##TITLE=1H_15-2023
 CDCl3
 8 sc, 
 23.3.2023
##JCAMPDX= 6.0         $$ Bruker NMR JCAMP-DX V2.0
##DATA TYPE= NMR FID
##DATA CLASS= NTUPLES
##ORIGIN= UXNMR, Bruker Analytische Messtechnik GmbH
##OWNER= root
$$ XWIN-NMR		Version 3.5
$$ Thu Mar 23 14:31:16 2023 Russian Standard Time (UT+4h)  she@DPX200
##.OBSERVE FREQUENCY= 200.13135
##.OBSERVE NUCLEUS= ^1H
##.DELAY= (6, 6)
##.ACQUISITION MODE= SIMULTANEOUS
##.ACQUISITION SCHEME= undefined
##.AVERAGES= 8
##.DIGITISER RES= 18
##SPECTROMETER/DATA SYSTEM= spect
##.PULSE SEQUENCE= zg30
##.SOLVENT NAME= CDCl3
##.SHIFT REFERENCE= (INTERNAL, CDCl3, 0, 15.7039)
##AUDIT TRAIL= $$ (NUMBER, WHEN, WHO, WHERE, WHAT)
$$ ##TITLE= Audit trail, XWIN-NMR		Version 3.5
$$ ##JCAMPDX= 5.01
$$ ##ORIGIN= Bruker BioSpin GmbH
$$ ##OWNER= she
$$ F:/spectra/data/she/nmr/H-F/1/audita.txt
$$ ##AUDIT TRAIL=  $$ (NUMBER, WHEN, WHO, WHERE, WHAT)
(   1,<2023-03-23 14:29:41.12 +0400>,<she>,<DPX200>,
      <created by zg, POWCHK disabled, PULCHK disabled
       configuration hash MD5:
       00 E9 B6 7A A2 85 ED C7 34 08 36 98 17 FE 4E 26
       data hash MD5: 16K
       99 C5 9B 96 14 48 48 11 5D DB 85 99 87 35 56 F6>)
$$ ##END=
$$ 
$$ hash MD5
$$ B9 70 FE DC FE 76 E6 48 D1 D2 8E 03 B8 F3 02 25
##$RELAX= 
##$RELAX= 
##$RELAX= 
##$RELAX= 
##$RELAX= 
##$RELAX= 
$$ Bruker specific parameters
$$ --------------------------
##$DU= <F:/spectra>
##$EXPNO= 1
##$NAME= <H-F>
##$PROCNO= 1
##$TYPE= <nmr>
##$USER= <she>
##$AMP= (0..31)
100 100 100 100 100 100 100 100 100 100 100 100 100 100 100 100 100 100 
100 100 100 100 100 100 100 100 100 100 100 100 100 100 
##$AQSEQ= 0
##$AQ_mod= 1
##$AUNM= <au_zg>
##$AUTOPOS= <>
##$BF1= 200.13
##$BF2= 200.13
##$BF3= 200.13
##$BF4= 200.13
##$BF5= 200.13
##$BF6= 200.13
##$BF7= 200.13
##$BF8= 200.13
##$BYTORDA= 1
##$CFDGTYP= 0
##$CFRGTYP= 5
##$CHEMSTR= <none>
##$CNST= (0..31)
1 1 145 1 1 1 1 1 1 1 1 1 1 1 1 1 1 1 1 1 1 1 1 1 1 1 1 1 1 1 1 1 
##$CPDPRG= <>
##$CPDPRG1= <>
##$CPDPRG2= <>
##$CPDPRG3= <>
##$CPDPRG4= <mlev>
##$CPDPRG5= <mlev>
##$CPDPRG6= <mlev>
##$CPDPRG7= <mlev>
##$CPDPRG8= <mlev>
##$CPDPRGB= <>
##$CPDPRGT= <>
##$D= (0..31)
0 1.2 0 0 0 0 0 0 0 0.06 0 0.03 0 0 0 0 0.0002 0 0 0 0 0 0 0 0 0 0 0 0 
0 0 0 
##$DATE= 1679567380
##$DBL= (0..7)
120 120 120 120 120 120 120 120 
##$DBP= (0..7)
150 150 150 150 150 150 150 150 
##$DBP07= 0
##$DBPNAM0= <>
##$DBPNAM1= <>
##$DBPNAM2= <>
##$DBPNAM3= <>
##$DBPNAM4= <>
##$DBPNAM5= <>
##$DBPNAM6= <>
##$DBPNAM7= <>
##$DBPOAL= (0..7)
0.5 0.5 0.5 0.5 0.5 0.5 0.5 0.5 
##$DBPOFFS= (0..7)
0 0 0 0 0 0 0 0 
##$DE= 6
##$DECBNUC= <off>
##$DECIM= 32
##$DECNUC= <off>
##$DECSTAT= 4
##$DIGMOD= 1
##$DIGTYP= 9
##$DL= (0..7)
0 120 120 120 120 120 120 120 
##$DP= (0..7)
150 150 150 150 150 150 150 150 
##$DP07= 0
##$DPNAME0= <>
##$DPNAME1= <>
##$DPNAME2= <>
##$DPNAME3= <>
##$DPNAME4= <>
##$DPNAME5= <>
##$DPNAME6= <>
##$DPNAME7= <>
##$DPOAL= (0..7)
0.5 0.5 0.5 0.5 0.5 0.5 0.5 0.5 
##$DPOFFS= (0..7)
0 0 0 0 0 0 0 0 
##$DQDMODE= 0
##$DR= 18
##$DS= 0
##$DSLIST= <SSSSSSSSSSSSSSS>
$$ [...]
##$SUBNAM2= <"">
##$SUBNAM3= <"">
##$SUBNAM4= <"">
##$SUBNAM5= <"">
##$SUBNAM6= <"">
##$SUBNAM7= <"">
##$SUBNAM8= <"">
##$SUBNAM9= <"">
##$SW= 18.05172834244
##$SWIBOX= (0..15)
0 0 2 0 0 0 0 0 0 0 0 0 0 0 0 0 
##$SW_h= 3612.71676300578
##$TD= 16384
##$TD0= 1
##$TE= 0
##$TE2= 300
##$TE3= 300
##$TEG= 300
##$TL= (0..7)
0 120 120 120 120 120 120 120 
##$TP= (0..7)
150 150 150 150 150 150 150 150 
##$TP07= 0
##$TPNAME0= <>
##$TPNAME1= <>
##$TPNAME2= <>
##$TPNAME3= <>
##$TPNAME4= <>
##$TPNAME5= <>
##$TPNAME6= <>
##$TPNAME7= <>
##$TPOAL= (0..7)
0.5 0.5 0.5 0.5 0.5 0.5 0.5 0.5 
##$TPOFFS= (0..7)
0 0 0 0 0 0 0 0 
##$TUNHIN= 0
##$TUNHOUT= 0
##$TUNXOUT= 0
##$USERA1= <user>
##$USERA2= <user>
##$USERA3= <user>
##$USERA4= <user>
##$USERA5= <user>
##$V9= 5
##$VALIST= <valist>
##$VCLIST= <CCCCCCCCCCCCCCC>
##$VD= 0
##$VDLIST= <DDDDDDDDDDDDDDD>
##$VPLIST= <PPPPPPPPPPPPPPP>
##$VTLIST= <TTTTTTTTTTTTTTT>
##$WBST= 1024
##$WBSW= 4
##$XGAIN= (0..3)
0 0 0 0 
##$XL= 0
##$YL= 0
##$YMAX_a= 819609
##$YMIN_a= -625681
##$ZGOPTNS= <>
##$ZL1= 120
##$ZL2= 120
##$ZL3= 120
##$ZL4= 120
##$ABSF1= 10
##$ABSF2= 0
##$ABSG= 5
##$ABSL= 3
##$ALPHA= 0
##$AQORDER= 0
##$ASSFAC= 0
##$ASSFACI= 0
##$ASSFACX= 0
##$ASSWID= 0
##$AUNMP= <proc_1d>
##$AZFE= 0.1
##$AZFW= 0.1
##$BCFW= 1
##$BC_mod= 2
##$BYTORDP= 1
##$COROFFS= 0
##$CY= 11.3945322036743
##$DATMOD= 1
##$DC= 2
##$DFILT= <>
##$DTYPP= 0
##$F1P= 2.36226072786647
##$F2P= -0.459571619588291
##$FCOR= 0.5
##$FTSIZE= 0
##$FT_mod= 4
##$GAMMA= 1
##$GB= 0.15
##$INTBC= 1
##$INTSCL= 1
##$ISEN= 128
##$LB= 0.24
##$LEV0= 0
##$LPBIN= 0
##$MAXI= 10000
##$MC2= 0
##$MEAN= 0
##$ME_mod= 0
##$MI= 1.114404
##$NCOEF= 0
##$NC_proc= 0
##$NLEV= 6
##$NOISF1= 3.799351
##$NOISF2= 2.8
##$NSP= 1
##$NTH_PI= 0
##$NZP= 0
##$OFFSET= 15.70392
##$PC= 1
##$PHC0= -19462.55
##$PHC1= 6.00075
##$PH_mod= 1
##$PKNL= yes
##$PPARMOD= 0
##$PSCAL= 0
##$PSIGN= 0
##$REVERSE= no
##$SF= 200.130013532006
##$SI= 16384
##$SIGF1= 3
##$SIGF2= 2
##$SINO= 400
##$SIOLD= 16384
##$SREGLST= <1H.CDCl3>
##$SSB= 0
##$STSI= 0
##$STSR= 0
##$SW_p= 3612.71676300578
##$SYMM= 0
##$S_DEV= 0
##$TDeff= 0
##$TDoff= 0
##$TI= <>
##$TILT= no
##$TM1= 0
##$TM2= 0
##$TOPLEV= 0
##$USERP1= <user>
##$USERP2= <user>
##$USERP3= <user>
##$USERP4= <user>
##$USERP5= <user>
##$WDW= 1
##$XDIM= 8192
##$YMAX_p= 0
##$YMIN_p= 0
$$ End of Bruker specific parameters
$$ ---------------------------------
##NTUPLES= NMR FID
##VAR_NAME=  TIME,          FID/REAL,        FID/IMAG
##SYMBOL=    X,             R,               I
##VAR_TYPE=  INDEPENDENT,   DEPENDENT,       DEPENDENT
##VAR_FORM=  AFFN,          ASDF,            ASDF
##VAR_DIM=   8192,          8192,            8192
##UNITS=     SECONDS,       ARBITRARY UNITS, ARBITRARY UNITS
##FACTOR=    0.0002768,     1,               1
##FIRST=     0,             0,               0
##LAST=      2.2672688,     0,               0
##MIN=       0,             -625681,         0
##MAX=       2.2672688,     819609,          0
$$ Real data points
##PAGE= N=1
##DATA TABLE= (X++(R..R)), XYDATA
0 0 0 0 0 0 0 0 -8 0 -8 8 -8 16 -16 24 -24 40 -40 56 -64 80 -96 113 -136 160 -185 217 -253 293 -337 386 -444
31 -444 505 -577 651 -738 829 -933 1044 -1168 1303 -1450 1614 -1788 1985 -2193 2424 -2675
47 -2675 2953 -3252 3587 -3950 4354 -4797 5295 -5853 6479 -7195 8012 -8966 10087 -11434
61 -11434 13087 -15172 17895 -21623 27072 -35830 52271 -94206 442823 819609 431258
72 431258 440273 145393 -105974 -153940 -186033 -273870 -339734 -418210 -362645 -381368 -328745 -173420
84 -173420 -44912 -93531 -70900 -93838 -99053 -139366 -12924 69676 148825 139302 198005 193911
96 193911 231572 233479 356864 355729 282637 182889 73671 -109188 -191086 -245619 -253959 -264831
108 -264831 -328829 -339583 -355512 -385446 -323978 -194309 -154325 -45701 -5751 17965 37781
119 37781 117308 127104 206305 233475 205588 79898 80961 -5207 -105021 -55032 7311 -99553
131 -99553 -57260 -35026 -116567 -98200 -55934 -36003 -1618 -25163 -43681 -18988 -117111 -89763
143 -89763 -24651 -12605 983 95381 92854 135020 143761 201880 209891 194393 131789 106724 -345
156 -345 -77084 -113994 -113399 -144429 -130035 -100921 -96491 -77356 -45315 5080 55899 79825 82386
169 82386 142397 78777 59403 89405 62311 7481 75466 21119 10006 24993 21615 -1062
181 -1062 32085 -3510 -4033 -30717 -42613 -61016 -68320 -61458 -64267 -75872 -57032 -59586 -64923 -17936
195 -17936 -19448 19435 38607 53166 67514 91204 63515 106858 71185 57146 34922 7260
207 7260 -42047 -40808 -77907 -66384 -83630 -78308 -68386 -64727 -52399 -12249 -496 18636 44349
220 44349 32998 33735 22209 25841 7788 20610 10057 14653 2312 26700 2041 37323 35333
233 35333 27588 20364 22098 -38255 -24551 -41109 -58188 -47121 -39528 -55330 -38723 -41413 -29401
246 -29401 1595 9648 44934 56412 59553 54768 55913 32381 42481 14040 25996 831 -5896
259 -5896 -18512 -16570 -39276 -15913 -36721 -24800 -31927 -32821 -28069 -15878 -15870 9092 5073 7867
273 7867 12685 -6248 7817 5957 8581 24015 33573 16253 39032 13721 22102 12117 15279 5704
287 5704 9730 -17170 -2898 -33108 -30824 -34061 -35456 -39355 -24058 -29389 -10897 -5786 6101 25536
301 25536 21462 29913 31993 24483 13582 20792 5329 13735 -2662 11955 -2583 -3317 -8591 2735
315 2735 -20884 -1957 -13366 -5517 -14429 -8912 -7454 -5170 -18884 1454 -9495 -14600 2400
328 2400 -2319 5356 14186 13597 19661 24482 694 23158 3688 834 3901 8442 -9766 7698
342 7698 -12495 -3600 -19019 -15634 -18331 -12416 -16127 3818 -3795 9618 12500 5385 9563 7705
356 7705 -1589 811 5447 -3505 7976 -226 6054 -3369 1172 -9383 2251 -6535 5036 -1667
370 -1667 15577 -3574 1301 -320 -5434 -20986 -676 -8671 -7104 -1604 7974 6976 982 10364
384 10364 14751 -208 -225 14930 -7804 826 -2265 649 -5552 -7513 -13343 7412 -25165 -4181
398 -4181 9724 -2764 -4487 25163 487 3307 5004 6344 -2371 -4137 1668 2639 -8484 -1002
412 -1002 5654 -4709 4281 -1183 4693 -1314 -1755 -4462 11039 -8587 1343 1286 -444 -20408 -512
427 -512 -7322 -9996 -4865 15007 117 11876 16365 9900 7824 9516 962 1468 -1628 -6145 2580
442 2580 -9339 -1149 -4990 -11082 -12142 1985 -14045 5203 7015 13278 1169 6696 2559 -2816
456 -2816 -23302 7291 -2070 -20645 1715 14225 -15562 -200 19195 5489 -811 7532 12452
469 12452 -7019 -5664 3233 6506 -13515 -7845 -12186 -9146 -30665 -10835 9306 9353 -6381 27992
483 27992 15390 -9274 -5169 19428 -1794 -7783 7204 6795 -21209 -20221 557 -1345 -6458 3430
497 3430 23135 110 -10531 7998 20126 -8135 15782 19647 -1778 -21815 -7414 -16021 -7783
510 -7783 -4144 19612 12178 4846 5188 5476 -1305 16619 12168 9097 16190 -10042 -20271 -6044
524 -6044 -10071 -16277 9767 1249 -5770 -9682 455 -1517 17804 18531 27489 16889 3928 -20697
538 -20697 -7747 -11965 -11875 2059 15291 -6558 -12476 -9830 -6520 -4760 4677 25238 20531 -233
552 -233 -6088 3569 -17615 -15585 -271 7373 -21985 -16494 -7139 -7567 -16559 22209 28318 13287
566 13287 3824 12705 -8705 -14835 -2184 10953 -1339 -5940 -9076 -21100 -23315 -17481 -1679
579 -1679 14969 18167 4749 19694 3653 -9975 1782 16259 -6669 1785 -4815 -13243 -23417
592 -23417 -11757 -5472 9903 4701 10950 8950 -182 -7676 5800 9580 4738 8409 3321 -10802
606 -10802 -19569 -14701 -15565 -841 725 8746 7880 9187 -764 11165 7617 13877 6050 8391 -1840
621 -1840 -8973 -17314 -3518 -9247 -7089 2179 383 -8913 -488 3887 3218 15955 18162 14703 8488
636 8488 4369 -12428 -7372 -10325 -7179 -4668 7297 -3777 3539 1050 3951 3261 12304 7224 14274
651 14274 4732 68 -1451 -5345 -13159 -7026 -6427 -11569 -5494 -3163 70 2516 12683 11418 14660
666 14660 6912 7810 -3118 -2973 -8930 -2040 -7045 -1715 -7276 -5174 -10631 -5659 -6440 3565 5776
681 5776 8975 9306 6963 -309 -1959 -2720 -7822 -2531 -3729 -5764 -7091 -1737 -7944 2515 4482
696 4482 9121 5304 10302 469 1940 -3781 1549 -1262 820 -5124 -3698 -11733 -12313 -8066 -2033
711 -2033 689 8007 12856 7758 6500 5002 5902 -785 4121 740 -324 -8845 -3316 -7997 -3921
726 -3921 -4107 5550 -656 2207 494 4017 -470 6496 6533 6022 -1190 -3844 -8420 -12652 -9538 -3106
742 -3106 2040 2659 8419 4696 3007 -869 5013 959 5151 2442 4957 -6062 -3169 -8502 -6462
757 -6462 -9222 -2183 -4835 -667 -2004 3189 3115 5509 8050 7251 2177 27 -1290 -6205 -2474 -1774
773 -1774 2221 -1883 710 -2122 -1369 -6600 4701 1576 4644 4427 8128 -1365 -724 -3356 59 -7268
789 -7268 -3021 86 -2671 -6154 3477 3738 261 6561 8487 4799 -320 3965 -400 -568 -4014 3693
805 3693 -2427 -4544 -7370 58 -9518 -4952 1634 5218 -1584 8409 6017 2154 88 2669 -595
820 -595 -2288 -3452 258 -919 -4691 2593 1514 -1130 -17 3485 -2869 2268 -532 4361 340
835 340 2241 -1388 -1036 -9457 -3258 -6410 -3941 -984 4293 1783 4774 4817 3758 -459 2559 4009
851 4009 -2071 2573 3524 -1532 -3679 652 -5826 -3751 -5903 96 -1188 372 639 9109 -688 1166
867 1166 3716 2031 -7965 614 1936 -4548 -3156 5706 74 -2973 1886 2679 828 -2402 5034
882 5034 6134 -1575 -1816 8776 -5568 -6505 -801 -2003 -9443 -1567 -1471 2930 -3765 3486 8113 1934
898 1934 -2562 10078 1358 -4521 2148 3101 -2845 -2584 991 -756 -4340 -4993 1624 -2473 -1576 1318
914 1318 7723 363 1620 2568 2803 -8000 -229 -1453 -3894 -3426 3297 -786 1337 1227 3668 685
930 685 390 2709 1285 1219 2753 2586 -1487 -486 -5045 -4494 -8278 -2651 -2911 -331 2535 7839 -648
947 -648 4389 3150 792 -1042 2900 1341 1932 -4318 1596 700 -8095 -2037 3515 -5112 -2022 4750
963 4750 -106 2241 1030 4706 2362 -3485 -4948 1990 -7933 -5540 817 4068 -4024 2100 4355
978 4355 1268 -3665 5998 5524 2261 1384 3655 1074 -5590 -4940 884 -4012 -7960 1392 -2266 -3752
994 -3752 -1503 4197 4147 4609 1611 7793 -1957 -3462 -742 1513 -2946 1391 940 1680 -4130 -2263
1010 -2263 1262 246 567 4803 4341 1947 41 -455 1711 -5591 -3243 -1071 -4531 -6808 1039 -2036
1026 -2036 2625 2991 4035 3126 2956 -1866 3875 219 1283 1923 1193 -2143 -3855 -6645 -4858 -5184
1042 -5184 -3536 1272 1324 3922 1689 2546 2006 -10 -2831 1739 -3525 -786 -2481 -959 -1289 -1453
1058 -1453 -3305 3597 -1830 814 4293 3225 1834 3586 1382 1261 -2487 -4003 -1333 -6049 -5246
1073 -5246 -2332 -384 -1477 3043 4006 5241 -315 4414 2497 1245 1643 5169 128 1404 -3501
1088 -3501 -1206 -3489 -4251 545 3031 -1235 3614 2482 -471 3151 2171 2934 2328 -1374 -3100 -2828
1104 -2828 -7678 -192 -1 1584 3136 2861 -2616 728 -1976 3389 3775 6019 5224 714 -4468 -3848
1120 -3848 -7759 -5179 -1157 -1250 -739 -2065 -1285 -435 556 2839 6894 1468 1705 -1785 -2815 -4770 147
1137 147 1172 2202 -2603 -676 -6475 -5616 -843 3999 6131 8281 3532 1514 -4688 -6942 -1377
1152 -1377 -2134 -738 3485 -1944 -5694 -1384 -4583 1764 4572 5298 5695 3105 -3417 2431 -2126 1194
1168 1194 5357 1343 -3711 -2560 -8156 -4637 -1571 2877 6882 3869 1727 791 -4399 -2540 3231
1183 3231 1679 2930 785 -865 -6055 -5307 -2358 1575 320 4120 966 -463 -3222 1357 3199
1198 3199 3631 3598 5113 -4611 -6583 -4620 -5753 -1379 2279 3103 2789 -2284 -2601 1784 -3440 3202
1214 3202 7783 2318 539 2075 -5283 -2174 -3324 -927 800 -1835 -2534 2165 -3434 1567 6359
1229 6359 3354 2549 2486 -2240 -2822 -3256 -1197 2769 -463 1406 -11 -3264 -3884 580 -22 3638 4121
1246 4121 5102 467 307 -977 -1233 -2765 148 -1478 -1153 -2191 -762 -323 -771 1784 2803 -901
1262 -901 948 2086 -1877 1227 931 1267 -205 -2177 -1797 -1065 -6931 1296 709 -2217 2330 4126
1278 4126 -1689 2989 9 1118 730 -2373 427 1225 -5248 336 1897 -3702 74 800 -208 -146
1294 -146 737 2327 3306 -1146 4170 1921 -1886 -1778 497 -4143 -2937 -969 839 -1715 1785 2808
1310 2808 1249 340 871 -96 517 -776 1469 2680 -2509 375 90 -4676 -2377 603 -2160 2271
1326 2271 1330 2771 1604 890 1264 1371 -3323 1371 -1185 -2614 -205 -259 -833 640 -1361 968 -595
1343 -595 -2910 2352 1368 -182 3812 2536 -1370 551 -2690 -1828 -2623 -922 926 472 -1805 3134
1359 3134 -312 -822 1347 2263 -421 1355 436 424 -1233 -504 287 -791 -1645 -1505 -40 -1607 -1628 2284
1377 2284 2807 -1333 4128 1860 -1618 -101 670 -2632 644 -2258 941 147 -2043 832 1741 -2785
1393 -2785 1381 1664 154 693 683 1863 346 -1239 962 -891 -4354 -427 -1637 -563 669 2084
1409 2084 1580 1867 -630 1884 -884 -299 116 923 213 296 -1291 914 -2434 -2740 774 -1028 -1598
1426 -1598 2644 1517 591 2414 1029 901 -1475 -597 -799 -1124 -1350 1017 -979 1087 -1072 494
1442 494 -212 -1027 513 2505 -527 2858 1525 -1220 -290 -858 -2354 -1135 -1256 -641 212 -676 2006
1459 2006 440 998 1516 863 -367 1202 -1411 861 -736 -529 114 -21 -2623 -128 -972 -982 -574
1476 -574 1889 1854 -364 1343 2388 -2114 -737 1572 -2697 -1572 -164 -1201 -505 393 31 2467
1492 2467 -1065 130 1819 -888 -1372 2825 191 309 91 173 -1812 -3201 -1515 -524 -2086 1411
1508 1411 2048 607 1478 1021 1017 61 -344 77 355 -1589 303 -292 183 -1364 -386 -501 -1233 -1048 2686
1527 2686 199 1616 3186 529 -681 -60 -1947 -1211 -1467 -623 702 -1368 859 800 -908 590
1543 590 1460 -974 1777 338 643 823 -300 -527 1058 -3526 -1087 -526 -2387 -113 2228 321
1559 321 1597 1683 399 58 -377 897 -54 -678 -185 -289 -2294 -362 -581 441 -496 786 -62 -42
1577 -42 -360 1666 883 1655 689 237 -1846 -2703 -1385 -468 -1321 1888 1752 -647 907 -11 -465 955
1595 955 1233 930 1244 -1479 429 -1020 -1569 417 564 -1829 -194 -2153 -823 509 1671 3243
1611 3243 3281 -547 446 -1548 -3730 -267 922 81 1221 367 -1741 -1826 -2262 850 1306 1734 2416 1598
1629 1598 -1591 -25 -155 -100 -389 1103 -1447 -2697 -2111 -452 -209 2306 2875 2041 -133 -1370 -584
1646 -584 -810 -144 3235 1529 -1160 -38 -3296 -2827 -1075 515 1760 2026 53 1006 -1186 -1060 1646
1663 1646 1822 398 1267 -1888 -2286 -2437 -1607 1242 1494 759 1271 -795 -2876 -74 551 1705 2464
1680 2464 2913 126 -1937 -2697 -955 -1690 200 1632 511 -1371 192 -533 398 1393 2854 1060
1696 1060 -727 -906 -1474 -1820 351 1493 807 -282 -1342 -1427 -2639 -393 2435 2583 1905 3050 -333
1713 -333 -1223 -1559 -911 -161 460 399 581 -1736 -1047 209 -223 1005 1688 393 757 -239 -755 1552 -191
1732 -191 -240 991 -1071 -2989 -591 -1276 -325 1510 2354 659 336 10 -173 -1115 251 637 620 -330
1750 -330 -110 -492 -1684 -1067 619 -217 -519 1196 -109 -56 676 1117 333 302 -727 279 -2020 -1472
1768 -1472 171 -258 -816 1311 55 -121 -32 435 -421 617 556 279 784 369 -447 96 -736 -2022 -288
1787 -288 -446 -1413 974 2113 -421 1620 1247 -236 44 650 -706 486 -624 -377 -104 -454 -712
1804 -712 666 -495 -768 465 327 242 1285 1738 477 562 -649 -813 -1619 -1231 -308 489 -212 1330
1822 1330 797 -298 -449 842 -877 1060 954 94 573 -61 -1572 13 -332 -1306 459 -196 -1401
1839 -1401 731 674 -831 1204 1319 -302 -330 99 -1473 2 -208 213 496 344 -1693 235 -514 -1472
1857 -1472 954 1568 -175 1156 1007 -482 -266 62 179 -255 -1018 -306 -278 -1721 740 1082 -31 408
1875 408 1677 -918 -355 61 89 149 822 -410 301 -834 -1723 -434 23 -1237 1220 1679 -399 889
1893 889 1357 -624 -347 1038 -1311 -681 -127 -1141 -77 427 -1069 979 -42 -1205 29 526 -989
1910 -989 1333 1640 -79 63 481 -1218 -1251 -319 -57 198 277 829 520 -443 -89 952 -502 18 1016
1929 1016 -15 -850 1032 -624 -725 -286 -601 -467 -68 -945 820 1125 -421 1015 1649 -897 -60
1946 -60 674 -1104 -376 602 -612 -63 462 -586 174 -88 -404 161 783 -501 996 713 -224 68 727
1965 727 -1043 -585 -325 -833 -816 134 204 487 509 550 350 -553 -14 104 -214 -313 728 -515 102 -21 -587
1986 -587 -1140 159 -594 35 318 846 1014 960 -49 292 -234 -1606 -413 178 -886 -374 850 -361
2004 -361 -270 474 -373 -511 544 -95 306 416 -147 227 74 -1080 -324 -461 -608 -507 450 -16 819 860
2024 860 299 -148 157 -10 -185 -30 102 6 -442 29 -320 -741 -391 141 -485 58 271 388 44 539
2044 539 446 22 -435 43 -563 -133 -654 204 384 -361 290 1046 -756 -283 773 22 -105 434 498 -466
2064 -466 -290 82 -296 -1145 -188 -1 -94 -176 569 576 452 523 787 -688 -510 -38 -184 -261 658 294 -5 -172
2086 -172 -389 -209 -546 521 384 537 641 458 -224 126 -582 -530 -451 -582 -432 240 -517 173 181 357 310
2107 310 53 -118 76 -527 495 825 -93 216 -124 -879 -1009 -313 -416 379 794 968 -8 530 45 -68
2127 -68 -459 494 86 -119 -415 18 -501 -343 384 256 -410 390 140 -624 227 281 468 209 126 -477 -577
2148 -577 -1186 65 -121 27 316 477 178 166 0 559 488 133 450 383 -207 -243 -95 305 190 -231 306
2169 306 -198 -1091 217 569 -196 1285 1090 -131 -640 -381 -746 -560 -178 461 360 196 198 -110 -558 215
2189 215 145 377 398 231 -44 56 184 -215 -324 -154 -286 -561 99 -316 104 567 506 189 147 -390 5
2210 5 -417 -348 659 217 -105 453 -617 -786 -259 -277 64 486 479 496 387 -40 -234 -60 370 -272 -304 229
2232 229 -131 -685 556 38 38 249 46 70 -198 22 258 48 176 362 -110 -102 -772 -496 -74 -53 -13 919
2254 919 247 191 502 372 -510 115 232 1 -336 -252 -43 -24 -292 370 -70 -169 -230 269 268 -202 699 912
2276 912 -133 -209 -20 -911 -981 -267 -119 -199 231 805 -124 -534 447 -138 55 285 512 405 0 -738 57
2297 57 -470 -725 138 -153 -657 100 489 102 243 642 490 -420 -335 26 -444 -285 400 -118 235 -103 -471
2318 -471 -65 -301 -266 853 12 457 609 -9 -295 -206 27 -474 -154 144 -36 -479 91 217 -133 12
2338 12 620 -306 -256 126 113 -290 79 230 78 -172 -325 -394 -151 -528 160 841 -132 292 1124 -518 -345
2359 -345 686 -317 -388 93 110 -144 -181 -70 400 -397 48 293 -211 -360 637 267 396 175 179 -67 -748
2380 -748 -572 -231 -339 -115 647 343 196 -29 -7 -143 -144 319 97 -49 182 -187 -154 -326 -585 -489 -131 -367
2402 -367 -64 -2 415 48 186 -111 72 -74 -72 -365 227 -267 -609 697 325 -400 -173 174 -770 474
2422 474 271 114 495 -189 -32 426 -595 -265 298 -624 -6 -23 -45 299 103 22 374 114 19 -7 -272
2443 -272 -66 208 -303 284 154 -183 -432 -231 -250 -162 336 137 102 627 63 -4 -69 -544 -265 -185 -241 241
2465 241 191 -217 28 421 -183 -139 112 -77 -338 87 865 192 -118 343 -471 -851 39 -273 144 200 175
2486 175 486 178 -472 241 -201 -572 240 26 103 49 -49 41 -116 -381 71 63 -187 301 231 -145 344 -63
2508 -63 -195 10 -223 -316 -42 -420 15 -135 -52 -64 -53 133 -116 20 104 164 308 205 -79 671 -190 -184 -11
2531 -11 -288 -272 57 -389 246 254 68 633 70 -7 94 -396 -71 -45 128 483 -1 -280 296 -378 -653 247
2553 247 48 -17 304 249 201 39 -131 316 -280 -302 127 -155 -7 617 199 311 118 54 -146 -250 87 209
2575 209 79 123 60 -161 12 -279 -250 14 63 69 439 251 -62 -170 -74 -42 -373 151 44 -225 -137 203 -300
2598 -300 -46 12 -221 -65 -298 150 -32 7 237 118 222 115 -1 -305 -194 -576 232 19 -147 370 135
2619 135 -312 288 -166 90 218 -322 82 107 -375 -221 11 -79 -231 -165 135 -248 10 288 356 126 106 -90
2641 -90 125 -177 -443 -125 71 104 249 -137 173 -25 -339 133 137 -356 265 180 -221 -45 160 -148 -313 -206
2663 -206 -208 -336 -63 469 314 -37 -2 429 75 -339 215 161 -496 488 142 -200 50 -352 151 89 -584 -109
2685 -109 676 -221 44 581 150 -523 -45 -390 -244 -73 133 343 -167 -67 178 -128 -111 76 -10 51 374
2706 374 219 -232 20 -53 136 -71 6 -280 -227 141 89 83 316 334 280 -74 110 58 -80 -98 523 222 -14
2729 -14 -128 120 -430 -216 102 464 -83 -89 61 74 103 37 375 -41 -881 -39 -91 -579 495 614 -56 11
2751 11 -65 -237 -88 -673 190 503 -115 330 46 -752 -328 -275 -1 71 299 -100 132 -169 -30 528 80
2772 80 29 85 -681 -194 106 -257 116 263 485 -87 -545 -82 16 84 189 466 612 -93 -454 -18 -130 67
2794 67 316 88 14 32 6 -220 56 587 254 153 137 -166 -444 -148 -66 310 135 -50 -126 35 -632 304
2816 304 220 78 480 102 -195 -143 -452 -134 151 -311 229 223 -419 -157 344 63 261 40 -150 -25 -13 239
2838 239 218 308 2 -124 -34 -518 -128 -121 92 212 326 251 126 117 -259 92 -254 -247 147 79 40 94 -163 -142 -215
2863 -215 59 10 -12 -74 367 -36 183 238 315 25 -145 -190 -2 12 -38 503 110 289 253 -72 -307 -80 -54
2886 -54 58 -180 282 486 -238 69 -160 -431 -340 -100 62 47 134 350 42 95 209 91 -34 -219 -170 180
2908 180 -265 -10 231 -160 12 359 -167 -122 -31 184 349 220 143 292 -345 -375 63 -549 -65 -22 -87 104
2930 104 143 -47 -58 -286 45 -4 -66 -24 271 -120 175 65 -233 -160 -157 -371 -102 -257 338 280 209 266 326 -297
2954 -297 -313 -256 -112 -58 -17 453 -148 -331 94 96 -449 385 182 110 24 430 99 -14 -21 12 -223 -67 -79 -152
2978 -152 -42 -48 232 292 180 -204 114 -159 67 59 354 -125 56 -111 111 -133 45 -29 -31 -56 230 80 189
3001 189 -11 -262 112 -133 -77 -1 -314 74 -69 49 -90 -73 103 -43 -143 -169 -154 26 290 285 172 83 -55
3024 -55 -39 -93 -389 -212 -13 301 133 127 -92 -65 -69 -278 -186 -201 -39 -27 61 169 -151 -34 -334 -295 -24 6 69
3049 69 119 359 304 114 -199 -57 -100 16 120 319 8 -71 222 86 -141 -220 23 -13 65 137 364 228 67
3072 67 -7 24 -148 -240 142 -59 -304 298 403 68 -48 -63 100 -52 -142 173 236 -218 -130 59 -328 -213 -2
3095 -2 -29 -75 -214 100 126 275 209 238 -72 39 -83 96 -646 39 173 89 -86 287 196 -397 -74 -8 15 46
3119 46 -62 255 240 165 -28 -313 -242 55 -335 -36 340 167 66 315 446 54 -248 -1 -58 26 273 64
3141 64 -52 134 -8 -99 -397 79 28 -31 82 280 356 -18 -165 126 -62 -288 -203 167 -161 212 356 50
3163 50 -278 -57 222 -280 -41 135 207 24 136 -27 -3 -253 -95 259 16 12 106 134 107 -121 163 5 -45
3186 -45 163 -295 -40 -12 25 -45 -6 8 23 -249 -167 -304 90 134 54 81 -116 -75 155 76 -185 249 -89 -133 -48
3211 -48 -59 126 149 225 -33 -381 -223 -267 -148 127 137 266 -82 -75 -224 6 -234 -15 14 260 42 246 171
3234 171 -136 -78 10 15 -83 60 -9 -107 79 142 -80 38 -94 -42 -148 -137 298 277 344 29 -6 -149 136 -106
3258 -106 300 82 137 77 -94 -141 -255 175 212 -173 75 210 104 193 94 15 104 -49 123 4 -26 55 127 217
3282 217 179 303 -68 55 -129 -281 15 276 132 98 -108 -19 60 -44 -101 167 -2 210 -124 335 -54 -276
3304 -276 232 177 214 -172 -55 -197 -167 230 272 371 260 -122 -152 -415 -248 -26 43 307 334 -94 -90 21 -417
3327 -417 -271 -217 -119 314 46 136 314 82 -200 -125 -60 -459 -178 44 -111 -24 276 154 -85 -54 -88 -218 38
3350 38 282 162 -117 59 -254 -257 -295 -144 -67 -72 208 120 198 -79 -8 -9 -334 7 212 10 -116 -45 116 -248
3374 -248 40 40 -182 -108 -151 253 -130 -30 264 -87 16 75 -9 -134 -352 -160 141 -101 -159 66 -121 -264
3396 -264 -139 -155 116 -3 13 -65 -172 175 -111 198 112 -369 230 47 199 157 91 54 254 176 91 -147 3
3419 3 -300 118 -185 -91 107 124 31 -315 -215 -318 -212 -79 329 49 233 310 46 -61 -9 -157 -176 -17 80
3442 80 16 91 -51 -125 -85 -61 -168 -108 -7 163 128 183 155 99 -263 -1 -93 -199 -284 394 349 167 328 38 -117
3467 -117 28 -42 203 258 -80 -104 -133 -89 183 261 -207 146 76 367 212 -145 255 29 31 142 -68 -159 -55
3490 -55 -7 -78 131 165 302 -102 22 155 336 -142 -140 196 99 38 358 -126 44 72 -409 -70 -107 -87 34 309
3514 309 229 -21 -134 -122 -157 124 3 153 253 337 -345 -30 60 -397 -120 59 127 -73 58 17 52 102 -85
3537 -85 -10 -237 -140 -66 111 -53 101 -84 -163 -3 -281 -104 4 -92 -94 204 292 -35 150 -3 221 -71 -426
3560 -426 79 378 -181 163 -152 -37 100 -112 60 -89 8 498 97 -156 216 188 -363 35 265 -360 -21
3581 -21 171 132 5 -103 -56 172 -306 -286 -127 -287 -31 123 -19 -157 -181 -91 184 -238 -179 190 -28 145
3603 145 33 267 265 -41 125 47 -248 19 -85 -176 -55 175 184 -78 -51 -4 143 84 -138 126 195 -70 155
3626 155 -332 41 -10 144 -108 54 332 -30 323 141 -112 143 -86 -368 164 -49 235 170 -413 222 186
3647 186 -355 -111 100 -390 61 1 -19 81 -302 -7 281 -136 -148 28 -320 83 80 118 -78 -274 66 -208
3669 -208 -7 127 -89 224 -244 -146 -103 93 -125 252 152 -91 46 298 145 110 49 120 -249 -26 -12 -303
3691 -303 49 -95 184 201 -82 77 86 -259 -88 -245 180 50 -85 -36 200 -108 -386 85 -372 -204 5
3712 5 -16 96 65 -230 397 59 -67 -191 -112 -173 86 65 298 271 -60 -12 -98 -327 -136 116 -173 -186 66 234
3736 234 -15 -209 -122 -136 -181 -48 138 -1 -113 33 242 -132 -226 29 -233 -263 94 0 257 85 -195 94
3758 94 -243 -222 -235 168 32 17 223 -87 -14 210 -350 -154 -85 4 -227 -171 -134 182 -15 -86 11 -174 -117 -208
3782 -208 -40 90 104 176 151 201 -67 -75 -95 -119 -93 163 98 66 225 -19 -53 124 181 -129 217 65 216 144 65
3807 65 -164 134 11 -143 -116 -123 36 100 -49 201 62 69 -203 -147 -437 -126 86 103 270 61 33 -159 188
3830 188 -256 152 197 -136 97 18 25 -44 -160 -106 -98 58 88 357 259 -40 126 110 -138 211 69 -147 -106 -206
3854 -206 195 -80 86 2 -244 -309 -151 9 52 -129 19 37 -62 -107 -1 -87 117 82 -239 -7 -199 -85 -24
3877 -24 -27 -29 124 -262 -278 17 -168 -58 -48 -44 327 -35 -21 226 -198 326 -73 168 214 -39 28 82 -270 43
3901 43 133 -283 136 -85 -260 241 69 25 5 -276 35 -218 32 110 397 65 387 -132 -190 17 9 -284 -232
3924 -232 131 -142 183 -74 -31 -128 -52 -372 -39 -11 186 49 111 65 -48 -155 168 -330 -141 -73 22 187 -180
3947 -180 -40 -31 -99 -422 48 139 -95 -41 -63 128 -5 -47 33 14 -155 8 377 78 47 54 101 -168 -181 124 277
3972 277 -211 -21 231 -89 -274 160 -173 48 108 -54 -16 73 214 220 -68 -230 -97 -164 -439 -150 20 14 134
3995 134 -148 -213 188 32 -132 -24 -71 -16 140 -12 161 373 4 29 111 -163 -229 150 -48 -194 -22 -19 320
4018 320 13 125 84 -206 -250 -117 362 93 -59 22 147 -219 6 -238 -201 134 30 -34 170 167 -142 -173 130
4041 130 -167 36 161 -34 25 -162 291 286 -213 147 -202 -20 -188 183 221 -178 -42 -102 -208 -122 -69 -38 356
4064 356 110 120 65 153 60 125 57 -112 14 6 161 87 305 350 -122 -12 70 -52 -45 -116 -69 98 387 71 61
4089 61 -140 133 -112 -395 -318 124 -149 103 -254 -82 5 -108 204 -210 -156 -22 125 38 130 139 66 -93 -535
4112 -535 -244 -52 326 -16 204 209 207 -4 -62 -85 55 -57 11 132 -21 -28 -81 -374 -7 258 -161 50 73 390
4136 390 42 129 236 -236 -174 -50 -112 -10 -117 175 -153 115 -5 -79 22 152 -37 -77 -252 21 189 87
4158 87 98 166 -42 16 121 -128 -144 102 -63 26 -194 65 362 -105 -46 86 237 -194 -39 234 80 -40
4180 -40 -7 -47 -440 -103 94 -127 165 214 250 74 -94 78 -123 -145 111 33 47 94 -102 -42 -41 -29 -210 -27
4204 -27 218 5 81 13 -27 90 -178 -62 16 -264 -55 189 56 -31 -72 172 -31 -26 52 125 -47 22 240 6
4228 6 83 49 67 -309 67 -140 251 111 85 42 213 -131 272 54 -181 54 -13 -159 -198 98 208 79 15
4251 15 197 13 70 -81 -106 181 -34 223 122 -290 -257 -320 -44 136 -61 294 -19 -159 -57 5 -43 194
4273 194 -117 64 169 -138 27 -18 102 85 4 -217 208 -148 -153 -70 -4 -130 47 -73 -130 36 -176 71 13
4296 13 -120 110 231 161 272 73 -166 -112 -103 102 -171 145 63 79 -142 -145 -50 -85 -43 260 -183 42 80 -82
4320 -82 55 50 -200 -25 -14 -111 174 -17 96 -73 66 -215 -152 136 24 -114 -116 178 -91 -103 -8 152 -210
4343 -210 -264 -170 127 -182 81 9 -55 -58 117 -160 -365 53 112 -15 -68 267 30 -198 -241 98 -96 -71 97
4366 97 -115 -196 156 -160 -339 12 -10 -82 -34 -47 30 -129 117 318 -196 51 -146 -34 25 66 -146 -14 -5 118
4390 118 14 351 66 -48 -67 25 34 -167 113 -133 -231 -34 52 -9 40 324 -73 -43 -26 91 255 157 -113 151
4414 151 -308 168 -89 87 17 69 -23 -345 135 -192 -372 -227 -9 -82 -15 3 4 -42 7 6 -205 -218 119 79 108
4439 108 234 134 -142 -205 -199 -263 -46 -65 63 -73 173 -52 167 107 121 81 -13 9 269 138 -15 49 22 -35
4463 -35 -336 -158 70 -54 121 -136 -75 -9 -2 -105 -104 -363 -92 262 -27 100 170 25 -74 142 -152 -378 40
4486 40 229 146 -40 -94 144 177 -151 -37 86 -93 -115 80 195 6 90 150 -171 6 -39 -52 -59 58 127 126 -314
4511 -314 273 -110 -182 -42 65 126 45 -158 -79 136 -169 -105 -204 -94 -321 233 -106 -173 174 -4 -405 161
4533 161 39 -150 131 -30 20 130 116 -130 247 -336 -35 -72 -198 -240 275 -20 165 488 -290 -87 77
4554 77 37 -201 -84 212 175 297 -68 -46 300 17 -130 -5 -43 139 -23 -156 0 -87 -79 115 -305 31 23
4577 23 42 -100 -22 52 -170 72 156 -97 -133 16 -164 -54 -104 -42 115 -47 -57 6 29 -162 135 69 202 120
4601 120 -158 134 -27 -5 -1 9 -180 83 -57 74 154 34 -61 13 0 -39 -89 27 -132 179 -172 -65 -90 -41
4625 -41 -298 137 407 -115 39 57 -35 -28 -46 -17 28 32 -204 39 190 -42 -315 -169 23 79 -260 -208 86 24
4649 24 68 281 200 56 -11 -13 -120 -141 102 -254 -107 -268 17 -213 -101 27 250 0 103 -4 -12 101 -191
4672 -191 -92 -88 -213 -366 -133 68 -339 -31 -108 -31 197 -92 -129 -13 -58 -148 -83 -103 12 9 283 -96 66 89
4696 89 -14 241 111 -206 17 -139 -15 37 85 115 -140 -90 11 -118 132 29 -45 245 -93 -183 -72 -115 50
4719 50 296 -151 4 72 1 -48 16 -107 21 60 -17 137 -234 76 192 -72 -196 77 -65 83 5 178 91
4742 91 128 -19 70 199 -185 -203 161 77 63 -155 -32 60 193 -166 197 149 -52 258 -88 91 5 86 97 36
4766 36 168 -102 139 -244 162 -69 156 254 -1 -58 186 -199 -84 311 171 -68 -119 182 -99 170 -194
4787 -194 13 -2 76 95 -46 -28 161 -202 -88 -38 159 108 -119 220 80 17 -1 163 -48 205 276 15 57
4810 57 0 76 -333 109 -16 -224 -14 44 -27 97 -50 30 -39 -108 -77 -234 -1 -62 241 2 148 -213 -15
4833 -15 176 -110 -91 13 -13 113 16 161 -10 92 -160 138 -222 -41 231 -72 18 66 115 407 179 -66
4855 -66 184 -12 -33 186 -69 21 162 -192 84 -147 164 83 -49 80 43 -121 -131 -58 230 36 -13 -108 -178
4878 -178 151 80 96 -141 192 -216 20 -106 268 1 138 149 31 48 -264 -209 0 64 -105 -101 94 25 119
4901 119 120 29 45 141 -192 39 44 9 -132 -14 41 126 116 -32 202 -57 169 175 68 -89 -182 -56 151 -79 -184
4926 -184 142 -1 287 -177 -19 264 -97 115 -181 30 -91 134 -88 38 -150 38 30 -105 169 -82 -138
4947 -138 -208 -24 356 -55 9 286 58 145 -242 -36 146 -83 -126 20 149 -17 52 -80 79 -44 174 124
4969 124 -184 -104 -115 92 104 62 -92 36 34 -360 19 -66 -61 -138 -199 14 -30 -12 -211 90 -171 169 -39 223
4993 223 -49 53 -96 -199 79 -25 -100 108 50 74 41 87 37 58 -48 160 143 231 234 52 -68 -192 -137 -329
5017 -329 139 -20 -29 133 -18 322 13 -173 -181 -107 -161 166 295 -158 129 71 72 -75 -159 -232 -181 -56 261 52
5041 52 -116 0 -174 -49 112 -96 -59 393 -3 -86 -178 32 -111 -277 187 -133 61 -66 -21 44 -180 -67
5063 -67 65 91 12 -293 -161 -208 -19 -178 -29 -85 176 463 77 66 -121 117 289 61 87 94 -80 -32 80
5086 80 -133 143 -74 -68 26 62 104 148 -155 113 104 -251 -167 72 194 -7 100 30 -6 -84 86 -79 61 28 -6
5111 -6 75 -62 70 -11 -82 -175 19 -84 87 -7 68 121 -22 64 71 -128 -64 -184 -220 -243 29 37 -55 93 199 118
5137 118 -215 -49 105 -150 126 75 28 -22 253 186 139 -121 109 5 132 -3 157 -90 -180 -69 -136 7
5159 7 357 -75 -119 -74 -291 -138 11 -135 109 -6 -291 62 53 -177 101 74 -270 74 -119 -61 -181 -221 -90
5182 -90 -144 76 -12 251 3 135 102 -181 153 28 -198 -61 -38 364 151 -133 -151 -148 -66 -114 -65 52 19 180
5206 180 -180 92 204 68 81 99 -74 -2 134 87 -73 96 -109 -74 -69 98 122 112 57 3 131 -185 15 114
5230 114 -8 -87 72 -78 102 -32 10 -63 -179 -163 -261 101 -188 168 -165 35 185 273 -61 -141 -47 -79 -86 -81
5254 -81 138 25 142 10 61 -255 265 68 53 -10 6 -75 -372 -144 -99 -62 -49 -60 102 -130 36 -111 9
5277 9 -141 193 13 -207 -6 32 -34 -280 400 140 -109 -29 34 -197 -207 -15 163 126 130 133 -122 29 156 -115
5301 -115 -181 -8 92 292 55 174 -8 -119 17 10 187 -77 109 -178 -113 -147 -86 -12 46 -108 -216 -224 -185 208
5325 208 -40 -7 397 -251 -61 -91 -176 -31 -52 -33 155 29 96 57 27 74 -130 -300 139 278 -121 -26 92
5348 92 233 -241 20 -118 -43 -23 53 45 -245 321 18 38 -101 13 1 256 87 41 147 -292 -188 52 66
5371 66 49 136 -237 136 -11 -169 -164 -49 -69 -226 154 97 124 28 121 227 -113 -93 -128 -97 82 91 153 24 46 21
5397 21 -131 -29 314 -105 -93 160 192 31 35 -49 -64 -155 10 169 38 6 148 -130 104 173 -164 55 192
5420 192 -8 -76 -284 -24 60 28 261 142 122 15 -56 -281 123 -16 -223 263 -31 -99 172 45 177 102
5442 102 -8 39 -45 47 170 -9 -4 -192 -147 2 -118 47 140 432 215 279 309 150 40 -239 -212 120 -76
5465 -76 353 -77 -103 -46 -127 117 121 59 69 38 -84 -139 -157 -49 -34 1 91 399 -60 -62 267 -224 49 32 36 -177
5491 -177 -110 -66 63 285 162 181 -6 -141 -156 -61 -182 -102 -77 211 -44 -9 -120 -166 -90 -70 91 109 -159 -16
5515 -16 59 -162 208 -201 -12 -117 -339 -155 159 137 -196 80 67 220 -246 -83 218 -165 -244 245 89 -135
5537 -135 -68 -182 164 17 241 -79 -131 54 189 182 -54 238 -93 -163 -294 33 -135 146 101 9 82 -53 117
5560 117 -3 173 8 -41 -43 34 189 -57 124 -148 -250 -75 11 170 -173 6 99 -158 -60 -146 -90 -121 176
5583 176 132 97 10 -108 342 -142 72 82 -80 -110 -91 -15 16 -16 -78 14 80 -29 50 49 -15 75 205 70 4 104
5609 104 45 -218 -88 55 112 123 8 110 75 -220 -211 -66 -173 -172 77 10 68 144 129 -3 51 162 7 -128
5633 -128 195 -25 10 -14 -83 37 102 33 -63 -165 -45 85 49 -138 128 154 253 -75 -139 3 -94 42 10 67
5657 67 77 127 221 275 -41 -456 4 111 15 92 69 -86 12 158 137 -73 -195 -88 71 37 -66 125 76 -53
5681 -53 -473 20 -128 103 53 -282 -25 -157 -17 142 -19 84 -115 -267 -53 111 219 140 -291 -177 220
5702 220 -52 106 102 165 56 92 -156 79 108 108 -31 -178 99 198 -24 -97 237 290 -246 -171 -43 -118 85 239
5726 239 -71 121 172 66 131 4 -51 -153 -224 -51 52 -21 -122 72 93 12 -235 -65 29 -58 -13 41 183 -28
5750 -28 -44 -123 -59 150 -142 48 -68 -180 148 56 199 -217 -269 170 -140 -1 1 10 51 22 -3 -262 -20 -314
5774 -314 113 -17 -145 -19 -96 40 290 -69 46 -95 -143 -42 -71 308 345 -39 -182 -56 128 -48 -91 9
5796 9 20 -104 175 -207 189 -110 -141 102 148 -59 326 105 161 163 90 94 -255 -201 -60 7 -51 -10 13 -55 138 -233
5822 -233 -84 -135 132 -53 38 335 17 99 88 -16 39 2 -183 -100 -117 189 137 100 -72 141 -86 33 184
5845 184 -97 121 199 202 -17 145 125 -86 125 -199 -9 131 -148 -200 194 30 -142 -73 -87 18 -352 -196
5867 -196 -11 45 19 87 -19 -28 -39 -347 209 103 89 -3 -210 113 -93 16 -150 235 26 -31 136 -174 118
5890 118 82 147 33 -31 -49 -98 46 -11 -30 -265 -40 -163 227 -175 105 -109 48 -184 -50 177 -235 76
5912 76 66 145 -80 -202 70 -22 124 160 144 211 -141 32 27 39 101 38 31 325 -113 -85 102 96 130 -84 -109 -26 115
5939 115 34 67 11 -25 51 -148 26 59 -189 57 74 143 -96 -82 -66 -9 -27 -1 -1 327 57 -7 237 -17 207
5964 207 -201 -72 66 -5 217 12 -91 250 -28 -317 -331 242 178 -2 -21 88 198 -20 -249 258 -71
5985 -71 -143 -73 154 -7 169 -220 96 238 157 47 4 111 -60 104 -108 9 -69 -9 -282 224 -9 78 189
6008 189 -56 -11 -87 44 -171 -154 19 -249 79 -45 -24 -62 -4 124 19 -84 167 -16 45 -8 188 -34 30
6031 30 -147 7 145 -131 -235 90 -48 -97 47 -155 2 -201 227 206 -304 -96 184 -36 -40 -86 131 -78
6053 -78 -85 -78 92 43 -45 170 -42 136 -133 -18 -165 -154 89 223 201 -62 193 -94 172 69 236 168 8
6076 8 -25 -68 -40 131 240 57 -77 -77 10 -18 -26 270 123 71 25 -82 356 34 276 -9 -65 -27 -56 -229 133
6101 133 -111 -129 -378 -138 -35 -58 -91 9 248 102 -125 -170 -122 29 44 -306 -25 -120 104 -6 -20 -21 127
6124 127 63 -149 20 -306 20 -2 -129 179 24 -177 67 -281 76 56 68 7 85 -38 -65 73 -62 39
6146 39 -259 103 212 -148 5 -260 28 -223 -249 -108 49 192 -116 -142 -95 165 9 104 -119 21 -182 129
6168 129 22 -75 16 56 13 217 38 25 173 239 113 -59 -35 95 60 -85 -4 210 -107 208 -63 126 252
6191 252 71 186 119 -198 94 217 -42 -202 177 196 175 81 237 -322 -255 -265 -288 164 2 35 -132 7 19
6214 19 -226 30 -109 -253 -58 -77 -82 40 111 -173 82 18 130 44 15 -95 15 -116 -127 51 4 -161 135
6237 135 35 -54 93 137 108 12 -4 -83 217 -142 -125 -45 -171 -105 -48 -54 -133 -150 33 97 -58 -102 -108 -173 -48 -5 -212
6264 -212 170 17 340 -19 -88 78 24 40 324 -45 11 171 59 -63 44 172 235 -92 102 -32 34 -15
6286 -15 -54 -147 -217 -17 -181 64 102 -99 96 -132 -309 -1 1 70 -82 9 42 260 52 102 262 140 183 -179
6310 -179 27 362 66 -64 113 130 -168 -128 -32 4 247 117 -144 159 559 -128 101 159 -357 -49 -27 243
6332 243 161 -62 8 -92 -89 -112 94 89 -229 -96 -105 -50 -88 70 -272 -176 98 -125 -2 -160 -138 -206 -234 17 -117
6357 -117 -55 49 55 103 -151 427 -68 13 -69 14 97 -172 -5 -84 143 42 -156 -73 56 -234 218 63 -96
6380 -96 -125 -11 -309 -163 85 -118 -51 -62 140 -220 -75 152 105 69 155 -70 -113 139 -265 -243 145 -183 234
6403 234 -35 107 -35 -87 -85 -332 -74 108 -42 156 -28 -21 355 -42 -251 -195 -102 -49 -52 -4 516 174 34 -110
6427 -110 -278 -33 -205 -1 -59 294 -34 -89 -48 -223 -216 -128 175 -100 -145 79 -85 -69 80 -107 -139 46 154
6450 154 88 -314 -154 177 13 -85 54 194 184 113 79 92 -77 -87 -274 -51 39 -154 118 249 -26 -61 145
6473 145 39 67 -96 13 114 -281 -195 95 93 219 74 132 112 89 -242 70 127 -263 -144 -4 48 40 20 70
6497 70 -22 57 12 51 91 -127 99 88 -118 6 -302 -126 44 90 117 181 -36 120 -43 -414 15 54 -35 -58
6521 -58 -107 34 69 -52 263 229 264 -135 -158 101 60 -37 190 73 -85 -9 41 -109 214 -199 -15 37 -22 17
6545 17 69 149 30 -99 69 -136 120 -132 129 76 24 65 48 -98 -80 81 -187 -17 25 97 -131 40 -122
6568 -122 148 170 -131 -49 60 -71 109 101 -67 -52 29 27 -183 31 157 124 236 70 123 40 -296 -15 -156 -63
6592 -63 105 -21 -6 67 -60 44 -243 118 -152 102 216 254 183 86 -315 40 21 128 33 35 30 100 170 176 97 102
6618 102 -223 7 12 -107 77 -218 12 -91 183 -219 -133 -145 -87 -172 139 202 -8 -8 -232 -217 -13 44 126 -50
6642 -50 -72 84 -166 203 -100 -11 -188 179 -55 87 84 175 213 34 148 -248 53 31 -1 33 -93 182 231 -70
6666 -70 -74 158 -6 -17 -68 -66 -119 57 17 -157 -134 -5 102 21 -6 5 -10 -69 -21 -230 -91 -79 -37 168 -437 -11
6692 -11 206 47 -30 -156 -47 -83 109 -204 162 -22 64 8 -140 276 190 -103 143 78 -172 42 145 371
6714 371 68 121 9 51 101 56 52 -79 33 -44 230 -152 -68 -203 -27 -31 -130 11 5 163 40 83 -198 -189 105
6739 105 -40 74 -163 -10 93 225 121 170 37 -136 55 285 -142 44 116 -7 70 42 66 -224 -15 133
6761 133 -257 -30 -98 151 -231 3 33 -147 -52 80 83 55 -32 -40 103 -54 -141 69 179 -1 127 33 30 -61 -133
6786 -133 -251 247 -257 -77 -20 -48 220 -372 170 32 107 85 178 -305 -109 -75 -342 -139 -7 -33 -27 58 138 -290
6810 -290 -132 -22 310 -37 -149 -165 154 275 39 21 67 91 153 -251 -83 -84 98 19 -42 112 -25 181 -241
6833 -241 128 169 89 183 -9 -135 115 -12 -121 -136 1 7 -8 181 -197 -243 -11 -249 -244 -5 65 -65 40 139
6857 139 124 195 -2 125 -37 -86 307 133 -132 17 41 49 -26 -57 -106 249 -119 -124 4 -193 148 85 -140 -117
6881 -117 144 -31 17 -37 -168 -12 289 -155 8 202 -120 -217 -7 19 -53 129 -62 111 -53 -110 -9 19
6903 19 60 107 -42 -44 -136 42 78 -62 78 -123 170 -231 203 -168 -68 97 -43 -462 -103 -80 93 -94 -21
6926 -21 -45 3 106 222 -124 -32 -277 -40 406 120 73 74 0 -128 -111 -54 395 -108 -92 185 170 -107 0 46
6950 46 -184 -98 39 -202 111 104 10 -128 -215 -98 62 118 92 -152 -125 -35 171 107 23 -60 -83 -160 -39 -195 -28
6975 -28 55 -135 206 -99 -28 -281 -67 -6 -142 1 243 -163 85 -277 22 142 67 94 -127 305 -73 109
6997 109 118 122 104 -17 35 97 -11 153 -21 126 83 34 -3 3 130 -34 -270 -36 -29 100 267 82 -150 -79 -52
7022 -52 15 33 -198 -53 -29 138 71 138 23 -22 -78 -348 27 -89 -179 124 262 -205 5 -1 -389 -152 5 -268
7046 -268 113 232 225 0 244 43 147 5 -189 57 22 219 72 -11 -112 -163 -137 311 59 -208 24 85
7068 85 -3 -18 -10 61 -138 -139 154 89 102 -17 -27 203 -165 -126 -170 -65 -368 -176 -19 399 276 -101 -208 -56
7092 -56 34 -14 -50 -79 -26 41 -12 46 -226 13 -203 44 82 162 214 -102 37 -179 295 111 -164 160 -101 -200
7116 -200 -59 90 122 218 -59 -218 -222 0 -297 82 -270 -33 -54 -50 -36 112 -44 72 243 -32 139 280 147
7139 147 84 40 51 -68 15 153 -198 -329 157 232 88 102 49 -237 -136 8 51 304 45 -150 270 -231 -2
7162 -2 -2 45 -110 -11 -119 146 53 71 -50 -6 -57 -224 93 -60 174 200 -125 -27 174 -38 -251 -31 76 -26
7186 -26 68 161 -29 141 79 -319 -125 153 151 202 -138 -49 169 169 -56 -45 -143 -63 9 -66 133 10 232 -30 -100
7211 -100 121 132 115 -58 30 191 -98 70 -65 265 115 -128 132 57 241 102 5 233 -277 -58 -42 -181
7233 -181 -31 178 206 89 71 12 176 -33 105 -26 142 51 145 -60 144 126 51 31 61 450 -39 -103 65
7256 65 -77 251 -114 140 203 -85 -121 216 -64 17 85 193 25 -99 -168 -108 -2 144 122 -302 -173 -88 31
7279 31 160 -98 89 -130 29 134 33 55 -115 264 7 119 -88 -95 -176 28 137 196 -28 136 130 -128 -71
7302 -71 -72 -229 24 -279 -205 178 60 296 -35 -145 -190 165 -218 -123 -13 -35 53 -103 -94 11 -20 1 51 -246
7326 -246 -4 3 95 -30 -86 -109 79 117 64 -52 -45 30 -419 -25 95 86 -45 -242 181 -96 -37 -223 77 218
7350 218 85 167 -164 -94 -296 121 -218 -182 101 -27 -72 166 44 -31 348 48 -24 -63 244 88 -83 -47 148
7373 148 -169 -173 -96 -80 105 -67 -111 233 1 23 -66 -163 71 -71 153 146 174 130 110 132 -52 241 211 -3 81
7398 81 -11 -185 23 -146 51 51 41 15 274 86 -69 -61 0 -76 1 -56 65 20 4 56 98 -106 35 0 -12 -11 134
7425 134 77 36 168 79 160 -101 -155 -46 -80 158 211 -1 135 -30 107 148 -2 -14 22 -93 -12 -80 175 101
7449 101 -141 -18 -30 51 336 32 -141 -301 101 132 -109 237 63 -28 -47 -40 -172 -141 255 -9 -28 294 83
7472 83 18 114 -248 -208 -185 310 7 137 -70 44 18 -95 87 116 -69 34 -90 -174 16 -34 9 77 -31 90
7496 90 46 232 19 34 284 -37 -106 274 -42 -103 -34 -143 97 92 35 -204 56 -75 257 -87 171 98 -88
7519 -88 273 68 168 281 -169 -2 -176 64 43 32 -26 135 201 326 -6 -83 22 72 -118 -116 -4 -53 80
7542 80 -171 -5 98 -66 31 -194 81 39 250 -15 -194 37 -49 -244 -162 -41 11 118 271 -196 -79 -174
7564 -174 107 -1 -197 58 191 -92 174 234 -103 -10 -33 -312 105 -28 127 160 48 147 -13 -46 62 45
7586 45 83 -87 208 -291 1 49 -300 93 150 -76 -295 98 -226 81 197 495 -96 -251 -19 -81 -63 -7
7608 -7 -161 46 -10 -16 40 49 -81 -103 -109 3 -50 81 -23 198 51 162 46 70 -156 -13 -45 -107 5 -28 -47 -115
7634 -115 22 129 -196 80 -216 -72 70 -416 25 100 -313 -89 -118 77 325 17 84 251 -6 118 202
7655 202 -30 -23 153 -288 -111 17 190 87 61 56 -180 -81 -240 52 -27 -42 -29 136 -3 -50 115 -135 -89 172
7679 172 54 -207 -33 -86 -214 -48 48 -83 31 178 24 156 168 -11 4 50 173 -44 -17 123 160 -148
7701 -148 68 276 24 -167 3 -166 -212 57 30 110 -51 10 207 -37 -266 -71 -224 -20 96 9 -160 276
7723 276 -180 -55 60 158 30 176 109 -79 88 130 111 42 -368 -43 -147 31 -216 -148 -6 -256 -35 -18
7745 -18 -181 -264 -22 -29 126 56 75 -208 -69 -85 -19 -60 232 149 20 1 -43 53 234 93 -21 -18 37 -176 139
7770 139 176 -4 165 -81 38 30 2 -40 44 112 7 -111 -87 -103 197 200 -205 20 -15 -102 -6 -97 83 -8 22 -5
7796 -5 -44 -92 -4 14 71 -65 126 -29 -12 300 -108 -53 73 -18 -110 43 68 222 190 154 58 35 -19 -81 112 293
7822 293 -72 -258 -205 112 -80 -249 15 44 52 39 1 189 172 34 -11 -240 78 29 11 -104 -50 31 6 -127
7846 -127 -178 23 -60 28 -62 -165 -17 9 9 25 -51 54 -163 2 -88 132 -120 153 26 -30 41 -51 -10 43 189
7871 189 158 180 114 -109 125 42 -173 -34 19 274 -244 -167 61 -63 -23 48 -58 147 264 292 62 -72 145
7894 145 73 -139 -13 315 -165 -306 97 183 -86 35 -79 23 -113 -158 125 127 52 327 133 47 166 -78
7916 -78 -162 102 -112 3 -141 104 -28 76 -175 60 -137 -204 -15 155 374 103 275 24 -23 -41 118 -94
7938 -94 -137 -91 -11 -306 -7 6 -121 -60 -98 -129 85 -267 -25 -61 -316 -78 237 -9 43 -63 193 -64 135
7961 135 -157 2 -1 -55 5 -52 47 -66 -37 4 112 -90 -12 -99 -122 -147 -235 -164 -8 -36 -35 76 82 -7 -96 -173 -13
7988 -13 -167 39 -59 -110 -33 39 142 -48 36 -355 233 50 89 40 37 -21 -255 -65 158 -123 -124 -148 -12 -105 -295
8013 -295 -6 -81 138 70 24 47 -1 -117 179 65 -178 224 94 -55 240 -19 -150 -4 -135 276 -15 -128
8035 -128 103 101 -262 67 -66 -209 37 -146 160 257 71 150 -159 -203 -2 18 -100 137 100 38 138 66 -280
8058 -280 -177 -141 -131 -183 171 -192 -35 26 -166 -115 -101 -45 110 -137 0 224 -6 183 76 329 -55 -95 81
8081 81 14 -69 -14 -71 250 -70 -32 125 31 -68 -116 21 85 11 -7 -25 -44 35 102 143 156 126 129 252 -48 -57 -26 -61
8109 -61 -64 -4 -138 -176 188 -14 -55 -169 18 22 -61 -268 259 7 -23 -1 -120 -170 -191 3 -13 95 -41 23 -67
8134 -67 -83 -71 251 -112 -141 196 -114 54 -106 165 -130 -62 -156 -64 97 -61 77 -46 -181 -195 287 -54 -44
8157 -44 97 -230 68 93 9 -323 66 123 19 92 192 -44 261 41 143 91 76 -129 38 -74 50 -216
8179 -216 -2 -149 -242 78 -5 71 109 243 -46 92 -80 418
8191D18
$$ Imaginary data points
##PAGE= N=2
##DATA TABLE= (X++(I..I)), XYDATA
0 0 0 0 0 0 0 0 0 0 0 0 0 0 1 0 6 0 8 -8 8 -8 8 -13 14 -16 16 -22 23 -28 30 -37 41 -48 53 -59 69 -77 87 -97
38 -97 110 -124 140 -155 174 -195 219 -241 270 -304 338 -377 419 -469 522 -587 654 -734 824 -927
58 -927 1049 -1194 1368 -1584 1858 -2221 2727 -3487 4747 -7232 14080 -85527 -164801 -322619
72 -322619 -436241 -367638 -528728 -625681 -525673 -436617 -292769 -248543 -145372 -50251 -28301
83 -28301 -2411 191180 272470 296403 288430 277397 164121 76864 80247 119662 122582 97570
95 97570 70793 2058 -98347 -183713 -131912 -164610 -195156 -234950 -290933 -419568 -434067 -443667
107 -443667 -303089 -199446 -65849 68092 178302 178015 289321 328488 349661 359686 316323
118 316323 193967 107526 11239 -73272 -72399 -29792 -49128 -86795 -11252 -76488 -126827 -26192
130 -26192 27471 -45735 51452 20904 -40127 -60742 -42882 -23707 58368 44132 138825 157947
142 157947 105866 128597 177065 126589 136055 130795 79546 20950 -45681 -61298 -80680 -104476
154 -104476 -115438 -85959 -131421 -136020 -121192 -63742 -58190 22266 61450 102744 98126 113654
166 113654 102750 127958 62985 68684 63101 -20159 -56094 -23386 -92465 -88703 -37343 -72209
178 -72209 -58671 -34509 -44015 -38305 -10967 -32793 -18085 -48459 -43237 -72850 -55210 -40290 -9425
191 -9425 3353 69856 58340 95138 100810 96917 89826 76236 27293 22515 -32930 -62314 -58809
204 -58809 -91214 -91240 -81237 -84043 -74669 -43616 -32331 18586 19149 53692 52121 47542 31444 50778
218 50778 20378 44200 34738 38903 17094 21349 399 534 -4798 3109 -14317 -6353 -16868 -38641
232 -38641 -20360 -29150 -39848 -20905 -22590 -54056 -17914 -32830 -18032 6070 30825 29518 61787
245 61787 38404 61313 47127 50243 46399 46361 15231 11205 -26038 -34662 -52474 -57915 -46924 -48807
259 -48807 -44310 -29081 -26603 -18952 7454 1820 28078 16439 19003 11010 9983 -1698 23552
272 23552 5626 34020 20154 22223 19820 17350 218 22402 -1077 3507 -1606 -16879 -22459
285 -22459 -29746 -37108 -29999 -34488 -32766 -12028 -23122 744 6850 17602 19678 32447 17265
298 17265 32495 9339 26032 17435 19045 11371 18874 -8647 -5449 -21849 -18397 -25776 -21064 -9644
312 -9644 -7592 -11647 949 -1543 -11029 681 -6865 3944 -5187 5033 8639 9066 -2455 23750
326 23750 -2051 10860 8474 10576 7585 17467 -409 20128 -4936 -9174 -5575 -19131 -28483
339 -28483 -12825 -20550 -14580 -4497 -6067 6756 -15 8914 8918 9953 6139 18163 -598 16804
353 16804 2481 4893 788 5526 -12579 2968 -10616 -2818 -6537 821 -2005 4239 -2289 -243
367 -243 -3113 -4974 -9712 -7250 2759 -10071 1418 7536 2753 -4925 14550 -793 5053 -1052
381 -1052 15094 1893 3318 5753 14511 -14766 1982 -6594 -14890 -15142 -8372 -5895 5108 -5975
395 -5975 13167 16135 -12094 8354 12519 -8474 489 17919 -4151 3176 -3763 2856 -13071
408 -13071 -7822 -4849 3369 -10892 11768 3636 8627 2667 4565 -1106 -223 -15826 -3366 -1630
422 -1630 -9051 -1275 10683 3143 -4070 12770 5445 -240 6827 16653 -4013 10015 -450 -3064
436 -3064 -10648 -6387 -18339 -6072 -18626 -3786 -5653 -1606 4653 11555 -2309 10780 4795 -4226
450 -4226 475 3264 2146 -5736 -1538 4736 -7908 -17979 18450 -1399 -9811 13326 17875 -15996
464 -15996 6735 9788 3223 -12458 3551 -5284 -17284 -25215 -3129 -4577 -1055 3455 18577
477 18577 13231 -7007 2783 20397 3129 -3555 27955 10207 -14635 -11377 6812 -18622 -13665
490 -13665 4107 14086 -12655 810 10651 14906 -2376 18097 24729 2417 -21116 3259 -7945
503 -7945 -22481 2594 16655 -836 -5244 -472 -5667 -5348 1058 26341 17381 14455 7072 -5802
517 -5802 -21192 -6396 -22204 -2715 3405 -10285 -16095 4974 -12134 559 18824 22664 10781
530 10781 9869 -2324 -8309 -8068 -6512 2162 4450 -8422 -23763 -11683 -20100 -15021 5698 26313
544 26313 10369 11638 1594 868 -16932 -7377 5788 9205 -16285 -6589 -8857 -21131 -20740 12639
558 12639 19581 6061 9475 17636 -4377 -15732 12111 14975 3069 235 5266 -22590 -30163
571 -30163 -21239 -933 -4263 13320 13254 12598 408 384 210 20106 6379 6053 12706 -4617 -26046
586 -26046 -7564 -5409 -10835 2572 5803 617 -5228 -424 6234 18233 11562 20170 11345 -3552
600 -3552 -21530 -10369 -16106 -7912 383 10993 -481 3357 -3324 2456 6682 13604 16074 20574
614 20574 8175 -1852 -6165 -10772 -10504 -12084 -3803 -4617 -8176 -8776 7250 -663 10481 18408 17665
629 17665 3535 10544 -3946 -5034 -4773 449 -6285 2246 -6172 -9520 -6766 -3185 -4628 8271
643 8271 13032 7950 10255 4233 -1423 -4808 -4715 -9668 -1541 -11897 -8493 -8054 -5661 -9521 7110
658 7110 4383 8969 7361 10394 572 2669 -769 2400 -2115 -1540 -5951 -9739 -14883 -14200 -9869 -5607
674 -5607 3774 7102 11932 7769 8254 -5 4193 -2270 1207 -1958 772 -9132 -2410 -9106 -5191
689 -5191 -2211 4607 242 8937 5704 4237 5651 7910 3621 2306 -170 -8299 -10821 -14213 -8391
704 -8391 -5446 2734 4302 12184 4011 5242 2085 6553 861 10440 7120 5295 -4310 -2625 -11257
719 -11257 -10486 -8606 -1054 -2274 73 2317 2585 384 3424 8151 3433 3130 -234 -1880 -9880 -4165
735 -4165 -4510 954 -2838 4002 -2097 -911 -4197 5285 2343 8224 7449 8137 -1044 -1964 -5567 -6477
751 -6477 -8033 -3567 -3010 -5355 -2199 -1698 841 2806 9028 6453 8087 2062 4684 -2608 742 -512
767 -512 2736 -3838 380 -6735 -5769 -8051 -223 938 5623 6139 9994 2447 -408 1055 -3515 -4821
783 -4821 -1949 744 -3894 -2150 -1424 2896 -4497 3123 5178 2930 -1705 9230 1987 1542 1397 5133
799 5133 -5140 -5297 -7455 -5358 -9653 -4489 1801 3909 -193 3818 6277 -2661 -694 4985 3085
814 3085 -1652 6543 1029 -838 -4864 -1027 -4822 -2623 -4832 4762 -1437 1026 3776 4761 -1780
829 -1780 3887 -720 -1891 -3661 -3357 -2736 -2981 -1932 1234 503 -1468 4363 -54 2231 3052 6360
845 6360 1486 4851 2683 2052 -6122 651 -5166 -7229 -4652 84 -6330 831 1473 3224 1671 2243
861 2243 3345 2362 -2686 625 4256 -3632 -581 3983 459 -7975 2111 33 -4370 -2074 8402
876 8402 750 3073 2596 5878 -3008 -5543 -2434 645 -11719 -1518 4512 -3814 -2665 5570 687
891 687 -1910 1062 4271 5473 -1948 5915 7972 -2087 -4835 5182 -7363 -7686 -3554 650 -5335
906 -5335 880 2276 5378 -2389 1546 2231 708 -3548 2353 3262 -1208 -2299 3244 -1257 -6803 1145
922 1145 388 -1354 904 5881 1820 3548 1059 4185 -2460 -580 -3042 -3265 -6247 -1088 -4248 -191
938 -191 -389 2402 13 1175 2997 2538 -180 6013 5037 -1023 2899 50 -3063 -5249 -2946 -2367
954 -2367 -1850 -7068 4786 749 -3244 3877 7974 -3499 2178 88 -1028 -4033 -2557 1040 3444
969 3444 -4513 903 3412 -5117 -4016 4337 5409 170 6287 7982 779 -5121 918 -3682 -4776
984 -4776 -6528 777 -1854 -4774 -2941 6629 -2617 666 5138 3775 -843 1794 2259 4631 -873
999 -873 667 3387 -5188 -7009 -3015 -2140 -2717 2450 4320 6522 -1058 1565 388 -1251 -3427 1579
1015 1579 -1387 -148 -5809 -855 -2202 -4455 -1092 4655 -1024 2503 4122 1927 3910 2785 2468
1030 2468 2611 -1871 -5102 -2526 -7219 -4194 -3316 207 -481 1591 -471 3266 -691 2477 1003 3056
1046 3056 1323 926 -591 1534 -3959 -1459 -647 -2085 -402 -96 1735 4328 1972 3553 7109 -977
1062 -977 1057 -100 -2402 -4426 -2077 -3427 828 -4048 1697 1876 83 -699 3607 1574 3360 3815
1078 3815 7920 3715 86 499 -3280 -6922 -4549 -2208 -1634 749 -773 3358 -1036 -1760 2565 3056
1094 3056 -1444 5035 -1164 -1418 -2715 -2963 -2516 -159 -3852 1034 -2734 -3565 1604 1989 3968 7768
1110 7768 3838 984 -1966 -6210 -4469 -5370 -865 254 -1448 -3270 -1656 -6307 -376 1265 5681
1125 5681 4963 4736 1542 542 -4234 1069 1337 739 4 -1249 -5054 -5986 -2588 2360 3914 5159
1141 5159 6943 -77 -2147 -2992 -1628 399 3645 1640 3139 -5873 -5031 -3365 -3143 472 7641 1775
1157 1775 3866 2065 -859 1840 3212 3037 5113 -2410 -5135 -4182 -9453 -3063 2607 2108 3340 2906
1173 2906 -3907 -1953 -3676 2735 5343 5264 4142 2268 -7434 -5572 -5529 -2645 -449 3211 2477 18
1189 18 -2182 1212 1104 2390 5398 3402 85 -4612 -2959 -2929 -3139 1170 4519 -3280 -896 -3143
1205 -3143 -3037 49 4421 6267 8296 -353 1725 -1795 -7251 -1510 2581 -2370 2011 331 -3418
1220 -3418 -1874 -2507 2002 4883 1316 3358 3582 -4806 307 731 -64 927 1815 -2629 -2304 -6373 -1432
1237 -1432 -434 925 3812 5511 202 851 -273 -820 -1058 595 720 -1584 -1763 -2262 -2660 -2329 798
1254 798 -303 1012 -679 2303 622 839 3405 3815 -1685 1716 -2824 -4488 -3719 -1964 -433 1170
1270 1170 -558 4292 639 -2914 3378 636 -1691 3799 1796 -482 1206 -2679 608 -2728 -4342
1285 -4342 913 778 -3859 5033 2585 598 2391 2731 -495 -193 -2268 1425 -1284 -2611 1507 37
1301 37 -3328 16 996 -1524 -347 1713 2282 -633 3027 2074 889 -545 -221 -1870 -1177 -4345 1482
1318 1482 -385 -2049 1916 2004 -2630 1959 629 210 1192 817 1390 -517 -1583 1091 -1586 -3076
1334 -3076 1443 -2050 -1466 -481 -320 1059 2476 782 5052 -551 -828 866 -1983 -4006 1940 -1059
1350 -1059 -225 407 -433 -414 -1340 -442 2425 -76 829 3947 49 -106 929 -145 -2302 -1659 -2262 -783
1368 -783 -2666 403 844 2317 266 1837 1032 -746 -2438 3123 -692 -958 3368 374 -2983 -408
1384 -408 -2120 -1652 -654 -1404 2926 1169 -40 2907 1501 -2497 1378 -742 -379 -1969 -601 534
1400 534 -884 -1874 2557 -1400 -749 717 480 215 1669 1640 2454 59 -311 180 -2479 -1902 -1755 -830
1418 -830 -150 -535 -214 3098 -1430 743 2476 255 -764 2182 -737 8 -760 374 -397 -1093 -791
1435 -791 -199 -2109 -54 292 919 1916 794 2321 377 -1174 -137 -675 -3293 755 -926 -646 239
1452 239 111 -616 1180 -156 1436 -334 946 1596 783 313 1641 -1036 -668 -1948 -2781 -1015 -1670
1469 -1670 -385 2357 1394 371 1862 80 -355 -1472 1642 -206 -798 1077 1511 -3379 315 -234
1485 -234 -2213 -474 1118 -76 1899 427 2157 2569 -1045 381 648 -3211 -1859 111 -1077 -460
1501 -460 -1 1649 -440 -755 776 1142 -832 2567 1059 839 18 -508 -882 -928 -2076 7 -959 -945
1519 -945 13 529 1246 461 1650 1968 -604 -105 1156 -2350 -156 336 -752 -548 133 -1274 5
1536 5 -1530 1257 365 76 1824 1553 -725 1988 144 -1096 80 -2151 -1635 -870 -1720 1492 1855
1553 1855 -960 2220 214 -1554 136 1253 -342 1793 530 618 -1413 -1328 -1170 -1447 -1521 552 -621
1570 -621 148 688 1713 1166 1173 885 133 -1280 -1485 -562 -715 -81 105 1098 -1298 -1652 -761 -298 -861 3824
1590 3824 2074 1477 1262 -207 -2032 -562 -1541 691 -691 -1295 44 -1322 -1227 1614 1203 1148 2064
1607 2064 -416 -46 -1231 -987 1663 1054 -1035 1558 -2368 -3210 -964 -22 57 2663 1965 1920 -736
1624 -736 -657 42 99 171 1738 -466 -1857 -1548 -1218 -1072 479 2697 1373 -68 -351 -650 -1139 1563
1642 1563 2446 3182 116 -681 -1950 -4258 -3172 1287 163 1660 2184 -74 -915 -300 -277 2199 1056
1659 1056 844 1783 -1951 -2025 -356 -705 92 1156 -793 -556 -2196 -894 1364 1884 2275 3623 -385
1676 -385 -2124 -2372 -1925 -1587 795 1869 1276 -1341 -1091 -1317 -1878 862 2953 2184 984 1015 -941 -1645
1694 -1645 -941 926 -298 -247 -588 -1470 -2558 -327 1032 2452 1612 2086 465 -1645 -1533 393 -396
1711 -396 959 1438 -383 -988 -2214 -1351 -336 163 1374 1795 -582 936 97 -54 884 1108 -188
1728 -188 747 -2505 -1494 -355 -1380 239 2725 -324 -341 539 -915 -1138 643 1705 857 478 318
1745 318 -672 -2290 -1220 -986 -401 -937 1246 469 233 588 2177 -278 668 806 -289 -1107 -52 -277
1763 -277 232 -412 153 145 -1494 -791 894 -117 731 2419 767 530 88 -344 -1110 -621 -1160 -228 -131
1782 -131 319 -38 1347 -161 -270 1039 237 -1300 1860 640 -499 1180 208 -1128 -311 -786 -1071
1799 -1071 379 -464 253 458 268 353 1478 -129 403 470 -249 -1312 -183 -536 -77 39 18 -481 -893
1818 -893 -901 119 148 46 1354 1116 -236 728 29 -1471 -31 -254 -875 181 -347 -1217 1405 -223
1836 -223 16 1543 390 -871 939 -447 -1016 1004 1059 -581 80 -646 -1679 -1098 -817 -280 1683
1853 1683 1052 526 1966 -210 -999 558 146 -1406 807 -2 -209 -655 45 -96 127 -693 1253 65
1871 65 -676 1455 1223 -264 922 768 -1356 -867 -825 -1128 38 220 263 1562 -150 -526 749 166
1889 166 -1521 1705 837 -602 691 373 -1648 101 -205 -658 43 -174 -770 1004 -19 70 1781
1906 1781 383 -655 561 -215 -1892 215 -172 -819 99 755 -895 -250 -142 261 -144 361 870 721
1924 721 -562 885 548 -991 -329 229 -1161 -720 179 -490 617 644 289 1153 -4 -1204 837 -443
1942 -443 -787 1029 784 -1189 292 109 -1560 -735 174 -353 808 865 196 904 401 -736 425 -46
1960 -46 -1133 313 245 -608 493 877 -645 276 440 -218 -83 605 454 871 99 490 -264 -591 -454
1979 -454 -301 -1186 -54 141 -228 476 916 -148 108 507 -166 218 96 -170 544 32 -633 715 -259
1998 -259 -1249 -22 434 -1032 872 966 -18 66 945 -202 -15 -255 -632 -484 -504 -322 164 132 -276 491
2018 491 -10 -102 -171 -30 -297 474 475 300 163 107 -528 -438 -702 -239 -300 308 801 618 579 427 319 -260 -433
2041 -433 113 -305 -494 349 18 -340 -224 -421 -697 36 -770 596 877 -20 676 1131 -735 -413 -117
2060 -117 -840 -603 278 230 -336 308 647 24 -223 303 443 21 -251 467 197 -368 63 350 -720 -451
2080 -451 -291 -572 -608 443 555 708 241 389 -61 -164 -74 119 -67 228 -65 -199 -25 -723 210 66
2100 66 104 375 502 -372 173 435 562 235 221 -272 -518 -1297 -194 -446 -167 683 1016 -154 31 -41 -536
2121 -536 -305 370 566 -65 396 66 -266 -590 -39 -231 -72 -4 302 -344 300 764 651 -47 611 -271
2141 -271 -1223 -400 -105 -357 377 464 340 -479 -641 -239 -185 -109 628 957 370 133 -518 -188 -508 -492 -47
2162 -47 110 -642 70 -50 324 33 265 958 105 -630 528 -283 -477 688 570 -159 -147 -239 -793 -670
2182 -670 -55 526 428 635 443 148 -297 -42 -700 99 -9 -52 -409 -77 -345 -152 63 659 -164 247 49
2203 49 -516 -121 24 441 592 331 -265 4 -1018 -584 -103 -29 403 734 164 400 20 -340 -176 420
2223 420 -173 240 50 88 -667 1 295 -698 -225 296 -474 -102 816 228 479 251 135 -114 -807 -321
2243 -321 -53 -554 79 326 373 -10 -596 -383 77 -266 380 960 531 -37 174 -364 -603 -867 -327 -52
2263 -52 -263 120 237 -109 58 469 605 5 -234 359 -230 -745 202 571 -606 267 311 -352 -640 164
2283 164 132 95 496 768 261 -241 178 -503 -281 -316 97 -71 -291 -103 558 -379 -186 536 66 -358 291
2304 291 -12 2 -331 522 419 -116 409 -158 -972 -173 -203 -145 556 244 316 245 -468 -484 21 -635 -118 437
2326 437 -26 -226 144 -322 181 -257 635 54 -101 521 139 -235 463 367 -94 -904 -233 -496 -602 187
2346 187 225 428 279 5 -103 -75 -499 563 613 -443 452 556 -901 -195 -104 -758 -247 345 -25 544
2366 544 -109 276 420 21 192 369 -223 -352 -84 -497 -80 -402 458 210 -166 161 9 -460 48 314
2386 314 351 292 210 198 -187 -179 -230 -258 -133 217 -128 353 231 -62 293 264 -87 68 -125 -258 -19 339 -56
2409 -56 308 263 -73 -478 198 -416 -656 503 327 -259 820 -226 -296 -241 -685 -290 385 -368 99 325
2429 325 -459 125 83 -241 251 -133 -122 422 194 190 316 -186 -266 -333 -871 78 185 74 217 531 -84 14
2451 14 -158 -262 -364 96 -100 -109 287 49 -94 -279 -146 -120 -116 19 577 221 -96 218 209 -212 -247 18 -190
2474 -190 -115 -4 165 -14 72 527 6 -151 -61 -106 346 1 -26 779 -196 -415 592 -557 -423 65 -260
2495 -260 -3 -150 -75 553 159 -129 469 -55 -195 373 -523 -320 140 -155 297 122 -117 -322 -162 -377
2515 -377 -388 186 389 93 307 33 21 42 -260 -563 149 -467 1 378 -299 188 25 -157 77 -352 -6
2536 -6 333 -166 195 148 162 -56 -91 -344 -335 91 23 661 -163 110 497 -263 -197 308 -130 -327 185 154 78 -341
2560 -341 -96 25 -137 82 423 -279 -128 20 150 -20 -148 282 -172 -346 -49 -258 -215 -88 -33 278 142
2581 142 52 36 -98 -219 177 -141 52 23 -394 86 -191 -306 -190 88 -366 33 -36 60 320 247 329 -44
2603 -44 -192 -87 -342 -412 57 -151 308 285 -200 99 -334 -499 223 -16 361 396 180 326 130 -517 262
2624 262 -225 -154 63 112 -146 250 173 236 -233 -191 99 -351 -13 199 73 290 -270 31 248 -395 -370 315
2646 315 -412 -21 273 284 333 -443 -84 404 -125 -518 249 -245 -229 128 388 26 -19 -171 157 -124 -220 166
2668 166 157 -41 -68 417 -271 -498 167 -23 -584 -108 -89 150 137 92 281 403 -527 -40 124 -485 140 470
2690 470 13 -298 -30 1 -191 -368 147 538 41 334 438 -122 -108 -51 -57 -324 -204 -186 -349 8 106 -92
2712 -92 157 480 -191 -125 -312 6 212 393 434 247 -296 -302 -8 -228 -272 470 447 54 20 173 -163 -213 287
2735 287 413 -174 -83 -25 213 -205 -149 547 -61 -638 305 -14 -783 141 292 353 297 -222 102 -496 -927 78
2757 78 -88 -192 457 311 -447 -189 283 106 40 214 241 -321 -109 141 -288 -315 285 498 -319 -480 -291
2778 -291 -53 88 388 441 438 298 -59 -279 -435 -122 240 345 -214 55 -74 48 -18 362 -97 -14 198 328
2800 328 -168 20 435 175 -123 -214 -334 -468 -55 -65 273 201 119 201 -227 -751 100 -203 44 469 89 172
2822 172 74 -416 -127 56 -146 56 -16 -130 305 29 -24 174 -54 -202 -169 -105 -194 -40 -80 189 74 146 56
2845 56 -179 -42 77 385 281 -180 520 -25 -32 131 -75 -66 174 -98 126 121 -57 305 -356 44 -38 -133 120
2868 120 -272 -255 150 28 245 177 89 18 -228 -177 -174 168 16 255 207 174 -37 -344 -64 -212 -355 -39 29
2891 29 66 402 84 -394 -12 -74 41 169 65 198 311 122 63 -210 -137 -496 -29 -36 161 285 197 -8 23
2914 23 128 -181 74 -267 -75 -114 -229 69 132 -72 -58 125 -339 32 -132 -85 172 203 -10 144 33 -221
2936 -221 -77 -32 175 -143 -250 -10 8 -24 -60 64 42 32 -98 278 -177 -6 220 50 -1 -176 -88 -58 -380
2959 -380 51 440 262 186 122 23 -126 -116 142 40 -59 217 134 35 13 -38 26 91 260 158 45 -112 260 231
2983 231 147 68 -1 -296 -426 -1 -237 -47 366 116 226 -208 -91 -226 -236 -124 219 127 261 -212 161 -89
3005 -89 -243 -150 -372 -60 71 286 154 143 65 201 -271 -292 2 -315 -189 312 -244 78 258 -213 -158 -148
3027 -148 -220 96 -46 112 150 80 174 1 61 -91 78 -290 -59 96 -1 318 -14 123 32 -208 40 -8 -66
3050 -66 -62 -31 -85 110 -130 8 -97 -149 -37 27 188 -119 63 395 2 122 323 -80 133 -97 134 -168
3072 -168 -8 -21 297 122 -67 132 -283 -19 -167 291 111 344 150 215 -309 -205 77 -357 -119 276 328
3093 328 16 37 -172 -81 -365 -221 -3 -87 -173 281 120 -119 -348 -52 -18 -223 -88 6 171 96 276 -11
3115 -11 70 -103 -212 -86 -204 -61 -37 67 133 -227 -166 -64 -117 -137 -186 80 -17 168 17 24 -103 -5 9 -208
3139 -208 -34 -293 256 89 -38 55 228 -245 185 -58 -109 -122 -38 104 -10 -111 -29 -8 -187 -140 29 -403
3161 -403 -162 548 30 10 131 122 -99 -604 -61 -38 -271 -18 377 194 -303 -36 -14 -316 -26 129 -51 -229
3183 -229 115 165 16 47 46 -281 -385 -119 128 213 116 243 177 -126 -153 48 -197 184 123 101 -117 -111 -51 -128 -38
3208 -38 14 135 -9 170 -54 40 330 394 -111 -63 -83 46 -145 -50 97 223 -80 30 -204 -236 -187 -150 98
3231 98 41 113 51 -32 -382 -104 165 -120 226 -37 55 -92 -102 342 301 33 136 32 32 -128 -333 382 157
3254 157 134 288 99 -216 51 -302 39 32 210 133 47 -141 -60 -107 -252 -73 2 -221 -131 -25 -8 241 50
3277 50 249 -44 -10 -44 -169 71 47 530 221 77 -243 -241 116 -60 -23 103 405 102 159 -302 -32 -70 188
3300 188 93 2 353 222 77 109 -9 -388 -71 -152 -95 -355 -100 147 8 -7 182 61 -467 -226 -24 -12
3322 -12 49 289 94 -116 -259 121 167 -94 -207 179 273 -205 -15 -95 -53 298 -105 -204 -66 128 -266 -24
3344 -24 67 135 141 -23 -89 -280 -274 -102 109 -123 -32 230 54 180 -61 -59 -121 98 -163 -162 78 21 222 -67 225
3369 225 -138 -62 -71 63 118 189 149 -70 79 -54 -141 -149 -79 204 313 118 89 30 -149 -72 -143 -134 36 -224 279
3394 279 336 506 84 -35 -144 48 -27 5 -17 249 178 -6 99 58 75 -213 -120 -152 129 -59 126 269 2
3417 2 111 -23 -164 158 -43 -98 42 266 162 6 40 108 -90 108 172 231 -54 -42 180 127 6 -6 -64 -124
3441 -124 150 71 -72 26 230 152 138 103 -179 -90 -83 -49 61 -79 -4 274 164 4 4 -343 43 -263 -5 286
3465 286 306 -344 136 -279 -89 -5 -170 294 -74 202 129 79 217 214 18 -178 -212 -74 -126 77 1 291 325
3488 325 117 -49 -44 39 -230 224 261 307 -95 -85 -123 -218 -264 -69 -141 -36 133 331 72 -32 142 57 96 -105
3512 -105 168 158 -168 189 138 195 85 -283 144 -88 -245 7 139 -91 156 160 -321 51 263 -246 -11 6
3534 6 62 -100 -258 10 4 -5 143 6 -165 -43 55 190 85 105 127 219 145 -5 -140 160 17 92 -281 -57
3558 -57 92 -202 -158 80 -6 -204 -5 92 27 102 71 69 -86 -445 -20 -164 -160 156 -67 -126 178 -285 -164 -199
3582 -199 -485 276 46 -185 313 102 -204 98 343 -24 -386 244 396 -52 2 169 -6 -165 -270 -137
3602 -137 -345 151 92 -16 -2 -154 208 35 -177 215 -139 16 103 218 -112 -43 160 81 -83 17 -242 46
3624 46 121 -101 -14 -99 18 2 -287 85 200 -292 39 236 36 -50 123 -119 -217 -161 -82 199 -38 -180 276
3647 276 246 -102 341 -48 -418 -210 -138 -11 -47 -174 55 -48 -67 78 263 -459 -188 -36 87 209 271 -71
3669 -71 109 141 -458 82 -142 140 89 378 -25 42 -29 -196 -168 -116 -80 59 71 185 311 106 -80 170 -272
3692 -272 -38 -456 173 230 -313 132 -155 -290 -157 -123 -169 46 -231 154 183 109 242 80 -183 10 130 72
3714 72 19 -48 177 352 -12 -13 260 75 -267 115 -269 9 213 173 70 -16 113 -199 -23 -90 -89 -25 -191 -102
3738 -102 181 -159 -191 -124 -26 149 -109 -329 -247 187 41 -49 82 -268 42 -100 101 60 -165 191 397 50
3760 50 -133 31 -77 -280 320 12 -128 94 288 23 -50 48 -39 -118 -16 -259 175 10 -43 79 -136 0
3782 0 -4 -57 6 123 213 143 247 85 -61 75 -86 126 -14 194 -4 73 310 -270 -389 -142 57 -86 176
3805 176 -6 -18 -218 204 25 -202 208 492 -259 10 222 -205 57 257 -181 58 -141 -238 -41 -4 97
3826 97 132 159 218 100 30 -269 -229 -194 -415 108 27 4 137 -73 -123 331 156 -73 13 -166 -352 -67 64 423
3850 423 100 -194 -106 35 -415 -105 119 31 488 62 -6 -258 -319 21 -199 -141 120 66 104 -67 43 -108
3872 -108 147 -173 -226 100 28 80 172 159 344 -79 21 -36 -76 -71 67 141 -73 76 159 -13 -133 -228 -141 92
3896 92 212 69 359 -77 -164 84 73 -213 306 208 36 109 233 204 -32 -59 -251 177 10 237 -158 49
3918 49 144 21 -211 44 -115 -147 -88 -157 198 -197 79 211 -10 33 64 47 -203 124 50 -21 30 172 148 28
3942 28 -21 -199 22 -105 -322 120 42 -134 12 -99 -31 -239 -38 -133 -185 -251 215 -84 -5 89 -270 26 157
3965 157 -327 101 135 -24 -78 -224 -152 10 -190 71 135 -184 158 364 9 78 91 -6 -234 -146 85 88 170 -11
3989 -11 170 -119 -333 161 -12 -81 329 -94 106 71 -12 -162 -79 -12 -133 98 -187 196 226 -34 -132 280 32
4012 32 -133 30 241 282 -296 175 225 17 -85 422 -301 3 111 -212 34 180 229 192 3 304 -320 64
4034 64 170 1 -253 -194 78 -143 107 -180 -199 157 68 -54 178 -11 95 25 36 -34 87 -107 -121 -25 -137
4057 -137 -160 108 30 54 -33 82 -165 -111 -82 20 136 -10 58 228 -169 -50 117 -123 212 -48 35 233 1
4080 1 184 426 106 -54 11 -112 -32 -106 111 54 -139 -123 6 -195 -42 -229 193 -7 -24 206 131 -126 156
4103 156 -121 5 -105 231 157 50 62 286 -204 114 76 -154 -111 213 93 69 -324 21 92 72 -148 -205 45
4126 45 23 382 -37 52 -158 -77 -51 381 115 -331 -13 51 142 244 130 -11 171 10 -164 -68 -83 -43 407
4149 407 241 81 78 -114 84 -45 -53 94 72 -86 32 313 -22 -285 31 -348 61 -182 2 7 134 263
4171 263 24 -230 -158 -42 -46 -105 196 -144 254 167 -281 56 -170 -19 69 -80 -223 19 -14 85 -38 -90 -284
4194 -284 -266 -169 14 -107 -297 28 -176 180 173 -24 43 -134 19 140 97 308 175 19 -20 107 -130 113
4216 113 173 23 33 -218 161 -72 35 62 67 -51 107 127 -281 79 89 219 227 -40 -22 57 70 -85 200 -18
4240 -18 202 -191 150 -32 -32 15 170 53 134 100 -116 -208 -259 42 8 -217 -146 198 -65 156 204 37 -61 -335
4264 -335 -55 21 -177 47 52 353 114 262 143 -23 -117 -142 42 44 125 57 -61 237 269 76 -63 -91 -26 14
4288 14 -70 72 -28 57 -48 -85 -235 53 -36 -182 110 176 154 -127 -3 -244 -149 -285 86 34 -88 154 113
4311 113 278 33 59 83 -84 120 29 -75 14 -18 83 -57 -104 -94 56 -208 -63 -14 -151 108 -137 92 41
4334 41 -37 -71 -207 117 11 1 161 71 28 -270 -135 43 28 107 -95 346 90 -158 191 -24 -145 -171 -188
4357 -188 -393 31 -152 88 152 -73 115 -148 109 -206 29 128 93 419 -47 -14 233 70 -173 107 -318
4378 -318 -139 -116 64 -16 169 -140 21 -36 -21 121 91 182 -20 90 115 -216 -44 -72 -392 -125 331 205 157
4401 157 225 29 -39 -8 -244 -119 -174 -65 71 -132 136 -105 141 -237 -111 -133 -41 -89 -52 343 -17 -109 25
4424 25 148 -107 101 -72 -60 -194 -4 -82 242 378 -19 170 -137 189 -105 -76 155 100 64 44 124 -118 -59
4447 -59 46 244 -44 -93 101 256 192 30 -26 28 -48 -85 309 30 107 154 25 -397 44 -169 -256 -75 -190
4470 -190 -159 138 -17 157 35 -3 -15 215 -115 -137 182 -323 -155 -85 -84 26 172 -243 35 -21 -83 -202 80
4493 80 -17 -132 104 -98 -199 48 -178 217 3 78 -91 79 -176 -149 -106 -37 68 -62 42 117 232 -162
4515 -162 63 195 -101 -126 -199 97 96 -59 440 -15 46 -31 -14 -45 -57 82 109 4 284 154 -268 224 -229
4538 -229 -29 70 153 -66 72 252 45 -112 -104 -43 -150 -107 -170 319 141 202 -152 -18 -212 -75 -60 42 -52
4561 -52 98 118 189 14 -329 182 -67 -24 -31 7 33 52 195 230 -151 -154 -103 -85 -39 160 -165 -132 -35 139 40 31 366
4588 366 -205 -60 -136 95 100 -229 -83 124 212 -303 141 186 -190 134 -42 -382 -91 31 -70 99 41 248
4610 248 -8 67 -74 227 -99 -122 -84 -59 -38 38 253 218 41 -6 -8 160 -83 -58 -205 -4 45 -87 20 -19
4634 -19 127 -291 -6 -107 -216 -317 43 285 237 -9 -390 161 -30 -84 -55 -26 77 244 146 194 74 -111
4656 -111 -134 -99 208 203 77 162 79 -125 -30 -83 -33 -275 56 29 -11 -95 198 84 169 -55 -145 77 -175 246 -20
4681 -20 -41 -209 -13 -57 1 -160 -233 -99 -10 -248 205 36 87 -70 -4 -55 28 98 -36 -44 110 63 6 -190 -174
4706 -174 -100 -164 192 -96 -325 -20 -18 77 132 193 10 36 -2 -159 -12 135 256 267 196 -127 79 -14 74 -115
4730 -115 -48 172 26 242 146 -35 3 -22 -354 -219 -187 -286 67 69 185 193 72 189 -59 15 116 -19 55 257
4754 257 185 -24 -101 -171 -144 56 -9 -361 56 197 87 85 -149 -205 -73 -101 24 -18 -75 -19 20 -20 185 0 0
4779 0 -16 59 -129 37 -235 43 -57 97 106 24 42 87 92 -148 71 155 -87 -23 243 3 38 -33 51 -192 174
4804 174 87 129 -130 -121 68 132 32 -67 -69 -44 175 -32 21 224 65 -193 -138 59 116 -16 -175 94 -108 -216
4828 -216 162 -59 -119 158 72 26 34 78 -16 40 -105 -162 -167 36 5 243 340 87 -24 -86 -13 -71 -170 74 184 96
4854 96 194 -382 89 149 -95 -109 -246 208 194 -282 110 -182 -161 -134 15 -136 -166 -98 -91 86 -102 -4 -225 -112
4878 -112 54 24 -46 -166 -190 -59 139 -97 -46 119 132 -28 190 -170 52 71 79 -125 -166 84 25 61 109 -101
4902 -101 -36 198 60 227 -192 -68 245 62 127 149 84 -56 162 -23 -75 -26 211 -7 -452 29 -84 -13
4924 -13 -27 161 179 34 -19 -275 -3 289 85 35 -55 90 -122 118 -18 175 -162 66 -98 266 100 153
4946 153 33 77 225 -9 -122 -15 50 4 110 25 130 69 -34 -208 113 -60 90 154 31 161 98 -19
4968 -19 217 -205 -136 -194 74 338 32 88 -4 -200 91 -42 80 -124 74 27 -70 -226 -25 -19 -87 -183 39 165
4992 165 -97 23 -37 73 -49 -37 -113 124 -73 -71 169 132 309 -4 72 -147 245 -175 -16 188 15 -40 -197
5015 -197 128 -187 29 -2 207 -302 55 -152 308 14 243 -77 -259 16 -223 -247 -197 -14 -199 -120 122
5036 122 107 -92 -222 -25 -113 -119 5 244 127 7 -228 -37 35 -90 80 -248 -32 -67 166 -177 12 -136
5058 -136 22 -130 46 -100 41 28 -210 48 -122 -109 -78 -51 -72 139 109 -28 118 -171 -102 -325 85 -122
5080 -122 -161 -239 23 70 -206 -196 11 151 -128 32 -155 -128 44 144 -196 13 27 -109 58 92 -181 -120 -72
5103 -72 -339 47 -37 158 -103 -148 129 -64 72 320 -91 -48 -52 115 240 -199 -330 -40 -101 -200 -91 52 36
5126 36 28 28 27 -348 -138 -125 36 99 330 -143 13 465 -3 -165 76 -144 205 -33 -100 0 -158 27 119 49
5150 49 122 -77 -84 292 55 -75 -165 164 177 32 -2 94 102 -9 -11 20 -85 28 -5 -178 49 -135 -109 -192 75
5175 75 -31 -112 102 277 79 -67 167 -286 -122 -220 -107 38 -159 -24 157 -7 8 -340 -59 -167 -134 72
5197 72 3 28 88 -187 -139 -58 52 -62 85 143 -126 36 135 -159 -203 -163 -321 -22 185 63 -155 287 -33
5220 -33 -29 54 -187 -59 63 108 20 -13 239 118 -52 -12 -170 149 27 -17 227 -42 9 57 -24 -144 -2 -106
5244 -106 -155 -112 180 93 -27 -66 52 51 -154 58 45 -4 -58 -18 -369 -119 -2 -109 105 -156 64 108 18 -314
5268 -314 114 -88 -100 41 86 66 243 102 -127 -86 -126 -236 67 -95 -88 -59 36 -51 -32 308 18 50 -209 -110
5292 -110 20 -19 -142 -169 17 243 100 -26 76 -111 363 18 -105 73 -136 -46 39 176 231 117 -160 57
5314 57 2 -100 176 91 -54 -199 -81 88 -148 -176 349 -55 135 329 183 146 115 27 -210 -135 71 73 71 11
5338 11 88 -113 -187 -19 -62 -172 -23 113 -57 13 11 -66 165 -211 265 11 13 -23 10 294 158 4 -203 -233
5362 -233 -147 -45 -123 -32 -82 325 275 -101 25 -20 -17 168 -34 -297 -160 137 -10 168 -36 -21 114 -216 25
5385 25 -57 206 35 66 5 -29 160 125 282 -161 -38 58 119 97 54 212 158 -107 -177 77 -120 -259 130 47
5409 47 33 209 127 -20 -71 -22 -150 180 -195 -19 133 56 -83 30 -16 90 -69 -13 -192 106 14 -109 116
5432 116 -139 -81 -187 50 79 160 61 87 46 -47 -209 234 154 139 151 -104 24 17 72 -124 32 90 -47 57 -111
5457 -111 71 124 -13 -292 -19 -87 51 179 16 37 160 -33 179 -47 65 -94 30 70 96 32 90 -119
5479 -119 -132 -42 -54 -173 102 2 223 13 50 282 16 9 -74 -42 -83 117 171 4 42 -5 41 220 -67 15 -202
5504 -202 -123 -84 -95 -38 124 131 92 -11 -136 80 55 -170 26 268 -7 -24 230 -144 -21 -75 148 -83 -43 -54
5528 -54 475 124 -37 -13 -207 -213 260 55 -102 191 -66 -33 119 63 183 -28 -288 60 -43 131 243 -87
5550 -87 -119 22 -154 159 38 24 136 276 -85 191 167 -116 -116 -94 94 -56 -165 -53 52 16 17 69 -120 -54
5574 -54 -58 -109 67 -143 28 -35 251 79 -35 36 -120 143 400 92 49 175 -108 78 229 108 -83 -28 -49
5597 -49 13 8 -120 -156 -125 5 170 -302 80 -54 -206 145 119 -68 -14 204 194 236 -121 160 96 -167 -253 151
5621 151 178 177 -13 109 -1 64 77 -122 80 169 -167 286 46 -2 363 55 115 -60 -48 210 -126 -344 47
5644 47 99 -54 -141 53 -17 -267 -52 7 411 20 -3 -73 -31 323 -46 11 23 -41 111 32 -189 -172 202 -60
5668 -60 -13 -143 150 56 -31 -3 187 49 37 -65 118 56 -147 -144 230 147 86 -156 -168 45 80 195 17 120
5692 120 -141 -32 -4 87 54 -134 133 -195 33 191 -73 -14 95 67 133 -207 -271 141 15 -85 -33 -140 -178
5715 -178 -229 -93 162 -113 299 -17 4 -49 -50 33 -94 -18 64 75 81 -20 -26 67 -39 61 -148 25 -147 42 239
5740 239 -251 -191 157 -83 -124 -340 103 342 -93 148 -117 -84 -78 -149 0 210 -83 138 102 -111 141 101 34
5763 34 -7 -82 -135 310 73 64 13 -256 -77 57 -201 -126 79 -56 -24 134 188 -229 173 85 -13 -39 -133 -1 330
5788 330 235 0 184 -83 91 156 205 -205 42 -92 81 54 -1 64 -157 90 -180 3 -221 384 173 95
5810 95 -94 18 -235 -25 116 -120 187 -238 -10 -26 290 -104 160 84 56 150 -131 91 -144 293 308 86
5832 86 37 -252 49 -59 -24 -248 -23 -327 80 -118 58 76 58 -144 -89 93 -81 1 275 -192 -146 202 -284
5855 -284 -178 -269 -123 46 -98 -185 95 -66 -310 -53 62 13 -91 109 -219 -284 -199 -136 73 -7 -28 94 -75
5878 -75 26 -41 -124 -41 22 148 -231 -194 -6 151 -122 -211 113 -51 -184 52 181 -111 -52 154 -88 62 76
5901 76 19 50 192 -19 -13 -2 100 -132 295 17 1 219 44 -9 -298 15 -30 96 52 193 68 126 31 141
5925 141 -71 -202 -20 22 -148 114 55 26 -121 93 20 -178 99 -24 -256 -63 39 -86 45 21 -108 30
5947 30 -33 41 -115 128 64 -238 37 118 -119 62 -233 -115 146 -209 -191 -139 -217 301 32 -60 -149 -18 -216
5970 -216 -158 55 148 -143 -114 30 112 -108 116 115 -24 116 -20 116 -60 -301 -50 38 -1 -6 -18 110 36 121
5994 121 2 -145 -20 204 -32 1 69 103 -183 110 -7 -4 -16 -82 -14 22 -218 46 45 -28 -308 14 -214 -220 183
6019 183 -125 34 34 323 -57 -54 -128 -180 -37 -192 82 -143 -2 71 116 -95 258 61 -45 164 -50 111 -80
6042 -80 98 31 105 88 -103 5 75 -5 110 -32 20 88 21 -145 -97 30 108 -81 111 -139 -71 156 87 43 -89
6067 -89 -172 -44 -84 68 31 -45 196 83 206 -62 -36 -299 -294 -98 38 38 111 130 220 -45 -77 -37 93 198 290
6092 290 203 204 20 11 20 -61 8 51 -5 -114 52 18 168 50 -133 -124 -159 9 32 -66 166 40 -222 -63 30 -421
6118 -421 94 211 300 211 -70 -237 37 96 -81 -60 113 25 67 -63 -43 206 111 19 211 130 -61 -74 -66 5 206
6143 206 245 -300 104 8 -52 -17 -85 -17 122 -52 -113 106 21 -147 -55 145 -157 179 61 -28 143 -70 -57 -135
6167 -135 73 36 -67 255 104 195 44 -54 -16 78 306 20 144 -200 -7 -103 249 -15 -201 1 13 -169
6189 -169 162 -152 -35 0 59 -130 313 160 -90 -72 74 -254 -173 2 6 77 -187 -29 -365 -184 -44 -34 -48
6212 -48 4 211 -44 -99 -182 135 -138 149 -335 -19 25 84 11 -63 -47 119 -201 0 62 -72 -49 24 179 -116
6236 -116 303 60 -18 58 80 121 -12 109 -122 44 31 -27 8 37 -64 141 160 278 33 137 78 -81 -160 128
6260 128 -11 -94 183 -139 42 107 26 -86 71 21 -123 -160 -25 -29 99 76 62 -107 -199 10 -122 48 -258
6283 -258 5 368 -237 -33 13 -152 -37 11 -25 81 -255 19 -207 -85 19 -54 -183 -11 68 66 49 271 -88
6306 -88 -234 -12 -273 -221 116 11 113 1 -222 -151 -98 108 -1 -31 -340 70 -24 -17 2 129 -21 -161 -146
6329 -146 -208 -4 -298 -51 81 -68 -121 38 158 62 247 26 160 57 -171 -162 -82 35 -314 72 -153 -78
6351 -78 -7 -435 -138 24 170 -221 88 -206 -40 -177 -116 124 -59 -28 134 -252 -6 113 252 -36 2 148
6373 148 -203 109 70 83 -139 -86 -49 104 94 -81 118 176 160 271 118 -52 31 -45 -24 177 -243 56 -267
6396 -267 72 86 -230 60 -247 66 8 157 134 -136 -130 86 -178 11 -37 76 -56 -48 39 -61 69 -65 62
6419 62 175 -213 -101 -163 -152 61 44 165 -179 117 -46 66 -146 -176 296 44 262 -211 -140 331 -302 163
6441 163 -21 -17 -116 194 -228 -35 2 119 33 290 -55 37 88 218 -24 -95 -44 4 -156 -9 -58 -55 148 258
6465 258 50 99 -105 167 132 36 -151 -77 255 111 150 -158 -37 127 -1 -140 159 -21 3 84 56 -81 74
6488 74 -52 -30 154 84 -59 -47 132 55 132 40 172 -18 29 120 206 139 -57 348 -92 19 98 -168 -22 13
6512 13 -19 -2 57 -241 -64 142 -126 245 44 48 6 -148 8 -1 227 -115 36 -20 42 19 133 124 -40 -180 430
6537 430 30 -85 95 -122 -47 -33 25 0 234 79 243 -204 13 12 57 109 -20 -83 -200 1 -117 -33 -61 -230
6561 -230 75 8 -17 103 -54 -89 -194 99 64 -247 -50 67 -123 212 -23 -88 -46 134 -68 -242 -343 77
6583 77 -124 -51 41 72 28 -82 -18 -113 34 2 -235 -99 -81 178 -79 -243 106 -71 -138 169 70 2 -85 -261
6607 -261 42 -54 52 63 -219 -80 -126 -65 -137 364 175 -118 -139 -61 -80 -156 175 -1 -219 13 -12 34 102 7
6631 7 19 -275 -128 0 -44 -10 10 247 79 272 36 236 177 57 118 122 207 85 -145 150 -190 -53 -231 -16
6655 -16 -132 -26 -6 -58 139 -14 -329 -102 6 158 -206 64 -155 -123 -27 -20 194 -90 -293 -188 -15 37 75
6678 75 -69 307 -99 -17 -81 298 -76 44 -252 -45 35 -2 -26 4 -15 126 -46 -120 153 263 187 134 157 -64
6702 -64 -203 147 183 -36 90 29 -165 -12 357 -177 54 -116 -15 75 272 -124 134 54 318 102 -210 86
6724 86 102 101 -8 325 -18 141 -276 77 -229 53 -14 154 114 117 51 -78 -124 -143 -61 44 69 -48 155 -190
6748 -190 122 -136 -256 93 -117 56 -54 -51 -76 -64 92 -51 95 -22 -77 -136 149 -1 29 112 -63 137 -191
6771 -191 -60 -254 -3 -43 18 107 -92 246 144 -106 -198 -69 152 164 380 64 -52 -3 72 -19 -23 -76 -69 146
6795 146 116 72 -91 154 -64 74 63 -22 -22 -1 8 4 -23 -83 1 -188 72 -78 135 115 144 -45 104 -267 208
6820 208 53 39 -150 -161 -16 -125 105 -215 63 -66 54 30 112 -97 -163 -148 -22 286 -160 155 -194 -226
6842 -226 15 -167 -22 48 158 124 95 138 22 -42 -148 -177 -69 -158 -42 268 76 219 226 105 76 -28 88
6865 88 -44 112 87 77 112 -35 90 53 51 -25 50 38 54 119 -131 68 46 -67 -90 111 243 30 -10 36 48 390
6891 390 186 -93 -69 120 -186 335 234 169 4 -155 -67 48 75 29 102 116 -53 -106 200 68 -93 213 130
6914 130 57 14 -70 -155 115 327 58 -267 -30 -218 -72 -33 51 -10 102 82 133 -296 -32 19 -211 149 -58
6937 -58 124 94 192 113 128 -32 58 -12 -26 -281 78 89 -32 8 116 60 186 53 -183 -53 51 105 -8 69
6961 69 10 1 117 -82 -53 137 -87 -58 -15 -29 -141 149 40 -129 94 49 -316 101 39 168 42 -12 -264 144
6985 144 -93 -42 57 -5 -253 -110 -42 201 -11 -70 259 99 -22 29 97 -106 -35 -64 -249 -205 -5 -120 -65 -50
7009 -50 110 -47 -18 -171 -32 -102 -148 -97 -216 -6 89 -64 -176 -21 81 -32 111 -76 -73 28 147 -32 228
7032 228 69 2 60 -180 -89 -57 36 214 90 63 -33 201 400 6 -134 -158 -61 -71 119 -31 -136 259 25
7055 25 152 59 -181 51 42 -77 -52 -83 -167 240 27 26 26 79 94 28 141 -40 187 198 -244 -184 35 42 111 -3
7081 -3 -123 -45 -113 -133 111 -21 -123 88 12 -177 -106 63 166 -172 68 -36 97 135 234 -90 -75 90 1 165
7105 165 226 -142 -19 -57 97 -39 -140 97 56 33 -82 -184 -287 60 -60 -44 116 -229 21 -95 -306 34
7127 34 85 66 228 -8 -50 50 -81 -47 140 -69 -170 5 -54 19 111 -68 -131 -26 -85 -191 -203 -293 56 218
7151 218 59 162 -98 91 30 -39 -34 -169 -21 176 36 -105 128 112 162 67 -68 185 52 164 11 -35 -202
7174 -202 118 -159 138 85 -55 246 -39 73 -117 -38 112 234 -20 -23 113 -41 -5 -13 -112 201 -137 60 153
7197 153 117 -48 -127 -143 0 161 355 -43 132 -166 -66 87 301 254 45 115 126 -144 62 -35 -21 -219 -43
7220 -43 230 -61 21 -81 55 -7 -81 -61 -110 -249 80 286 111 8 -44 11 -107 163 171 291 -21 -67 168 -46
7244 -46 22 45 -321 23 107 55 -63 -202 16 -33 -166 -39 123 88 29 -176 -153 98 -141 11 46 29 55 16
7268 16 -133 91 -141 47 343 160 11 23 -162 198 103 17 101 -183 -37 107 184 -132 -131 123 123 -34 45 247
7292 247 -51 148 226 36 80 -77 49 -133 204 4 241 171 -80 -177 -116 -89 -253 150 194 131 128 107 -65 -152
7316 -152 13 117 -166 206 -163 266 -186 105 -210 -33 -180 -91 -255 -118 69 202 -123 62 13 203 18
7337 18 -13 -28 -196 -132 -58 -135 209 37 131 161 -171 -38 -92 -31 -138 81 213 77 -46 108 -206 -30 125
7360 125 -127 -30 57 40 76 -43 231 -80 51 40 195 140 -199 53 -194 236 102 -107 -86 62 -95 147
7382 147 -31 -145 -67 36 -12 209 -111 -93 -150 -107 85 119 -17 103 157 -99 121 -150 114 -21 166 -65
7404 -65 24 109 4 33 65 -116 84 101 -34 168 -27 69 -201 -196 -20 80 -190 -173 97 -255 9 -78 -244 -228
7428 -228 -478 187 -95 56 -87 1 69 -49 -176 -105 66 182 -80 -241 41 108 -9 -73 189 -17 52 -9
7450 -9 44 83 244 54 100 -76 14 30 84 146 63 -49 -158 28 6 -12 23 164 141 -138 -36 -13 -92 188 -86
7475 -86 -42 41 9 76 -108 80 -283 -10 116 268 21 -201 91 -10 44 106 220 297 89 192 133 -97 -122
7498 -122 94 85 -130 194 107 8 -126 -152 -19 -88 -23 -70 17 162 279 -51 452 188 107 -39 -326 70 -51
7521 -51 -108 -215 1 36 32 86 207 43 132 -10 254 143 50 -6 97 -157 198 -232 59 129 71 60 148 -19
7545 -19 -67 297 -34 -36 162 -144 -118 -214 20 270 -222 -86 -219 8 -41 30 -125 -100 -153 -267 -202 57 -44 -132
7569 -132 80 2 104 -43 148 67 34 170 194 58 248 6 -88 65 -14 -141 249 35 -255 26 145 -36
7591 -36 3 288 138 -128 -185 -166 21 -364 37 38 211 8 -24 129 83 59 -146 13 -152 -23 200 124 169 93
7615 93 -164 78 85 43 114 118 -9 114 191 -90 155 -195 -45 -53 138 54 135 38 123 80 -28 -126 93 140 22 125
7641 125 -101 -14 -104 59 -170 135 -15 -371 196 -5 -52 -158 103 -13 37 -101 48 55 -167 135 99 -103
7663 -103 183 -41 -39 -77 -236 63 7 5 -13 -4 277 1 -99 47 -173 0 64 -97 -108 50 -53 263 136 195
7687 195 46 -16 -139 -119 187 48 -114 272 -134 -102 -161 -399 194 -69 -71 -12 -134 -112 411 50 -40 41 -7 89
7711 89 125 142 10 10 -19 10 -273 77 129 83 -105 -132 280 -70 -93 -287 8 182 -76 54 236 23 -158 111
7735 111 158 44 -129 -116 -98 -63 -62 -87 -121 -86 47 234 62 -60 -214 -61 -93 87 187 -178 -41 -274 96
7758 96 -299 -51 174 -3 -50 -212 71 -74 118 131 -277 -35 107 17 -169 28 273 234 -103 -100 -139 108 176
7781 176 -112 -273 264 153 136 -70 -8 78 -32 236 -113 278 292 -173 18 20 -203 175 -47 -7 -58 59 -24
7804 -24 54 -216 -106 176 138 -142 -117 92 -81 -33 88 42 377 61 149 -42 -356 126 -58 -93 -62 71 -34
7827 -34 -86 33 -133 -31 -114 52 -218 -27 -12 130 -132 -226 -60 200 -167 40 37 26 -203 38 -109 1 174
7850 174 -45 153 -83 106 -41 -303 -58 7 -77 169 -117 -205 -56 -302 30 -130 -139 197 -21 64 64 -66 -52
7873 -52 255 29 335 111 15 -216 34 -185 -6 11 42 -308 -74 -205 -79 160 -19 -72 -199 230 -193 -115
7895 -115 -3 -81 -139 -49 140 -132 -41 83 41 -19 -11 23 -46 68 -114 77 16 -102 -91 -149 -122 -126 172 51 166
7920 166 49 -65 -67 51 -11 73 246 93 -58 -65 39 -64 9 -44 -111 138 138 -118 81 -6 50 -41 -208 -303 119
7945 119 -7 -5 46 134 174 -205 -181 -99 -110 -205 -197 -119 55 -36 -198 12 -184 -81 100 234 -101 141 17 -142
7969 -142 -195 -53 -77 -158 105 199 -86 -91 31 35 -54 -1 88 -259 26 -267 84 7 67 -37 -49 -212 -41 37 139
7994 139 36 -127 39 -38 130 -216 189 -146 2 117 172 -200 -73 33 8 16 -125 -3 -163 48 -5 181
8016 181 29 86 -140 -172 -122 19 305 -206 -249 -79 -18 80 -261 -86 93 168 -24 264 132 343 -151 201
8038 201 50 95 -156 -226 -132 7 97 164 109 -89 -87 50 179 103 -51 50 56 104 -64 58 -197 85 163 58
8062 58 95 -417 -253 114 -193 -188 8 196 10 -133 32 -1 -188 -257 -127 -156 -20 -21 265 -299 -253 88 -115
8085 -115 -98 340 148 130 61 -166 68 -20 -173 -212 353 72 351 67 -44 54 -110 -103 -20 88 113 8 77 57
8109 57 79 139 -121 -168 5 -45 109 -84 -208 315 -118 227 -15 -185 -30 56 215 -146 -112 266 120 -104
8131 -104 -134 -65 -200 34 276 38 93 -240 104 201 1 119 -14 164 46 -31 28 -29 -199 -186 47 55 -74
8154 -74 41 84 183 40 -44 146 -140 167 -41 96 -104 36 72 -78 141 85 -36 87 -86 -2 45 -14 71
8177 71 97 26 -77 170 177 -150 125 24 40 127 92 -56 145 -192
8191a92
##END NTUPLES=NMR FID
##END=
