##TITLE=1H_15-2023
 CDCl3
 8 sc, 
 23.3.2023
##JCAMPDX= 6.0         $$ Bruker NMR JCAMP-DX V2.0
##DATA TYPE= NMR FID
##DATA CLASS= NTUPLES
##ORIGIN= UXNMR, Bruker Analytische Messtechnik GmbH
##OWNER= root
$$ XWIN-NMR		Version 3.5
$$ Thu Mar 23 14:36:58 2023 Russian Standard Time (UT+4h)  she@DPX200
##.OBSERVE FREQUENCY= 200.13135
##.OBSERVE NUCLEUS= ^1H
##.DELAY= (6, 6)
##.ACQUISITION MODE= SIMULTANEOUS
##.ACQUISITION SCHEME= undefined
##.AVERAGES= 8
##.DIGITISER RES= 18
##SPECTROMETER/DATA SYSTEM= spect
##.PULSE SEQUENCE= zg30
##.SOLVENT NAME= CDCl3
##.SHIFT REFERENCE= (INTERNAL, CDCl3, 0, 15.7039)
##AUDIT TRAIL= $$ (NUMBER, WHEN, WHO, WHERE, WHAT)
$$ ##TITLE= Audit trail, XWIN-NMR		Version 3.5
$$ ##JCAMPDX= 5.01
$$ ##ORIGIN= Bruker BioSpin GmbH
$$ ##OWNER= she
$$ F:/spectra/data/she/nmr/H-F/1/audita.txt
$$ ##AUDIT TRAIL=  $$ (NUMBER, WHEN, WHO, WHERE, WHAT)
(   1,<2023-03-23 14:35:47.57 +0400>,<she>,<DPX200>,
      <created by zg, POWCHK disabled, PULCHK disabled
       configuration hash MD5:
       00 E9 B6 7A A2 85 ED C7 34 08 36 98 17 FE 4E 26
       data hash MD5: 16K
       66 F4 C5 4A 12 C4 E1 22 AE 61 0E 10 41 B5 7E 0C>)
$$ ##END=
$$ 
$$ hash MD5
$$ 71 6C 92 7E D4 F2 6A 2C 75 65 90 F8 FE A3 B8 8F
##$RELAX= 
##$RELAX= 
##$RELAX= 
##$RELAX= 
##$RELAX= 
##$RELAX= 
$$ Bruker specific parameters
$$ --------------------------
##$DU= <F:/spectra>
##$EXPNO= 1
##$NAME= <H-F>
##$PROCNO= 1
##$TYPE= <nmr>
##$USER= <she>
##$AMP= (0..31)
100 100 100 100 100 100 100 100 100 100 100 100 100 100 100 100 100 100 
100 100 100 100 100 100 100 100 100 100 100 100 100 100 
##$AQSEQ= 0
##$AQ_mod= 1
##$AUNM= <au_zg>
##$AUTOPOS= <>
##$BF1= 200.13
##$BF2= 200.13
##$BF3= 200.13
##$BF4= 200.13
##$BF5= 200.13
##$BF6= 200.13
##$BF7= 200.13
##$BF8= 200.13
##$BYTORDA= 1
##$CFDGTYP= 0
##$CFRGTYP= 5
##$CHEMSTR= <none>
##$CNST= (0..31)
1 1 145 1 1 1 1 1 1 1 1 1 1 1 1 1 1 1 1 1 1 1 1 1 1 1 1 1 1 1 1 1 
##$CPDPRG= <>
##$CPDPRG1= <>
##$CPDPRG2= <>
##$CPDPRG3= <>
##$CPDPRG4= <mlev>
##$CPDPRG5= <mlev>
##$CPDPRG6= <mlev>
##$CPDPRG7= <mlev>
##$CPDPRG8= <mlev>
##$CPDPRGB= <>
##$CPDPRGT= <>
##$D= (0..31)
0 1.2 0 0 0 0 0 0 0 0.06 0 0.03 0 0 0 0 0.0002 0 0 0 0 0 0 0 0 0 0 0 0 
0 0 0 
##$DATE= 1679567746
##$DBL= (0..7)
120 120 120 120 120 120 120 120 
##$DBP= (0..7)
150 150 150 150 150 150 150 150 
##$DBP07= 0
##$DBPNAM0= <>
##$DBPNAM1= <>
##$DBPNAM2= <>
##$DBPNAM3= <>
##$DBPNAM4= <>
##$DBPNAM5= <>
##$DBPNAM6= <>
##$DBPNAM7= <>
##$DBPOAL= (0..7)
0.5 0.5 0.5 0.5 0.5 0.5 0.5 0.5 
##$DBPOFFS= (0..7)
0 0 0 0 0 0 0 0 
##$DE= 6
##$DECBNUC= <off>
##$DECIM= 32
##$DECNUC= <off>
##$DECSTAT= 4
##$DIGMOD= 1
##$DIGTYP= 9
##$DL= (0..7)
0 120 120 120 120 120 120 120 
##$DP= (0..7)
150 150 150 150 150 150 150 150 
##$DP07= 0
##$DPNAME0= <>
##$DPNAME1= <>
##$DPNAME2= <>
##$DPNAME3= <>
##$DPNAME4= <>
##$DPNAME5= <>
##$DPNAME6= <>
##$DPNAME7= <>
##$DPOAL= (0..7)
0.5 0.5 0.5 0.5 0.5 0.5 0.5 0.5 
##$DPOFFS= (0..7)
0 0 0 0 0 0 0 0 
##$DQDMODE= 0
##$DR= 18
##$DS= 0
##$DSLIST= <SSSSSSSSSSSSSSS>
$$ [...]
##$SUBNAM2= <"">
##$SUBNAM3= <"">
##$SUBNAM4= <"">
##$SUBNAM5= <"">
##$SUBNAM6= <"">
##$SUBNAM7= <"">
##$SUBNAM8= <"">
##$SUBNAM9= <"">
##$SW= 18.05172834244
##$SWIBOX= (0..15)
0 0 2 0 0 0 0 0 0 0 0 0 0 0 0 0 
##$SW_h= 3612.71676300578
##$TD= 16384
##$TD0= 1
##$TE= 0
##$TE2= 300
##$TE3= 300
##$TEG= 300
##$TL= (0..7)
0 120 120 120 120 120 120 120 
##$TP= (0..7)
150 150 150 150 150 150 150 150 
##$TP07= 0
##$TPNAME0= <>
##$TPNAME1= <>
##$TPNAME2= <>
##$TPNAME3= <>
##$TPNAME4= <>
##$TPNAME5= <>
##$TPNAME6= <>
##$TPNAME7= <>
##$TPOAL= (0..7)
0.5 0.5 0.5 0.5 0.5 0.5 0.5 0.5 
##$TPOFFS= (0..7)
0 0 0 0 0 0 0 0 
##$TUNHIN= 0
##$TUNHOUT= 0
##$TUNXOUT= 0
##$USERA1= <user>
##$USERA2= <user>
##$USERA3= <user>
##$USERA4= <user>
##$USERA5= <user>
##$V9= 5
##$VALIST= <valist>
##$VCLIST= <CCCCCCCCCCCCCCC>
##$VD= 0
##$VDLIST= <DDDDDDDDDDDDDDD>
##$VPLIST= <PPPPPPPPPPPPPPP>
##$VTLIST= <TTTTTTTTTTTTTTT>
##$WBST= 1024
##$WBSW= 4
##$XGAIN= (0..3)
0 0 0 0 
##$XL= 0
##$YL= 0
##$YMAX_a= 170999
##$YMIN_a= -233154
##$ZGOPTNS= <>
##$ZL1= 120
##$ZL2= 120
##$ZL3= 120
##$ZL4= 120
##$ABSF1= 10
##$ABSF2= 0
##$ABSG= 5
##$ABSL= 3
##$ALPHA= 0
##$AQORDER= 0
##$ASSFAC= 0
##$ASSFACI= 0
##$ASSFACX= 0
##$ASSWID= 0
##$AUNMP= <proc_1d>
##$AZFE= 0.1
##$AZFW= 0.1
##$BCFW= 1
##$BC_mod= 2
##$BYTORDP= 1
##$COROFFS= 0
##$CY= 11.3945322036743
##$DATMOD= 1
##$DC= 2
##$DFILT= <>
##$DTYPP= 0
##$F1P= 2.36226072786647
##$F2P= -0.459571619588291
##$FCOR= 0.5
##$FTSIZE= 0
##$FT_mod= 4
##$GAMMA= 1
##$GB= 0.15
##$INTBC= 1
##$INTSCL= 1
##$ISEN= 128
##$LB= 0.24
##$LEV0= 0
##$LPBIN= 0
##$MAXI= 10000
##$MC2= 0
##$MEAN= 0
##$ME_mod= 0
##$MI= 1.114404
##$NCOEF= 0
##$NC_proc= 0
##$NLEV= 6
##$NOISF1= 3.799351
##$NOISF2= 2.8
##$NSP= 1
##$NTH_PI= 0
##$NZP= 0
##$OFFSET= 15.70392
##$PC= 1
##$PHC0= -19469.25
##$PHC1= 16.40075
##$PH_mod= 1
##$PKNL= yes
##$PPARMOD= 0
##$PSCAL= 0
##$PSIGN= 0
##$REVERSE= no
##$SF= 200.130013532006
##$SI= 16384
##$SIGF1= 3
##$SIGF2= 2
##$SINO= 400
##$SIOLD= 16384
##$SREGLST= <1H.CDCl3>
##$SSB= 0
##$STSI= 0
##$STSR= 0
##$SW_p= 3612.71676300578
##$SYMM= 0
##$S_DEV= 0
##$TDeff= 0
##$TDoff= 0
##$TI= <>
##$TILT= no
##$TM1= 0
##$TM2= 0
##$TOPLEV= 0
##$USERP1= <user>
##$USERP2= <user>
##$USERP3= <user>
##$USERP4= <user>
##$USERP5= <user>
##$WDW= 1
##$XDIM= 8192
##$YMAX_p= 0
##$YMIN_p= 0
$$ End of Bruker specific parameters
$$ ---------------------------------
##NTUPLES= NMR FID
##VAR_NAME=  TIME,          FID/REAL,        FID/IMAG
##SYMBOL=    X,             R,               I
##VAR_TYPE=  INDEPENDENT,   DEPENDENT,       DEPENDENT
##VAR_FORM=  AFFN,          ASDF,            ASDF
##VAR_DIM=   8192,          8192,            8192
##UNITS=     SECONDS,       ARBITRARY UNITS, ARBITRARY UNITS
##FACTOR=    0.0002768,     1,               1
##FIRST=     0,             0,               0
##LAST=      2.2672688,     0,               0
##MIN=       0,             -233154,         0
##MAX=       2.2672688,     170999,          0
$$ Real data points
##PAGE= N=1
##DATA TABLE= (X++(R..R)), XYDATA
$$ [...]
1782F42n25o7O26j085N31K55q31R98k41p50P30q00K31L72m25O22k70o09O29m85
1802d52J16R31j058O58pp75Q53l64n7R76p61J88m8n22P09m43J74O63q93L04N0
1823B42q74Q72l91k36R30r65J20R8n89J013k59k47O50o43j42N06n80R69r7m91
1843a14P12r34K64K98o52O32K55m00L72p69k36P29k37K15jm43N87p78L7Q18p81
1864d26P58k87n10P14k62p4N81o49L29K60p96M87l1j82P40p50J90J91o80P47j93
1885A57m25P77m48m88M36n77N46K54n65N98l03k40K47k99M04O2m24M21k39j03
1905b09N94o41M57L57p68N89j95m57P71n94LK63o36M10Q9r8L98p35M42K36q37
1926e61O87j80k20P49m88m42L56n79P98J01j93P29q20j96Q51o75M64l52p5K49
$$ plain form
1782 642 117 50 676 -409 122 377 -454 544 303 -447 283 -517 -286 86 -339 283 13 -596 33 -452
1802 -452 -336 595 -463 195 188 -587 266 -98 -155 821 60 248 200 -322 387 -56 118 781 -112 192 242
1823 242 -632 240 -151 -387 543 -422 -302 -204 -793 220 -39 -286 364 -279 -421 85 -495 474 377 -114
1843 -114 598 -336 -72 226 -426 206 461 61 433 -336 -572 157 -80 135 134 -309 278 -500 -463 355 -426
1864 -426 332 45 -465 249 -13 -87 494 -155 174 434 -362 125 94 -88 652 -98 92 283 -397 350 157
1885 157 -268 509 61 -427 9 -568 -22 232 -333 265 -38 -278 -31 -330 74 136 -288 133 -106 -209
1905 -209 385 -256 201 558 -210 379 184 -273 498 -96 -93 170 -466 -56 33 -65 333 -402 40 276 -561
1926 -561 126 -54 -274 475 -13 -455 -99 -678 120 221 28 757 -63 -259 592 -83 381 29 -46 203
1946B03m85J57M77n58K50K73p49O97l55l34O34l76J95J13l95K97k82l43J036n48
1966i3K7N86q63O49J28q23R73l60l21M92n52N15O9r58J045o91k1P09p67L50J58
1987B52p77P25o31J07N53n06K28J50o18K83K54k45N40l30R9J09o00N24mj05N72
2008E80p78K91L64p27O30k01k76N99n69j37K57m00L60J71p97N92k65mK97k29L76
2029A34K96q82P94m06l87P27m66N49O1k96j1k77LN14n71L90J67p88O87j37p81
2050f80Q89k68k01M39p40K81J99k59N03n09K29M62r14N51Q2m94P55k80j23L59
2070B81o68L04K34k38L28k60j38N86o79O30q6o90Q18l31l02J68k88M46O1n47N36
2091A65l31m12R87o03K14K38l97N1K34k20J45l32J66K19l82L42l3l50O08k78k36
$$ plain form
1946 203 -282 -125 352 -206 44 317 -432 265 -90 -424 210 -166 29 142 -253 44 -238 -581 455 -93
1966 -93 -66 520 -343 306 434 -389 584 224 -97 395 -157 358 427 -531 514 -177 -198 511 -256 94 252
1987 252 -525 200 -431 -324 229 -277 -49 101 -517 -234 20 -225 315 -15 84 193 -407 117 113 8 580
2008 580 -198 93 457 -270 360 159 -117 482 -87 -224 33 -367 -7 164 -633 -41 -306 -310 -13 -242 134
2029 134 430 -452 342 -64 -451 276 -190 359 420 124 113 -164 -161 353 -218 172 339 -449 238 101 -680
2050 -680 209 -59 -260 179 -561 -280 -81 -340 163 -346 -117 345 -569 -18 64 -430 325 45 -78 281
2070 281 -387 -83 151 -87 241 -19 -157 429 -250 380 294 -396 422 91 -211 -43 -331 115 176 -371 165
2091 165 -166 -578 409 -194 20 258 -139 -88 146 -74 71 -261 -95 124 -258 84 51 -299 309 31 -205
2112b05M62m60K78J67n24L3K28k75O63k90j68J61m31N84l3n19P11n10L88K82r11
2133c69P27r6o80R65n70R0J71o26M33J11o61P44p4j57Lj58N29j67o52P64m46j54
2155b73N89o53K47N12r81P58k10l7M37l20J65K0k03K86k55k68M74k67J71J02o47
2176c53L96Q9m22O79n26P4J88k49P6rk37M71n74K53L88n55M89qo09O48j20l52
2198b63M50m07M90J08o02M98k60p2L19m62J99K54m26K37J42m32O02o68K36L52
2218B95p41O71k91m78L59N1J26L77m99J21Kk27L95M6j95K05l23m2K16l42M02k28
2240a00j40N09m99J06L00l99L08j83j79N27p14L65K81n20L40Lm14O13j55k08L73
2261B14l78L19J53k79n6J90j83L54m52J98P9o13N91l84K35K57o35L94Q2l84M08
$$ plain form
2112 -205 257 -203 75 242 -282 -249 -21 -296 367 77 -91 70 -361 223 190 -329 382 -128 260 542 -369
2133 -369 358 262 -418 547 -23 67 238 -388 45 156 -505 239 165 8 11 -147 382 215 -437 327 -119 -273
2155 -273 316 -337 -90 422 -559 199 -11 -48 389 69 234 254 51 337 82 -186 288 21 192 294 -353
2176 -353 43 132 -290 389 -137 -63 125 -124 -48 -57 -294 177 -397 -144 244 -311 178 170 -439 209 89 -263
2198 -263 187 -220 270 378 -224 274 14 -58 261 -201 -2 252 -174 63 205 -227 375 -293 -57 295
2218 295 -446 225 -66 -544 -185 -134 -8 369 -130 -9 -7 -234 161 207 12 217 -106 -148 68 -274 128 -100
2240 -100 -240 269 -230 -124 176 -223 85 -98 -277 250 -464 -99 182 -338 2 5 -409 204 49 -159 214
2261 214 -164 155 308 29 -27 163 -20 334 -118 80 159 -454 137 -247 -12 245 -390 4 86 -298 110
2282A10l78J3N65k77Q4l6l63L33P8j43K80l93J93J51m31N82l0m59L39k92J3L01
2304B40o12M57n5m7O9k0l39K76j22J64k54J80K82m66L4L15l31K65K94o83L18j38
2326a73L1J98k14L00j9k54M53k52k80K94j11L9L19n94L18r5l46M03o0J64o4j24
2348f7l51K65RK39j84J48K23o88O49k63j46N51j18l09K63m22J20Q2j72L03p0j98
2370a36K34l27K02K66p04O00m93L9L58j82o8L43l14K12J91n14L76m6m5K52m35
2391a91N78k03k89M06p02N36j55j20N1K59k55P5O2j10P8m44N40P4o19P58j99j01
2413B9j19k14K77R2j49K64k29k10K99J19l65O92o22R1J38k09J63k4m4Q4n5K13
2435B21m12P1N3j71K2K06k92M91J66m24J58r1j18K37k49R8Qj99O14m35q6P7J66
$$ plain form
2282 110 -268 -255 310 33 117 81 -282 51 129 -14 266 -127 66 217 -214 368 338 -121 218 -74 -61 240
2304 240 -372 85 30 -17 52 32 -307 -31 -153 11 -243 -63 219 -247 -213 102 -229 36 330 -353 -35 -173
2326 -173 -142 56 -158 142 123 -131 322 70 -210 84 -27 12 331 -263 55 -40 -386 17 -43 121 57 -67
2348 -67 -418 -153 -144 95 -89 59 282 -406 243 -20 -166 385 267 -42 221 -201 -81 1 -171 132 62 -136
2370 -136 98 -229 -27 239 -465 135 -358 -319 39 -143 -211 132 -182 30 221 -293 83 37 -8 244 -191
2391 -191 387 184 -105 301 -401 135 -20 -140 -89 170 -85 -10 52 -58 20 -424 116 190 -429 329 130 29
2413 29 -90 -304 -27 65 -84 180 -49 -259 40 159 -206 486 -136 -45 93 -116 47 23 -21 63 8 221
2435 221 -191 -120 -67 -238 -216 -10 -302 189 355 -69 89 -2 -120 117 -132 -34 -26 -225 389 -46 -132 -55 111
2458A11K73j31k68L90l42k3M17l86o5N9l29L75j10j68M65k51k49P9o4K70j4j26
2480h7L2j63K10K45p3m4Q7j79J51l06J00J58k55M10k05m28K57K33n4qo0K6K62
2503C09m16%j45K73O5k56J45M00l80J53l07K02J14k68RO8j4j3L3l35O50k37k7
2526B3L02k25p3P2k02K26l22l8M11m45M87j62j54kR3RJ95j04R3o7j99L58k41m6
2550a1Po5j55K79k11M58j45k32K53l45L41K23m76m0M8L0J29O6k43K87j96j04j41
2573b43MK74j9O9n6q1j00J56j22L30l25J70j45r0K33j12j8N03l04p5Nj40L22k84
2597d8o1J48j97L29Nl11J25J13l97K17J13l15N21k47l8R3l33K96J24r5O9l78P6
2620a91L00k35J61R3l57J93K4k11M75m62J58L14k03j24M4p0K61m84K41J5L8K4
$$ plain form
2458 111 384 253 -15 375 33 10 427 41 -24 35 -294 81 -29 -197 268 17 -232 -153 -217 53 39 -87
2480 -87 -55 -218 -8 237 164 120 207 28 179 -127 -27 131 -124 286 81 -347 -90 143 89 81 21 47 309
2503 309 -107 -107 -252 21 86 -170 -25 375 -5 148 -159 43 157 -111 -102 -34 -48 -61 -28 -363 287 50 23
2526 23 325 100 27 99 -103 123 -199 -237 174 -271 216 54 -100 -102 -9 0 195 91 184 117 -82 276 35 -11
2550 -11 -4 -69 -224 55 -156 302 157 -75 178 -167 174 397 -79 -119 -71 -41 88 154 -89 198 2 -102 -243
2573 -243 -239 35 16 85 29 -52 -152 4 -118 212 -113 57 -88 -178 55 -57 -75 428 124 49 54 -86 236 -48
2597 -48 -109 39 -158 171 176 -135 -10 103 -294 -77 36 -279 242 -5 -43 50 -283 13 137 42 111 -267 -191
2620 -191 109 -126 35 128 -229 -36 -12 -223 252 -210 -52 262 59 -65 -21 -91 170 -314 -73 -58 -20 4
2642DL0J20k00K76n2p3k44K47R8m06K73j19p9K04j36R1n0k37K61r7J71M8n15R8
2666b87K89o2M3j43K43N4k08J87J8l77L64p3O7k10M0l2J9j07K31k2j16K42m16
2689b56K43K23j97l3J5R4l44K09J01l5k76M44j62p6J86k17n9M23m13l0r7K65q
2712@J79k29L11j52k55K52N9P1k68j06O8J84k14M71m98J60J78m76L78j92M1O8
2734C0J67k63q2rJ68J37m95O63l18L1r4j8O2Rq3K00q5QJ68k58K09l05K30o9n1
2759d8L1j32r3L15rj85L44k83j07K56k54K28k1k24K61j26m3K03k12J16N0k08l
2782a44K1O6R8j74J65l0j17R5K7J88N8j51LK3j83r1J13o0K47k46L7o2P3q8R2J06
2808F6K08k21l31L46j21J04j71K82j62R8j79Q8m7k04Q6J81n1M2j35M6j09K86j00
$$ plain form
2642 4 34 154 -46 230 178 105 -139 108 206 -200 73 -46 -125 79 -57 34 -16 -253 8 -89 82 130 -385 -287
2666 -287 2 -60 -17 -160 83 137 -71 116 134 -243 121 48 115 -95 -55 -87 -68 -175 56 34 -82 160 -256
2689 -256 -13 210 13 -20 -5 89 -255 -46 55 20 -256 188 26 -50 136 -81 -140 283 -130 -160 -257 8 0
2712 0 179 -50 261 109 -146 106 165 236 -32 -138 -70 114 -100 371 -127 33 211 -265 113 -79 -38 30
2734 30 197 -66 -148 -157 11 148 -347 316 -2 29 -65 -83 -21 -12 -95 105 20 28 196 -62 147 -158 72 3 -48
2759 -48 -17 -149 -242 73 64 -121 223 -60 -167 89 -165 63 42 -182 79 -47 -90 113 -99 17 67 -141 -144
2782 -144 -123 -57 41 -133 32 2 -115 -20 7 195 253 102 105 128 -55 -146 -33 -93 154 -92 -55 -117 -44 -132 -40 66
2808 66 274 53 -278 68 -53 51 -120 162 0 98 -81 7 -40 -244 -158 23 -28 14 -121 -75 -184 102 2
2831Bj59N9Lj7J39p1L9P5k96M69l61J2K71k65r8J93jk9J52j75L48m47K95j21N2
2856F9J17l02j36L01M9j76M6J44j80Q9j23O4p3K52J47l22J74k6r1Q8j96J96j09
2879Bj6j14L96k64K3n5k54J40R8J06j65O5O6L2o5j19JJ78Q4l51K72j43j6K49k41
2904i1Q0J75k93J69l90K88N9j05K43j07m1L79k91k23J46p3j47J35q1J76K07l15
2926a00nJ32m6L01m81J82L1k3J35m3n2n8q2o4L08K15l08K4k58M04O3k22kk29J88
2951A0n0N1N5o8r2M8n8L64j07k39K4J3K10j49l5M9j92k9K17l10K13m0j10M09n0
2976A34R4k85K81k07J59l09L6J00P7l8Q7l49L28k03m59N73j19J43j56q8J25o9
2998a45j13L59n0J05j82j1l4J62L7K73m54P1j70k4L23k68R8J65j1r2J59l73M36
$$ plain form
2831 2 -157 -98 -95 -112 27 -44 -5 70 -226 243 -118 -106 165 -100 -198 -5 -6 -35 117 -58 290 -157 138 17 69
2856 69 186 -116 -252 49 98 -78 -32 112 -68 21 -102 -38 -111 141 288 -34 140 114 23 111 -85 111 2
2879 2 -14 -128 268 4 27 -28 -282 -142 -44 62 -103 -38 28 60 -5 -124 -123 55 139 -212 60 -83 -99 150 -91
2904 -91 -11 164 -129 40 -350 -62 -3 -108 135 28 -13 366 75 -148 -2 -75 -222 -87 -168 8 215 -100
2926 -100 -105 27 -19 282 -199 -17 14 -9 126 83 31 -27 -109 -173 135 350 42 66 -192 212 275 53 51 -178 10
2951 10 -40 11 66 -2 -94 -46 -104 260 153 -86 -62 -49 161 12 -23 26 -166 -195 22 -288 -75 -115 -225 184 134
2976 134 228 -57 224 17 176 -133 -97 3 80 42 129 -220 108 -95 -554 19 -100 43 -113 -201 -76 -145
2998 -145 -258 101 51 156 -26 -37 -71 91 128 401 -53 18 -152 -176 147 -121 -23 142 131 39 198 -175 261
3021B61k36k10J41J6K86k56j24j38K14j7K7j43P7K50j51r1J1J16M9j18J18M6m9
3044G9l7k91K62K61k34r8L8k60L04J75m32L57r1j49K67l45K24j17n1L32j11m24
3066c41L36j94J15J58kkO5k36oL65k12M2q4N7k27J20K49j72n7k6j7K4J68k15J98
3091A06p5K42k26k9j83J85k04J34j5j44L90l74M98m71om4M34l73K91j4k40J13
3113ej38N40m20o5L44m58L53j3k61K51R2k95q5K25L0K46n34N8J04p8J54m7j31
3136a33J79o9k4M6J95J44k90j64n2NJ52r2j11L31j79P7R2k41J80r4j02J84J46
3159A80k84j09J84J01j27L4j19J54M5Q8k68P0P5k31K15j26K40J72j22k54m4K45
3181A19l5M2L2k17K20j90J86l31K34q0o9J30p6q5K32p9k23K11n9L09m58J06M6
$$ plain form
3021 261 25 -185 -44 -28 258 2 -122 -260 -46 -63 -36 -179 -102 148 -3 -94 -83 33 82 -36 82 128 79
3044 79 42 -249 13 274 40 -58 -20 -280 24 199 -233 124 33 -116 151 -194 30 -87 -138 194 83 -341
3066 -341 -5 -199 -84 74 72 70 135 -101 -107 258 46 88 4 61 -166 -46 203 31 -26 -52 -69 -45 123 -92 106
3091 106 31 273 47 18 -165 20 -184 -50 -65 -209 181 -193 305 -166 -172 -216 218 -155 136 122 -118 -5
3113 -5 -143 397 -23 -88 256 -202 151 138 -123 128 220 -75 -160 65 95 341 -193 -135 -31 -109 45 -2 -133
3136 -133 46 -23 -47 -1 194 338 48 -116 -168 -163 -11 -103 -214 117 -62 15 107 -134 46 -48 -150 34 180
3159 180 -104 -213 -29 72 -55 -21 -140 14 59 147 -121 -51 24 -207 8 -118 122 294 172 -82 -126 119
3181 119 84 126 158 -59 161 -29 157 -174 60 -20 -89 41 -35 -120 112 33 -190 21 -38 271 -187 -81 -35
3204c5m3M6J19k57K14L1k48J7o8J54K89m18K46j01nK55j25j35M62n02l29K60K07
3227C4M5J22pl3l15J37J36k30J80Rk37M21r9J00j47k59N4K7K4l0O6O3j35K50l02
3252a26J46k7J42l3k37J69j78j52K02O2R8j59%R6m8L4j83K54K7j28J06J83j71
3275G7M2k26J73Q2n6r8J40j16j45p4J86M43m66m1J80l4P6j41o3R7k86L44L7j54
3299b3Q1j0m0r3J42q6K48j56j25K52j02j05ok03K58k90R0L67k97J03K6k54K51
3322B8Kq7J0j01M15k45k01J11P3k24K07p9L1L36l57J06k33K3K77k0j95N2p5n3
3346a99Q6L0qoJ1J17k56M11j10j45J09o5K42j07j79O7K42l0j02j39J38p5k30L22
3370A24k23M6M67m51k16L39p2l0J98j83N3J1j20j05K93j13j82o9J36R5O8m7k0
$$ plain form
3204 -35 -78 -32 87 -170 44 75 -173 -156 -224 -70 219 -199 47 -54 -59 196 71 -64 398 -104 -433 -173 34
3227 34 79 201 194 161 -154 -17 119 -111 69 78 -159 262 163 263 116 -143 -89 -62 -38 -68 -2 61 -74 176 -126
3252 -126 20 -7 135 102 -135 34 -144 -296 -94 -32 66 -93 -93 3 -45 -11 -194 60 87 -41 65 248 77
3275 77 119 -107 66 148 92 -6 134 18 -127 -201 -15 428 -38 -79 101 67 143 2 -61 36 -250 94 131 -23
3299 -23 58 48 8 -85 57 -29 219 63 -62 190 88 -17 -23 -226 32 -258 -168 199 -98 5 31 -223 28
3322 28 30 -57 -47 -148 267 22 -179 -68 5 -219 -12 -91 -60 276 -81 25 -208 -185 92 72 -123 -71 -146 -199
3346 -199 -113 -83 -91 -97 -86 31 -225 186 76 -69 40 -25 217 110 -69 -2 240 210 108 -31 107 32 -198 124
3370 124 -99 -53 414 -37 -253 86 14 -16 182 -1 52 63 -57 -162 131 18 -164 -233 -97 -2 66 19 -1
3393aJ59j55m96N99j0l13M59q3kj24R3k77J34KJ13k61qJ84K6J30k76J23N4P3l12
3418a69K61m31K74q4Q2R3jk2K01m92l6K81K0O3k25P4O9P5j62O8j39J79p0l9J86
3443E6j97J14L05l04J67j36j07J3M2j05K13p2l2K82j30j76p0J25J11k87N6j78
3465c10K05P3L9K6J52j17j30j21K31j1K88m88J88j0k14M74l46N1L59n14J82k3
3487a6R5J50q5m50M54n7J02j85m0J52l20K27j67R4o3O4K6Q1k12J45L41l96NJ77
3511A22l44K14mJ57j00j56m5K6Q3J93q3j28J40J89l18J16j18K53l78n0M24l88
3533a95N76j90l34p4M44m29J92q3q7J90j41L62j76k32L10p8J94l10K87k95l5J15
3555A1R7m0r3K10j03n5l9j31J73l63M20j21J97j26j56R9J05j16J99o0j92K28l2
$$ plain form
3393 -1 158 3 -493 106 96 -217 242 159 157 33 126 -151 -17 -15 98 -163 -171 13 39 169 -107 16 70 143 -169
3418 -169 92 -339 -65 -149 -67 26 25 3 204 -288 -324 -43 -23 40 -185 -111 -42 33 -129 -61 -200 -21 -91 -130 56
3443 56 -141 -27 278 -26 141 5 -102 -89 -47 -152 61 -11 -43 239 109 -67 -137 -12 99 -188 -132 -310
3465 -310 -105 -32 7 33 185 68 -62 -183 48 37 325 -163 25 15 -199 275 -71 -20 339 -175 7 -16
3487 -16 79 229 144 -306 148 91 193 8 -32 120 -200 27 -140 -46 -109 -45 -19 62 -150 -5 336 -60 -55 122
3511 122 -222 -8 -12 145 45 -111 -156 -130 -47 146 63 -65 75 264 -54 62 -56 197 -181 -231 193 -195
3533 -195 381 191 -143 -217 227 -202 -10 -93 -180 10 -131 231 55 -177 133 55 249 -61 226 -69 -104 11
3555 11 108 68 -25 185 82 27 -12 -143 30 -333 87 -34 163 37 -119 -20 85 -31 168 108 -84 144 112
3578A12J6j66J79j93M61n68K11j36J6J00M35m25r1J35l0p9k48J11J21M9j91J47
3600c4r6J31k3J69l3l69J72J7K3k02J61K9P9m4L55o17L78j32L8n8j45L21j99J24
3624D5O4Q4l06J23N9j0N8k15J27j6k6k31J74KJ90j43M7L28k61o6j31p8m2K22j01
3649a03j7J54m8K37k99K41j98q9K63j45J51ok61j8J13m7J44j02OK8j92m4K24J
3673gm2K22k18J43j63j08L19r4l33J74K2k0M2j0L22l51O5j67K24R2K4j44K32j61
3697F3M0N5j33j48J45j57M28k99j36P5m1J53m7N0N5l39J27K92k01J36M2p7K33
3720C16k20K3l08N4J71l8L5r4r7Q7L97k92L0l0O2Rm4K19k80j08J51j84L99j63
3744I5J30j73J81j70o0L3k36K77l26M57k59J70O9n7k49K73M4m57L38j39J98p1
$$ plain form
3578 112 128 -38 141 -52 409 -159 52 -84 -68 32 467 42 -49 86 56 -23 -271 -160 -39 10 -181 -34
3600 -34 -130 1 -22 147 114 -255 -83 -66 -43 -245 -84 -55 24 -20 335 -282 96 -36 2 -56 -201 120 -79 45
3624 45 109 193 -113 10 69 59 117 -98 29 13 -13 -244 -70 -68 122 -21 26 354 93 27 -104 -182 -224 -2 -103
3649 -103 -120 34 -14 223 -76 165 -33 -122 141 -4 147 141 -120 -138 -25 -72 72 -30 -24 4 -188 -232 -8 -7
3673 -7 -49 173 -45 98 -65 -173 146 52 -281 -107 -85 -105 -63 -73 249 -102 -37 -204 20 112 136 -8 224 63
3697 63 103 158 25 -123 22 -135 293 -6 -142 -67 -108 45 -2 48 103 -236 -109 183 -18 118 160 83 316
3720 316 96 119 -189 -135 36 -2 33 -61 -158 -71 326 34 64 34 96 105 61 280 0 -108 43 -141 258 95
3744 95 225 52 233 63 3 36 -200 77 -249 208 -51 119 188 131 -118 155 199 -258 80 -59 139 68
3766F8k33K56j56o0P8J42k41K70k93q4L38q2K47m16J73K30k78O4J18Q3k63J45
3788A06m32L54J63j19J26j33J71k21k05L58l17J80J54k56L7p1j75K32O8m7J15
3809H8j32K60k40p2J02j48L05k4Q8j56J50k06P3o5R7O6k38K0L2mJ38lq7q4K4K15
3835A99k19k04K34J14q0J39j26Q9%r2Pj7l0K1j64q9L12k26J92L4n3p0ML23j19
3860A79j40P9j27K51r0k59J34k80M37j57j89L2K43m40K20J96j82J92q7q2N6K26
3882B12q5l68L35J5k12L8m0K39l63L29k38j91L61O0k37L06k13J26j82K10J24l83
3904a57K24K8j97J48K35l90m8O6M6K56m40K58j15J0M00l7j17k12k2M88k90j49
3926a5n3n8J81K65n33L31k80J60K43l01k01K40k96M71k8j90j7J7K57J1k21J71
$$ plain form
3766 68 -165 91 -65 -125 -47 95 -146 124 -169 -253 85 3 250 -166 7 237 -41 23 141 224 -39 106
3788 106 -326 28 191 72 198 65 236 15 -190 168 -149 31 185 -71 -34 -105 -280 -48 20 -27 88
3809 88 -44 216 -24 -96 6 -142 163 139 227 71 221 15 88 23 120 186 -52 -32 0 -4 134 131 44 -40 -16 199
3835 199 -20 -224 10 124 44 183 57 146 146 54 61 44 14 35 -129 -218 94 -132 60 94 41 -29 -25 298 179
3860 179 39 118 -9 242 152 -107 27 -253 184 27 -162 -130 113 -327 -107 89 -93 99 12 -70 -14 212
3882 212 127 -241 94 109 -103 -65 -105 134 -229 100 -138 -329 32 92 -145 161 -52 74 -108 102 226 -157
3904 -157 67 95 -102 46 281 -109 -157 -91 -45 211 -229 29 -86 -76 324 287 170 -42 -64 424 134 -15
3926 -15 -68 -126 55 320 -213 118 -162 -2 241 -60 -261 -21 -317 154 126 -64 -81 -64 193 204 -17 154
3948A54k55j21R1m9L0J31J77l25J88r5L05k10k24K47K19l27J78r1J26qo9j00J01
3971G3j04K04j89mJ90k15km1J12k33L50J62k20j21L60l69K21j36p4l4R8Q0Qj45
3995b9j98M14j93J52k21J64j24J15k72R6Q9j88M83k9j39r9P6k66L20k8j02j85
4017a64K3K5L9K09k1j72L3N4o6J6J65J13j58k23J56r4J16P9j24K07L0k74j10J2
4041a29J47Q3j06J39j36j51M09n69N25j61o9n4P6p7J11k07J80N6l15K22N0k0K71
4064B75l94K75q2k61J73o8lJ10l6k29L75l11K15O8j30mL5L6R3k84K70j58P1L7
4088G3k50K15j99J82J60j91r2KJ97j64L00k25JK04m8m16L47r9J57p8k5Rm16L60
4112Dj94K63R9j99l9K01k24N4q1K78kj86r1J86j37Q9L8k11R5J6p7J68j5j71l8
$$ plain form
3948 154 -101 -222 -131 -180 -150 -19 158 -167 21 -74 231 21 -203 44 263 -64 114 23 149 141 72 -28 73
3971 73 -31 173 -16 -20 170 -45 -47 -88 24 -209 141 303 83 -38 322 -47 174 38 -36 -70 28 108 116 -29
3995 -29 -227 187 -6 146 -75 89 -35 80 -192 -96 -7 -195 288 259 120 21 97 -169 151 123 21 -164
4017 -164 -141 -116 -77 132 111 -61 -28 26 -40 -24 141 254 96 -127 29 -65 51 130 6 213 243 -31 -141 -129
4041 -129 18 101 -5 134 -2 -153 256 -313 212 51 -18 -72 4 -73 38 -169 11 67 -248 -26 24 4 275
4064 275 -119 156 74 -187 -14 -82 -85 25 -11 -240 135 -176 39 107 -23 -27 8 44 137 -147 123 -35 36 73
4088 73 -177 38 -161 21 181 -10 -102 -100 97 -67 233 8 9 213 165 -251 96 -3 154 76 51 60 -356 4
4112 4 -190 73 172 -27 -66 135 -89 -35 -116 162 160 -26 -117 69 -68 21 59 -152 -57 -41 -118 50 35 -136 -174
4137a74K04k2n2K09j67K0R8l25K20j35M5J36k31J43L36k42l38N0Q1J70Q9M5k62
4160a02J68q9j60J43J09j68j08Q9J58j39J40J26l75j37N81N4l27J16n3o4o2J29
4182B9Q8k78J09J50J26j17k40L39J5j52j48p5K26j47K43l67K01j39L32k31L03
4203B67k19j7J61k76J07k1J99j01L3l02J91K21j22l28J91l57M21m37K84L3j38
4224b10M4J96L5l96L34j79J93k46L10k3K09m09L2j3Q0o9J11K9r9K40m93L92P5
4247A43l28j34K51lj0j45K26Q4j8j45R3k3Q6k65K55J09k66K54k41J30q2j72K21
4270B0J81m04K31rl6J30j0k96o3NM39k86K60j87N4J31j36K80l17q6J38p6j33K6
4294a44J25R3l89M30j36RJ08j1p5J71j83J30l1J10P0l48J56K29k08j24j72K83
$$ plain form
4137 -174 30 8 -44 165 -2 18 116 -209 11 -124 -79 57 -174 -31 305 63 -275 -225 -144 26 115 160 -102
4160 -102 66 -23 -183 -40 69 -99 -207 -118 40 -99 41 167 -208 -345 236 290 -37 79 26 -38 -100 29
4182 29 117 -161 -52 98 224 107 -133 206 221 69 -79 -154 72 -75 168 -199 2 -137 195 -36 267
4203 267 48 31 192 -84 23 2 201 100 133 -169 22 243 121 -207 -16 -373 48 -389 -105 -72 -210
4224 -210 -166 30 65 -331 3 -176 17 -229 81 58 267 -142 -110 -123 -43 -112 -1 28 -71 169 -324 68 143
4247 143 -185 -319 -68 -71 -81 -226 0 84 66 -79 14 -9 77 -188 67 176 -90 164 -77 53 -29 -201 20
4270 20 201 -203 28 19 -17 113 103 -193 -256 -251 188 -98 162 -25 29 160 24 304 -13 -99 39 -37 -170 -144
4294 -144 -19 74 -315 115 -21 -12 96 85 10 181 -2 128 97 207 277 -71 85 314 106 -18 -190 93
4316I3qq7j31K16j61k22N09k46J10J96k07k32K25J45j98J80L02l48m2j21k9J97
4338A41k90K44k94K46j57j88J82J02n3j26J68M4m4O1o9K0m7R5Q0o4J54k31j93
4361b19R3R7J87j66n6J6J08p6J50o7j95M12k93K7j65J84O7k53J75o5k99N3L73
4384H8o8J6o8J27j18n9J40j54J96k11K44j33J10r4o3J28r9k5J41j86J09j5j18
4407a12K63l62l8J81j23K97j88K19k16J64j71J32k6L2k6k33K93k32J49j1m4K58
4429B06m88J0K89k77M37j10k15P6J13p0O0j08lJ26j88J4J42k26J07K50j05n1k15
4452b26L41k41MJ14L1j83K01q3r4L39j22r6M7r9Lo9j88M48k20O7P8j09J50k8m
4477F1j52M9l6L26l22K61J11l13l3r5J64J06l88P7K01J17j80J49j09K66n73K09
$$ plain form
4316 93 85 -2 -133 83 -78 -300 209 -37 73 269 62 -170 55 200 2 182 484 136 94 -27 -56 141
4338 141 -149 95 -199 47 -110 -298 -116 -14 -67 -193 -25 19 -25 36 -33 -13 -60 35 115 51 205 -26 -219
4361 -219 -126 -29 158 -8 -64 -48 60 -16 134 67 -128 284 -9 18 -147 37 104 -149 26 -39 -338 -285 88
4384 88 20 36 -32 95 -23 -82 58 -96 100 -111 133 0 110 16 -47 81 -18 -43 98 -88 21 6 -112
4407 -112 151 -211 -249 -68 -191 106 -82 137 -79 85 -86 46 20 52 26 -207 86 -146 3 -8 -52 206
4429 206 -282 -272 17 -260 177 67 -148 -72 41 -29 31 -77 -80 46 -142 -128 14 -212 -105 145 40 -11 -226
4452 -226 115 -126 -122 -8 23 -160 41 -42 -136 203 81 -15 32 -67 -64 -133 -321 127 -93 -26 52 -57 93 65 61
4477 61 -91 -42 -78 248 -74 187 298 -15 -48 -143 21 127 -261 -184 17 134 -46 103 -6 260 -313 -104
4499a04J63J10j87j3k7K5J93r7q3J98q5j53P4J29j29k63P6J98o5L1l2J29k02L33
4523B19l5m21L67j80k6Q2n7K44k80m6J22o1J25r2l5q0L7Q6p1K63j14n7l6K1J3
4548a2K7K7r4j26R6K44k84P3p9J36K21m12J76j00J57l2k75O5J25%L71l04q9Q2
4572gm5Q8j90P9K07j62K6R4j70N6Op4J51pm42L56J44k67L28k14N8l36L08L64l56
4597eJ9j07q3J24K12k00J08j60P9j0o8o0L61j67k48K42l9m1J24j75M8j02K56n1
4621E7j69K68m09K94K01j56J48l02l5L2J1j09L61n00K87o3j35K78J3j26J74Rk47
4644a18P1j40K18n6J27q9l2k01K13l10L01lk0j42N8j06M04k65J74j12j5J15l27
4667b55K54k4P0j6R5l59K13N1J17p4k30K10j68J01m1J98p0l56K00M5nK55k45M4
$$ plain form
4499 -104 59 169 -18 -31 -58 -33 160 63 -20 178 93 -60 14 143 14 -249 -173 25 -40 -9 -41 88 -114 219
4523 219 184 -237 130 -50 -76 6 -51 193 -87 -133 -11 -72 53 -39 -74 -154 -117 -31 -102 161 47 -10 -46 -25 -12
4548 -12 15 42 -52 -178 -82 162 -122 -49 -128 8 229 -183 -7 -107 50 18 -257 -192 -67 -67 304 0 -89 -7
4572 -7 -52 36 -154 -75 132 -30 -4 90 -80 -24 -18 -92 59 52 -390 -34 110 -157 171 -43 15 -321 -13 351 -5
4597 -5 14 -93 -176 -52 160 -40 68 -92 -13 -23 -91 -151 210 43 -205 37 -2 -43 81 -94 -46 -148 108 57
4621 57 -112 156 -253 41 242 86 234 -68 -103 -71 -60 -169 192 -308 -21 -84 -219 59 72 -54 120 129 -118
4644 -118 -47 -187 31 -25 102 13 -19 -220 -7 -317 -16 -19 -39 -181 -123 -229 175 -90 84 -28 -43 72 -255
4667 -255 -1 -25 45 29 124 -235 -22 29 146 72 -158 52 -116 -15 -56 142 72 -284 -84 -39 -44 211 -34 10
4691A0J24o8M0j16L9J38r9j51p9K70k21l3L28l39J54O0j37M7k53L78o4k58m0%
4715b70R3K60m3k83L20n0L19m76N2J28k95jK26k6o4L03j91j07J52m6R4j11O0l8
4739Fm0P6Qj46N07m25J7K43k34L9k05L23k05L9J87j94k01l8K60j73J29K1M5k3
4763A6J69k2k41n7r3L81k4k40J57R5k19R9j81R6j28K72J04q9l29J25J31L7N2k4
4787H7J1P1J58k25k1J26J09l87o5j61K56M6m5O9J20j20k02J00K09L5j6p9R2j64
4811DOM2O9m6j85J02kk6k84L66J67l93L43l13K61k13P3K73j39j61l1J68n8J18
4835A41j38l4J95j06j48J61j19n9J99l32L66l47K95M0k41J09j63L40j67r6J52
4856D8Oj13J42N0p5J06j41k60K25k0q0K38k70K52Q8k58n2K05r9O5j73J02J64k60
$$ plain form
4691 10 134 66 106 -10 29 167 68 -83 -162 108 -113 -146 182 -157 -3 57 -80 -33 -286 92 28 -230 -270 -270
4715 -270 -177 83 40 -243 77 27 346 -130 -78 50 -245 -246 -20 -46 -110 193 2 -105 47 1 95 -16 44 6
4739 6 -34 42 50 -96 411 -14 3 246 12 51 -154 169 -36 3 190 -4 -205 -243 17 -156 -27 -6 39 16
4763 16 185 163 -78 -135 -228 153 129 -111 46 141 -78 21 -160 -64 -192 80 184 95 -234 -109 22 59 111 87
4787 87 98 169 327 102 81 207 316 -71 -136 -297 -41 5 -40 29 149 29 -173 -73 136 171 155 76 168 4
4811 4 10 52 121 75 -110 -8 -10 -36 -320 46 213 -180 163 -150 111 -102 -29 244 105 -56 -87 81 23 141
4835 141 3 -31 164 58 -90 71 -48 -107 92 -240 126 -221 74 114 -127 -18 -181 159 -8 -104 48
4856 48 54 -59 83 133 58 164 23 -237 -12 -32 -112 126 -144 108 196 -62 -114 91 -8 57 -116 -14 150 -110
4880a10j1l7M0m6P3K8K99j11p9k69J98ol5l0M4J51j66j13j3K66M1j2n3k94Q3P2
4906i0R6J93k32Q1o4j43Q2O2p3K57q4r8K29k78K23o3K42j81k52L90j20l09K68
4929A36l50M6O2K30k59K52l21Q6R6k22M8Q4Q6j22K48j77K50p9J18l95Q6J58J94
4952B55l02J98k24j13J89o2%P3n7k4N9q0K75k25R4J55k99K8R9q6K5pk7K67k19
4977hO9J8k95M06M2k51o1j03K04o6j26J87j8J27j91j88J10J70J0j52Q6J09m6l73
5001c40L97O9m15J89RO3o9N9J78j47L2M0R4j41n3p7J16m9p0K51k37p6J93j38J50
5026B8P4m4M8l80L26J22k02L46n94M13j86J38j33L1l6p0k03K33K89k70M7l4J72
5049A15L4j8l9k24NK26o9p7k76M64n5j87J27j78K38j17j45J37J66k30k7q9K77
$$ plain form
4880 -110 -121 -158 -118 -164 -91 -63 236 125 46 -223 -25 -31 -66 -96 -52 99 -67 -180 -193 73 114 102 49 -245 -162 -90
4906 -90 6 199 -33 48 -16 -159 -77 -15 -88 169 85 -13 216 -62 161 98 340 159 -93 297 177 -132 136
4929 136 -214 -168 -106 124 -135 117 -204 -118 -22 -244 -196 -112 -26 -148 100 -77 173 94 212 -183 -97 61 255
4952 255 -47 151 -73 -186 3 -59 -59 14 -43 -67 -8 -88 187 -38 56 211 -88 -60 39 -47 -22 -29 -56 211 -8
4977 -8 61 79 -216 190 232 -19 -80 -183 21 -45 -171 16 -2 125 -66 -254 -144 26 36 -116 -30 79 33 -340
5001 -340 57 126 -289 -100 -91 -28 -97 -38 140 -7 25 65 159 18 -35 -112 4 -45 -115 136 -101 -177 16 -122 28
5026 28 102 58 106 -274 52 174 -28 318 -276 137 -49 89 -44 -13 -49 -119 -322 -89 200 -70 -23 -57 115
5049 115 149 131 92 -132 -127 99 30 -47 -323 141 86 -101 26 -152 86 -31 -176 -39 127 -103 -130 -219 58
5072E8J84j50r9j40J29J35p4J90j93m4j30J31%P0m01L32J47p1k1k16nM87k57j20
5096e8q6np7K33K20j25j82J87k36pJ0k5K62j50J00Kl54J64l8K97j21j53J25K9
5120A2j13o7J79K45m02L01k64J7L49j24j69n3J3K36m85L48n1j67K08J11j35k9
5142d0p0K1J36J60j73p6j3n3J52J11j28l4k6q4K11%k26J4L15l56k%K84Ro2j69
5168i9j84K60j56L03p1K81n76J57J66J2p0l5K0L2R4J55j01l52K94j25k45M39l29
5191a30K6K7k34J67K45k25J50n2J77k59M0L62j99q7K5k0J38k29R6K06j25Q4k25
5214d2J83k16K19Qo8j42NQ2l20K77R4j23J55q2j15J3P9J13j08Jj6r0j33K70Oj5
5240C5P9j03L6Kl2p7J16n4j19L7j13J65k6J01Jnl7J51k37J70J18k78N5k69L23
$$ plain form
5072 58 242 92 -7 -147 -18 117 43 233 40 -4 -134 -3 -3 67 -334 -2 145 74 53 -163 -168 319 62 -58
5096 -58 -144 -149 -226 7 227 102 -80 107 -129 -136 -126 -151 111 -39 61 63 -291 -127 -165 132 11 -142 -17 12
5120 12 -101 -168 11 256 -146 155 -109 -92 257 133 -36 -89 -76 160 -325 23 -28 -195 13 124 -11 -40
5142 -40 -110 -89 47 207 34 -42 -55 -108 44 155 27 -7 -33 -117 94 94 -132 -118 197 -159 -161 -161 123 132 70 -99
5168 -99 -283 -23 -179 124 53 334 -242 -85 81 93 23 -12 8 40 134 289 188 -164 130 5 -240 199 -130
5191 -130 -104 -77 -311 -144 101 -124 26 -26 151 -108 -68 294 95 8 33 13 151 -78 18 224 99 183 -42
5214 -42 141 -75 144 152 84 -58 -53 29 -291 -14 80 -43 112 30 -85 -72 7 120 12 13 -3 -93 -226 44 50 35
5240 35 114 11 47 49 17 -60 56 2 -117 -80 -193 -28 -54 47 48 43 6 157 -80 90 208 -70 -15 -284 39
5265C9j7j57J36j61J53J15No2k24P9L55k90N2m8j31J08J52P6j61p0k11L83k15
5288i4R5K04l16K66j96o5J69p1n4J00k69K99q3J79q1m7o9k9R5j82P4j24K11N8
5312G0N9q7P6r1J14l10M8J15j27J8q2K89j04L5K9k6Q1p8k18K17M1k26K99l06K27
5337F3K9m8j60J23qj27K64j0K54l22o6k0Q2L4N6j39Jr6j48K87o3K7N4o1J69k48
5363g3j7M0j81L64K5l1k13nJK98k17J74j43R2j6j32K53k77J48Q0L8k13j20L66
5387B41l90J17lR1q4j41K85ok18j9K75K8j45QR4P0k69O5J53j58J18m3j54j6P3
5412b8L6k1p6j1J39L4j08R2l4j22JQ2k20K52qm7J40l54L56k77K19J62R6j79k13
5437h9P0j47j5N0J12K3r7K4L9O6R0L3k6l4k08K8p8K89p3j72n0L56m43J84L05m41
$$ plain form
5265 39 22 -135 1 -160 -7 108 113 51 -173 -94 261 -29 23 -25 -156 -48 104 180 19 -51 -262 121 -94
5288 -94 1 205 -111 155 -41 -106 63 -8 -62 38 -231 68 -15 164 83 36 -33 -62 33 -149 -75 -199 12 70
5312 70 129 42 118 27 141 -169 -121 -6 -133 -115 -197 92 -12 23 52 26 107 29 -189 28 69 -157 142 -164 63
5337 63 92 44 -116 7 -1 -128 136 126 380 58 -8 -28 54 88 144 5 6 -90 -238 49 -14 13 67 6 175 -73
5363 -73 -90 -50 -231 133 158 127 -86 -91 -90 208 -9 165 22 114 98 -34 219 -58 90 170 208 -5 -125 241
5387 241 -149 -32 -35 56 -28 -169 116 110 -108 -127 148 176 31 39 133 203 -66 -1 152 -6 112 69 -85 -101 -28
5412 -28 8 -13 -89 -100 39 73 -35 57 23 -99 -98 -16 -236 16 8 -39 101 -253 103 -174 45 207 303 124 -89
5437 -89 -19 -166 -181 -131 -19 4 -93 -69 -30 36 126 159 133 99 -109 -81 -159 130 57 -115 -165 191 -252 -68 237 -204
5463b04J90J8J07K5l05L05J03k52J25m7o4plQ5J20j82k04K39m9l0J38J4Lj61J15
5488G9p7qr9j10L20K15l05Mj3k54M18p8j47J40j17l4K88j82j53K81Rj35Mj64K42
5513A24j01K5r2n1K7m6J87J88k75r8N5m6L69j82j38j21K69LN7k37l4K90QJ04m92
5538b07J50J48j42J19n8j6L01l79l2l6J73j19K41J47k63j23n6N2K86J01l05K01
5560A83j38o1K22p3k37J37k73kK20R3j84R6J29j61P9J59j27J47j70L54l01j21
5582b9J97m90L36J02j09P7j84K68M2j66p9k72O8L00j07J81k9M3J81j57k13J16
5604G6J7j53J35K11Q0m51L1L23l46K83l56o6J93K00l55J05M6J56r8j60K97j51
5626A7j12rj32L55n0m8P8r1q3J76k18P0J20n4M24n72L98k58J9j8O7k45J10o1J03
$$ plain form
5463 -204 -14 4 111 136 -169 136 239 -13 112 65 1 -6 -9 76 196 14 -190 49 0 -30 108 122 125 -36 79
5488 79 2 -6 -105 -215 105 320 15 19 6 -248 170 92 -55 85 -32 -66 222 40 -113 168 177 42 46 -118 124
5513 124 23 48 -44 -95 -68 -114 73 261 -14 -112 -57 -103 266 84 -54 -175 94 97 154 -83 -117 173 181 285 -207
5538 -207 -57 91 -51 68 10 -6 295 -84 -116 -152 21 -98 143 290 27 -96 -152 -100 186 287 -18 183
5560 183 45 -16 206 133 -104 33 -240 -242 -22 71 -113 -17 112 -49 30 189 62 209 39 393 92 -29
5582 -29 168 -322 14 116 7 84 -100 168 210 44 -35 -307 -239 61 -46 135 106 149 330 173 -40 76
5604 76 93 -60 75 286 366 -85 -54 269 -77 206 -150 -216 -23 177 -178 -73 -27 129 31 -129 168 17
5626 17 -95 -104 -236 119 69 21 99 8 -75 101 -117 -47 73 19 443 -129 269 11 30 12 79 -166 -56 -117 -14
5651a4J99n3j77J05k64L1K76j85K47k17J51L08l86k26J31J56r9K8J09N3k36P4
5673A1N0o8k03L15r1j9K22k30p9K01j16Qj08Q3O9j00K83o2m37J60K07K29q7j46
5697I2j50j71K30m7K00M6k91J69j5K19m41Q6L21l63K85l22K32k13n3K41j34R1
5719A2P4j59K19Q9l52O5J21j21L17k33N3nP0l32l8K95J47k28R4k3j07j6K8j4j38
5744a82L41p0R1j89O0q9q7L42k14k57K67oj27P7N8M0k40J07J79j54J7M39k28j31
5768D4N6r3J18k37K09k29K93j6k96q6R5K72l60J09K03o5j15L93j63l04L52k0r5
5791F5j31m2L69k3k92P3j12r0K46k25K90j83j55K11j17P9pm2J01j57J52j63J54
5814Ar0L1J3j31K71l93K18K15o0Kj6k55J98j6K76k49N8j35J38m7m8j25K11Kj86
$$ plain form
5651 -14 185 132 -45 60 -204 -173 103 -82 165 -52 99 407 21 -205 -74 82 -17 11 120 173 -63 11
5673 11 61 -7 -210 105 14 -5 217 -13 -92 109 -7 1 -107 -24 45 -55 228 166 -271 -111 96 325 238 92
5697 92 -58 -229 1 -46 154 200 -91 78 63 282 -159 -73 248 -115 170 -152 80 -133 -186 55 -79 12
5719 12 86 -73 146 235 -117 -52 69 -52 265 32 85 80 150 -182 -220 75 222 -6 88 65 -42 -58 -30 -44 -182
5744 -182 159 89 180 -9 51 -38 -125 217 3 -254 13 7 -120 -43 15 55 -185 -78 101 -53 -36 403 175 44
5768 44 100 7 125 -112 97 -132 161 145 -151 -237 -142 130 -230 -121 82 17 -98 295 132 -172 180 160 65
5791 65 -66 -108 261 238 -54 19 -93 -183 63 -162 128 -55 -210 1 -116 -37 -44 -86 15 -142 10 -153 1
5814 1 -89 -58 -45 -176 95 -298 -80 135 75 77 61 -194 4 -12 264 15 73 -62 76 29 -19 -144 67 69 -117
5839a17nK05q4K07m10K39J94m34J50j15K33J00j16J03k52M4MK4K33j38O3J17k46
5862aJ0J38j49j81J48K7P5n5Nm1J53N3k03M2j50K20k00O1K40o9p8j1j15K2N8k8
5888b9j4q3P2M77k07L7k88p2L40n4p3P5j89J68k51J7O4j17k05J83M1j97M44j15
5912B4j05M3j47O6J52j41j61J15K34j58M4L7k3LR1j12J0J08J20j51R1p5O4p1k80
5937b22L01k65L76j93Q7R7l48j10K51J2l3J59k93P6P9M2J65J10l48P0j12OQ7L6
5961C0J25k82m3J88n2m0j19K78j8k30Q5K31k94J53p7J53k3j18q4J37Nj8J00j89
5985a02pOQ3j5l7K14l89J44P8K51k08j15K55j69j00Q7Q8n1J43n9k17j94L27k45
6009b32L72k62Q7j47R7N7O8O5o6j2k1j4J62k97J2K89l28J84j89L64k85K53l26
$$ plain form
5839 -117 -122 83 -1 206 -204 35 229 -205 -55 -170 63 163 47 150 -102 -58 -54 -30 203 65 128 245 -1
5862 -1 9 147 -2 -183 -35 -8 67 12 17 -24 129 182 -21 21 -129 91 -109 -48 192 123 45 34 -81 -59 -1 -29
5888 -29 -43 -126 -54 423 216 253 -35 -107 233 179 106 181 -8 160 -91 -74 -10 -127 -332 -149 -108 -305 139 24
5912 24 -81 -38 -185 -119 33 -108 -269 -154 80 -78 -34 3 -20 -17 74 -38 -28 80 200 49 140 65 129 58 -222
5937 -222 79 -186 190 -3 84 181 -167 -277 -26 -14 -47 112 -181 -105 -26 16 181 291 -57 13 -99 -93 -6 30
5961 30 155 -127 -170 18 -34 -74 -193 85 67 -163 -78 153 -141 12 -65 88 65 -53 -137 0 5 -13 87 -102
5985 -102 -109 -103 -20 -35 -72 142 -247 -103 -25 226 18 -97 158 -11 -111 -24 64 13 156 97 -120 -314 13 -232
6009 -232 140 -122 -35 -182 -85 -28 40 105 39 27 6 -8 154 -143 -131 158 -170 14 -175 189 -96 157 -169
6032a69M7M86l24j3p5J57j39j91K3K84j85L12k98j15L93N0j64n2j76K36K9j89
6054g3J77k70N5O0O0k03n8K94l0R3l6j21K09j40J7j84J8l3m6K34L4Nm0n8j8Q9
6080C5j90J59j0K54j74j32N4K46j94j75M57n32R1R5K80k57P5j36L48l15J60O4
6102B03j97n6j88K56J28j72j38L46j87p0J28j29J42R9k68L78k62l6Q6r7r2J64
6124C8j47j7N3K57k95K25p2p5J11j8n6J1m6KP1j61K43m5j45J15j22q4O7j20K59
6149D9ol6R0N9k1m7o4N5j19j06OK2J49M14n55kQ9p7K81J46k39k7k06K85k85K30
6175H5k75OL14j05N2j3p7k8O2o4J48j76J15l15K36KK68l13J33K38k77q5o9J40
6199BJ81k95J76k79L38k05J95k29J45j54q5j10L64k2J78k50m4p0J83m4K11r4m1
$$ plain form
6032 -169 -122 364 40 27 -48 109 -30 -221 -198 86 -99 213 -85 -200 193 243 79 27 -149 87 116 -73
6054 -73 104 -166 -111 -51 9 -194 -252 42 12 105 69 -52 157 17 34 -150 -132 -165 -211 23 57 62 22 -36 -54 35
6080 35 -155 4 -6 248 74 -58 -4 242 48 -127 330 -202 -111 -16 264 7 82 -54 294 -21 139 203
6102 203 6 -50 -238 18 146 -26 -164 182 -5 -75 53 -76 66 165 -103 275 13 -23 63 -34 -126 38
6124 38 -109 -126 -73 184 -111 114 42 -33 78 60 4 15 -31 -29 42 -119 124 79 -66 49 -73 -157 -90 -210 49
6149 49 43 7 97 156 135 88 24 79 -40 -146 -140 -118 31 445 -110 -112 -23 -100 181 327 88 61 -145 140 -145 85
6175 85 -190 -184 130 25 77 64 -13 -41 21 -43 105 -71 44 -271 -35 -33 235 -78 55 293 16 -69 -138 2
6199 2 183 -112 64 -215 123 -82 113 -116 29 -125 -210 -320 44 22 200 -50 -94 -164 19 -25 186 92 51
6222E1k0k30K27Q1k4j13P9k45L24N8j82j91K55j90p0K44j93o4J50k06K69j67J01
6245e6o6j8k97M91p1N5oj21O2J27j30l7k66M01j19O2k74L34r8M7j34J25J0K6o3
6270a6J9R1j47j88L10j06J50k5j10K06j36J11p7r8O5j60J60L5k38K62r1j9Q4R6
6294A78k65q3M1o3NK76J82l28n7O5J88k9R9j88Q2j12P0J7K4n8k19K72J41q4l64
6319b10M21l82L25q4m37L29l8M8j17%p2J57K52j61J11Rr1j99J90j10J61j13p4
6342h5K5O5J01K38n21p0R5J45K3o2KJ48k19R5o6lK14j12k32O4R1K04j18j46J44
6367B0q1j63l7r0N61k42l5J6K7o8K53j10j70K55J81k29o1J27j86j3J70J31k29
6390B7k5N2Q3j8j30N9K3j17m8J53j95L3J26j45n6J63J3J3q7M2M54l99k3J43n3
$$ plain form
6222 51 31 -199 28 109 85 -28 51 -194 130 188 6 -185 70 -120 -190 54 -139 -203 -53 -259 10 -157 -56
6245 -56 -122 -140 -437 54 -17 38 32 -89 -27 100 -30 -67 -333 68 -51 11 -263 71 -27 20 -114 11 21 47 -16
6270 -16 3 94 -53 -241 69 -37 113 88 -22 184 48 159 82 -16 49 -111 49 84 -154 108 17 -2 82 178
6294 178 -87 -170 -129 -192 -187 89 271 -57 -114 -49 139 110 209 21 103 -9 61 78 102 44 -175 97 238 154 -210
6319 -210 211 -171 154 70 -367 -38 -76 -28 -145 -145 -217 -60 192 31 142 151 60 -139 51 -59 102 -11 -85
6342 -85 -60 5 106 344 -177 -247 -152 -7 16 -46 -44 104 -115 -20 -86 -89 125 13 -219 -155 -64 140 22 -124 20
6367 20 -61 -224 -261 -351 210 -32 -67 -51 -24 -92 161 51 -119 136 317 88 27 154 -32 -45 125 256 27
6390 27 2 54 137 119 -11 48 71 -46 -94 59 -136 -103 23 -122 -178 -15 -2 11 -76 -34 420 21 -2 141 88
6415H8m16L53J5l2j84R9l3J36M1j61L21j40r2J86L7m86N41l65J14k2m0K34p8O2
6439A78j28p3k3r8J48R8j14j76o9J31J00J14mo8L20m62R1k69L59J24J21m0l28
6462f8M0N0k03q0M12ll7j46j20K70j77no7J26J91k10J73j79P7j6m1k84J66K02
6486G1m41J17M84k49J10k0j06m5J26M7J66l02O7l5m1M3m7J73Q1j79L78j00k33
6509F5L1k18K39k34j7K51L1k46j36J1L92j30l41K98m9O4j36k6J08mP5j91J25J07
6533F9P0k77K22P1l13K31J13n4k18J45m8q4l3J33rp4J0j77L03M0P1j17q6l09L45
6558B4o5j31Q9K41j31M5m5R8k9j79K04j56J21N5q7p8k8M6J01j27K65l21o9R2Q4
6583A9k3p1J70j87K44j93K58k11j8nJ81j55q6J94M1r0q9j40J35J10p7j82J31l3
$$ plain form
6415 88 -328 25 40 8 -176 -77 -110 26 67 -94 227 87 -5 181 218 -268 273 -92 22 0 -40 194 116 178
6439 178 50 -23 -46 -144 4 102 -12 -188 -257 -126 -26 88 84 16 336 -126 -35 -304 55 179 300 260 -68
6462 -68 -28 22 -181 -261 151 148 111 -35 -155 115 -62 -67 -134 -8 183 -27 146 -33 44 28 -13 -297 -131 71
6486 71 -370 -253 231 -18 92 72 -34 -79 47 94 260 -42 25 -10 -51 -8 -55 118 199 20 398 298 65
6509 65 96 -122 117 -117 -134 117 148 -98 -234 -223 169 39 -302 -4 -53 11 -125 -151 -43 -47 28 -163 -38 69
6533 69 139 -138 84 155 -158 73 186 132 -86 59 11 -73 -106 27 18 -56 -46 -223 80 120 191 74 -12 -321 24
6558 24 -41 -172 -83 158 27 72 27 125 96 -83 121 -35 86 141 54 -24 -52 -6 95 -32 233 -88 -157 -65 19
6583 19 -4 -75 95 -92 152 -41 217 6 -12 -17 164 9 -77 117 158 68 -21 -161 -26 84 7 -175 -44 -77
6607g7O8j60M54l61J60J42l29J18J41j13j23J2pQ7j30L84j81L4m6k2J6l88L97
6630G6j17j03M17j45q0j85J7K20J9k34L71j69M3j67Q9j73J69j4qJ04j25K73j03
6653A75n40M03J9m6P8N1k61R0m7m6O7M0J98m73K00K59n3j4q6j76N4J67O1nl1j04
6679b0p9r7J66r8r7L20l22J52j76P7J69j44K53k98P5K82j39J87k15l49L44L7J4
6702D2r5L1rJ46j40L0M8k83J53P2Q4j16J20k02J61j89L16J95m45J95k13J23j16
6725i2J58j05rJ36M4k17K79r0l4j40J18O9j30L26m33J10j68K44j45J9K65k18Q1
6748F8J17o75N92j35k80K61n3l0L49r7k94L00l19L04k24P7J7J93m5q1l25K46O0
6771B6oJ13k67K63r1j17M4o1P2N8M9l1M5K6Q7m48K89Oj1kj1j23k1J12J42Kk50
$$ plain form
6607 -77 -9 -169 285 -76 84 226 -103 15 156 43 -80 -68 -75 12 -118 266 85 119 73 51 67 -321 76
6630 76 -41 -144 273 128 48 -137 -120 100 119 -115 256 87 130 -37 52 -121 48 34 26 130 5 278 175
6653 175 -365 38 57 11 89 140 -121 -31 -78 -124 -57 -17 181 -292 -92 167 114 100 14 -162 -108 59 120 115 84 -20
6679 -20 -99 -196 -30 -128 -225 95 -227 -75 -251 -174 -5 -149 104 -194 -119 163 24 211 -4 -353 -9 28 42
6702 42 -53 -22 -31 115 -25 5 53 -230 -77 -5 79 -37 83 -119 42 -147 169 364 -81 114 -99 24 -92
6725 -92 66 -39 -48 88 132 -85 194 104 70 -70 48 117 -13 313 -120 -10 -178 66 -79 -60 205 -13 68
6748 68 185 -490 102 -33 -313 -52 -105 -135 214 117 -177 123 -196 108 -116 -39 -22 171 126 45 -280 -34 26
6771 26 20 133 -134 129 38 -79 -35 -96 -24 34 83 52 97 123 210 -238 51 57 46 44 33 -90 -111 1 143 145 -105
6798a05P5K40k31PJ2m7R9o9K39l19j99M47j59P9rO4P2j04J0R1jJ4l36nJ61J8n3
6825ik57L20j21K05L8k72R6J76k59J97j68L81j95j0J71k57p4R3j17K38J76j38
6847B14j06j49K45j32Q2n0n1J36l03Q5j68K56N4j70lj6m8J34J96j30j28k9K56
6870A75%k63j38J73o7o4j97K67j20L17j63m8K01k80J36J1O1k24P9J03P7j21k65
6893c50O69m46K61j38l03L73m06N00q9r1K05k84j0K46r3k05k4q3L59J27n18M31
6915A31j9j43J67k32J79o3k75L25P3q6J8O0j87l4L08k22J12l0K8j08J81k29j1
6938e7J58l06M2K79j42J43J21l41J22%J5J06J4P9q9k27n3M93l73R2m3l66M07j59
6962h5J0K38l65J01J10L5J36k16n5L21k64j44J33J09k06oN0P2N1Q2k46J92J76
$$ plain form
6798 -105 -30 210 -21 -14 -2 -49 50 -19 220 -99 -298 149 -10 69 60 124 196 92 102 193 192 206 -130 -135 26 44 -9
6825 -9 -266 54 -67 138 176 -96 0 176 -83 114 -54 327 132 122 293 36 -38 55 -62 176 352 214
6847 214 108 -41 204 72 154 104 53 189 -114 -29 -197 59 113 -57 -60 -76 -124 10 206 76 -52 -81 175
6870 175 175 -88 -226 -53 -120 -184 -381 -114 -234 83 -80 -128 73 -207 -71 -60 1 -223 -144 -41 36 -85 -350
6893 -350 319 -127 134 -4 -307 66 -340 160 71 -20 185 -99 -109 137 44 -161 -185 -268 91 218 -300 131
6915 131 112 -31 136 -96 83 20 -255 70 143 57 75 135 -52 -86 222 0 112 82 110 2 183 -46 -57
6938 -57 101 -205 -163 116 -26 117 238 -103 19 19 34 140 154 233 144 -83 -136 357 -16 76 33 -333 74 -85
6962 -85 -75 163 -202 -101 9 44 180 -36 -91 230 -34 -178 -45 64 -142 -148 -98 -26 25 107 -139 53 229
6985B29j20j37J11J39m36J29pQ6P4l84M61l42k6L75l80MM21k12j89kQ0L87l23
7008f2O8O9L0J16k34j34L17k95J62L2N2O6l10j9J59j06P0l44N32j35K2r2K99j49
7032A14K3n2M7k58R9K27k95K04K9J2j87j11K51j9R0m9l13L27j92L73n50K78q7
7055c9k1J64l60N32k52J59l20L07j55j88L38ql10q6J41R1J74k20n4P8j95L36J2
7078A24k66J69o7l9J09K68j17k23j62L51j94L00l00j66K78k91K02o4mm4L77l19
7100g8J0k4j06J89R8k06K66l45J47Lk67K66r5L12r4l31K35k00J83J2j8J19J76
7123B52k56j17K33j32J05n6l7j77K03O5j15J13k7j93K84j47L4J60l16P7L6n3Q4
7146B0J24l3j31p2j78M45m19L73M5k11R1J22j32j69o6J56j27M6J37n2k9R6n6J44
$$ plain form
6985 229 109 -28 83 222 -214 -85 -92 -6 68 -316 145 -197 -223 152 -228 -224 197 -15 -204 -206 -126 261 -62
7008 -62 6 75 105 221 -13 -147 170 -125 37 69 121 187 -123 -142 17 -89 -19 -363 169 34 56 -36 263 114
7032 114 137 85 132 -126 -27 200 -95 109 138 150 -37 -148 103 84 174 125 -188 139 -53 320 -230 48 -39
7055 -39 -60 104 -256 276 24 183 -137 170 15 -173 165 157 -153 -239 -98 -7 167 -53 -107 -29 -224 112 124
7078 124 -142 27 -40 -79 30 298 181 -42 -204 147 -47 253 -47 -213 65 -226 -24 -88 -92 -136 241 -78
7100 -78 -68 -92 -198 -9 89 -117 149 -196 -49 -46 -313 -47 -142 170 76 -255 -20 -220 -37 -25 -43 76 252
7123 252 -4 -121 112 -20 85 29 -8 -185 18 83 -32 81 54 -139 145 -2 32 192 -124 -47 -11 -64 20
7146 20 144 111 -20 -92 -270 175 -244 129 174 -37 54 176 44 -125 -191 -35 -162 -116 21 -31 -60 36 -20 124
7170A24k68L35m14j6J66K07M9l11P2J6O3k8j57oK86q9Q1J3m41M22j63o9J56j41
7194a13K22r6j63L49l59J30N2l22M47l25M2M1%K20K6l03J80M05p17K9J56%j24
7217b23qM06k02J7MR7j69L21j85n7Q0J46l12J20K2m5R2j07j21J24n2n7k19K25
7241a03k70K41J32J64j60j11M7J80N2l54K38m1k01J66j38J79J98k38m3q3M3p9
7263a81J94j3j18m00O88m49J49L17j11j23j86M56j31k83J72k2r9K62j25J44k44
7284a03J03R6j56k02M29j66j02K80j28j92L88j76j95p9K36k09J58j47K30m9L4
7305E0p0j8K49j75j75J19J45k75J81r6O9J35l20N9n%O5P5J11k97O6N7j23L02k29
7330a00P6J24k12j10M45m00J21j10o8K66j16L81j72k9j6L0L0k22m1J74j68J09
$$ plain form
7170 124 -144 191 -223 -239 -73 134 183 -128 -56 -40 23 -5 -162 -168 118 29 110 123 -318 104 -59 -128 28 -113
7194 -113 109 13 -150 199 -160 -30 22 -300 147 -178 -136 -95 -95 125 151 -152 28 433 -284 -255 -99 -99 -223
7217 -223 -231 175 -27 -10 -6 91 -78 243 58 1 81 227 -85 35 57 12 104 -3 -124 0 -52 -109 -328 -103
7241 -103 -373 -132 0 164 4 -107 -60 120 172 -182 56 15 -186 -20 -158 21 219 -19 -62 -145 -102 -181
7263 -181 13 0 -118 -518 170 -279 -130 187 76 -47 -233 223 92 -191 -19 -41 -140 122 -3 141 -103
7284 -103 0 96 -60 -262 167 1 -101 179 51 -141 247 71 -124 -203 33 -176 -18 -165 65 16 50
7305 50 -20 -38 211 36 -139 -20 125 -150 31 -65 4 139 -181 -122 -127 -127 -62 13 124 -173 -107 -50 -173 129 -100
7330 -100 -24 100 -112 -222 223 -177 -56 -166 -234 32 -84 297 125 96 80 110 140 -82 -123 51 -117 -8
7352hN0N2N8l49N7L0J49M2j84P9k2K14J7k99L07k30J3p1K28k19J51m66L91or0
7377a06K70j90P0r5p0K93k04K45k84l0M1J0K2n5K08j47l5J59L3j21m1j36J40J37
7401A14j63K13jk60k86M25j35K14nj61J04N2l49L82R0k77j8k73Q3J30K57l41K13
7424Hm5M0j0qj9j03N7J74j67j2J17j73J00J31j10j52J9K34P0l56k7M7J35Pj41
7449a84P9K77k34M2J56J01j89k5r4l8N7M4J48n8j87J25j72K08j22J74o3j53J60
7472E2j58L46m9j3J0j12m17M46J3j4j73N8K49j49K0k37p0J50j58O7J28J82j46
7495B5K40k78M0l8P1q7m6O2O9r0K44k73J0M2J29j85J20J86m18J29J90k24N1lj11
7520a45O5j24R4j69L14J88m21r9L81J61l6j52K1j52K22j63l3k73O10k35j85K31
$$ plain form
7352 -8 42 94 152 -197 -140 -110 39 81 -103 -24 -46 168 185 -114 193 -37 -24 -95 133 -86 65 -401 -10 -16 -106
7377 -106 164 -26 44 -51 -121 172 -32 213 -71 -101 -60 -50 -28 -83 125 -22 -57 102 135 14 -27 -163 -23 114
7401 114 -49 164 163 -97 -383 42 -93 121 116 -45 59 111 -238 144 234 -43 -61 -334 -251 -121 136 -205 8
7424 8 -37 3 -7 -15 -34 -137 -80 94 -73 -85 32 -141 -41 90 -20 -172 -153 81 151 -205 -232 -185 -50 -43 -184
7449 -184 -105 172 -62 -20 136 237 48 23 -71 -109 -52 -8 140 82 -105 20 -152 56 -66 108 45 -108 52
7472 52 -106 240 191 178 188 76 -341 105 118 104 -69 -11 238 89 109 -128 -198 -48 -206 -139 -11 171 25
7495 25 265 -13 27 -11 60 -27 -73 -11 58 -32 212 -61 -51 -9 120 -65 55 241 -177 -48 142 -82 -31 -34 -145
7520 -145 -80 -204 -110 -279 35 223 -198 -297 84 245 209 57 78 -74 148 -15 -48 -321 289 54 -131 100
7542A00k4Oj37nk30M00m09K63j22M07n36K22p2K65j00L5l04M6J8O0N8J08k41J29
7566f3K38l73L00k23K62l24L31j69L20m97J64K1J42k99J22n1J32J11j19j17K02
7587A10l23K09l9L9j93J37N6J66m3k39K21j10R2j89K58p2J33m84L48k65J35K40
7609A87j74Q5n7l19L89k34J30P7o3k54K94Q4r2J16k80o1R6p9J51k96K56j03J41
7632fN6J37j41k84M20j29l9q7J02p7J24o4q8j06J65p9J53M1l79L01L7J58m81N25
7656B59j45l27M8P0R5K8k09J35L7j00l1J72K05n01L07j24oJ8K27k15J88Qm3M7
7680A43j98o3j03J51m3%M00r4o3l00L42N5j58l03L06J36k27p0p2J92j73J18M5
7703B1j10K57j68Q8k55L04j87J60R8l85K83k07J43k2j68K15J69l68J04P3j9J40
$$ plain form
7542 100 76 82 -55 -60 -290 110 -299 -36 -158 249 -287 -65 -137 128 28 63 -241 -195 -177 -117 -59 49 -192 -63
7566 -63 175 -198 102 -121 141 -183 148 -21 299 -198 -34 -13 129 -170 -48 -99 33 144 25 -92 110
7587 110 -213 -4 -43 -4 -197 -60 -4 162 119 -120 101 -9 83 -106 152 80 213 -271 77 -188 -53 187
7609 187 13 98 41 -278 111 -123 7 84 21 -233 61 145 53 169 -111 -172 -76 -155 -4 -300 -44 -147 -6
7632 -6 50 187 46 -238 182 53 14 -73 29 -48 76 12 -76 -182 -17 -96 57 98 -281 20 57 215 -266 259
7656 259 114 -213 -165 -95 0 28 -181 -46 -9 -109 -140 32 237 -264 43 -81 -87 -69 158 -57 131 139 96 143
7680 143 -55 -118 -221 -70 -113 -113 287 193 130 -170 172 227 69 -234 72 208 -19 -89 -161 31 -142 -24 21
7703 21 -89 168 0 88 -167 137 -50 110 208 -177 106 -101 42 20 -148 67 236 -132 -28 45 26 166
7725A66j95J21J03j21p3O1K8k30J93j8j98M63j76K20k30j75K28J04j96N1m81K25
7747a30K68m8j79P2j30L4j21J87N3l1o1j22K58p2QN3j67J57j06J06Mj93O3J91
7771I4j6j35L4j60J57j04J36%L1J47l73K40k7j83J52J17J8l2k10P3J53j12j5q1
7795i6K44j64J61Kp4R6p3n6Q4Rr4j69j24K89j51J81k15L6J99k97J63o8K40k63
7819a40P4L97j43k18J40l00J26J69j91Q4j9l2p3K0J6L94m30o7L70m65L64j45J80
7842A11k26j33L24K3K2k53J93R2j51o0l92N16j14L74l86rL08j23j74L85l16k0
7864ik36K19K77l40N0L6k46M92l60L17l00J22j6j13n1K19j73K3K34l67K90K9n0
7887D7j44K17o4J26j71q1n6j4K63j33J66k56J47q1K00k07K28j97j63J6J70k4j51
$$ plain form
7725 166 -29 92 195 74 1 62 90 -140 53 35 -163 300 124 344 114 -61 167 271 75 126 -355 -130
7747 -130 138 90 -89 -17 -147 -113 -234 -47 6 -25 -86 -208 50 -22 -14 39 -128 29 -77 29 33 -160 -97 94
7771 94 78 -57 -23 -183 -26 -130 6 6 37 184 -189 51 24 -159 -7 110 128 96 -114 -41 112 0 -15 -96
7795 -96 148 -16 145 147 73 169 96 40 124 133 39 -130 -254 35 -116 65 -150 -114 85 -212 -49 -117 123 -140
7819 -140 -66 331 188 -30 110 -190 -64 105 -86 -2 -21 -53 -126 -106 -90 304 -126 -193 177 -288 76 -69 111
7842 111 -115 -248 76 99 121 -132 61 153 2 -58 -450 66 -48 326 -60 -69 239 116 -58 327 11 -9
7864 -9 -245 -26 251 -89 -39 -3 -249 243 -117 200 -100 22 6 -107 -158 61 -112 -89 145 -222 68 97 47
7887 47 -97 120 56 182 11 -70 -126 -140 123 -10 156 -100 47 -34 166 -41 187 -10 -173 -157 13 -11 -162
7910a62K95j84j31J38K44m08J25J72j59j75J59o2L48k07J41p3k1n8k35J29J02
7931b2N7k41K99j50l7J00j83n4Q9J85nJ35j18l86L11J90k27L3L76n20K27j63K31
7954A27l40J44R5k08R6J61k1J8P5P0k62O5j05J3j11K41l8j51j10Q5Q5L20m7j49
7978E3j99K07L3p4j97l2K81J55k71k4j64L65j56j27L44j87J9r5j88L73j10L7J21
8001A64k75p9K04J2M4J3p4J36M5j89j26R0J99j50j18J84N2k40J40P9j31k05K94
8024F9k02J09pQ3k98K63J99m37Q1J18J54j08p0J70k30r3K49m1K0j25p7K08j19
8047h4J64p5j29j5Q3J41j33l5L46k83K04j56j81P1O9J8j1J3J47k01J62j79L6M0
8071A2p0j10J51L6m2O2k58J01J96j00J25j44O8M0O9m1P2k5M1j16q4J02L5j01j31
$$ plain form
7910 -162 133 -51 -182 -44 200 -208 -83 89 -70 -245 -86 -148 200 -7 134 61 40 -18 -253 -124 -22
7931 -22 35 -206 93 -57 -94 6 -177 -231 -142 43 38 173 55 -331 -20 170 -57 -24 352 -168 59 -104 127
7954 127 -213 -69 26 -182 -86 75 54 72 147 217 -45 20 -85 -72 -183 58 20 -131 -241 -156 -71 249 202 53
7978 53 -146 61 94 20 -177 -209 72 227 -44 -68 -232 133 -23 -150 194 7 26 -69 -257 116 6 43 164
8001 164 -111 -190 14 26 70 83 9 145 190 1 -125 -35 164 14 -104 80 132 -108 32 111 -20 -225 69
8024 69 -133 -24 -31 52 -246 17 216 -221 -140 -22 132 24 -46 124 -106 -199 50 9 29 -96 -173 35 -84
8047 -84 80 5 -124 -139 -56 85 -48 -83 263 -20 184 28 -153 -82 -13 5 -6 7 154 -47 115 -64 -28 12
8071 12 -58 -168 -17 19 -23 39 -219 -118 78 -22 103 -41 27 67 136 95 167 142 183 67 -17 85 120 19 -112
8096a12k79L44o8R4J63n2j57J31k1pK9k01R2l19M89l58K96j30J94l2j36P0J8J72
8120B20k57J12j62%K10j33l6Q4j30Q2J30L9j06j34K9J1m5j68J23j5L06J25k82
8143CP1k37Q0m0J07j0nR0M0k12P0q3n8M59l87L7p6q0J72J29K18m23j16J58L14
8168B21r4J68l11J29l09K38J4j6J64k18j54J87J17k34J13l0o4j41l1P6P00l45
8190A80j41
$$ plain form
8096 -112 -391 -47 -115 -21 142 90 -67 64 43 36 65 -136 -44 -363 126 -232 64 -66 128 96 -40 30 48 220
8120 220 -37 75 -87 -87 123 -10 -46 38 -92 -10 120 159 53 -81 -52 -41 -86 -254 -131 -146 160 285 3
8143 3 74 -163 -83 -123 -16 -26 -31 59 99 -113 -43 -126 -184 275 -112 -75 -151 -231 -59 70 288 -135 -251 -93 221
8168 221 127 295 -16 113 -196 42 56 40 204 -14 -168 19 136 -98 15 -15 -79 -220 -251 -175 525 180
8190 180 39
8191C9
$$ Imaginary data points
##PAGE= N=2
##DATA TABLE= (X++(I..I)), XYDATA
0@%%%%%%%%%%%%%%%qJ6j6J6j6J8k6L2l2M0m8N6o4P2q4R4j07J22j38J54j71J93
37A03k16K40k67K95l27L63m00M41m87N36n91O52p17P88q68R58j057J171j301J449
57G65j623J827k072K369k743L229l879M795o180Q484j2924K4184r7427j51959
71b33154L69606n8523k36385K38446M9539k81381J13784K04661k21240p9786K53367
82A18934o1370j58594J58859l502j80016J08865J25336j12456n6994R3734p105
93B5691j00352P2571P7361j33501J3615J45785j05335q8733J31382q572j05333
104g5421J09575O2801j74605K1369J62821j40175n2149K04144j04194j30003K01787
115H5950k7918j87018J45834Q5113j78830M3718J47711j54740o5520J97220o2528
$$ plain form
0 0 0 0 0 0 0 0 0 0 0 0 0 0 0 0 0 -8 8 -8 8 -8 10 -16 16 -16 24 -24 32 -32 40 -44 50 -57 65 -73 81 -90 103
37 103 -113 127 -140 155 -172 191 -209 232 -255 281 -310 342 -375 413 -455 503 -554 617 -684 765
57 765 -858 969 -1103 1266 -1477 1752 -2127 2668 -3512 4972 -7952 16232 -81195 -233154
71 -233154 136452 77929 -158456 79990 129529 -151852 -38068 166593 -54647 -134433 118934
82 118934 57564 -101030 57829 54327 -125689 -16824 108512 -3944 -60938 32796 25691
93 25691 -74661 -2090 75271 -58230 -44615 101170 -4165 -92898 38484 29912 -75421
104 -75421 34154 96955 -77650 -56281 106540 -33635 -85784 118360 14166 -115837 85950
115 85950 58032 -128986 16848 101961 -76869 -33151 114560 -40180 -105700 91520 28992
126B8992j40772J66253J7382j69077Q5627Q9864j20584r664J13770l5603r3683
137f7495Q0673N2738j22776J7276J18442p8224o0048J04301p523j05045O1510
148f171Q5757j14043k6477J42888p3535r8310J46108j6334j35880J17371N6514
159G7888j42619L2271J03792r7843l5441J28264m7472r9465J19677J3327j24241
170g1862P6189N3222j03047L1620P2684o8811l0512O7028n149n8010M3447L6641
182D3440p3734Q939O3411n1685k6921N8867l514m6398K2722L8143n5102k0047
194d1879Q5368l0021o6145Q2234n05q6463O2727M3772q2829J0596P7015n4691
206h21m9904Q5379q482q3204P9645L1470j03913L7553O0359p5149J849O6562l7795
$$ plain form
126 28992 -111780 54473 71855 -97222 -11595 78269 -42315 -51979 61791 26188 -67495
137 -67495 13178 65916 -56860 -39584 78858 634 -59414 44887 37364 -67681 -6171
148 -6171 79586 -34457 -60934 81954 8419 -89891 56217 39883 -95997 21374 77888
159 77888 -64731 -32460 71332 -26511 -61952 66312 18840 -80625 39052 52379 -71862
170 -71862 4327 57549 -45498 -13878 58806 -10005 -40517 26511 21362 -36648 6799 43440
182 43440 -30294 -21355 42056 -9629 -36550 22317 18803 -27595 -4873 33270 -21832 -41879
194 -41879 43489 13468 -52677 29557 29052 -57411 5316 49088 -33741 -23145 53870 -821
206 -821 -50725 34654 26172 -57032 22613 54083 -49830 -12277 48082 -27067 -25218 41344 3549
219C549m0570N1082R245o0971K8111M8363n6322k568N2141m0916k3434M8006J922
232A7638l2520J0566K8315l0986k1655N3306j0493m5234N1191P909n9456K5185
244f234L2165l8626l380M6892k0558m6738M5505J4062o1697L9278M0097o6801
256b6035J0519M5798m6655j1686M9947p874l5646K7134J7637m9607J0321M8266
268C2119l9181q227M6243k9742k6027L2790K426k1696J1312K3362k3708k1960
280b2289L3836o922l0701L8963P974l8360J3547J5180k3683m461L0174Q9l1031
293a7684K1286J5221m5296J6707L6385l7139K438L3621k7124j8229K6495M617
305A1298k4253J4389K5277l5662p636L6903k6913j3289M0615j3165k2714K0411
$$ plain form
219 3549 -37021 14061 23306 -37665 -9554 38809 -17513 -20081 32060 -8856 -32290 15716 17638
232 17638 -14882 -4316 23999 -6987 -28642 24664 14171 -31063 20128 28037 -31419 -6234
244 -6234 25931 -12695 -16075 30817 10259 -36479 9026 23088 -38609 669 40766 -26035
256 -26035 -15516 30282 -16373 -28059 21888 14014 -21632 5502 23139 -26468 -16147 32119
268 32119 -7062 -15289 30954 1212 -24815 7975 10401 -11295 17 23379 -329 -22289
280 -22289 11547 4625 -26076 12887 20861 -17499 -3952 11228 -12455 -16916 13258 13347 -17684
293 -17684 3602 18823 -26473 -9766 26619 -10520 -8082 25539 -1585 -19814 6681 11298
305 11298 -12955 1434 26711 -8951 -16587 20316 -6597 -19886 20729 7564 -15150 5261
317E261O90j9896M227K2677j0631j6709K6939o252k9716K6802P059k2832J5208
330B827J1052j6552o609J3121L190j8833J3845J8280k9666M226K1775k6611j311
343a1266K4524r874j0848J1699M220k0053O52K4326j8092p948L0925j7940j8291
356a7966K5229o302j4322J7763O595j3015l964J3102p476j4573K4219K578k1620
369i752J7920Q65k2151R908R460n856j170O466J364j7611L862J5150j7642N716
383c471J9292j8894n636J1146o958l921R800R162j1368o652J6244j2878j0069
396a4203K6149o908j2238J8973o766j5877Q346P073l490j570J0827o705j7138
409a3527J4973K969j5271J5899M088j5863O123R23o572K30O804P972j0728j517
$$ plain form
317 5261 5951 -13945 -9718 12959 2328 -14381 12558 6306 -23410 3392 10451 -12381 2827
330 2827 13879 -2673 -9282 3839 7029 -11804 2041 20321 -9345 -5119 16656 -9955 -11266
343 -11266 13258 3384 -7464 4235 8455 -11598 -10946 13380 -4712 -12660 18265 325 -17966
356 -17966 7263 961 -13361 4402 10997 -2018 -5982 7120 -356 -14929 9290 11868 -9752
369 -9752 8168 9033 -13118 -3210 6250 394 -776 5690 7054 -10557 -6695 8455 -9187 -3471
383 -3471 15821 -3073 -8709 2437 -4521 -8442 1358 10520 -848 -7500 8744 -4134 -14203
396 -14203 11946 5038 -7200 11773 5007 -10870 -2524 4549 1059 -511 10316 3611 -13527
409 -13527 1446 4415 -10856 5043 9131 -6732 -609 314 -6258 -6028 776 8748 -1980 -3497
423c497Q690j4498K785J7138j0141k499P753m833m843P15Q437m200m690J6104
437A2421j0306j4997J8238l897r749J6822l084j2474N085L655m684l646J1005
450D389J7j3007J1894J02j5627J4164M095j0670P553j60n271N49J679N545n589
465c37l40Q441j1337n22J0203o887m58M293k169j691k438N766k432q092J4188
480F188k624j3758J3135k371r614J4026k36j0141K847N660j810n584P708R8j1238
495g714J3620J697j7038J0889L992q987Q252j477p028K119K555L583o056k692
509d285P646n705Q47N324q591J256M348K76N78p292M836L900q412R307p46j2279
525h992J2382L469j0873M530J574l879K109M755k095q947P535M694j3290Q555
$$ plain form
423 -3497 5193 -9305 -6520 10618 477 -2022 5731 898 -3945 -3230 5207 1007 -3683 12421
437 12421 2115 -12882 5356 1459 -8290 8532 5448 -7026 -1941 1714 -2970 -6616 4389
450 4389 4406 -8601 3293 3395 -12232 1932 6027 -4643 2910 2750 -2521 -1972 -293 5252 -337
465 -337 -677 7764 -3573 -4095 6108 -779 -1237 3056 887 -804 -3242 2524 92 -8000 6188
480 6188 3564 -10194 2941 570 -9044 4982 4746 -5395 -2548 3112 1302 -4282 3426 3524 -7714
495 -7714 5906 7603 -9435 1454 5446 -3541 4711 3234 -3794 -1675 880 4463 -1593 -4285
509 -4285 3361 -2344 -1497 3827 -4764 -3508 840 1116 1694 -5598 -762 3138 -5274 4033 3287 -8992
525 -8992 3390 6859 -4014 516 2090 -1789 320 5075 2980 -5967 1568 6262 -7028 1527
539A527L620j3107J0762L059j2805M932K347k425L089k29k11m015J152N881o969
554c392K381N799n965K825n01m653M623j949L341M159j0234M457J930r421Q526
569A926K745o623L591L69l985l340L943M760o831N091M784j5337N050Q014j1327
584g170Q268O710j0180J703J460l694L45L894M573m374j089L499r573K627P418
599D417n204M777K12p426K562k927N28O725m279K804Q15q804K651J714j345M770
615A990Q75n85m440j619N086n427M104R163j0921J655N422j1855M158P901n214
630B93K102J812l795m032M53N559l620J297O831j0408k45N532p323M184M957m695
646a098K521k129k230K595k569L933K388l915K747k217k733L393p95L150r80k138
$$ plain form
539 1527 5147 -7960 2802 5861 -6944 -2012 335 -2090 999 770 559 -3456 -2304 3577 -3392
554 -3392 -1011 4788 -1177 1648 1147 -3506 1117 -832 2509 6668 -3566 891 2821 -6600 1926
569 1926 4671 -1952 1639 2008 -1977 -5317 -1374 3386 -3445 1646 6430 -8907 -3857 4157 -7170
584 -7170 1098 7808 -2372 -669 791 -2903 -2558 1336 5909 1535 446 3945 -5628 -3001 4417
599 4417 -787 3990 4202 -3224 -662 -3589 -3061 3664 -615 2189 3004 -5800 -3149 -1435 -2780 1990
615 1990 2865 2280 -2160 -3779 1307 -4120 -16 9147 -1774 -119 5303 -6552 -2394 5507 293
630 293 2395 4207 412 -3620 -3167 2392 -1228 69 6900 -3508 -3753 1779 -5544 -1360 3597 -1098
646 -1098 1423 -706 -2936 -341 -2910 1023 3411 -504 2243 26 -2707 686 -109 3041 2061 -77
662g7M294o396j143P673p165J944O948q729P05L458m837J554K166J278k747j125
678b199M900n913j265R359o942J13P248p400M65M190m138K251L28O81J414m306
694a214K294n26l727O012j540k428L485l862R71J12k960N320k239j455N581o951
710c127q97O114m505K323L267l746j05k65J873j283j838O990l444l010O549o932
726b036j854Q492m130j33K391l931N0n00J602J307l515M630j099n637M661j604
742a306j695N874k948K88n7l592M215j300l69N560n105k83L465m893J813K619
758B286j482R58j945R64r25l428O265j481l710O651n348l813O706k950K99K572
774A619k218K50k002J796J611l952M896P82n420M210j368l176N488q87l03N24
$$ plain form
662 -77 4217 -2179 -3322 4351 -2814 -870 6078 -2651 -1946 1512 -3325 -1771 395 1673 -1074 -2199
678 -2199 2701 -3212 -4477 4882 -2060 -1947 5301 -2099 -1634 2556 -1582 669 997 1678 3092 -1214
694 -1214 1080 554 -3173 2839 1299 -1129 2356 -1506 -535 -423 -3383 1937 -302 -1757 3824 -3127
710 -3127 -4024 2090 -2415 -92 3175 -571 -676 -941 932 -351 -2189 4801 1357 -1653 4896 -2036
726 -2036 -3890 4602 472 339 2730 -1201 -1151 -1651 -49 1258 -2257 2373 1274 -4363 298 -1306
742 -1306 -3001 2873 -75 213 156 -3436 779 -521 -890 4670 -435 -718 2747 -2146 -333 2286
758 2286 804 1762 -183 781 -144 -3572 2693 1212 -2498 4153 -1195 -5008 1698 -1252 -953 1619
774 1619 -599 -349 -2351 -555 1056 -2896 2000 2782 -2638 1572 204 -2972 2516 1629 1326 1850
790A850l825K958j473l49M515m462N25K805n105J456J073j498L212j975L43p79
806g29l923N386L56l478N788l501k981M667k284j91K575q17J514l053N36J128
822I93l924M798K051n666L525j494l677M229j001J36R68k184K294k899j139M356
838A366l137J369L245m988J008O55j414L124r17J098N03m142L458l25l713N821
854C011j450k348L503l223n57J004m54K535k541N48J805n387L079J642m787M672
870A052M20l249K432k012R4J230j176L654k323r81L562m341M79L603l499K587
886A532Q52k945J530k237Q40J831l110L686m43m026L520k196j437L646j387O86
902C42o7k087J636k442J118L915l680K465J183n392K884K99j361L502q89j60m58
$$ plain form
790 1850 -1975 983 -490 -839 3676 -786 -261 2544 -2561 -1105 -32 -1530 1682 -293 50 -729
806 -729 -4652 734 1090 -2388 3400 -101 -3082 1585 -699 -890 1685 868 2382 -671 -135 993
822 993 -2931 1867 3918 -1748 1777 283 -3394 835 -166 -30 938 -1246 1048 -1851 -2990 1366
838 1366 -1771 -402 2843 -2145 -1137 -482 -1896 1228 311 1409 1912 -2230 1228 903 -2810 3011
854 3011 1561 -787 2716 -507 -1064 -60 -514 2021 -520 28 1833 -3554 -475 1167 -3620 1052
870 1052 1472 -1777 655 -1357 -1263 -33 -1209 2445 122 -859 2703 -1638 -1159 2444 -1055 1532
886 1532 2384 -561 969 -1268 -428 1403 -1707 1979 1536 -2490 1030 -1166 -2603 1043 -344 342
902 342 275 -1812 -176 -2618 -1500 2415 -1265 1200 2383 -3009 -125 174 -1187 2315 1426 1266 808
919H08k746K803j211o52M650l516n18J582m189J730J949j187K318k244m77O18
935b82l311L541J174k238L748k531k704K752k068K329J438j178J806l325o14K888
951A425l128K581K669l874J551r53k881K486m13J681L65l059K182k215j573M393
967A237k181M45L153m092L24N60j067L131j145O76P68l872K376M95k733M335j324
984A086j257K310l436P21R12r12L006k524j277K830l944J473K414l331K414J83
1000F68k333J672j747J594P61j829K872j701j762L823k442p7K605k669J143M56
1016A034j549J901j828P70J680l347K125k05k670L162r00j424K114k346R11Q07
1032B35j684K433j739n66L087l135R89J882k975K366R9j661J869j735J214R49
$$ plain form
919 808 -1938 865 -346 -998 3652 136 -382 1200 -2989 -1259 690 -497 1821 -423 -900 -282
935 -282 -3593 -52 1122 -1116 2632 101 -2603 149 -1919 410 1848 670 2476 -849 -1463 1425
951 1425 -1703 878 3547 -327 1224 271 -2610 -124 -537 1144 1509 -1550 632 -1583 -3156 1237
967 1237 -944 -499 2654 -1438 -1114 -554 -1621 1510 365 1041 1809 -2063 313 808 -1925 2410 1086
984 1086 -171 2139 -1297 -576 336 -576 2430 -94 -1371 1459 -2485 -1012 1402 -1929 485 668
1000 668 -1665 7 -1740 -146 615 -1214 1658 -43 -1805 2018 -424 -501 2104 -565 578 1034
1016 1034 -515 1386 -442 328 2008 -1339 786 581 -2089 1073 173 -1251 863 -1483 -572 235
1032 235 -1449 984 -755 -1321 1766 -1369 -380 1502 -1473 893 992 -669 1200 -535 679 1628
1048A628k718K458j217j731L603k165n86K190k761J284L22j586J939j777N79J549
1064A011l206K326O15k652K683o44j277J969j553J235N28j857K283j634m78K403
1080A752k280R81J356k826J668m09j513K351j800Q01Q68k770J701j69j943L645
1096A413j765l44J466k330J048M96q50K113j447j9J691l354K119P67j649K750
1112B105j374j472J690k035J273J007j329J820k288j149K171k172J366K133k557
1127h11J484j071j772K320j260J263J413k440J544p85k144L233o34Q8J523k391
1143d40N49m61j051K919j361J81J941l743J087N48k051K913j00j389J339k502
1159a621N49P11j213L081j043j733K486k953O33J881j665K264M4j968J430k204
$$ plain form
1048 1628 -1090 1368 151 -1580 2023 -142 -728 1462 -1299 -15 307 -1279 660 -1117 -538 1011
1064 1011 -2195 131 746 -1906 777 133 -1144 825 -728 507 1035 -822 1461 -173 -651 1752
1080 1752 -528 453 1809 -1017 651 242 -1271 1080 -720 81 949 -1821 -120 -289 -2232 1413
1096 1413 -352 -696 770 -1560 -512 -16 -866 1247 -200 -219 1472 -1882 237 1004 -645 2105
1112 2105 731 -741 949 -1086 187 1194 -135 1685 -603 -1752 419 -1753 -387 1746 -811
1127 -811 673 -398 -2170 150 -1110 153 1566 -874 670 -115 -2259 974 340 428 1951 -440
1143 -440 109 -352 -1403 1516 155 336 2277 -1466 -379 169 -1882 1031 931 -458 881 -1621
1159 -1621 -1072 -361 -1574 1507 464 -1269 1217 -1736 -1103 778 -887 1377 1421 -547 883 -1321
1175a321J018J737j726K162r86k085K029j693J69J987j867J528p05k162K125j395
1191a185M11K404k647J069J96k270J903j35n31K140j659Q00k63j664K351q71p30
1208f81K744k307J44J205k062J593k14j159K195k129J00R88j920J548m7j232K282
1225A048j752k88J610k000J349P47j484J972j417m21J851j902Q76O64j099J569
1241A323r27q82J291j489J157N60j758J752j087j388K132j330R7J581k181J387
1257B38l48j206J399q48O83J530k564J617n55j365K591j147J42J344j951O31K22
1274D13j286K109q94j46J490k602R13L02j333K064r15n06J078j965P35Q36j664
1291a371K034l70j193J924k065M53J358j276J548l32j228J218j345N51J236j568
$$ plain form
1175 -1321 -303 1434 -292 1870 884 -1201 828 -865 -696 1291 -576 952 247 -1915 210 -1185
1191 -1185 -774 1630 -1017 52 248 -2022 -119 -254 -785 1355 -304 496 233 -1431 920 49 -681
1208 -681 2063 -244 -100 1105 -957 636 422 -737 1458 -671 -571 417 -1503 45 -2 -1234 1048
1225 1048 -704 -992 618 -1382 -33 714 -770 1202 -215 -636 1215 -687 189 853 -246 1323
1241 1323 396 -486 805 -684 473 1033 -725 1027 -60 -1448 684 -646 -549 1032 -1149 238
1257 238 -110 -1316 83 -765 -82 1448 -1116 501 -54 -1419 1172 25 167 1511 -440 191 413
1274 413 -873 1236 342 196 1686 -916 -3 299 -1034 1030 115 -391 687 -1278 -543 293 -1371
1291 -1371 663 293 -900 1024 -1041 -588 770 -506 1042 710 -518 700 -645 -94 1142 -426
1307d26J540n99j614J868r85p20J955j227L76N4j749J935j044J33J201j791R15
1324a78L72j855J878l93l15J800j890K52Q76j649K028o5j241J770j444M3Q37j155
1342c29J161n49p71J239j612O6J554j801J622k64j822J886j100l95K157j679Q23
1359A86P0j388J544o93J9J572j401N38L14j644J559k22o62J755k138O85N91j975
1377a290J838jj227J537j349MO89j559J306L54r11J135j439K90J424j602J335
1394E34K55j669J746p83o24J262j481J018L32r75J398j241r6J157j643Q94P29
1411H13j547J147p81n25J699j382O2R17j225R88r1r14J289j085M93O67r34R06
1429D97l35j062J615r96M79Q81j821J038K74j316J544o93n40J509j418P3K26j049
$$ plain form
1307 -426 1114 515 -1099 769 -216 -936 1019 -208 168 222 -1527 408 -636 -503 698 -1093 -178
1324 -178 194 -1661 217 -176 -491 1309 -581 -329 547 -1102 926 861 -380 1390 -54 -11 826 -329
1342 -329 832 283 -488 751 -861 -795 759 -1042 580 316 -1506 380 -720 -1115 1042 -637 186
1359 186 256 -1132 412 -281 -262 1310 -91 447 761 -883 676 454 -208 1547 -591 94 685 -1290
1377 -1290 548 547 -680 857 -492 -488 201 -1358 -52 302 -609 526 -913 -623 801 -801 534
1394 534 789 -880 866 83 -541 721 -760 258 590 -385 1013 -228 -324 833 -810 84 813
1411 813 -734 413 -368 -893 806 -576 -514 403 -822 166 75 -839 450 -635 -142 525 -409 497
1429 497 162 -900 715 -281 198 1079 -742 296 570 -746 798 105 -435 1074 -344 -271 -45 -1094
1447a094J586r12J88R51j632N50M63j108J446N3p54Q90j310J82Q34j059J670J4
1465I58j015R47j392L80P66r67J301k31j250R58j182j08J515j286P59M03j485
1482i29R20p03j33J518r25P89j14j543J449o68J60J278j409O44L64j628J069L9
1500A78n17J489j188L00J67j321J221J12p96J447j179p2K95j366J180J13o85J496
1518H74j193l31J031j181O97Q86p30N92q09m32R92r58R69J80o94R64j087k70J181
1537F81j040M18P97j677J164o28n77J378j014J09N03j109J165l47q51J620r11
1554c19K32P99j784J193J48p65J400q91k62R25j258Q02K06j189J395o63q1O95
1572E83p37K77J04j139J455q08m51J098q47O9O41j175J072j7p53J184q04K82M38
$$ plain form
1447 -1094 492 -420 -232 719 -913 -363 100 -1008 438 491 -263 627 -683 -501 333 -726 944 958
1465 958 -57 890 -502 -122 644 -323 978 747 -503 455 -727 -835 680 -606 153 556 -929
1482 -929 -9 -712 -845 673 -252 537 423 -1120 329 -339 -179 1099 -310 334 698 -930 139 178
1500 178 -339 1150 -38 262 429 -892 329 441 -355 1092 -87 -159 136 -1230 -50 63 -622 874
1518 874 -319 -650 381 -800 -103 783 53 645 -164 -596 396 -562 407 587 -107 857 -230 -500 681
1537 681 -359 59 856 -821 343 -285 -862 516 -498 -389 114 -995 170 -177 -1028 592 -319
1554 -319 -87 712 -1072 121 269 -496 904 13 -249 676 -582 220 426 -763 632 -31 -112 583
1572 583 -154 123 227 -912 543 -265 -716 382 -465 -396 245 -930 142 125 -628 556 -248 34 472
1591D72q07P14m0m80R26j105J94J046j216P34J08j008P54n01j37R41r11L61J25
1610A70q15N62m39j69J204j248P04M73j292J469o69m44J385j130K04N19o83O32
1628D33m9l47P49p38L9L56j364J419m43p47J447j275l57J046p68N36L35r70J030
1647C32r40J30O16m98O12R2p15Q02j062K10J088o69O75L2j427J139m57k91J265
1666I34p34%J85r21K89O8k83R71p69K64K83j396J102j91n26J337q02l29J142j344
1686g20O26N84n40O10m65l19P29p53M28O36j239J238j276K2Q88j164P42O07j125
1705d91Q19l68j182J588o48K26O13p04J53P8p89Q62k67L78J44p67P43l97p44J272
1725E19j85m19Q85j173M36L71o60N60l68j91O14q47L11K49p83J036o39j22R63
$$ plain form
1591 472 -335 379 339 -141 785 -320 -126 920 -296 438 546 -462 292 -209 -346 595 -316 45 170
1610 170 -645 -83 -522 -691 513 -735 -31 442 -850 619 -50 -494 891 -239 -35 484 -199 433
1628 433 384 37 786 48 87 443 -921 498 55 -692 755 -520 -877 169 -599 -63 272 -698 332
1647 332 -608 -478 138 -360 252 344 -371 431 -631 -421 667 -2 673 705 -722 417 -40 -331 934
1666 934 200 200 385 -536 -247 -179 -462 509 -260 4 287 -1109 -7 -198 -724 613 -189 -518 624 -720
1686 -720 -94 490 -50 560 95 -224 505 -248 180 816 -423 815 -461 -439 449 -715 27 634 -491
1705 -491 328 -40 -1222 366 -282 -56 557 -147 6 84 -705 157 -110 268 412 -355 388 -9 -753 519
1725 519 334 -85 800 -373 63 434 -226 334 -34 -225 389 -458 -147 102 -681 355 -284 -406 557
1744E57j113K06M77q81R99j98j92M73n64J52L46n36P97r0m49M61o93L7P43j199
1764f67J013m0p41Q80n28k65P29q21K91L34n33M32o06Q4P53o08L32L95r24Q49
1784C59k71o90J263q50N60J82j025Q06o13l83J305p05p0L64p24M11l2j46Q65q16
1804b10k03P60j026K97O30n90P81k81n01N91n37K33M75m11O67n44k85O89r70P75
1824C40K41r13P85m29n94O87n28M91M83p56K95j81m73Q08o66K14O09p98M58m84
1844d11j25J026n48N9P33r40K41l5k67Q81l89j51J83p71N94j45J8P57o71k12O71
1865D98j021M75K80r30O53J22l75P42m23j49L36n24P96o85j60R89q66J82N45o88
1885b03P14l61p32R35n04L2P12q08P3L90q61Q79l52k08K82n92M79J06n27P67n12
$$ plain form
1744 557 -556 -350 127 -754 245 47 -145 328 -236 -84 262 -274 523 433 -16 445 -248 -211 532 -667
1764 -667 346 306 -435 445 -83 -348 381 -440 -149 185 -348 84 -522 -438 315 -293 39 434 -490 359
1784 359 88 -602 661 -189 371 553 -472 334 -279 -662 643 -62 -132 232 -492 -81 -113 -259 606 -210
1804 -210 -413 347 -679 -382 248 -342 439 158 -343 248 -289 -56 419 8 675 131 -154 535 -435 340
1824 340 581 -332 453 24 -570 117 -411 80 563 -193 102 -79 -552 256 -410 -196 413 -385 73 -411
1844 -411 -536 490 -58 1 734 -206 35 0 -267 614 225 74 257 -514 80 -65 -47 710 39 -173 498
1865 498 -523 -48 232 -698 -45 77 -298 444 21 -128 208 -316 480 -205 -365 624 -242 -60 485 -203
1885 -203 511 150 -582 353 -151 -119 593 -215 -142 248 -613 266 -86 -294 -12 -604 -125 -19 -546 221 -291
1906b91m0O95j011P09J71n80O80m18N5L54o00R9N86n74M77k06k91R07n70r5L97
1927D54q44M56m8n12N72l56K0M92n05K82r9l22N31m30R2N25o16M97M7o06O25k43
1949A2RL69o76L95L84o35N50l75k19L17l73M00m1l27N86m29m34O60l23j04N55
1970C01r64R16j71k26M15k45k1M19o03K09J80k73M06l53J27J79n19J66P21q08
1990a44M13j58m00M83n90J72N40p74Q98m77j95K35m97M41N07n08J82l15j4M85
2010B84n99L51M56m34K34r6n21M84k16J79K92m81K15k42l30Q34o27K9N35o07K49
2031a1L74p24L80j6k17L49l44J74P7j46O35j49l00L90r41L36O09o89Q46n03m61
2052c31O92o53J33N14n97N05k39m12K29k47R7O72o57L87no36O92k75j03N38l06
$$ plain form
1906 -291 -331 364 -647 62 233 -347 333 -85 -30 324 -276 -177 409 -165 312 106 -185 722 152 57 454
1927 454 -390 66 18 -494 78 -278 -258 234 -271 11 -88 -410 121 -309 -217 308 -308 189 236 -370 255 12
1949 12 21 390 -286 109 493 -142 408 33 -186 131 -242 158 117 -210 376 -53 -487 173 -150 -254 301
1970 301 -663 253 82 -144 271 26 5 424 -179 30 210 -63 343 -10 117 296 -223 -57 664 -144
1990 -144 269 111 -289 194 -396 -224 316 -458 440 -37 -232 3 -494 -53 454 -54 128 -187 -201 284
2010 284 -315 36 492 58 292 196 -325 159 -57 122 414 -67 148 -94 -424 410 -217 -188 347 -260 -11
2031 -11 363 -361 19 3 -214 135 -209 -35 42 -104 531 382 82 472 -469 -133 476 -213 633 130 -331
2052 -331 361 -292 -159 355 -242 263 24 -388 -159 -406 -309 363 -294 93 88 -548 144 -131 -234 304 -2
2073bJ48j09l74O93l57k29M48m67L93j39p9M58o61P6O41m29Q5K81p04M30K27q48
2095e18O34r2k00M34p17N06J97n32L43j34j74O78p87M83J73k90M83m10j83N17
2115D11p30J58O04q17M31nj87M37n39j14O48p23N02k24n3M59m19q9N99n56M19
2136B12L0n85Q55m38Q2L67o44M88m01J9M78m39l4J90m38M98p0n39M13j01j85M02
2158A60m96m8P81q23Q74l57l56O86n77K58j18l85N12K39k61Ol38J11M60n79K97
2179D6J05l8m0j87J57M19o24L09o0m55N11k41j65M95m63K97k6l39N60k14k57Q08
2201E98j024M73K2l80M46j67MK71k89K39J59n59M66o5m55N89k90M2L25o75L29
2222E9j04j85J76K47j49O8m35N90L9o48L70q3J70K5l37M14K0o45O80p7m42N89
$$ plain form
2073 -2 146 37 -337 356 -1 -230 218 -249 144 5 -74 384 -277 -201 440 11 96 377 -327 103 330 -518
2095 -518 116 24 -176 258 -459 47 244 -288 55 -79 -253 425 -362 121 294 4 487 77 -106 411
2115 411 -319 -161 443 -374 57 52 -135 302 -237 -351 297 -426 76 -148 -201 258 -161 -250 349 -207 212
2136 212 242 -343 512 74 156 523 -121 367 -34 -15 463 24 -10 180 -258 240 170 -369 44 -57 -242 160
2158 160 -336 -384 397 -426 448 91 -265 421 -156 102 -16 -401 111 350 89 95 -243 -132 328 -251 46
2179 46 151 113 73 -114 43 462 -162 147 87 -368 143 -98 -263 232 -231 66 40 -299 261 47 -210 598
2201 598 -426 47 69 -311 135 -32 -28 243 -46 193 352 -207 259 194 -261 328 38 80 405 -270 59
2222 59 -45 -230 -54 193 44 112 -323 267 306 -342 28 -55 115 140 -197 217 237 -408 272 195 -247 342
2244C42k73l35K76l92O21j35l49M01k16K30j46p39O50J75n28O05m36R1J3P7J62
2265I4J17k90J25j47J2K4o5K04J52m06M65m02%N23n28J76K64k35J3k11j51K93
2287B7j30j67K10M0K53n4l46Q4K09p7J44l66R0L92n26N42k92j75L95k40N3P3l01
2310a62L35m10L79L40n95L90m59k93O03k18k45P08o04k1M40m91J73J62j99K35
2330F8j62P3ol04P34l15j50O55o39o8L23m29Q2K84m37M41j07o8N0l80M88j58m5
2353g0L22o37J79J05o7M76k58j79L62k75l53P86l66R7K7j27J54j33j72L53k2J33
2375C35l78n9J89J21l97M21l61k0L28n76M21j96R9Q1J6qo6k35M65l50k6J47L0
2398a9l1J55k77K60K94o03N36q7m04L30l91J59N21p58L38k23M6K88l98J92J00
$$ plain form
2244 342 69 -266 10 -382 239 104 -245 156 -60 170 24 -715 -65 110 -418 187 -249 -158 -145 -68 94
2265 94 211 -79 46 -101 -89 -65 -130 74 226 -180 285 -117 -117 406 -122 54 318 83 96 -115 -266 27
2287 27 -103 -270 -60 -20 233 179 -167 -83 126 49 193 -173 -83 309 -217 325 33 -142 253 13 66 139 -162
2310 -162 173 -237 142 482 -113 277 -182 -475 128 -90 -335 373 -231 -252 188 -303 -130 32 -167 68
2330 68 -94 -21 -27 -331 403 88 -62 593 -46 -114 209 -220 -138 146 -291 150 43 -25 25 -355 133 -25 -70
2353 -70 252 -385 -206 -101 -168 308 50 -129 233 -42 -395 391 25 122 149 22 176 43 -129 224 202 335
2375 335 -43 -102 87 208 -189 232 -129 -149 179 -397 24 -172 -73 8 24 16 -50 -285 180 -170 -196 -49 -19
2398 -19 -50 105 -172 88 382 -221 315 228 -176 154 -237 -78 443 -315 23 -200 -154 134 -264 -72 28
2419B8l23J48k0L9N3r0j23K92k33R6J85k63K83j4L1k74J64K43j64k23M01r3l19
2442a76L38l02J1J98k36L50p49M82J62k14K91k19k71L88p2k35N16n92K07L74n62
2463c11J98J49j76O09m93R8j0l84O68k25r2J36m24K60K91m00J13L51m85M05p38
2484d60M00L02m96L63q1J9J38k67J83p6n1M26l08p2K72m69J49N00q38L29J68l05
2506a74N9M88m82K84q9l23J65j22K07pk01L08j94p2K59l47O05k56l58M29k30k45
2528b96P02m77J05K32j97J75l30k69N40l37M25r6n33N77m10%J97j89M3J47j99
2549a90LR6j69K80l1m3q1n2M09m02j65P43o00K02k3k36J96L12l02K63K6m30L91
2572A97m45N11k27r8J72j58m6K62m04M7J04%N5j15J4J87N0m8J18k42J2K2j4K73
$$ plain form
2419 28 -295 -147 -167 -128 -75 -165 -288 4 -229 -133 52 -211 72 58 89 -185 -21 222 58 -165 236 143 -176
2442 -176 162 -140 -129 69 -167 183 -566 -84 78 -136 155 -64 -335 53 -19 -254 262 -330 -123 251 -311
2463 -311 -113 36 -140 469 -24 74 64 -320 348 123 31 167 -257 3 294 -106 7 358 -127 278 -460
2484 -460 -60 242 -254 109 28 47 185 -82 101 25 -26 400 92 20 292 -177 -28 472 -366 -37 131 -174
2506 -174 -115 373 -109 175 86 -237 -72 -194 13 6 -195 113 -81 -153 106 -241 364 108 -250 179 -51 -296
2528 -296 406 -71 34 266 69 244 -86 -355 185 -152 273 177 -356 221 -189 -189 8 -181 -138 9 -190
2549 -190 -187 -91 -260 20 -11 -54 -135 -187 222 -180 -345 398 -202 0 -23 -259 -63 249 -53 210 236 -194 197
2572 197 -248 263 36 -62 110 -48 -94 168 -236 -189 -85 -85 -30 -145 -131 56 106 58 176 -66 -54 -32 -46 227
2596B27j8j12J26k79L30r8l38L76l97K46J69k63J08J26l62LR8KM9j51J6K33m87
2619c96N32l84L2K95j79K6o1L8j41L61k65J71J20l29P3R4J60m10J56K74l33K43
2641G7r8K3QP8k64M86k77J9J20k44K49k6j99J88r3j42M20l94RK8j79L17k94j50
2665c38N92k93L1L7o7l7K4j19J62N0j26K46l65N07m09J15j26M4Q5J25l45K39o0
2688b8oK58q6k96L65P5m21L54l56M53k46j28n2K62j86K45j86Q8J8l80M30j19p1
2711a3R1k91L23j30j38L97k54P2J63k36K38j64o4L9k51K19J39k84K21K8k8J02
2733A79L7l02N03o37L67q5k37L37l22J82K1l59M09o2j28L81j17k23J19k14K36
2754H5Ok99L77j22k17J72J44oL9r3j1P1l33K55j57J44J14k27J6k2J30k1q0j23
$$ plain form
2596 227 209 97 223 -56 274 176 -162 214 -183 63 232 -31 77 203 -159 -156 -58 -56 -7 -158 -142 91 -396
2619 -396 136 -248 -216 79 -100 -74 -135 -97 -238 123 -142 29 149 -180 -107 -13 147 -263 -107 167 -166 77
2641 77 -21 2 10 88 -176 310 33 52 172 -72 177 151 -48 140 47 -95 325 -69 -60 -32 -211 106 -188 -338
2665 -338 254 -39 -8 29 -38 -75 -51 -170 -8 42 -84 162 -203 304 -105 10 -116 -72 13 138 -207 32 -28
2688 -28 -34 224 138 -158 207 282 -139 215 -141 312 66 -62 -114 148 -38 207 21 109 127 -253 177 58 -13
2711 -13 78 -213 110 -20 -158 239 -15 57 220 -16 222 58 -6 33 -218 1 140 -144 77 105 77 179
2733 179 216 -86 417 -220 147 62 -175 162 -160 22 43 -316 93 31 -97 284 167 -56 63 -151 85
2754 85 91 -208 169 47 -170 2 146 140 179 86 75 146 -187 68 -89 55 169 -58 -42 -64 66 45 -35 -158
2778a58K98n8j89K43j76J84j82r2K85j35n3j7K2J31j52n5K46l43L35k62J22m3
2800d9M1j67K84l52N9K48l0R2l37j1o0J28J52N1L2r3m7o5K05k56L48k4m9p8J52
2825A74l18K27Nj59K08l22M43l51j45M46l47Q7k6L43l84J03P3K2j22J95K09l73
2847a2O6j61l0L36k17J16m0k07J39J36l46J96J90j8j7n7j8J48k01j35J82m28P11
2870C33k50m8K4q5n5K53L2j7k76p6J80j81M9J46k00L0m5N1J82o8O1o1k6J77j11
2895A9j18M24m34O2k24K96L8j64q7M07l32J05J22j29K72k06p9L09j32j91J66R0
2917B14q8j75k9J76J22m66K11P7j09K79l15M69k64j58K14k00M1ok71M40m0l26
2939b04Q3Q8j01K82j96N7o0m4Q8j65J61J20l1K9k42J36N7j44J27K64l46lM5k23
$$ plain form
2778 -158 140 82 -107 136 -40 144 -38 -130 155 20 -33 -50 -28 103 -49 -104 142 -201 134 -128 -6 -49
2800 -49 -8 -175 109 -243 -184 64 34 126 -211 -222 -282 -154 -2 49 81 -12 -59 -124 81 -175 173 149 100 22 174
2825 174 -144 83 88 -71 137 -185 258 -93 -238 208 -139 -52 -78 265 -119 -16 57 79 -43 152 361 -12
2847 -12 54 -107 -137 199 -18 98 58 -149 -10 126 -220 -24 166 148 131 74 56 204 3 -132 50 -378 333
2870 333 83 35 59 -26 -81 172 204 187 -89 -165 15 -166 -117 29 -171 -141 -186 -135 47 -21 40 -21 -47 130 19
2895 19 -99 325 -109 -47 -271 25 63 -101 -188 219 -113 -8 114 -15 257 51 -28 281 149 -42 124 214
2917 214 126 -49 -78 98 220 -246 -35 42 -67 212 -103 366 102 -56 158 -42 -1 -7 -278 162 122 -204
2939 -204 -121 -33 -134 148 -48 9 -51 -95 -7 -172 -11 109 78 107 -135 1 58 -86 41 305 -41 -44 1 -222
2963b22L08k1j44Q5r1k80L24p9K81j15K20k13j89J20mJ47j20O0o2L51k53k8K6
2986A01L52m12k21L3K61j38J2m1OJ1L81n14K6L29j59J20P2m5l44N1O5j2O5J16
3010A15j92K09j95Q1R6j31k1J24j52j06L10l53K94j46n9L64m97J52K74j57q2J50
3032G8l47O7J05m04M19L3j0R1R4o3J24k72J91j04L3j63P3J07k48K52J07l29j9
3055a85L42j66l2R7k03M4l27L30L64l06R5J28k41J3o0j32N03n43M72j17m40M52
3077H8k13J0K54l08J81L6j08J80k15n7O7p4K11k57J22N3j21J85jj14J62l90K59
3100e0q7j4k8J86j9o9K92l76P3q8n9K31J3J58r6j02K05q2l83L75O4k30J62o4o4
3125e2O1j43J87k26q3K70j63J16J84k78L33l26o6J94r0K89l25J14J39j18n9o6
$$ plain form
2963 -222 86 65 -79 6 -85 -365 -41 -120 161 46 266 53 -136 -16 -20 127 7 67 5 356 103 75 101
2986 101 453 41 -180 -147 114 -24 -12 -53 -47 -36 345 -169 -143 186 27 147 219 174 -170 -119 -54 -66 -1 115
3010 115 -77 132 -63 18 114 -17 -38 86 -66 -172 138 -215 79 -67 -126 238 -259 -107 167 10 -72 78
3032 78 -269 -202 -97 -501 -82 -49 -59 32 126 63 187 -85 106 2 35 -128 -55 52 -196 56 163 -166 -185
3055 -185 157 -9 -41 56 -147 -103 -430 -100 264 -42 53 181 -60 -47 -107 -239 264 -279 193 76 -364 88
3077 88 -125 -115 139 -169 12 48 -60 120 -95 -152 -85 -159 52 -205 -83 -30 -151 34 33 -81 81 -309 -50
3100 -50 -137 -151 -179 7 -12 -81 211 -165 -92 -180 -239 -8 5 163 67 -35 170 88 -295 80 144 -86 76 12 -52
3125 -52 9 -134 53 -173 -256 14 -149 -33 151 -127 206 -120 -186 8 -82 207 -118 -4 135 17 -42 -108
3147a08K02l63M59l13R0O6j59J69J26l82M86l64l4Q1j51L07n3k0j21O9K5j88K01
3170B5P2k00K00K0m27L33k21P1L96k90l1J55j65k07L12j88J77M9j09L24j98J6
3192A14j20j41K41j74k2J91m88J98o2J38o8L07k48L34mj37P4k1p1j13j06M56m64
3215a86J09J94j24J21j49j26K06J95k48K04l06L57k98J17j11j42R5p6J61k93K98
3236bj7L00k21j87K64p1l80L83l67K42Q8m3J77j18k11nK1K79k90L4L05l30NJ36
3260hj28K09m9k55Q9P2J26P7m64K98j5k48K31q6j0J70K0M0J11l36K20m2l85N25
3284A62k93L00j97J12Q1k14J6Kj01J31p3l4J76l2k05K01j19K14r7m5K84m00m7
3307a78N51k73Q6l16l5L04k61j39M75k21l33L16j52n7M05m42K18J52k10J93J5
$$ plain form
3147 -108 94 -269 190 -123 -33 33 -126 43 169 -213 273 -91 -125 -44 -195 112 59 39 -82 -13 12 -176 25
3170 25 97 -103 97 117 -310 23 -198 -127 269 -21 -52 103 -62 -269 43 -145 32 81 -28 296 98 114
3192 114 -6 -147 94 -80 -102 89 -399 -201 -263 -125 -193 114 -134 200 196 59 133 112 41 -72 -178 278 -186
3215 -186 -77 117 -7 114 -35 -161 45 240 -8 196 -110 247 -51 66 -45 -187 -92 -168 -7 -300 -2
3236 -2 -19 281 60 -127 137 66 -314 69 -298 -56 32 -11 166 48 -163 -168 -147 132 -158 -124 181 -149 -144 -8
3260 -8 -136 73 24 -231 -142 -70 56 133 -331 -33 -48 -296 -65 -151 -161 9 29 69 180 -156 64 22 -363 162
3284 162 -131 169 -28 84 165 -49 -33 -31 -132 -1 -74 -108 68 36 -169 32 -87 127 30 -15 269 -131 -178
3307 -178 373 100 186 -130 -165 139 -122 -261 214 -7 -340 -24 -176 -233 172 -270 -52 100 -110 83 98
3328I8k76k34K76J28O9k67J46Q1j42J0J87K5Q9k1j08j15j6J10J0k01P3m30N96
3351H8j75o7L06o54N74J06l47j04K19n9K51k40l7l8k2K90L8j35M1M4j48O2j18
3374a25J2J04R3j35J83m18N15l51R6l2q4J44j54J53l4o0J01k6n8L46m80L35j8
3397A07j59J52k44J06L05o7k23k49J41K48K1k14J95j49O8J33l0k41p9J75L54n54
3419b04l6N30l30L3J59j37K41l08j90J02Q7j4J54r4M3j69K56j41r5q6K42p7J78
3442A44k04n0J16M9r2N8p3L3R2j83L10p3J29l39K1n3J74k82J76L53k49j95K14
3465G6k18K78j78Ln8N7N0K8Q4k1o9ML2m1L01k99K5l2l6p7O4j64L52k82J25l1l1
3492e8N7n8p5m1J22K2K02m12J28j4K08j67R9p0m9k75L47nJ9k5k2n4M64m48J42
$$ plain form
3328 98 -178 -412 -136 -8 61 -206 -60 21 -121 -111 76 101 190 169 61 -54 -70 40 50 -151 -78 -508 88
3351 88 -87 -154 152 -502 72 178 -169 -273 -54 -113 138 -102 -139 -177 -199 91 129 -6 35 79 -69 -7 -125
3374 -125 -113 -9 84 -51 132 -286 229 -122 -26 -58 -142 2 -152 1 -33 -93 8 -18 -76 270 -210 125 107
3397 107 -52 100 -144 -38 267 200 -23 -272 -131 117 138 -76 119 -30 38 171 141 -100 -179 -4 350 -204
3419 -204 -240 290 -40 -7 152 15 256 -52 -242 -140 -53 -67 87 -7 36 -133 123 -18 -113 -199 43 -34 144
3442 144 -60 -110 6 55 -37 21 -52 -19 73 -110 200 127 256 -83 -62 -115 59 -223 -47 306 57 -138 76
3465 76 -142 136 -42 -39 -97 -40 10 38 122 101 32 36 68 27 328 29 54 22 -14 -91 -27 -191 161 -121 4 -27 -58
3492 -58 -1 -59 -134 -175 -53 -31 171 -241 -113 -127 81 -86 13 -57 -106 -381 -34 -39 -20 -45 -67 -121 343 -105 37
3517C7J9r0K96j39k14J18L8j96R8m0n6L18l29J63O1k21K82m8J08p7j72Rq4J46
3541B7j72r1J84J02j4K2l49K65N6j64L0P5J4J27qr7q4J67P4p3l12J95O5k51L9
3566a73k7K91J6j37L0m6l0P9k61J96k32L35j86j5n0K06n2j67K66Oj14L41m22J21
3590b5l86K20M85l55J14J89l06J52j17m9M1N9m8j26M4K74l28l1M26k18j20K26
3612A21k77K76k65q7K00l6J60p8K7p2Q9n9K54k97J70j11P0j12J53k18L3J7j4K5
3636c1j10J16l4j34K86K2j28P5o8j03p2J3j24K92o1J39j19l8J09J1O7k96L6K75
3660A23k40K61j33l5j70J70n5J12L7J6r8j22L5J32l07L91j11k68J23J96k73po
3683b29K29P8k97K75j64m8K40m66N88k28r3J78J14Lj86O6J39k07j41J06k5QL59
$$ plain form
3517 37 56 -34 262 123 -91 27 65 -131 -33 -73 -129 189 -140 23 84 -137 145 97 205 128 -44 -35 -119 27
3541 27 -145 -236 -52 50 36 58 -291 -26 30 -134 -104 -29 -15 112 104 7 -77 90 164 91 -221 -26 39 -212 -173
3566 -173 -200 91 107 -30 0 -46 -76 3 -258 -62 -294 41 -145 -160 -210 -4 -56 -223 43 49 -65 276 -146 -25
3590 -25 -411 -191 294 -61 53 242 -64 88 -29 -78 -37 22 -26 -152 -108 166 -162 -193 233 15 -105 121
3612 121 -156 120 -145 -232 -32 -68 92 14 41 -31 58 -1 253 -44 126 15 85 -27 126 -92 -59 -42 -56 -31
3636 -31 -141 -25 -59 -193 93 115 -13 62 -6 -109 -181 -168 -292 0 -61 78 -41 -79 30 41 108 -188 -152 123
3660 123 -117 144 11 -24 -194 -24 -79 33 70 86 -12 -134 -99 33 -274 117 6 -262 -139 57 -216 -223 -229
3683 -229 0 78 -219 56 -108 -156 84 -382 206 -22 -115 63 177 180 -6 60 199 -8 -149 -43 -68 -60 299
3706B99l22ok3N2L05l08J11k48q9K22o6p6N14m11q2K21k86J95j96O5O3k26K27
3729f5J75l25K62J05l9K04j19R8l60L0k72M49k81K4J59O1m2k83m3J84k9j24k1
3752b52k11J52K99O1j33M05k02m0n2j8J31n1k75p3L73o9k37J92n1j65K12m5N9
3775A0l9N7M4l6l49J98j21J12J10j11J74L6l94K85m8k12N76n30N05k18q6M27l32
3798E8j52J99o2j59j56K93K34m09J53J53k48P6J27k19oJ34J4n1j6Jj30j01K79
3821A2M3j87q2J60m5J79j55J05O7j11P1o3J09J43j18j59k0j88N10M4k15k26J1
3844a15J13j13L9J06J85j02O8j70m8m2J55M2j88j29P1J35p5L78p9k86R6L3m6K7
3868E5J69j68k19K33r2J08j76J10j05K14k82K01k43K33j32J23n6r2j32J38k8L0
$$ plain form
3706 299 -23 -29 -52 0 305 -3 108 -140 -229 -7 -73 -149 365 -46 -128 93 -193 2 -194 -129 -66 -292 -65
3729 -65 110 -215 47 152 113 317 198 296 -64 -34 -306 143 -138 -114 45 106 64 -219 -262 -78 -107 -231 -252
3752 -252 -463 -311 -12 49 -84 321 119 79 27 9 140 89 -186 -259 114 45 -192 0 -51 -216 -4 -49 10
3775 10 -29 28 72 36 -313 -115 -236 -124 -14 -125 49 85 -309 -24 -72 -284 292 -238 267 49 -37 390 58
3798 58 -94 105 43 -116 -272 21 255 -154 -1 152 -96 -20 107 -112 -118 16 30 -21 -37 -36 -166 -267 12
3821 12 55 -132 -214 -54 -99 80 -75 30 97 -14 57 -6 103 246 128 -31 -51 -239 271 315 100 -126 -115
3844 -115 -2 -115 -76 30 215 113 181 11 -37 -79 76 118 -70 -199 -128 7 -68 310 231 -55 41 74 28 55
3868 55 224 56 -163 70 -22 86 -90 20 -85 129 -153 48 -195 38 -94 29 -27 -119 -251 -113 -141 -111
3890a11J86j15j17J71N1K1k9P4j4qJ87q5j58r7K14l20K81J4k21M7k21K88j3J72
3914A97l71O9j04K38J70l47K46m9O8j2k10L47k35k31K90J92m84K27j04K96n9m10
3936b76L13k15R6L2m2J18p3K8K08l16J93l08J90O1J22l30M13j69k43M5L63k52
3958d2J98l40L8K94m6J6l67R7K85l16K57k45N2K15n49L78l9J09J27N9j12J35k75
3981g1J08Q5j63J80L8j05J50k36K46l86K53K4J05m05M6K66l09K05m9J19K9l77
4003b47M90k04N9j41j21P5O4O9q1m06N42j94m4o6K46K2k10J39J67L2k38j8PJ20
4027F2J57l10L75m40K12k84K00m2L01l56j5K63j52J95N5l97J87k46K85jr0R2J1
4050F2j49L7O9l31L94OJ74j46m20N92o32K11M47l56r1K65k56J96J8l35K98NK39
$$ plain form
3890 -111 75 -40 -157 14 65 86 57 131 117 109 296 211 53 -44 170 -150 131 145 -76 -29 -250 38 25 197
3914 197 -174 -105 -209 29 199 -148 98 49 117 105 -105 242 7 -224 66 258 -226 1 -103 193 134 -276
3936 -276 37 -178 -82 -50 -92 26 -47 -19 189 -127 66 -242 -52 9 131 -199 214 45 -198 -153 210 -42
3958 -42 156 -184 -146 148 102 118 -249 -152 133 -183 74 -171 -119 96 -453 -75 -114 -5 122 181 69 204 -71
3981 -71 37 122 -41 139 177 72 222 -14 232 -154 99 123 228 -177 -131 135 -174 31 -18 101 130 -247
4003 -247 243 39 98 -43 -164 -89 -25 44 -37 -443 99 -95 -139 -205 41 63 -147 -8 159 191 -47 -65 -58 62
4027 62 219 -91 284 -156 56 -228 -28 -70 231 -125 -140 123 -29 166 221 -176 11 -235 50 49 -41 51 62
4050 62 -87 -50 19 -312 82 88 262 116 -304 288 -344 -133 314 -42 -133 132 -124 72 90 -245 53 58 297
4073B97j95M0m2o6n0j11L1K35j11p4N8r7j0P7M8j35j70m3J47M83k00j31J34k35
4097a20K53j96m1J85j54k4K42l1q2Qj38o1K03k0j51O4L64j17j69J75j30l11L22
4120G1P2k8l1q7K57j71K8o2k0r6J63J17j80n7J25L9k17l7K59m5M9j35j85k0J75
4145a6j60M31k11K0J04j66j38J08Q7j55L8R7j12J31j45o4K23j92J57L54n32J48
4167GN9k36N14j82j17k77K17j27O5L8J03j6j56L14j30J19o83N48L4q3Q5K64k14
4190A46k47K70j90P1J9j37L68j54j38j54K21k36J35j36O1Q5K94o8mk59L77j76
4212A48l26K35k77N3K6J97J35k25J52p7j76J95N2o1M12n78K11l86K89p3Q6lk09
4235b00J45r6Q8j11O5Q2K03j78m2rK99m0l86J68J13k28N6K36j72M7p2J51r6J53
$$ plain form
4073 297 102 142 100 34 -16 -127 -96 139 28 -46 12 -85 -95 -18 30 -105 -275 -318 -171 312 112 -19 115 -120
4097 -120 133 -63 -104 81 -73 -97 145 114 32 40 -98 -159 44 24 -127 -63 301 184 15 190 60 -251 71
4120 71 143 115 84 -3 254 83 111 49 29 -67 96 213 33 -24 101 140 -77 -114 145 100 149 14 -171 -191 -16
4145 -16 -176 255 44 64 168 2 -136 -28 59 -96 -58 39 -73 58 -87 -151 72 -120 37 391 -141 7
4167 7 66 -170 344 162 45 -232 -15 -142 -77 -39 64 48 -108 206 76 195 -488 60 94 11 96 360 146
4190 146 -101 169 -21 50 69 -68 300 146 8 -146 75 -161 -26 -162 -101 -16 278 210 206 -53 324 148
4212 148 -178 57 -220 -167 -141 56 191 -34 118 41 -135 60 112 51 463 -115 96 -290 -1 -74 12 9 -200
4235 -200 -55 -151 -63 -174 -109 -27 176 -2 -44 -53 246 206 -180 -12 101 -127 -71 165 -7 40 -32 119 23 176
4259A76k4q3J51n3l14L1k8J56P0l42L80m29M18j73L87n50J45k21J39J44J88p6
4281I2K67m45K31k70Q9Q6k74K42K7J8l2j69J41m7NL20l74R8j51K44nR5m91L78
4305G5K52l69m5M9M7Q3j12j14L10k74J7rK52n1j58Q2p0l4K29k68K00m05K17K77
4329A81j00l23J99P5M4o9L6j75K63l19M94j48j59j69L64k8k45P1j15K46j92j76
4351b45L83r0K3j92j71J56j70L62k19L00j27j42k35L55l58K96M3L7K21k18N0M4
4373A03O8j81L2j69K99k64L08k88K98l1l76J43K77l20Q4J00k07J7L00k14K09l03
4395a15K35J17l66J02m4j27R2j66K69o6r4M57l60K36p2j4p3J39m6l96J51K45k3
4418H1j53J24j6j55jM3N2Q6J63k59R4j22p2K8L1K31l02qM98l84J57j01J58l4k24
$$ plain form
4259 176 152 69 220 167 -147 -116 -144 12 82 -260 120 -309 109 -64 323 -227 -82 -303 -164 -20 168 92
4281 92 359 -86 145 -125 -36 50 -224 18 45 63 31 -138 3 -44 -39 281 -93 5 -146 98 93 188 -303 75
4305 75 327 -42 -87 -38 9 92 -20 -134 176 -98 -81 -90 162 111 -47 35 -35 -69 160 -108 92 -313 -96 181
4329 181 81 -242 -43 32 76 7 43 -132 131 -188 306 158 -1 -170 194 166 -79 -8 -123 123 -69 -245
4351 -245 138 48 71 -121 -292 -136 -306 56 -163 137 10 -132 -367 -12 -370 -74 -31 6 227 9 59 103
4373 103 171 -10 22 -147 152 -112 196 -92 206 175 -201 -58 219 -101 -17 83 -124 -107 193 -21 188 -115
4395 -115 120 237 -129 -27 -71 -198 -106 -272 -3 -69 -163 294 -66 170 98 84 11 150 104 -292 -141 104 81
4418 81 -72 52 36 -119 -120 -77 -25 61 224 -35 59 -63 -135 -107 -76 155 -147 -155 343 -41 116 15 173 139 -85
4443h5j2K45r3o0j56k4K96k41p7j71M13pq7L59k33l5k46O4l8J56Q4O7o8P0k23
4468a02n2Q2K31o7m30J65J02J47l4k22M6J72k78K94j2JJ29l25R9K05k5k09N3R5
4492F5k01J13j99L66o5j84J45j96J39k9J9R5p3P6k08NJ07J68q2J32k26j26K45
4515H6j87J28N5k77R6J51N0j16N5j17K40j68J01k40n4J52Q6r7mr0K82q5L3O5j00
4540D5R7j19n3J31j48Q9j07l6j13K75N1j01k00K47k01J77j22k9L13k64L04m23
4562a87J07L00m34J57j35J85J00k07J03L1j82L73j86j46J92j00M3p0j30L79k6
4583A67J99m43J28l04L25l1J47k86p4K65q9R6l7r3J65r6j54J13j67M64j91K34
4605C38l25n8j20L60q4k55R5j84K3K15l7k39L05K0J12k87K02J24q9j47L0N5j60
$$ plain form
4443 -85 -97 148 55 -5 -161 -185 111 -130 -207 -378 35 28 -59 300 67 32 -214 -150 -188 -32 52 119 51 121 -102
4468 -102 -154 -72 159 92 -338 -173 -71 76 42 -180 -134 38 -240 54 42 43 172 -153 -54 151 126 -83 -30 65
4492 65 -136 -23 -222 144 79 -105 40 -156 -17 -46 -27 68 -5 71 -137 -132 -25 143 61 193 -33 -159 86
4515 86 -101 27 82 -195 -99 52 102 -14 41 -76 164 -4 97 -143 -197 -45 41 -56 -60 -150 132 47 80 145 45
4540 45 142 23 -30 101 -47 42 -65 -101 -214 61 112 11 -189 58 -143 34 -88 -117 196 -68 236 -187
4562 -187 -80 220 -214 -57 -192 -7 93 -114 -11 20 -162 211 25 -121 71 -29 14 -56 -186 193 167
4583 167 366 -77 51 -253 72 41 188 -98 -172 93 4 100 63 -30 135 39 -115 -2 -169 295 104 338
4605 338 13 -45 -165 195 111 -144 -49 -233 -210 5 -32 -271 34 54 166 -121 81 205 116 -31 -1 54 -106
4628a06J20q1J67P4k70K53l76L82j52M7j11k34K29J76q0j95J80J27k44J22J76
4649B04k21O4J10l44J88j02l20M61K72n12O9Q6j00J47K96m77J97p7K1J3M0J03
4671A18j72n3L4L42r0m32K99l0P6k09M13k17k52J51K71k20n4K00j1m70K03K50
4693A47k90K07k18L19k56KJ53R3l70J46j43M29J5l85J40L6p1k1R5J38P8j86J74
4716B32j13l31M19k9k04j52m0L95j79k11K14j20J69j03j32J12o7J95O6k19R7n1
4738e2mK18k63m8N4j9r5K47m6Q7J80k84J64O6l22J00m6K88j14k3l55K05J69Jl22
4763b14M2L12j68j04n5J97K99m53J75K35l06O4N3O5j47K01m5j2k44J30N2j51l04
4786c78J33K64J6Pk03L95j39j64Nj83J99K1j5k3O4pL15k94K21k28j88M5N24j36
$$ plain form
4628 -106 14 -67 100 174 -96 157 -219 163 11 58 -53 -287 -58 118 38 -157 23 150 -94 28 204
4649 204 -17 47 157 -187 1 -101 -421 40 312 -200 -131 -45 -145 2 298 -179 18 -59 -38 -25 15 118
4671 118 -54 -107 -73 269 179 -253 46 16 92 -117 296 79 -173 -22 249 29 -25 175 164 -306 -103 147
4693 147 -143 64 -154 165 -91 -89 64 157 -213 -67 -210 219 234 -151 -11 25 -46 -67 28 166 244 58 232
4716 232 119 -212 207 178 -26 -178 -218 177 -2 -213 1 -119 50 -53 -185 -73 -140 55 121 -98 -1 -52
4738 -52 -56 162 -101 -149 -95 -114 -209 38 -8 79 259 -25 139 205 -117 -17 -63 225 111 88 -267 -62 107 108 -214
4763 -214 -172 140 -28 -132 -187 10 309 -144 31 266 -40 24 77 142 -5 196 151 139 -105 25 77 -74 -378
4786 -378 -245 19 35 42 -161 234 95 -69 -64 -247 -48 -27 -42 -65 -1 -8 307 13 234 6 -182 -137 387 251
4810B51k79j59K34j8j00J68k35%R6O8j7Rk36N13n19j63L16K08j35p4J37r5Q6k38
4834a82K67k90J5J01K75Q6m8n09L59j92R0k90L41K57m13M18l50j62M2O4P2o8O8
4857d9J02J61m69N4P0K5K04J21j25p6m1Q4P9j99k1K42q0p6k43K64P7k74J94p7
4881e3l8R2k1J04P2k44J38J04j29K92k03l7l9j29j6J84L9j04K7k35J54J85j03
4904D0n1j9o4J25j10K04k06J39n1M2l5J7q5O5J43l76J61J12J11j21q9R9j23J82
4928A10n8j02P7l1r5Q4r7J16R2O4r8j75K52p1j69O6J69J53k23j85J35M1l1K6k7
4953B3j01K85k58j66K96N0K29j54k05o7L1j9L2j3m4L18k51o2nj36K29k00K20R6
4977A28k68K60J31j09J4j99j95L34r9o9J79q7O2K64m03j6m9L2M43j97J8j24K25
$$ plain form
4810 251 -28 -187 47 29 -71 97 -138 -138 -42 26 9 18 -218 295 -224 -387 -71 137 2 -72 65 -30 56 -182
4834 -182 85 -205 -190 -89 186 272 224 -285 74 -118 -28 -318 23 280 -133 285 -65 -227 -185 -121 -49 -117 -49
4857 -49 53 214 -255 -201 -131 -106 98 219 94 18 -23 61 140 -59 -80 162 82 6 -237 27 104 -170 24 -53
4881 -53 -91 1 -20 84 156 -88 50 154 25 317 114 77 38 -91 -107 77 116 12 39 -196 -42 143 40
4904 40 -11 -30 -94 31 -79 125 -81 58 7 49 14 31 -54 11 154 -222 -61 51 162 41 -48 51 -72 110
4928 110 52 -50 27 -4 -99 -15 -112 4 96 160 62 -113 139 68 -101 -35 134 287 64 -121 14 55 24 50 23
4953 23 -78 207 -51 -217 79 129 358 204 -1 -68 -37 -56 -24 -37 -81 237 -14 -76 -81 -217 12 -188 32 128
4977 128 -140 120 251 142 156 -43 -238 96 -3 -72 107 20 82 346 -57 -73 -122 -90 353 156 174 50 275
5000B75m13J14M6r1K3p0O14o74J46k32J84J73k29J84m7J79l63M63k95m1M6k2K80
5023B50l25J23j70J43J62m19K45J77l25J62JM9m1K13k95j0K29j2k21R7L0Q9j35
5046A7J15k70J71j95O3L0q2j43L20j50J28q4J17K15k05q7k9l1K78k7j21j07j17
5069a94L16J05l48J26L9j30J18n2k05K19k91M00k79J59J77l74K70r5m9p0J30K7
5091aQ3k10Q6J46J49k00M3k03OJ91j2L3q9j82L07k14J15J23j91J37o0k21l8J57
5115d5J05n1P0J79m10J11n8J58M3j44J03j40J19k93L01j25m3J14J83j87q5K41
5137A46L0n8k23M6j04m3J98L8KN5k64J47l88K86K07j48K24j92J62L4l98R8J0J05
5161c0J22k98O9R3K29m24K78Mj16%Jn7Q6K68j62J21k26J97j1N4m14O0N2o8K00
$$ plain form
5000 275 -138 -24 22 -69 -46 -116 498 -176 -30 -262 -78 95 -134 50 3 182 -181 282 -13 -54 -8 -30 250
5023 250 -75 48 -122 21 183 -236 9 186 -139 23 24 73 32 245 -50 -60 169 157 -64 33 63 152 17
5046 17 132 -138 33 -162 -99 -69 -151 -294 26 -124 4 -80 37 252 47 -40 -69 -100 178 151 30 -77 -194
5069 -194 122 227 -121 5 44 -86 32 -20 -225 -6 -297 103 -176 -17 160 -214 56 -39 -88 -158 -28 -1
5091 -1 82 -128 -42 104 253 53 96 -107 -101 90 78 111 22 -160 147 -67 48 171 -20 117 57 -164 -202 -45
5115 -45 60 9 79 258 -152 -41 -99 59 102 -42 61 -79 40 -253 48 -77 -120 -6 177 -10 -95 146
5137 146 176 118 -105 -59 -163 -206 -8 30 32 87 -177 -30 -418 -132 75 -73 151 -41 121 155 -243 -145 -135 -30
5161 -30 92 -206 -137 -44 185 -239 39 43 -73 -73 -72 -129 -43 225 63 184 -42 155 144 198 -216 -156 -104 -172 28
5186B8l5R2j30N1q9J10k07K90p4M8oo6j6l6k04K36P8Rqk02j22K89l06J04K48r7
5212a5L13j16q0l0j31j1j38P7K36j62k3j52L72q8J32l53l3L71k55n9L7l9L26k82
5236a03K7J8j38J71J22nj29k5j24J90R0k00L0K6K16k3o2k04K47l73L55m26O36
5259C16j74l57M96j72N2j42J15j49M7j2o1l7o4Q6M36m43J85j35j24J91JK23qm16
5283a46L45ok51J97NLj65o7N0k63J25L1J41P4k65K13M4j47K43m34J84j2L5pO6
5308gl68L35k5L3K98l62M2J31K2k31P8p9J13L4q4k9J82q8K40j25j13M7K9O6l39
5333b00K36J16j40K12l05R1j02M42l86K2j48O5L9J1l5MK07l9j28Mn5j00K52j86
5357a23PJ85j12P4K2rp8L16j48j77q4L47n1k76L2K4OK11k68M04j31j75j11l4K37
$$ plain form
5186 28 -7 85 -45 6 -83 27 -180 110 36 84 78 12 -4 -40 -244 -8 70 79 71 -131 -253 36 -270 -166 82 -15
5212 -15 298 182 102 72 -59 -70 -208 -131 105 -57 -80 -232 140 52 184 -169 -202 169 -86 -145 -108 -147 179 -103
5236 -103 -76 -58 -196 -25 97 92 -37 -62 -186 4 94 -106 -76 -50 166 143 81 -123 124 -249 106 -320 316
5259 316 142 -215 281 109 161 19 134 -15 32 20 -41 -78 -142 -56 380 -63 122 -13 -137 54 55 278 270 -146
5283 -146 199 193 -58 139 144 147 -18 -85 -35 -298 -173 -142 -1 73 -192 21 65 -82 161 -273 -89 -101 -66 -73 -7
5308 -7 -375 -40 -65 -32 266 -96 -54 77 99 -132 -54 -133 -20 14 -70 -99 83 -5 235 110 -3 44 73 139 -200
5333 -200 36 152 12 224 -81 10 -92 350 -36 -14 -162 -97 -58 -47 -82 -78 129 90 -38 -34 -89 -189 63 -123
5357 -123 -116 69 -43 31 53 44 -34 282 134 -43 -127 220 169 -107 -75 -51 -45 166 -102 302 171 -4 -115 -149 88
5382H8M7j67N8Rj08J31n1m7J48m10M08j74j69L96k11K60k52J76j10m0K8M6N7j64
5406e1J26k27QM5j02L82k43J79p2m8m8P4o3J93J45l31K77k30J1p0J39Kj37J33
5430I2p4k05J20J57j17j3k21J94K94j53N5p7J88o1p5j14p8K05r2l9k59M11n5K4
5454A07M1m9m0q4k10L38j96o4LJ88k76J21J1M3J30jp4r3J53M0j49R5l1N9L8J9
5480A19j76J0J76j16j31n1L66Rk39J35K4l41N09m91K18L9P6m1k15L24k38K20j80
5503Fj2L61m71M02k87J10k3k54J89j05J97pj7p6k51q4L84k9M8j05j83N7N7J80
5527H7j9k71O5M61j22k40Q0O8j14J8k8P0j61K92m31M30j02j42J1j49J44L11m05
5550a47J38J35l09L43Q2J60l89J65k22k07K50j58K25k10M9O7JK48k80K26j0l26
$$ plain form
5382 88 135 -32 26 35 -73 58 7 -40 108 -302 106 -68 -237 159 -52 208 -44 132 22 -18 10 56 113 -51
5406 -51 75 -152 -144 -99 -201 181 -62 117 45 -3 -51 23 -40 153 298 -33 244 14 25 -45 94 96 -41 92
5430 92 18 -187 -67 90 -27 -40 -261 -67 227 74 129 52 240 179 104 -10 -88 117 25 -14 -273 138 83 107
5454 107 148 99 59 -25 -235 103 -93 -157 -154 34 -242 -121 -110 -67 63 62 -12 -105 48 88 -61 34 3 62 100 119
5480 119 -57 -47 129 13 -118 -169 197 206 -33 102 126 -215 294 -197 21 60 136 95 -120 204 -34 186 6
5503 6 -6 355 -116 286 -1 109 86 -168 21 -84 113 106 89 13 -238 -322 62 33 81 -24 -207 -150 -93 87
5527 87 68 -203 -138 323 201 -39 41 109 -5 13 -15 55 -106 186 -245 185 83 -59 -48 -197 -53 258 -147
5550 -147 -9 126 -183 160 242 402 13 178 -44 -251 -1 -159 66 -144 -95 -28 -27 221 -59 167 157 -169
5572a69J94k8k95K33J50k30K63K93l78j33L83k03j82J40J48o3j82K52l10J03n9
5593g3RJ12j79J59K5N1R1j31m23M37p0L2k63M39l49K51k59k06K55K65J00k32K7
5616F8j42K18k16j86L16P3k75J72J7J06j30j64P9K58j26L0J9k55j25L07l8o7J54
5639I3j06j15N3K9J8n5o3K51k32P1o4M1K40j35L5P9j20J75q1p4j40K04j08R5k2
5664F9l5k31K26j8j70J22l6n3L7l3M0R4q3J99m16J26P1lO0j8p4l5K0J01n2J65
5690G3P8k71J82j93O1N5j07k6K48l80J22Q5J92m73N19j16l9q8M2M8O5J27m1m5
5714A18r2n2j47J65q4J84L1k32k37M90k05m2N9k23L02p6q2J47K60j73j04o7K40
5737A80o2l11M21j20Or2j12J54m9k71L54J69m45K76j32P7J09k29K43l19J56lj75
$$ plain form
5572 -169 25 -3 -298 -65 85 -145 118 411 33 -100 283 80 -102 38 186 123 -59 193 -117 -14 -73
5593 -73 -64 48 -131 28 53 104 195 64 -359 78 8 40 -223 216 -133 118 -141 -347 -92 173 273 41 68
5616 68 -74 144 -72 -258 58 131 -144 28 45 151 21 -143 -64 194 68 98 117 -138 -263 44 6 -61 93
5639 93 -13 -128 -75 -46 -28 -83 -146 105 -127 -56 -120 -79 161 26 61 140 20 195 114 40 -100 104 -4 91 69
5664 69 34 -197 29 11 -159 -37 -73 -126 -89 -122 -82 12 -71 128 -288 -162 -91 -94 -34 -52 -126 -161 -141 -40 -92 73
5690 73 151 -120 62 -131 -70 -15 -122 -148 100 -280 -158 -73 119 -354 165 49 10 -78 -36 12 77 204 163 118
5714 118 26 -26 -173 -8 -92 92 123 -109 -346 144 -61 -103 -44 -267 35 -41 -123 24 284 111 7 -60 180
5737 180 118 -193 228 108 114 22 -90 64 15 -256 98 267 -178 98 -34 43 152 -77 166 -153 3 0 -175
5760a75K75j5M9o1j40L4N9n8J73o9l10J55p2P6J66Pp0L7k1Q5r3j20l8J08J72j72
$$ plain form
5760 -175 100 85 134 73 -67 -33 26 -32 141 72 -238 -83 -155 -79 87 94 24 61 40 125 32 -88 -126 -18 154 -18
$$ [...]
8191b87
##END NTUPLES=NMR FID
##END=
