##TITLE=1H_15-2022
 CDCl3
 8 sc, 
 9.03.2022
##JCAMPDX= 6.0         $$ Bruker NMR JCAMP-DX V2.0
##DATA TYPE= NMR FID
##DATA CLASS= NTUPLES
##ORIGIN= UXNMR, Bruker Analytische Messtechnik GmbH
##OWNER= root
$$ XWIN-NMR		Version 3.5
$$ Wed Mar  9 12:02:58 2022 Russian Standard Time (UT+4h)  she@DPX200
##.OBSERVE FREQUENCY= 200.131346
##.OBSERVE NUCLEUS= ^1H
##.DELAY= (6, 6)
##.ACQUISITION MODE= SIMULTANEOUS
##.ACQUISITION SCHEME= undefined
##.AVERAGES= 8
##.DIGITISER RES= 18
##SPECTROMETER/DATA SYSTEM= spect
##.PULSE SEQUENCE= zg30
##.SOLVENT NAME= CDCl3
##.SHIFT REFERENCE= (INTERNAL, CDCl3, 0, 15.7039)
##AUDIT TRAIL= $$ (NUMBER, WHEN, WHO, WHERE, WHAT)
$$ ##TITLE= Audit trail, XWIN-NMR		Version 3.5
$$ ##JCAMPDX= 5.01
$$ ##ORIGIN= Bruker BioSpin GmbH
$$ ##OWNER= she
$$ F:/spectra/data/she/nmr/H-F/1/audita.txt
$$ ##AUDIT TRAIL=  $$ (NUMBER, WHEN, WHO, WHERE, WHAT)
(   1,<2022-03-09 12:01:43.65 +0400>,<she>,<DPX200>,
      <created by zg, POWCHK disabled, PULCHK disabled
       configuration hash MD5:
       00 E9 B6 7A A2 85 ED C7 34 08 36 98 17 FE 4E 26
       data hash MD5: 16K
       30 8A 6B 9A 44 6C 7A 5D C3 93 BC A6 F1 2B E5 AD>)
$$ ##END=
$$ 
$$ hash MD5
$$ 1F FD 03 53 A2 8A 0B 7F 1D AE 8C 25 A9 0B 9A 95
##$RELAX= 
##$RELAX= 
##$RELAX= 
##$RELAX= 
##$RELAX= 
##$RELAX= 
$$ Bruker specific parameters
$$ --------------------------
##$DU= <F:/spectra>
##$EXPNO= 1
##$NAME= <H-F>
##$PROCNO= 1
##$TYPE= <nmr>
##$USER= <she>
##$AMP= (0..31)
100 100 100 100 100 100 100 100 100 100 100 100 100 100 100 100 100 100 
100 100 100 100 100 100 100 100 100 100 100 100 100 100 
##$AQSEQ= 0
##$AQ_mod= 1
##$AUNM= <au_zg>
##$AUTOPOS= <>
##$BF1= 200.13
##$BF2= 200.13
##$BF3= 200.13
##$BF4= 200.13
##$BF5= 200.13
##$BF6= 200.13
##$BF7= 200.13
##$BF8= 200.13
##$BYTORDA= 1
##$CFDGTYP= 0
##$CFRGTYP= 5
##$CHEMSTR= <none>
##$CNST= (0..31)
1 1 145 1 1 1 1 1 1 1 1 1 1 1 1 1 1 1 1 1 1 1 1 1 1 1 1 1 1 1 1 1 
##$CPDPRG= <>
##$CPDPRG1= <>
##$CPDPRG2= <>
##$CPDPRG3= <>
##$CPDPRG4= <mlev>
##$CPDPRG5= <mlev>
##$CPDPRG6= <mlev>
##$CPDPRG7= <mlev>
##$CPDPRG8= <mlev>
##$CPDPRGB= <>
##$CPDPRGT= <>
##$D= (0..31)
0 1.2 0 0 0 0 0 0 0 0.06 0 0.03 0 0 0 0 0.0002 0 0 0 0 0 0 0 0 0 0 0 0 
0 0 0 
##$DATE= 1646812903
##$DBL= (0..7)
120 120 120 120 120 120 120 120 
##$DBP= (0..7)
150 150 150 150 150 150 150 150 
##$DBP07= 0
##$DBPNAM0= <>
##$DBPNAM1= <>
##$DBPNAM2= <>
##$DBPNAM3= <>
##$DBPNAM4= <>
##$DBPNAM5= <>
##$DBPNAM6= <>
##$DBPNAM7= <>
##$DBPOAL= (0..7)
0.5 0.5 0.5 0.5 0.5 0.5 0.5 0.5 
##$DBPOFFS= (0..7)
0 0 0 0 0 0 0 0 
##$DE= 6
##$DECBNUC= <off>
##$DECIM= 32
##$DECNUC= <off>
##$DECSTAT= 4
##$DIGMOD= 1
##$DIGTYP= 9
##$DL= (0..7)
0 120 120 120 120 120 120 120 
##$DP= (0..7)
150 150 150 150 150 150 150 150 
##$DP07= 0
##$DPNAME0= <>
##$DPNAME1= <>
##$DPNAME2= <>
##$DPNAME3= <>
##$DPNAME4= <>
##$DPNAME5= <>
##$DPNAME6= <>
##$DPNAME7= <>
##$DPOAL= (0..7)
0.5 0.5 0.5 0.5 0.5 0.5 0.5 0.5 
##$DPOFFS= (0..7)
0 0 0 0 0 0 0 0 
##$DQDMODE= 0
##$DR= 18
##$DS= 0
##$DSLIST= <SSSSSSSSSSSSSSS>
$$ [...]
##$SUBNAM2= <"">
##$SUBNAM3= <"">
##$SUBNAM4= <"">
##$SUBNAM5= <"">
##$SUBNAM6= <"">
##$SUBNAM7= <"">
##$SUBNAM8= <"">
##$SUBNAM9= <"">
##$SW= 18.0517287032376
##$SWIBOX= (0..15)
0 0 2 0 0 0 0 0 0 0 0 0 0 0 0 0 
##$SW_h= 3612.71676300578
##$TD= 16384
##$TD0= 1
##$TE= 0
##$TE2= 300
##$TE3= 300
##$TEG= 300
##$TL= (0..7)
0 120 120 120 120 120 120 120 
##$TP= (0..7)
150 150 150 150 150 150 150 150 
##$TP07= 0
##$TPNAME0= <>
##$TPNAME1= <>
##$TPNAME2= <>
##$TPNAME3= <>
##$TPNAME4= <>
##$TPNAME5= <>
##$TPNAME6= <>
##$TPNAME7= <>
##$TPOAL= (0..7)
0.5 0.5 0.5 0.5 0.5 0.5 0.5 0.5 
##$TPOFFS= (0..7)
0 0 0 0 0 0 0 0 
##$TUNHIN= 0
##$TUNHOUT= 0
##$TUNXOUT= 0
##$USERA1= <user>
##$USERA2= <user>
##$USERA3= <user>
##$USERA4= <user>
##$USERA5= <user>
##$V9= 5
##$VALIST= <valist>
##$VCLIST= <CCCCCCCCCCCCCCC>
##$VD= 0
##$VDLIST= <DDDDDDDDDDDDDDD>
##$VPLIST= <PPPPPPPPPPPPPPP>
##$VTLIST= <TTTTTTTTTTTTTTT>
##$WBST= 1024
##$WBSW= 4
##$XGAIN= (0..3)
0 0 0 0 
##$XL= 0
##$YL= 0
##$YMAX_a= 289391
##$YMIN_a= -386057
##$ZGOPTNS= <>
##$ZL1= 120
##$ZL2= 120
##$ZL3= 120
##$ZL4= 120
##$ABSF1= 10
##$ABSF2= 0
##$ABSG= 5
##$ABSL= 3
##$ALPHA= 0
##$AQORDER= 0
##$ASSFAC= 0
##$ASSFACI= 0
##$ASSFACX= 0
##$ASSWID= 0
##$AUNMP= <proc_1d>
##$AZFE= 0.1
##$AZFW= 0.1
##$BCFW= 1
##$BC_mod= 2
##$BYTORDP= 1
##$COROFFS= 0
##$CY= 11.3945322036743
##$DATMOD= 1
##$DC= 2
##$DFILT= <>
##$DTYPP= 0
##$F1P= 2.36226072786647
##$F2P= -0.459571619588291
##$FCOR= 0.5
##$FTSIZE= 0
##$FT_mod= 4
##$GAMMA= 1
##$GB= 0.15
##$INTBC= 1
##$INTSCL= 1
##$ISEN= 128
##$LB= 0.24
##$LEV0= 0
##$LPBIN= 0
##$MAXI= 10000
##$MC2= 0
##$MEAN= 0
##$ME_mod= 0
##$MI= 1.114404
##$NCOEF= 0
##$NC_proc= 0
##$NLEV= 6
##$NOISF1= 3.799351
##$NOISF2= 2.8
##$NSP= 1
##$NTH_PI= 0
##$NZP= 0
##$OFFSET= 15.70392
##$PC= 1
##$PHC0= -16588.2
##$PHC1= 10.60078
##$PH_mod= 1
##$PKNL= yes
##$PPARMOD= 0
##$PSCAL= 0
##$PSIGN= 0
##$REVERSE= no
##$SF= 200.130013532006
##$SI= 16384
##$SIGF1= 3
##$SIGF2= 2
##$SINO= 400
##$SIOLD= 16384
##$SREGLST= <1H.CDCl3>
##$SSB= 0
##$STSI= 0
##$STSR= 0
##$SW_p= 3612.71676300578
##$SYMM= 0
##$S_DEV= 0
##$TDeff= 0
##$TDoff= 0
##$TI= <>
##$TILT= no
##$TM1= 0
##$TM2= 0
##$TOPLEV= 0
##$USERP1= <user>
##$USERP2= <user>
##$USERP3= <user>
##$USERP4= <user>
##$USERP5= <user>
##$WDW= 1
##$XDIM= 8192
##$YMAX_p= 0
##$YMIN_p= 0
$$ End of Bruker specific parameters
$$ ---------------------------------
##NTUPLES= NMR FID
##VAR_NAME=  TIME,          FID/REAL,        FID/IMAG
##SYMBOL=    X,             R,               I
##VAR_TYPE=  INDEPENDENT,   DEPENDENT,       DEPENDENT
##VAR_FORM=  AFFN,          ASDF,            ASDF
##VAR_DIM=   8192,          8192,            8192
##UNITS=     SECONDS,       ARBITRARY UNITS, ARBITRARY UNITS
##FACTOR=    0.0002768,     1,               1
##FIRST=     0,             0,               0
##LAST=      2.2672688,     0,               0
##MIN=       0,             -386057,         0
##MAX=       2.2672688,     289391,          0
$$ Real data points
##PAGE= N=1
##DATA TABLE= (X++(R..R)), XYDATA
$$ [...]
2014d33J264k062J769J62j756J612j081l56J560j034N21pj024J171r25L06J456
2031A143j623J091N5k166K217o73n92K221j821j69Q32j697J416J23n42J171j642
2048f56L48L93j599K069j26j085K031j988n53J837j831J331R45j627J120p51q44
2065i86J559q78Q93M05j386J201j431j06J696j491J043Q29k597J341r5j435K418
2082I80p11m13P22j429O05J12l74J463j126K4R45k018J469M08j577K353j065j408
2100a040K085j649K21J404j532J005n20o93J133j193Q78O23j613J515p62j113
2116a251K359j710P5J779k177O22P00j310J573k47n22R33j478P04J96o89J780
2133A337j221o78J548k180R35J157j927J895k66j875J634q51j70J425j086P50
$$ plain form
2014 -433 831 -1231 538 700 -1056 556 -525 -881 679 -355 166 159 -865 306 -619 -313 1143
2031 1143 -480 611 666 -1500 717 44 -548 1673 -148 -317 515 -1182 234 357 -185 986 -656
2048 -656 -308 85 -1514 555 429 -656 1375 -613 -1166 671 -1160 171 1116 -511 609 -142 -986
2065 -986 573 -305 588 993 -393 808 -623 -729 967 -524 519 1348 -1249 92 -3 -1438 980
2082 980 269 -144 578 -851 -246 -134 -508 955 -171 -147 798 -1220 249 657 -920 1433 368 -1040
2100 -1040 1045 -604 -383 1021 -511 494 -26 -719 414 -779 99 722 -891 624 -138 -1251
2116 -1251 1108 -602 -527 1252 -925 -303 397 -913 660 413 -109 824 -654 50 246 -443 1337
2133 1337 116 -562 986 -1194 -259 898 -1029 866 600 -1275 359 -492 -662 763 -323 427
2149D27l23j024J278j204P51J247j769J323k53j816K264p51n91J993j728j48Q45
2166E21j378J076j47n4Q43j506O88q7j332K039m32r09K004k137k02J862j929J244
2184A64P98j489J117o94m20Q65q82J299l90r77J537j594k1J986k024J039N36k010
2202a160J388j25j029J661q78j57N86j016Q24l96j66J565j664M11Q33k001K000
2219F76q7j567K126j252q55J844j286L01Q65j071P23o73n1P71j281J322J1j576
2237a060J648r63r25K385j540K42J198k152Q47M44q99J528m86k10K69j128J198
2254C96l80k99J638j493j28J330k375J334Q81j641J698o20j395J332q79K33O94
2271C26n52R42j053l97J130j271R21R09j768J684o73j575K032o89r3J196j199
$$ plain form
2149 427 104 -920 358 -846 -95 1152 -617 706 453 -1363 901 150 -441 1552 -176 -324 521
2166 521 -857 219 72 18 861 -645 43 -44 -1376 663 231 -678 1326 -811 -1013 849 -1080 164
2184 164 962 -527 590 -104 -524 341 -541 758 368 -609 928 -666 -687 1299 -725 314 850 -1160
2202 -1160 228 103 -926 735 -143 -300 286 -730 94 -302 -468 1097 -567 -156 677 -1324 676
2219 676 589 -978 1148 -104 -959 885 -401 -100 765 -306 417 -256 -307 464 -817 505 516 -1060
2237 -1060 588 -375 -1300 1085 -455 -213 985 -1167 -320 124 -775 753 267 57 326 -802 396
2254 396 16 -283 1355 -138 -266 1064 -1311 23 904 -737 961 341 -1054 278 -601 -368 326
2271 326 -226 716 -337 -734 396 -875 46 955 -813 871 198 -1377 655 -34 -127 1069 -130
2288a30J19L25r99J242o95J92O49j428J005m66r74K043r30p58J737j608R7J315
2306G36j461J109P3q74Q15p12M24L28j002J432q27q27J891j701L48J494k114J162
2324B94L93j862J662m64n58J160j148L70J46r50J361n28r7J240j968P11P08j734
2342a264K206l06j323J607r57p05J470j074P41J72p78O58j089L19Q86j305J505
2359G63k88j531J892j433l21J948j567M12Q78j708P30K64o14J343r78O42j17j353
2377a038J586o70k97J781j840K75J132j882J094N68j391J493p80o16R02r26M63
2394a46M94q07J138j176P2Q97j445J179N20j698J513l90j057J643p93k58J064
2411G50j104M17P3l46P66r42O22L56j553J367j35j160J947j327l98J428j517L48
$$ plain form
2288 -130 -11 314 -685 557 -138 54 703 -725 280 -186 -1160 883 -47 -805 932 -676 -579 736
2306 736 -725 384 457 -417 398 -314 110 438 -564 868 41 -786 1105 -596 -248 1246 -868 294
2324 294 687 -1175 487 23 -535 625 -523 -153 -7 -957 404 -124 -221 1019 -949 -238 470 -1264
2342 -1264 942 636 -687 920 -37 -742 728 -346 395 567 -211 447 -642 -323 563 -742 763
2359 763 475 -1056 836 -597 -918 1030 -537 -125 753 -955 -225 39 -575 768 -210 432 315 -1038
2377 -1038 548 -122 -419 1362 -478 -203 929 -953 141 709 -682 811 31 -585 317 -609 -146
2394 -146 348 -459 679 -497 -425 472 -973 206 726 -972 541 151 -906 737 -56 -314 750
2411 750 -354 63 136 -210 556 -386 236 592 -961 406 271 -889 1058 -269 -667 761 -756 -408
2429d08R75j165J026k60o87O82o72N82L77r43J334q64o57J558j327M33J143j686
2447e59Q74k9j129J261m51J24O10j107M31k30n10J287p81R0R61j806R24L81j400
2466a059J810k09j006J247r87j29P35o56P27m7n98Q59j412O41M61j013J351l42
2484C73j453J891j253k51J376j206M46N40j074N95k43J26M98p51P61j89j014J562
2502G34q03j38J367j711M87O24j301J166J82j003J041q35j47O77q41J032l46p53
2520e68J212j458M91R16j397J236K04j532J404o56m19J214o27J39L42r56N78l19
2538a96O7R41j303Q55rj355J479k83q61J719j237k03R18j287O13N77p64P39n66
2557a56j66O01j038J133m1o72J259j153k97J328j222N46O68j287Q56k38p32J026
$$ plain form
2429 -408 567 -598 428 168 -519 163 -509 73 450 -493 841 -23 -680 878 -449 -16 1127 -559
2447 -559 315 286 -843 418 -33 91 701 -406 25 -205 -715 572 -209 -119 842 -964 -40 341 -1059
2466 -1059 751 542 -464 783 -204 -333 402 -254 473 426 -172 687 -725 -84 377 -636 715 373
2484 373 -1080 811 -442 -693 683 -523 -77 463 -611 -16 -259 -133 365 -386 375 186 -828 734
2502 734 -69 -207 1160 -551 -64 560 -741 425 607 -396 645 -190 -337 340 -501 531 185 -568
2520 -568 644 -814 -323 593 -804 432 636 -896 508 -148 -567 647 20 159 501 -455 123 -196
2538 -196 -129 812 -491 364 355 -1000 479 196 -665 1054 -183 -386 532 -755 -142 435 -329 410 -156
2557 -156 -322 279 -759 374 333 -339 920 -233 -530 798 -424 122 790 -497 359 121 -611 415
2575D15o76L83M45j046Q69p25j74J037j027M88Q24j686J057O2r48J473n88m56
2593b73R49r97L59J18m06Q25o97O5O31j173P83L13j014J175o43q29J413j047o1
2612e09J313j345N03l3l86O32n84N59K55q99Q45l06o76J430q80o2J052j531N40
2631h2N10j089J056J4o98O31p61L73J41n37J099q95j80R04j273N26R59j497J260
2650D61j38r87R23m23j68P71m53K24j7n77P76o50L04O54j231Q86K0j146J221m20
2670C0m91J327j179n8P10j060P35J47m72N22p17M94K42q33J153m52n67J120j169
2689e18Q9J027r64O68M49j130N93j59l77Q14o20L71r2q07J029p60KJ107j218O32
2709A36K33j212Q85J38p25R44n02k12P32n89K21J27k52P48q31J53N81j171R05
$$ plain form
2575 415 -261 122 567 -479 390 -335 -509 528 -499 -11 813 -873 184 246 -702 771 183 -273
2593 -273 676 -321 38 156 -250 575 -122 -57 574 -599 184 497 -517 658 15 -814 599 -448 -509
2612 -509 804 -541 -38 -71 -457 175 -409 150 405 -494 351 45 -631 799 -81 -143 909 -622 -82
2631 -82 428 -661 395 409 -289 342 -419 -46 95 -442 657 -238 -418 486 -787 -261 698 -799 461
2650 461 323 -664 259 -164 -332 439 -14 210 193 -384 392 -258 46 700 -531 355 375 -771 450 30
2670 30 -461 866 -313 -371 339 -721 14 161 -311 211 -506 -12 230 -603 550 98 -469 651 -518
2689 -518 -429 598 -366 302 751 -379 214 55 -322 492 -128 243 151 -656 373 -387 -385 722 -496 136
2709 136 369 -843 42 180 -545 399 -103 -315 417 -172 49 176 -76 672 -159 -6 575 -596 309
2728C09O5r49J081n88m56R87q36L69L52q36N44k54k39O33o97O68J86j006J163
2747D96o68l76J279r73J28Q26j255P27J81q75J041m67JL42p97O73k26m49J140
2766G48r15p5O72j316P95N62j033Q37m5q78R74p11J92M47m25N95m05l38P71p15
2786b63M84M08j095J070l87q32J174m83m47J119j021K36J76o60P14k82j24M43
2804B30q34O89j31m62J094n66m23J092j204L10O26o79N11J10q06P44m82K72M58
2823E49q34Q42n72m39J007r47J93R77j302O12L16j161J053k83n29R91q11J18K60
2842D0m39O89k54k20O88q34K28N68j073J144J8j047J001o45n02J068o15L87R2
2861B94n57M59n97K8N62n90O89p9q44J242r24k44J339j036K31M69r84Q70o1o89
$$ plain form
2728 309 374 -575 506 -82 -538 449 -387 -18 334 -502 42 -212 -451 182 -515 153 339 -667 496
2747 496 -172 -548 731 -242 -114 712 -543 184 365 -510 531 64 65 407 -390 283 57 -392 748
2766 748 -167 -242 430 -886 -91 471 -562 275 230 -648 326 -385 -193 254 -171 424 19 -319 452 -263
2786 -263 221 629 -466 604 217 -615 559 76 -371 748 -273 -37 139 -521 193 -89 -213 230
2804 230 -604 85 -46 -508 586 20 -403 689 -515 -205 421 -258 253 363 -443 301 -181 91 549
2823 549 -285 557 -15 -454 553 -394 -201 776 -526 86 402 -759 294 11 -518 473 -338 -220 40
2842 40 -399 290 36 -184 504 -330 -102 466 -607 537 555 -492 509 -136 -638 430 -185 202 294
2861 294 -263 196 -401 -373 189 -401 288 209 -635 607 -317 -561 778 -258 -27 442 -542 328 267 -422
2881d22R45n15m2M16p83O70l72j96R93r71J9O73j214R08L94j117P95l12k71O65
2901B63n89L55K59o47P03o06LQ15r16N41K75q66Q32j36q16J268q44p8O87p98L38
2922D3N3l36N14n30J02L16q82Q04k9n61J161q78p0R02j153N14M53q90Q14k62l65
2943b80N52o44N83J80p85Q95o25k12Q02j034K75Q17j052O24P7q79R53k80k78P29
2963D18o70R6J27m94Q32m12R4O50j169N09L27q41J093l59l79O72p78J34N23p29
2983c56N83j87m63P61p41K85M03p19O90j83o29R10o02p7Q52r12L33L23m76M23
3003B18k26j90N25n19L48J2n86Q36l85k51P54p89J40O19j099O79R1o38O65m35
3023b31j0L90l68L72j30l89R89q92K03N44q21N94Q9q22O71k10l70J012o91J12
$$ plain form
2881 -422 523 8 -34 382 -401 269 -103 -299 694 -277 -258 415 -799 109 503 -614 181 -131 -402 263
2901 263 -326 29 288 -359 344 -262 -259 556 -360 181 456 -410 422 286 -530 738 -106 -184 503 -295 43
2922 43 96 -240 274 -256 -154 162 -720 84 55 -506 655 -223 -293 609 -544 -30 423 -467 347 85 -280
2943 -280 272 -372 211 391 -394 501 -124 -336 466 -568 -293 524 -528 96 173 -706 247 -33 -311 418
2963 418 -252 -156 -29 -523 309 -103 -9 641 -528 -19 308 -533 560 201 -178 494 -284 -150 373 -356
2983 -356 227 40 -423 338 -403 -118 285 -434 256 73 -556 354 -248 -325 527 -385 -52 271 -205 218
3003 218 -8 -198 327 -192 156 168 -418 418 33 -218 536 -253 -113 506 -593 86 177 -461 204 -231
3023 -231 -241 149 -219 153 23 -366 623 -269 -66 478 -343 251 340 -482 189 -21 -391 621 -70 42
3043D2L32q72O67m42R5N73q05K36M01q66Q42j34o21J135p34k29P35r08N20L42
3063C09o06Q15n46j84N56p48O39K23q96J044q66j91J089j038L62M41r29Q06j48
3082A32p67R14l95J62K31o34N20l11j82P68o52J06O04j062O12K39p32Q80m90k14
3102b71P33p50L15M2l05N52l78k75O73q59N32L86j022R50k65o11R92p17J80N79
3122D81r17N14P8m53P45o52J90N21r20P47j79o03J130o95k83Q21r62L03M54o19
3142b99O11l55k65O49p21K74L30n08P44n77k25R08j065M65N90r64P55J60j041
3161e34Q37m04m8O79q38M32R5p41Q02k55j69P53j076M61J05q12J070k79l24P72
3181E26r18K48M44q40O57J0l29N99o30K35M79r48Q31j60o73R79n53k18Q13r11
$$ plain form
3043 42 374 -498 169 -273 -178 395 -410 -174 227 -639 203 69 -552 583 -151 -380 355 -553 -33 309
3063 309 -297 518 -28 -212 344 -404 235 458 -438 606 -260 -451 638 -400 -38 403 -526 280 132
3082 132 -635 279 -116 46 277 -357 163 -148 -330 438 -214 -108 496 -566 46 285 -447 433 -57 -271
3102 -271 462 -288 27 69 -236 316 -62 -337 336 -523 9 395 -627 323 58 -553 439 -278 -98 481
3122 481 -436 78 156 -297 448 -204 -14 507 -413 334 155 -448 682 -13 -296 525 -437 -134 320 -299
3142 -299 312 -43 -308 341 -380 -106 224 -284 460 -117 -342 566 -499 -34 556 -408 347 507 -534
3161 -534 303 -101 -149 530 -308 124 219 -522 280 25 -144 609 -467 -6 99 -713 357 78 -246 526
3181 526 -392 -144 300 -540 117 127 -202 397 -233 2 481 -467 364 204 -469 510 -43 -261 552 -359
3201c59M87K18p73N27j49k16N65n71L48M1o17P65l97j71P77p14J41M36q92O54
3221A00K28n76R84o97o2L60o60M67J13n05O11n23j14N77p59O13N8p28P94l88l58
3242d65Q54n98K00L69p40M95j02k46O78n36K87J52p87Q57l35n13J045p17N4M54
3262D06q42L29K98m65M85j40k52M32o29M57j23m78J058n42l02Q08q87M29K50p60
3282d68Q33k06o16P72l98J83K37p49O70j23n12O24n76L69L76q77N70Qn60Q14m90
3303a19j48P19p45J91K54l89N73n19j11N02o45N84J54n60Q31m29o24J009p87J68
3323i1O50p29L74M7n17L82k84J79L39o87M66j86m52P10m61k2Q01o67K02J78p79
3344e47P61r2k31N89p64M09O3o12P32j04l56O01o71p0O45p46O81k29n12P14n60
$$ plain form
3201 -359 128 346 -427 100 -49 -265 300 -271 77 118 -499 266 -131 -302 475 -239 -98 338 -554 100
3221 100 328 -248 736 39 -23 337 -323 144 257 -248 363 -160 -274 303 -456 157 215 -513 281 -107 -465
3242 -465 389 -209 -9 360 -380 115 13 -233 445 -91 196 348 -439 418 83 -430 615 -102 -48 406
3262 406 -436 -107 191 -274 211 71 -181 251 -378 79 -44 -522 536 -6 -308 500 -387 42 292 -468
3282 -468 365 159 -457 315 -83 100 337 -412 258 135 -377 247 -329 40 416 -461 109 117 -443 371 -119
3303 -119 -267 452 -293 -102 152 -237 336 -183 -294 208 -437 147 301 -259 572 143 -481 528 -259 -91
3323 -91 559 -170 204 251 -266 116 -168 11 350 -337 129 -57 -509 201 -260 -282 519 -148 54 232 -547
3344 -547 214 122 -109 480 -284 125 188 -424 308 204 -152 449 -222 -292 353 -393 288 59 -453 261 -299
3365b99l2P13o12L12J86o19O21m10j5O63r29N87K16p93Q62o24mO39n05o5M40o33
3387c01M44O7m71O51o29J49L06o06N15j15m13R08p90M8O43p88N23O6n25O36l41
3408b3l56Q46n19O0K84n81N70j97l78O83o11J37L73p21O04No53R99o03j3L43o38
3430c89L57J39l11M77k71j34N24o93M83n2n82R29l31m34O26o53L15O48r04M48
3450A92l21k83Q06p43K83M21q33P15k01o76Q87n59Q3P35r26N15km09N15q8k12
3471a01M50o00L98R2n22O54k96k08N22p09K75M41r31Q84j12n77N66o03K73K45
3491A41l62L81j2n02O94p24J72N99p05N15r7o10R19m27n4M52o36L83R0o10P01
3512C08j79j88K37l82K50k0m99N33j32k83P24o49J64L22p17N80L15o61N67l98
$$ plain form
3365 -299 -331 382 -230 82 268 -351 270 -140 -155 508 -421 166 382 -411 451 -173 -177 462 -43 -108 332 -301
3387 -301 143 210 -261 390 -239 -90 216 -390 125 10 -403 505 -285 -237 406 -382 141 207 -318 318 -23
3408 -23 -379 467 -52 8 292 -289 281 84 -294 389 -222 -85 288 -433 171 176 -477 522 -81 -94 249 -389
3430 -389 -32 107 -204 273 2 -132 392 -301 182 130 -452 477 146 -288 338 -315 0 648 -256 192
3450 192 -129 -412 394 -349 -66 355 -478 237 36 -640 247 -312 -229 506 -420 95 93 -316 199 111 -101
3471 -101 349 -251 147 239 -283 371 75 -133 389 -320 -45 396 -535 349 237 -340 226 -377 -104 141
3491 141 -221 160 148 -354 340 -384 -212 387 -318 197 100 -510 409 -18 -72 380 -256 127 217 -393 308
3512 308 129 -59 178 -204 46 26 -473 60 -72 -355 369 -280 -116 206 -511 69 384 -277 290 -108
3532a08m2M42n38N49k52n34R58o17J13M46o78L64K16p92P78k50k58N55n42J09
3552h1J00m04O12k92k52O48o23J62L69o31M63K43o41P50l14k16L83m94K25J90
3572A97l89M12m42P1M41n64J95K04m53M90q7m56P82p70K04M81q52O10j55l10O39
3593B48m38J29M62p24O02k08m20P45l86p8L13n55M56K91p68O84m97j24M08l27
3613a87J29J92n21N52k07l41O87o46M64K12o08L87P7n24P27m78k12P95o86K47
3633E9o0k13M71m58J71K64o91L76K26n07P99m43r1L30n62L91J71n48O03j33m39
3654b84M69l23NM49n18M06q7m06P88o92N1N63o55J71K37o04O80k76k17O33o89
3675b99N47j06n17N46l50j55O58m33J67Q1n35O25j70l17O73m34j07N31q02N14
$$ plain form
3532 -108 -150 292 -246 303 51 -483 475 -142 -29 417 -261 103 319 -473 305 55 -203 352 -190 -81
3552 -81 19 -385 227 -65 -317 331 -292 -130 239 -392 71 314 -327 423 109 -107 276 -218 7 197
3572 197 -192 220 -222 -151 290 -274 -79 125 -328 162 75 -381 401 -369 -165 316 -536 74 -81 -391 248
3593 248 -190 -61 401 -323 279 71 -349 396 10 -68 245 -310 146 437 -331 353 -144 -268 140 -187
3613 -187 -58 134 -387 165 -42 -383 304 -342 122 334 -274 113 190 -334 393 -85 -297 498 -188 59
3633 59 -1 -214 257 -201 -30 234 -457 -81 145 -362 437 -6 -97 233 -329 62 233 -315 288 155 -284
3654 -284 185 -138 -133 316 -202 204 117 -289 499 -193 -142 421 -234 -63 174 -430 250 -26 -243 390 -299
3675 -299 248 142 -375 171 -179 -334 324 -109 58 139 -396 229 59 -258 415 -19 -126 405 -397 117
3695A17M8n39P24n61P6L07m09L80j80l43N80l35jL49l42Q1K31o73N60j27l24O92
3717C11n93K72K00m18M77n2k60M51n31L3L43o55N70N3n09M39k40j09L71m59K03
3738a03K30m08L41o5j63L91n06K82K13o51O29k06j89M34k66J07K73m90K84p1l45
3759b79N82k85K12P3m70L74j62l31N53m45r9N43n60J92K66n11N00j39k26M50m88
3780b50J82M20m95L97k88m0N03n58K24J5j89K57j6n19O29k51j55M87o84L54O5
3801H8n29O37l28r0L19m99M50M4l95L93J7j52L46o55M50J54n35N84k15k67L47
3822A64l75J69L46n58M75j16m47N92l08j88M23m30L98j47l07M21k13N7L60m66
3842a50J87J66o27O21j61j85M65m32K03K24n06M34m4m24N38m55J57K35p42O02
$$ plain form
3695 117 165 -374 350 -211 -135 172 -237 143 -37 -380 200 -135 -136 213 -129 -48 183 -490 70 -57 -381 311
3717 311 -282 -10 190 -228 249 197 -63 388 -143 -110 233 -422 148 201 -308 131 -109 -218 153 -306 -103
3738 -103 127 -281 60 -5 -168 223 -283 -1 212 -439 190 -16 -205 229 -37 70 343 -147 137 66 -279
3759 -279 303 18 230 303 -167 207 45 -286 267 -178 -277 266 -294 -102 164 -347 153 14 -212 238 -250
3780 -250 -68 352 -143 254 -34 -74 429 -129 95 110 -79 178 162 -357 272 21 -134 353 -331 23 88
3801 88 -441 196 -132 -222 97 -402 48 92 -303 90 107 -45 301 -354 96 250 -285 299 84 -183 164
3822 164 -211 -42 304 -254 221 105 -342 250 -58 -246 177 -253 145 -2 -309 112 -101 -44 316 -150
3842 -150 37 203 -424 197 36 -149 316 -116 87 311 -195 239 195 -229 309 -146 11 246 -496 106
3862A06pl97M97l68O7M53p07M10R3l73M39l77O2L91m90M01p4l49M73l00q8L78
3884B40l50J99M9m40N11j51j50M02m58P3K78l97J74J7j08N59m81j95N39n17K15
3905IJ33l16L53k05k43O23n43L23M5m54L74p8k75M52k78J27K24o68O33l71j63
3926b98N89m01k9M54p46N17J21n39O27m30j95P60p07M26L4n09O10l56Q4L81n79
3947a86K44L2l64N89j46n07O42n03K77Q3l20L12o5l92N47m45J21L33m79J25J67
3968F5j76L69l29n6M57n44L62M4m61N04k54l0K26l77K91J14n83M63j18l5K55l93
3990b06L05J17n87N96r1m54M24k09O7L78n82L98mk69L67m43J67K82m20J40Q7k68
4012b05N05k67l41N51m75J33L25o70N94n1l58N56m80R2K37m56L99Pl15L95m47
$$ plain form
3862 106 99 -298 199 -169 -102 351 -356 54 147 -226 213 -164 -102 289 -201 200 126 -223 250 -50 -138 240
3884 240 -110 89 138 -302 209 58 -92 310 -148 -75 203 -194 -20 -3 -111 448 -33 -228 311 -206 9
3905 9 142 -174 179 -26 -269 354 -189 134 179 -275 99 21 -254 198 -80 47 271 -397 236 -135 -298
3926 -298 291 -110 -139 315 -431 86 207 -332 295 -135 -330 430 -277 149 183 -326 284 -72 12 393 -186
3947 -186 58 90 -274 315 169 -338 304 -199 78 161 -159 153 88 -304 243 -202 -81 252 -227 -102 65
3968 65 -111 258 -71 -127 330 -214 148 192 -269 235 -19 -49 177 -200 91 205 -378 85 -33 -68 187 -206
3990 -206 99 216 -371 225 134 -320 104 -105 -38 340 -242 156 152 -117 250 -193 -26 256 -164 -24 63 -205
4012 -205 300 33 -308 243 -232 -99 226 -444 150 99 -259 297 -183 -91 146 -310 89 96 -219 176 -271
4033b71K15L21m47L64l7l51M08l24q7M62n22L16J45n17N90k16k52M07l71K38L8
4054A09l40J98Rl64O96m67K4L36m86M21j2k04M44l82p2L94n92L38O7j62L13k79
4076a1p4K59l67J32K84m37L46j81q7L06m72K05L10l18K64j46k65M99k38r8M29
4097C40n11K66k9k12L09k22lL05m09K01K20l97M64k50k39M73m52J61J14k76L05
4118A58j66q7L75m13K02J08k84J42Nm3K36l49J41J40l11K36M6l56L78j89J14J82
4140B65m85L13O6o12Q10m90q9M12n33K51Q6p3J80j6j39K85l70P7K10m07M79j61
4162E9k16N84m07%K03m29K56J57l56L71l04j0L93n59L13j04j80L21l21qL94l63
4184b06K92J83n12L38q4j09L26m65L19J14m46L20J21l02L00l08P9J86l97K50J88
$$ plain form
4033 -271 -56 265 -182 182 145 -206 202 -122 -209 253 -269 47 192 -325 265 49 -203 204 -167 71 109
4054 109 -231 -33 -24 -388 308 -159 -135 201 -285 136 124 -80 364 -18 -90 304 -288 50 117 -45 268 -11
4076 -11 -85 174 -193 -61 223 -214 132 -49 -136 170 -302 -97 213 -105 159 13 -252 247 9 -89 340
4097 340 -171 95 66 -146 163 -59 -62 243 -166 35 255 -142 322 72 -167 306 -146 15 129 -147 158
4118 158 -8 -95 280 -133 69 177 -107 35 40 -3 233 -116 25 165 -146 90 136 -220 158 -31 83 265
4140 265 -220 93 159 -453 357 -133 -222 190 -343 -92 -6 -79 101 85 -54 231 -139 -62 148 -259 220 59
4162 59 -157 427 20 20 223 -206 50 207 -149 222 -82 -92 301 -258 55 -49 -229 92 -229 -237 157 -206
4184 -206 86 269 -243 95 11 -98 228 -237 82 196 -250 70 191 -111 189 -119 -40 146 -251 -1 187
4205A87l53Q0k03J45M43n21J39K09k68L06l19M9M05n25K14K12m16P14n48o8N43
4226D25m59MJ69m60L19J77m50M63k79r2J42l82L59Q8k66N28l76j13L95l98K95
4247H9K5l79K21K3q7L90m02J84K28o18N05j50k57N83n72K37K30m98M19j80k28
4268b37L86l57M4K59m10M11Ol62K81j79q1L50k81L02om15M64k39j63K93j62J22
4290B6K09m53M14q5k13J31k46J88J56l92L40M9j17J88r2k38M05o80N17k0m93O49
4312B43j96k00L41k88L4J75l72M83j39k36N73o48K46J89m44M39j01l18L80l59
4332a98J93J26l23K36J99m65R8P9j85M66l52J70o0k99O53n48J10K60m23L24P9
4353A40k07K52k78O7J11j02N5O8k66L03pk75L57m28Q0L37m73L11J12l91N03l99
$$ plain form
4205 187 -166 -86 -289 -144 299 -222 -83 126 -142 164 -155 -106 299 -226 -12 200 -216 498 -50 -118 425
4226 425 -34 -30 139 -321 -2 175 -275 188 -91 -183 -41 -423 -64 24 -242 286 -90 -203 192 -206 89
4247 89 114 -265 -44 -21 -108 282 -120 64 292 -326 179 29 -228 355 -217 20 250 -248 171 -9 -237
4268 -237 149 -208 -164 95 -315 96 102 -260 21 -158 -239 111 -170 132 126 -289 175 -64 -227 66 -96 26
4290 26 235 -218 196 111 -102 29 -217 -29 127 -265 75 124 7 195 103 -135 270 -410 107 87 -406 243
4312 243 47 -153 188 -100 -66 109 -263 220 81 -155 418 -230 16 205 -239 200 99 -219 161 -198
4332 -198 -5 121 -202 34 233 -232 -134 -55 -240 226 -126 44 -16 -315 338 -210 -100 160 -263 61 140
4353 140 -67 185 -93 -26 85 -17 38 106 -160 143 136 -139 218 -210 -130 207 -266 45 157 -234 269 -130
4375a30RM78m76K60R6m63L83k63J5L22l65J30J32l68L65j98R4nq3m7J27k31K36
4398A8k47k1M94l97M3K86m03L86j3k78L71l95LL38k76J93J40n06M24j51j68M25
4420B66l78mK48l59L59m6k99K79k60Q1K62l73L83j19j61M39m05KL04k74J27Q5
4442A57l93L43m3j23J40j36M8K79m88N34k09l53M49m14K22J59k59J41j03r9L18
4463A70k97K14l4l64M13j61k15L25j10j61M47m41L55K7l96K43J65l25K34j91J54
4484E2O2l08L44k66j01M16l64K21J02l68K39k7j67N05l51j2J60m23M82j49k00
4505a53L55k31m1K20m13K82L7n05O48j48j36J39j96K03q8k59L38j02l51N73k64
4526i2K4K99l90M08j93k43L37l31K04K8k29K01nr5J91k44L9K64l35K73j19j56
$$ plain form
4375 -130 -121 357 -119 141 237 -226 157 -106 -91 231 -134 -4 128 -240 125 -73 21 16 -67 -114 13 -218 18
4398 18 -229 -250 244 -153 -110 176 -227 159 146 -132 239 -156 -153 185 -91 102 242 -264 160 9 -159 266
4420 266 -112 -116 132 -227 132 86 -213 66 -194 -113 149 -224 159 40 -121 318 -87 -85 219 -55 72 157
4442 157 -236 107 64 -59 81 -55 -7 272 -216 318 109 -244 205 -209 13 172 -87 54 -49 -148 170
4463 170 -127 87 53 -311 102 -59 -274 51 -59 -220 227 -214 141 168 -228 15 180 -145 89 -102 52
4484 52 114 -194 150 -116 -217 199 -165 56 158 -210 29 2 -165 340 -11 -23 137 -286 196 47 -153
4505 -153 202 -29 -70 150 -263 19 56 -449 199 51 -85 54 -142 61 -27 -286 52 -50 -401 172 -92
4526 -92 -68 231 -159 249 56 -187 150 -181 23 51 -178 23 18 -77 114 -130 -91 173 -162 111 -8 -164
4548a64K39j40j95M74m21K63J12m53L81m5k84M84m52K48M9n13N63k39o7L29j34
4569C5J7J88m91M39Mk73K61k17l5J72l45L93j43k21L65k52l1K48k49J96lj85K74
4592A47j66l25N59k55m5K30l69L54ol96L42r5n2L37k75MR7l66L51j19j18L97m04
4615a73L21j43j60M81l50r9L23m47J72K82k67L12k35j72K82j64M0L39m87M13l83
4636a15l2K42j11m9J85j66j01R0j19L87j86j17J38k47K03J05k54K29rk71M07l26
4658a17NL75l92L56k10o0L64l36JK44m51K40K1l75M31k09J03K82l36K50j00l37
4680b51M31j75p9K65l87J31J28k90M47k66j50K78k13J26L69l77J40m8j18K89k07
4701D3m2qk58K91L0k93L04j95R8J46j87J16N1l14L12rj28K40k82R1O0l48K47K20
$$ plain form
4548 -164 75 -65 -260 214 -207 56 168 -285 96 51 -233 251 -201 47 96 -417 146 -93 -160 169 35
4569 35 52 240 -251 188 192 -81 180 -37 -72 100 -245 148 5 -216 149 -103 -134 114 -135 61 58 -127 147
4592 147 -19 -344 215 -40 -85 145 -224 130 124 -272 70 -25 -77 260 -15 -11 86 -280 71 -48 -166 231 -173
4615 -173 148 5 -155 326 -24 -123 200 -247 -75 207 -60 252 17 -155 127 -37 3 342 -145 268 -115
4636 -115 -147 95 -16 -65 120 -46 -147 -57 -176 211 25 -92 46 -201 2 107 -147 82 73 -198 209 -117
4658 -117 -112 263 -129 227 17 -43 321 -15 -14 230 -221 19 40 -335 96 -113 -10 272 -64 186 86 -251
4680 -251 180 5 -74 191 -196 -65 63 -227 220 -46 -196 82 -131 -5 364 -13 127 79 -39 250 43
4701 43 1 -7 -265 26 56 -237 67 -128 -30 116 -71 45 96 -218 94 85 -43 197 -85 6 66 -282 -35 185
4725A85l06L72k94Ko7p5K07L3r7L08k65k13M34m20J75N7j01K96m82J01L03l58
4747b05L53ol40K88L7m00M31l97J48K93l79K95k7k62L90l92J61J17l11L85k16
4768c7p7L20k54J2K21l28K59r7k18J65k2QJ71k46J16Q5l14K58N8p5J55k13J83
4791A30Q0l06J44ok92M87k82N8J83m08K49q4j64J68j6j23L93n00L01Q5l65M89
4813B21k05k7L18m32J98kk07J87L9j59K76m10J86N6j26J39l5n0J33m02K62L16
4835B76l78K18j90q8K64j99J88nk26K07M4l73K25J83j66N1k0n2K58l34R8M9RJ30
4859A69k10m5J98l59K92j07p9K48l44J91J44k22N7J61k72L23l11J02K09k90K73
4880A28m2k83L58l7l03K86j61J63J03n16M13n7k00K80l56M3K47m50N19j21k67
$$ plain form
4725 185 -121 251 -43 -41 -108 -183 24 57 -40 268 3 -210 224 -196 -21 36 -65 231 -251 -150 153 -205
4747 -205 148 142 -198 90 127 -273 158 -239 -91 202 -177 118 91 -171 219 -173 -12 105 -206 179 -37
4768 -37 -114 206 -48 -36 185 -143 116 19 -199 -34 -56 -48 123 -123 -7 78 -236 22 80 5 160 -53 130
4791 130 210 -96 48 42 -250 237 -45 13 196 -212 37 -47 -211 -43 -59 -182 211 -289 12 97 -268 221
4813 221 16 -11 307 -125 73 71 -136 51 90 -69 207 -203 -17 39 -87 52 17 -33 100 -302 -40 276
4835 276 -102 116 -74 -162 102 -97 91 86 -140 67 111 -262 -37 146 -20 31 11 -41 217 -117 -19 30 39 169
4859 169 -41 -86 112 -247 45 -62 -141 107 -237 -46 98 -124 -67 94 -178 145 -166 -64 145 -145 128
4880 128 86 -197 161 124 -179 107 -54 109 212 -304 109 52 -148 132 -224 -181 66 -384 135 14 -253
4901b53M47m35K64Q0l58K17J08l07M72j43j06K86l70K83j0j49Q9k70J05P5k10
4922a85J69J92k41P3p0RJ93k57Q7K55m16L00l3j15K58m09J99K65m51J39J01m5
4944A8J03j67JK68k26J83j10l1J30l07ML75m76J01K34j04P7j06j99M39m15K73
4966F5J60m59M28k90p7L57k00P1O4k37J88r1o8L72l17J08k8k91J55p7o3M05k01
4989b6o8K26k57K28k1k69L66k94lJ65j94Q4J65j89J08L43n12L44j89K0J00k33
5011a06J71m6j33J31o2O0J09k0p3M9k97L42k33J12J17k57n1K99k35J92rk72L80
5034A68k00O0J72m06L36j19r0K32k41n6L86l58J21L2k13L37k73O5K28l54K00M7
5056G4o8K51k66qK76l71O0J49m11M19k9j36J87q1p3K68l75J89N6n5L1n4j75J47
$$ plain form
4901 -253 194 -241 23 103 -255 -38 70 -237 235 92 -14 272 -98 185 175 26 115 -155 -50 25 -185
4922 -185 -16 176 -65 8 -62 -53 140 -117 -30 225 -191 109 76 -39 219 -190 9 274 -177 -38 63 18
4944 18 121 -46 -45 223 -3 180 70 39 169 -138 -134 241 -235 -134 100 -4 73 -33 -232 207 -208 65
4966 65 225 -234 194 -96 -173 184 -16 55 119 -118 70 -21 -89 283 -34 74 46 -245 -90 -167 -230 175 -26
4989 -26 -94 132 -125 103 82 -187 179 -115 -118 47 -147 -63 102 -87 21 364 -148 196 7 27 127 -106
5011 -106 65 19 -114 17 -45 15 124 104 31 80 -217 125 -108 4 121 -136 -187 112 -123 69 60 -212 168
5034 168 -32 28 200 -206 130 11 -79 153 -88 -144 242 -116 5 37 -176 161 -112 -47 181 -173 27 74
5056 74 6 257 -9 -17 259 -112 -52 97 -314 105 76 -60 127 46 -27 241 -134 55 111 56 87 33 -142 5
5080El41J83K04k00K47j86n1J61j46M7J31j36K59j26p1K18m31L15R9l81J83r7
5102a14N7K43l54J43J17k00J00m0k0K4m6L9K1m2J01J20m09M48l90J26J43j89J90
5125F8j0k14J91Q1k85K66jl6l9j78J80L6k09J74q5j69L32j38l6J49l55L33l11
5148b56Q5K91k12R1J25l75M20l14N2L63l70J03O6j51K11j65j39L35k77J18J29
5169A30k04J65pj36J02j36O3J45k94M0P3j05J06L0J41O6l83J24K33k96J98n6J48
5192A47k4k02j0J69j96K14r7j87L90l26M6K09j81J82q5j12K09k58O5O9m2J13j76
5215h3p1L51nk91K41l95J36J63j00J87k81OL29k68N2K58l62J58J00l23K80l04
5237b22J26J46j51J53P7l46L01k99K89J8l55K89J37l74L46j76j69K43j36J27%
$$ plain form
5080 5 -336 -153 51 -149 98 -88 -139 22 -124 -77 54 -82 177 51 -20 198 -233 82 181 -200 -17 -114
5102 -114 -57 186 -168 -25 92 -108 -8 -48 -68 -44 -90 -51 -30 -72 29 149 -260 188 -202 -76 67 -122 68
5125 68 58 -156 35 116 -169 97 96 60 21 -157 23 59 -150 24 -61 -230 102 -36 -72 77 -278 55 -256
5148 -256 -171 120 -92 -1 124 -251 169 -145 -93 270 -100 3 69 -82 129 -36 -175 160 -117 1 130
5169 130 -74 91 84 -52 50 -86 -23 122 -172 -132 -59 -164 -58 -28 113 179 -204 -80 153 -143 55 -1 147
5192 147 123 -79 -89 80 -116 98 1 -186 204 -122 -76 133 -48 134 49 -63 146 -112 -47 22 -20 93 -83
5215 -83 -154 197 192 -99 142 -253 -117 46 -54 133 -148 -142 187 -81 -29 229 -133 25 125 -198 82 -222
5237 -222 -96 50 -101 52 129 -217 84 -215 74 92 -263 26 163 -211 135 -41 -210 33 -103 24 24
5258B4k47K56o9k1K13j55o1O6j92K08M0j83M04m07J98Ok20n7K14k88M17k59p2
5281a85L22m06K37K4k61L52M6j23J82j68l2J23k09K27j07j94K41k12J45J35m12
5302b75P7J27oJ72k10J10K34m45K82J41k54L0o3J24o0k38L20K21k77N5M2k84K49
5325G2k97L33N4k53J77p0k01L61k28k00K97j50J03L8j79L14l92K88J01l71J80
5346b3k2q1K29n0n5K51j19K6k9k75K39J10j44O4k92K95k4k12L25m21N7L84l22
5369h9J78J3k11K66j16k11K36k08J61J08k25N3l8J79M6l00K14R2j75J79p1k97
5391b16K03j10l4K85j11k21L08m58L05N0k6J68j40j30K58k75K27r9j18L22k32
5412d4r2L02j74j8N9k50K92k05L4J12n1P4M9l27M29k63K1P2q4R0J11l33L44j56
$$ plain form
5258 24 -223 33 -36 -57 156 1 -60 6 -186 22 62 -121 283 -124 74 80 -140 -197 17 -271 146 -113 -185
5281 -185 137 -269 -32 -8 -269 83 129 6 188 20 -12 111 -98 129 22 -172 69 -143 2 137 -275
5302 -275 -198 -71 -77 95 -115 -5 229 -216 66 207 -47 -17 -80 44 -16 -254 66 287 10 65 107 -177 72
5325 72 -225 108 162 -91 86 16 -185 176 -52 -252 45 -105 -2 36 -143 171 -221 67 168 -203 -23
5346 -23 -45 -126 103 53 -2 249 130 156 127 -148 91 201 57 121 -171 124 100 -112 213 -208 -151 233 -89
5369 -89 89 102 -109 157 41 -170 66 -142 19 127 -98 -45 -83 96 142 -158 56 148 -27 152 81 -216
5391 -216 -13 -123 -157 128 17 -204 104 -354 -49 1 -25 143 3 -127 131 -144 83 -16 -134 188 -44
5412 -44 -136 166 -8 -26 33 -217 75 -130 -96 16 -35 39 88 -239 190 -73 -52 20 -64 26 137 -196 148 -8
5436hj37N3J9k6L4J7P7p1j01L20j87j11J84k54J93r9N2J74j57j38J57k43J77K16
5460A41l65L15r9j82J70M7l9J12k90K87j57q1L58m18J71J61r0K4qk44K95n5n2
5483AK20m61J95Jm4K86l04k1K04j60J39oj04J20l5j31J78q2r1J44k54K92m5j69
5507a27K35k50N1K47r8Q7j53p6J98k2k01L89l38J7L4l7J52l6j49J21j64J99l3
5530D6k06J97M0p7%J6Q3J8j60K81k25J5j11L3L6J76k37O9J96l47K98k63J11O8
5554E7j58J00K17k61L9l5o0K51k64J98lj19oQ8j60J11Np6J62j62K29k9k78L10
5578A56j98J2L24l64O6Q4o9M7J24k79J79k59R3J28k13K80p7n0Q6q6K18q5p7K9
5602F9K37m01K49j95L5J86l31L20j19k08K44k45J30Q3J8j78J83k22J34J01j99
$$ plain form
5436 -8 -145 -92 -73 -99 -65 -48 29 -42 -143 177 -10 -121 63 -191 2 -97 -45 129 -28 -166 -9 -252 -75 141
5460 141 -224 91 -8 -190 -20 27 -12 100 -190 97 -60 -141 217 -201 -30 131 41 65 57 -187 108 53 1
5483 1 221 -240 -45 -44 -88 198 -106 -127 77 -83 56 50 -54 66 31 -100 78 -4 -95 49 -205 87 42 -127
5507 -127 108 -142 -91 156 58 145 -8 -84 114 92 -109 280 -58 -41 -7 -44 108 72 -77 44 -120 79 46
5530 46 -160 37 77 0 0 16 99 117 -43 238 13 28 -83 -50 -14 162 -75 -6 190 -157 141 -122 -11 57
5554 57 -101 -1 216 -45 -6 -41 -101 150 -114 84 81 -38 -44 44 -116 -5 0 -76 86 -76 153 124 -154 156
5578 156 -42 -30 294 -70 -4 80 11 58 182 -97 82 -177 -84 44 -169 111 34 -16 70 -16 202 117 40 69
5602 69 306 -95 154 -41 -6 180 -151 169 50 -158 86 -159 -29 54 72 -106 77 -145 -11 90 -109
5623a09N8k6k0N5NK12j87o9J49K0r8K21j68N5J44n05N51l93J45Jj41R6k9j24K50
5648I3j61M2J03k82P0J42j71K25p5o3J22k77L15kn7N8k1m6O9p7l0J76k54K23o5
5673E7q8J91k57NJ37j82J36j13r5K89m9j30L41m41K80%j30K47k16l6J43k49K23
5696F3K3j98J48J4k83L48j13j14K03j3l7j4r1J77p7l09M98l19J16q7q6K00k9l4
5720a4K50k08r5J60k50K46n0j36J74O2j96L00l73J90r7j04L67l41K4J89k85K35
5742D8l7j38K98k69M8J00k00J23o4M8J40j73K4J47j59O3M0k10K80k58K37QJ8j32
5766a8n5JJ12Mk60L09r5J46j75k63K40k4lK85m03J26K74j73N6K2k56L42q6k17
5790a11M02l81Q5J06j67J49j64k1K69k81p8K29p6J09j0k74K86r6r8J79n7J06j05
$$ plain form
5623 -109 -51 -77 -97 -42 -37 175 -12 -81 68 88 -10 211 43 98 242 -263 288 -105 40 41 -100 -4 -33 -157 93
5648 93 -68 -26 77 -205 -135 7 -164 61 -14 -77 45 -232 83 81 24 82 61 15 84 7 -23 153 -101 122 57
5673 57 -31 160 -97 -92 45 -137 -1 -114 -209 80 31 -99 242 -199 81 81 -49 198 -18 -54 89 -160 63
5696 63 86 -112 36 50 -233 115 2 -112 91 78 41 27 -64 113 36 -273 225 -94 22 -65 -151 49 20 -14
5720 -14 236 28 -67 93 -157 89 39 -97 77 139 -57 243 -130 60 -37 -141 226 -115 -91 98 -187 48
5742 48 11 -127 171 -98 -50 50 -150 -27 -91 -43 97 -76 -52 95 -64 -1 39 -171 109 -149 88 96 114 -18
5766 -18 -73 -72 40 44 -216 93 -2 144 -31 -294 -54 -78 -81 204 -199 -73 201 28 84 106 -150 192 106 -111
5790 -111 291 -90 -5 101 -66 83 -81 -102 167 -114 -192 37 -39 70 60 -214 72 -24 -122 57 0 106 1
5813An0K08q9k8K06j74j51K49l47J53R6l2O6l31K61l9j87L45p6l32K52n8J23q0
5837a4k1L3J2k6K05k75m0K24k34K19L8q7%j7P4j5N8j41R9j93K70j75q6K37k43
5862i8LO2n6L9J9l6J50j45n2J33j95J24J02n6J33l0o5Q0j89J40J18k93K93l18
5886a37Q2N0k2J68j11j39J55k6k54L09k48K18oj64K34p9j35J70r8o3J14j21N2
5909e1J55j84K22k46J06J14l42L10J45l11K18k94J00K05j50j42K35j82O0K5p7
5930h4L4Pm0N4j27K24m4o9L04k04n2O7j32J14J28k91J60rj33J61k26L63j77j34
5954a06K22j56j17J55q8J51Q3k66J93j58k3k2J04M4k7oJ38k7k26J49j99J25J20
5977F3k00L78k35j96L72l17K7J20J9p5k1q0K37k07N9J48o6j1lj37K36p3j16L09
$$ plain form
5813 1 -49 159 70 42 248 74 -77 172 -175 -22 74 42 108 -223 38 -1 -188 157 81 -251 1 -57 66 -14
5837 -14 -35 -2 10 -16 189 -86 -126 98 -136 83 121 34 34 17 91 76 134 -7 92 -101 169 -6 -92 145 -98
5862 -98 -95 -33 -89 -50 -31 -67 83 -62 -114 19 -176 -52 50 -6 127 97 32 112 -77 63 181 -112 181 -137
5886 -137 -55 -5 -27 141 30 -109 46 20 -234 75 -173 45 39 -125 109 30 -105 65 -33 -96 18 -103 -51
5909 -51 104 -80 142 -104 2 116 -226 84 229 -82 136 -158 -58 147 -3 -145 90 -92 -32 -7 -84
5930 -84 -50 -43 -83 -29 -156 68 24 -45 259 55 3 70 -62 52 180 -111 49 40 -93 68 -158 205 28 -106
5954 -106 116 -40 -157 -2 -90 61 144 -122 71 -87 -110 -132 -28 16 -11 -17 121 94 -132 17 -182 -57 63
5977 63 -137 241 6 -190 182 -135 -108 12 31 -44 -65 -145 92 -115 -56 92 26 15 12 -125 111 38 -78 231
6001B31l55M9M8M1J94k37Q9J77k28m2n5K9Q2m4j19J77J2j81K16k13J08N4j81J76
6025B8R7o7l9k43M08N0m28J09Q0J2K38k65j02N15m24J02k51J38M3J6k3J84k67
6048h9R1N3q5J27l3j43J40Jk2L7j64J51K2j18J34j50M4J42j95J27m5o7J81j48
6072iK7p8R9J3P0j84J31o2o9K05l93K43n8k7N0J30p9J53k78K31p0j43K48j93K0
6097b3r0O7J49q1J5m7K2J1k8j79K02J03j44K7J21j38Oo1J55o0k07J36L3n7N0J00
6123H2j48J41j36P7J83k58K65k22j29J58m3L9J73j95J47j11j36J74p6m3R5j29
6145i2P4M1l2q8R5j6O9k2mp0O4P2j47rJ48j67J46n7l4Q9l1m2J33q1M2m1k20K46
6173F6j72J03M6j06j8P4%L4j21l5J35J00k81K45k19J42J57k04j8q3K11N5n6j05
$$ plain form
6001 231 -124 -75 -27 14 208 -29 60 237 9 -33 -88 -59 23 -21 -140 37 49 -132 84 -129 -21 33 -148 28
6025 28 125 58 19 -224 184 234 -194 -85 -5 7 245 -20 -122 393 -31 71 -180 -42 1 17 -6 178 -89
6048 -89 2 55 -30 97 64 -79 61 62 40 77 -87 64 86 -32 102 -48 -4 138 -57 70 25 -42 139 -9
6072 -9 18 -60 39 52 122 -62 69 7 -62 143 -250 -7 -65 -92 -42 88 9 162 -116 115 45 -98 150 -43 -23
6097 -23 -113 -46 103 22 37 -10 12 23 -5 -184 18 121 -23 4 125 -13 -7 -68 87 27 -180 -44 -11 -68 -18 82
6123 82 -66 75 -61 16 199 -59 206 -16 -145 13 -30 9 182 -13 134 23 -113 61 -15 -58 37 -92
6145 -92 -18 23 -9 -97 -2 -18 51 29 25 -45 19 91 -56 -65 83 -84 62 5 -29 60 29 -13 120 39 81 40 -180 66
6173 66 -106 -3 43 -63 -81 -7 -7 27 -94 -129 6 106 -175 70 -149 -7 150 -54 -72 -155 56 111 55 -50
6197e0K10j99L7O3j90L2P1m2J32j44J05m8j64J33o2J81k5k45L00p0j87K28l17
6220b51K38J52p3j39K13j16J75l22M0K80j29j85K62m09K85rm5Q1j95J58oo4J88
6243A29p2j34K47k73J11L8j85J85qj07J84q5j9J6j10J89P7j18o4K4r0J44k00J93
6267G2p4k47L17j89n7K15l2L2J4r9m9R3q9J31j34J48K3n9pL9j94K33M9j46o0l0
6293a00K45j85O2o8nk0J64j50J04M8l19J86J14k30K53k17QJ73l7J01k03M6J56
6316A26k48J67j74Q3N8N4j70J85k80K15Q5k49J38J87j09j64j20J93K04j82n4J61
6338A06k15J59o7k66N14l17O6J38j09M4j37q3J72kj1J64k29L7N4j23J52l5k4j15
6362a27Q0m0K04j17n9m6O0R3j48K0N9l1J70q0k88K31j4J9K5r5P6k0r8L18k80L3
$$ plain form
6197 -50 160 -39 -2 61 -129 -97 -26 -68 64 -80 25 -23 -187 -54 -116 65 40 -205 95 25 -162 66 -251
6220 -251 -13 139 66 -73 140 24 199 -123 -83 197 68 -117 145 -264 21 12 -33 48 -147 11 5 -59 129
6243 129 57 -77 170 -103 8 46 -139 46 38 -69 115 30 11 27 -83 106 183 65 1 25 -65 79 -121 72
6267 72 -2 -249 68 -121 -178 37 5 37 51 -48 -97 -4 -93 38 -96 52 75 16 9 48 -146 87 136 -10 -70 -100
6293 -100 145 -40 22 -46 -51 -71 93 -57 47 95 -224 -38 76 -154 99 -118 -110 63 26 127 -76 -30 126
6316 126 -122 45 -129 -46 12 66 -104 81 -199 16 101 -148 -10 177 68 -96 -216 -23 181 -1 -55 106
6338 106 -109 50 -17 -283 231 -86 -20 118 9 53 -84 -167 5 3 -8 156 -73 -36 18 -105 47 12 -12 -127
6362 -127 -47 -87 117 0 -59 -105 -45 48 -100 -80 -21 -52 118 38 -250 -19 -33 -14 11 -84 -8 -28 -126 192 -88 -55
6388e5m3l8L59k77J19qr2Q2O9k49J95L5r9N8j85J67j03K7K5R4k64Q8K90r3n0L9
6414I1p8P7j60R8M5j09O4o2l4k4J64q0K16l51K10j1n3L8j67J40M4K4j90K72k83
6439a19J56j82K24J45k40J33j89J43R4j81M0J77l70K20Kk30K90q5Q3J73l97J13
6461@M6j18O0j29Q8QR4k6%j14P8M2J8On4K0K0j83L00j00k01K49Jk21J99j08R3
6488F8l1N6m4j05m0J75j24j5Q3j73M9J4J40O1k07Q9j71J66J49r2N6j19n4pR4j24
6514a06M2J6l4J29k19J56J4p9N4kq3J09K1J5P7k14P5l6q5L89k41j08J65k15L32
6539A72k43o6J97j63jR4nr3J27o7J4R1k68J92o1j19L24k55R2k0nJ60j84J21L7
6564G1q0j7J8q7J02j55J9J61l6J11j24j51K20o4j22K14k33K02j03l9K7J10m4P8
$$ plain form
6388 -55 -98 -136 223 -54 65 57 -35 47 116 -133 62 97 -2 56 -129 38 -65 -38 -13 81 -183 -95 195 102 52 91
6414 91 13 90 -70 28 73 -36 28 -34 -68 -92 72 -8 208 -143 67 56 3 41 -126 14 58 82 -108 164 -119
6439 -119 37 -145 79 224 -16 117 -72 71 165 -16 24 201 -169 51 53 -177 113 28 111 284 -113 0
6461 0 46 -72 -12 -141 -53 -45 49 23 23 -91 -13 29 47 53 -1 19 39 -144 156 56 -145 104 105 -116 83 -25 68
6488 68 37 93 49 -56 -96 79 -45 -60 23 -150 -101 -87 53 114 -93 -4 -175 -9 140 48 104 -15 -69 -76 18 -106
6514 -106 -64 -48 -82 47 -172 -16 -2 -81 -27 -29 -112 -3 18 33 110 -104 -29 -65 -150 239 -2 -110 55 -160 172
6539 172 -71 -137 60 -103 -104 -10 -15 -108 19 -48 -34 57 -211 -19 -80 -199 125 -130 -38 -58 -63 97 -87 34 71
6564 71 -9 -26 -8 -95 7 -148 -129 32 -4 107 -17 -168 52 -12 -134 80 -153 49 -54 -93 -66 44 0 78
6588G8j25N1j0j68J38J15j52K71r1l8j32N0r8J88m5K07j95p2J83m33J65K04r3
6611bK7J1QK1k02O4K23j34l7M3j23K03q7l1J28k73J65M9r6P7k1R1o2j29m6K37
6637A04q0j4Q6l13L41j47l4M7j31J38j22J91Q0k55L8J72j99K39j26j78L85k08
6659A4M4J37k70RO6j59J47K3j65J77j16K64r1j97J18j25J55P2p5M4m4k44L67p2
6683G9j16Q8r2j55J87m4J38O4o1j15j00J33K49k51n4M3j10N5r6m3K57j22J16L9
6707H9l85L89L6j83R0k24J73L6n8M6l1K4K8m1p3O6j34L22j04k31K90nj50K27j17
6732H0R8o7j30K5p1L6l0jO6J3j92K12j01q9L14k11O6n6q8o7J22J34K7j99O5J33
6758H9j90L33j69k18M01l01J85N8l07M7Qo0K12J6r4o7N3p8K31k21J49L6k85K08
$$ plain form
6588 78 -47 4 -6 -174 -36 79 -73 198 107 69 -63 -13 -111 77 32 239 44 -28 155 -278 -113 91 -2
6611 -2 25 36 44 65 -137 -73 150 16 -21 22 -101 102 15 -16 112 -161 4 53 -43 34 13 104 42 -87 -133 104
6637 104 24 10 96 -217 124 -23 -57 -10 -141 -3 -125 66 146 -109 -71 101 -98 141 15 -163 222 14
6659 14 58 195 -75 -66 0 -159 -12 11 -154 23 -93 171 80 -117 1 -124 31 103 28 72 28 -216 151 79
6683 79 -37 51 -41 -196 -9 -53 85 149 88 -27 -127 6 255 4 -50 -7 -117 -62 -158 -201 56 -66 50 89
6707 89 -296 93 129 -54 36 -188 -15 21 -37 9 -22 2 30 -11 -84 -18 -152 170 66 -165 125 120 -30 197 80
6732 80 178 111 -19 6 -65 -29 -59 -60 6 19 -173 39 -62 -151 163 -48 18 -38 -126 -193 -71 63 90 -109 -44 89
6758 89 -101 232 63 -155 246 -55 130 188 -119 -72 -64 -124 88 104 10 -57 -4 -82 149 -72 77 113 -172 36
6782C6o4%N0L8J26k22j39K50j81K48J66k07L9j10j02J40L7m00K85j58P8J77l10
6805b23J52Q0n3J24r0j13K04j98J73J1qrj00n3J18j81J77K36l13L11k52RK0o4
6829d2K36l33q8J66p7L11j65oq3Q1j00K14j31M6M4k13K96j54k00K34M4j93L01
6852A88k05J16j4k92L45k2k35J30r1o2K10j3q4N6j34J41p0M7J33k23o9J04o1M7
6876e8N0j17K80k94J85P3j83L6N9m3J70n8rp8j02K54j12q8m5P8j26K84l23J87
6900B0J09k81J09J37k41L31l61K9K22k19K62m2j54K23r0j53J62k34R3J34j42J04
6922A8O4q1n0j15J06M1Q9P6j75k8K54j00n2J28k22R2lk38J70L2k5J7Rr2L1q4K78
6949A40j33J07o2k2k5L3o0J49j13p5J24n5m0J59j99J57k48N4K17k31J61l4l3%
$$ plain form
6782 36 -28 -28 22 60 186 -36 -175 75 -106 142 308 101 140 30 -72 68 105 -295 -10 -168 -90 87 -223
6805 -223 -71 9 -44 80 -10 -123 81 -117 56 67 59 50 -50 -103 15 -166 11 247 -66 245 -7 2 22 -42
6829 -42 194 -139 -227 -61 -138 173 8 2 -81 0 -100 114 -17 29 73 -140 156 2 -198 36 80 -113 188
6852 188 -17 99 85 -207 138 116 -119 11 -80 -142 68 55 -29 27 -107 34 -36 11 144 -79 -148 -44 -105 -58
6876 -58 -8 -125 155 -139 46 119 -64 -28 31 -12 158 100 91 13 -89 165 53 -35 -80 -2 -128 156 -167 20
6900 20 129 -152 -43 94 -147 184 -177 -148 74 -145 117 75 -79 144 54 -99 63 -171 -78 56 -86 18
6922 18 82 1 -49 -164 -58 -17 72 148 -27 -55 199 99 47 175 -47 45 42 -196 -26 6 -19 -2 7 -85 -54 -138 140
6949 140 7 114 52 30 5 38 -22 127 14 -61 63 8 -32 127 -72 85 -163 -109 108 -123 38 4 -29 -29
6973b9m2K2J02j12J54N6j91oj0k29L62q1q7J58j86P8J58o2M1j6j51K11k18P3R2
6998H7k53L80j14k74P2P4k5R0j34J07q5J46q1r1p0KL17j99J18j44nJ49J3k5j53
7023i8R4k0J5l4M2m6kNJ57Ql15P1J63j67K62l06P5K58k73Q7j09J96o4p3j3J76
7049H9l42K85L2k54J72K7r6J0L4K22j05j28K39j23j03m6N7j7O3RJ65p7j27O2j35
7074h7Q6O1r0J38j03p2J6P2o3J29p8o5j23J1K22k0k15K19L0Np3p1O8j43m0K01
7100A5j28J41j4O2K6r2J37k06j1O2l3K9J05o9j85J88j79K39m7k28K13l7L7k3J96
7125A98l94M46k11n7p1R0J50k44m9J36j1j50K04j22K60l39J69m9M0Qm5J1J38j21
7149a3Mm3m3J34L6m0K5rj77K49O6j7j59l8J83j76L3m8N0k9L7M2q7J44l27K15J14
$$ plain form
6973 -29 -71 -49 53 -59 95 151 -40 -46 -56 -285 77 -4 -91 67 -119 -41 117 55 96 80 -71 140 -78 -5 87
6998 87 -166 214 100 -174 -102 -28 -53 37 -97 10 -75 71 -10 -101 -171 -169 148 -51 67 -77 -82 67 80 55 -98
7023 -98 -4 -24 -9 -43 -1 -47 -49 -44 113 121 -194 -123 40 -127 135 -171 -96 162 -111 -24 -133 63 -1 -74 -87 89
7049 89 -253 32 64 -190 -18 9 -87 -77 -43 179 74 -54 185 62 -41 -87 -30 -47 16 25 190 113 -14 48 -87
7074 -87 -1 60 -30 108 5 -67 -51 21 -42 87 9 -56 -179 -168 54 34 -181 38 68 73 0 -71 -3 -146 -186 15
7100 15 -113 28 14 76 102 10 147 -59 -70 -8 -41 -12 93 24 -161 27 -152 87 40 -188 25 -12 25 2 198
7125 198 -196 250 39 -18 -89 1 151 -93 -142 -6 -17 -167 37 -85 175 -164 5 -44 -4 4 -41 -30 108 -13
7149 -13 -9 -52 -95 39 75 35 60 51 -126 123 189 172 13 -25 158 -18 15 -33 17 -12 25 67 -20 124 -203 12 126
7176A26j82N4N5r1Q6rP5m9K6j67p2J55M5k4R0j0r3j8j21k4K07j93RJ94j06R2k54
7203a99K48J7l7l0J6q8K03k58J1K67o0k31J51j08J42j26rJ72o7k03K34j94LJ65
7227A9j21J92k86K33Rr8J49k24P7J01p9M3R0k80J45N7n6K4N2n7O1k21J16J16n7
7252EL3J58l03P1J6J12q4Pj25J02q9J58j39J3R3j2p6K34k62J07P1j85R5Nn9J26
7278G2j28J34o4q7M4J06j57J49N6j18J48l07J95j0j0qj51J85Q8j0j46r2R4J32
7302A15k16P0J18k43Q8m7P8Q3r1j47K14J2k03K15j59M2qP4J02k44J76J06j45k6
7326c6J25k55J61q8J18J09l43K14l6j06K16j97J35j03j06K35j23J23Q7k92K80
7347A18j05n0K6M0kK8j35O9J64k56K07p8j88M17l33L7J10k87K70K7k58J58o1L0
$$ plain form
7176 126 -56 -2 53 -38 48 39 114 65 91 -76 -148 7 52 28 118 108 15 -3 -124 -148 59 -134 -125 69 -37 55 -199
7203 -199 49 66 29 -1 15 -73 130 -128 -117 150 90 -141 10 -98 44 -82 -91 81 14 -189 45 -149 -146 19
7227 19 -102 90 -196 37 46 -52 97 -127 -50 51 -28 15 105 -175 -30 27 -29 -5 47 -10 51 -170 -54 62 5
7252 5 38 196 -107 -36 -20 92 8 15 -110 -8 -97 61 -78 -65 28 16 -60 174 -88 19 90 -95 0 5 -54 72
7278 72 -56 78 14 -73 -29 77 -80 69 125 7 155 -152 43 33 23 15 -136 49 137 127 -19 -111 -17 115
7302 115 -101 -31 87 -156 -68 -115 -37 46 -45 -192 22 34 -169 46 -113 -71 -79 -5 97 -147 29 135 -10 -36
7326 -36 89 -166 -5 -93 25 134 -209 5 -31 -137 79 -118 17 -86 -192 43 -80 43 130 -162 118
7347 118 13 -37 -11 29 27 55 -80 -11 153 -103 104 26 -162 255 -78 -41 69 -218 52 79 -179 -21 -82 -52
7371e2J52j01J6J1n2J49j32Q2O9r2k51L38k13M3J9j55L18k02L2K55l49N0N0J0
7395eQ8m3j44J06j29J70jk52K18Q2k92K65q4L4J78k35Q3o8j1R3M6j73J61q4p7
7420g4K59l80K89k10K7O3r1K74k64J6J13j22j28L39j78J28j37M8j7MR5O9l12K40
7444E1q7k21M04k5j64R8j7j44J57j00o9K38k94L39j81j84L41l43K76j53m3J76
7466E5j24L8j5J3J4kj15J45Lj31K21j03%k3p7J61O3k10Q0rp9K9J0J39l6r1J63
7493A19n3k10K37k26k2K92j50P3n0k7K1kO2%j88J39l4j43K71j34N7o8rj8J96k89
7519a56K50j42N2J19k31K01j34rN1j1j0J34k47J66k40L2P1J77kK8j40K03j03j13
7543e4j32J19J8J5J75j50p6J96j94j55J20K12j51j52L94k50N7K0pM4j27NJ00r2
$$ plain form
7371 -52 100 -1 15 26 -26 123 -9 73 142 50 -201 137 -76 -33 -14 -169 149 -53 -21 234 -115 -65 -15 -5
7395 -5 83 40 -104 2 -127 43 42 -210 8 90 -202 63 -21 13 191 -44 39 -29 -40 53 99 -74 87 3 -74
7420 -74 185 -195 94 -116 -89 -26 -117 157 -107 -91 22 -100 -228 111 -67 61 -76 -28 -45 -41 54 123 -189 51
7444 51 -36 -257 147 122 -42 56 39 -105 52 -48 -117 121 -173 166 -15 -199 142 -201 75 -78 -121 55
7466 55 -69 -31 -46 -33 -19 -21 -136 9 12 -119 102 -1 -1 -24 -101 60 123 -87 -7 -16 -95 -66 -56 83 47 -44 119
7493 119 66 -144 93 -133 -155 137 -13 60 10 -17 4 2 64 64 -124 15 -19 -162 109 -25 32 -36 -45 -63 133 -156
7519 -156 94 -48 4 123 -108 93 -41 -50 1 -10 -20 114 -133 33 -207 -175 -104 73 71 99 -41 162 59 -54
7543 -54 -186 -67 -49 -34 141 -9 -85 111 -83 -238 -118 94 -57 -209 185 -65 -8 12 5 49 -78 -73 27 -65
7567f5o6K45k36J8K17j26K21k61J18j7J4l6M7j81J23o1J09N8k35J66j31o7K02
7590E6l7M2j38m5J50K3k05K22n4r5J21j26M2j40L7J27mj9J10m7Q5J37j88O1j32
7615a7r0J57j63J04J25l9r6k12J94J09j77M1R2n1j08J02J04K5j39rJ20j71Q8L1
7639B0q4J14L0j60J60j3j38J33k14R6m9l8J80r6P6m8M3L2q1ql7K3k1m1J10KK7
7666A8j76J0J23m5K14k80J23J38k81J07p2p4L82l87J74N8o8Lk4p8J49Qj60K29
7690I1NR2k82L3K60m5l78K90J5j22P0j30J12m4q8K87j26o3oJ14r5K3j05J73m8
7715C3m2J16j97J30k5j50J24R5j74Q3r4K17l3j72J5J74j07O1k10J84O6k09J82
7738F7O6j53jj45K17Nk22J27J17j94K29q0p3J04j63J00m6m9K62k21q6J88j10K06
$$ plain form
7567 -65 -131 114 -122 -104 113 -13 208 -53 65 48 62 26 73 -108 15 -46 63 121 -114 52 -79 -146 56
7590 56 19 61 -77 -122 28 51 -154 68 14 -81 40 -86 -44 -184 -147 -20 -24 -43 67 20 105 242 54 115 -17
7615 -17 -107 50 -113 -9 116 77 -19 -231 -37 72 -105 -64 28 -23 -131 -29 75 100 -39 -48 72 -99 -11 20
7639 20 -64 50 80 -80 80 67 -71 62 -152 -56 -105 -143 37 -59 17 -31 12 44 -37 -45 -82 -59 -80 -121 -11 -9 18
7666 18 -158 -148 -25 -70 144 -136 -13 125 -156 -49 -121 -195 187 -200 -26 32 -36 -33 -57 -135 14 22 -138 91
7690 91 96 188 -94 -61 199 154 -224 66 81 -41 29 -101 11 -33 -121 166 40 -23 -29 85 -10 13 -92 81 33
7715 33 -9 107 -90 40 15 -135 -11 84 -90 -7 -101 116 83 -89 -74 100 -7 54 -156 28 94 -115 67
7738 67 133 -20 -21 -166 51 56 -166 -39 78 -116 113 33 -40 64 -99 1 -45 -94 168 -53 -139 49 -61 145
7762A45k08p5M7P7j33R1N9J7j3j00M7k56L56j49J92k4Q5l16K61j94j1J80m2j01
7786f5Q0j4PJ51l06K60j26M7M7j41L1L7j91L53K7l14p7L0J40J32k43O7J95j93
7810f6K62j48K6l8j26J31Mj72J03j28L3J50J8o9L8j62K68%j12J28m30K49J35j55
7834f1K14K5k94J64j53N9J50k57K10m6j22K62j78j44K85n7L4o9k7k8j1j25K53
7857H4k13R9J38j68J87j37q5J61k45K10r9N3N0o5j23K73p7j69J06M0l8J04Mk7
7881F3j63PO1r7K06K8k72K94j81l5K10j67Q3J62k80J11n2r5L25l22lK14k2j31
7905e6oM2K21k24j66L21j45P5j21L1M6j51M8J50o5M0Q2k48J16J61j02R2j48m7
7929e4P8q0J02q1n0J11r2J58R5j31k4j3o3Nm3PJ08k08Q7J24r1K91l36P5j1P2p6
$$ plain form
7762 145 -63 -138 -91 -14 -147 -56 3 20 7 -93 -46 -302 54 -95 97 73 158 -158 103 -91 -102 78 36 -65
7786 -65 15 1 8 159 -147 113 -13 34 81 -60 -29 8 -183 170 197 -117 -194 -164 -24 108 -135 -68 127 -66
7810 -66 196 48 74 36 -90 41 45 -127 -24 -152 -119 31 49 -20 18 -144 124 124 12 140 -290 -41 94 -61
7834 -61 153 178 -116 48 -105 -46 104 -153 57 11 -111 151 -27 -171 114 57 91 22 -5 -33 -44 -169 84
7857 84 -129 -30 108 -60 127 -10 -95 66 -179 31 -68 -15 35 -30 -153 120 43 -126 -20 20 -18 86 90 63
7881 63 -100 -93 -32 -129 77 105 -167 127 -54 -89 121 -46 37 199 -81 30 -22 -117 208 -114 -117 97 75 -56
7905 -56 -62 -20 201 -23 -189 132 -13 62 -59 -28 18 -133 -85 65 0 40 122 -126 -10 151 49 141 -7 -54
7929 -54 24 -56 46 -35 -85 26 -66 92 187 56 32 19 -44 -39 -82 -75 33 -175 -88 36 -55 236 -100 -25 -36 36 -40
7956d0j17J98r7k1k5J4J23L8m9p7nJ42j81J52n3J1Ok11J83m7kk9m4P0l6K8J22
7983E3N4j66O0l6J0J71j45%Pp4K25k37l2O7j16K14P1k58K13L4j40K50l13J42j29
8008g5j02L10k07j25L04k26J76J0K2n5K0m8K32l17M9o3j14L37j16m1K9m3L0K19
8032B06k59M2J26l04J90q4r2K46jj8o8r5J88K7k28J63j20K4k4K2J09J20k15J73
8056A28j72r6P7J38j57R4n6M2pr0J65m2Q6j11j28K11j09r9J19k1P6j93J97q8J20
8081H4j53R0p0O3l2J37p4p4l2j6J39n7O0j55P1J52j14j30J17j09J13p7M7L1j03
8106i2K05j22O1M7o5j4N5j0q1o3JK51k23MQ4J51qp4k17J28j4p5J41j25J04p1k4
8133d6J40j54j13J66p1J16k6j23J62l5j31J22P8j51P8j77J98j54J30J05r2l8q8
$$ plain form
7956 -40 -157 41 -56 -77 -102 -88 35 73 24 -53 -58 84 -97 55 2 13 19 -192 -9 -56 -58 -87 -131 -61 -97 -69 53
7983 53 107 -59 1 -35 -25 146 1 1 8 -66 159 -78 -110 -43 -159 55 126 -132 81 115 -25 225 -88 54 -75
8008 -75 -177 133 -74 -199 105 -121 55 65 87 32 52 4 236 -81 -32 -95 -209 128 12 -29 0 -43 -13 206
8032 206 -53 -11 115 -189 1 -83 -175 71 70 52 -16 -111 77 104 -124 39 -81 -57 -81 -59 50 170 -45 128
8056 128 -44 -140 -63 75 -82 12 -44 -2 -9 -99 66 24 110 -1 -129 82 -27 -126 -7 -28 48 -145 52 -36 84
8081 84 -69 21 -49 14 -18 119 45 -29 -61 -77 62 5 65 -90 -19 133 19 -111 6 -103 10 -67 -20 11 -92
8106 -92 113 -9 52 99 34 20 75 65 -16 -79 -78 173 -50 -46 38 189 181 107 -110 18 4 -71 70 -55 49 -22 -46
8133 -46 94 -60 -173 -7 -78 38 12 -111 51 16 -115 7 85 -66 12 -165 33 -121 9 114 22 -16 -104
8156a04l9J76P1q7Q9Q0j92M2J0J52l9k79K99j90l3J47r1J79k22N1K9Jl44J60R8
8181c6L2M2j56J19n0l7J14o2j12J66
$$ plain form
8156 -104 -143 33 104 17 106 186 -6 36 46 198 159 -120 179 -11 -44 103 12 191 -31 20 49 50 -294 -134 -36
8181 -36 -4 38 -118 1 -49 -86 28 -34 -146 20
8191B0
$$ Imaginary data points
##PAGE= N=2
##DATA TABLE= (X++(I..I)), XYDATA
0@%%%%%%%%%%%qJ6j6J6j6J8k6L2l2M0n0N8p1Q1r1J07j25J44j65J88k14K42k71
34a43L04l43L86m32M80n33N94o60P29q03Q87r80J081j190J309j441J587j751J933
53A014k133K358k616K913l255L657m138M724n456O394p645R397j2016J6325k4514
68a4991M4963j77687k38342O31093j34018l87789M34535P9511n10349J95734L59674
79B82334l87641j42019M56192q3483k97651K47318K6964l07995J50623K35677
89A80319j67580j15809J64334N555j99701R3139J76391j99821k6852K53651j44092
100A9534j92503K33471L3865k42201J45451J93531k77831l6374L02953k10292
110c0396j69887L82322q1546l27144K97529Q7364l45091J67763K26760l26245
$$ plain form
0 0 0 0 0 0 0 0 0 0 0 0 0 -8 8 -8 8 -8 10 -16 16 -16 24 -26 32 -39 42 -49 58 -67 77 -88 100 -114 128 -143
34 -143 161 -182 204 -228 252 -281 313 -347 382 -421 466 -514 567 -623 686 -755 832 -919 1014
53 1014 -1119 1239 -1377 1536 -1719 1938 -2200 2524 -2932 3462 -4183 5214 -6802 9523 -14991
68 -14991 29972 -147715 -386057 245036 111018 -276771 157764 237275 -273074 -77340 282334
79 282334 -105307 -247326 208866 125383 -172268 75050 102014 -205981 -55358 180319
89 180319 12739 -103070 61264 66819 -132882 -39743 136648 -63173 -90025 163626 19534
100 19534 -172969 60502 94367 -147834 -2383 191148 -86683 -123057 179896 -30396
110 -30396 -200283 182039 100493 -226651 70878 158242 -186849 -19086 207674 -118571
120a18571l5977L54379j60065k40634L00060J3714l06296K07911J63815l01652
130a23316J5075K59339j10242j55299J39626M2205j76984P4286K03575j67444
140H21j40639K05094M602j86850J09818J26949j73892j7621K17702j32125k09514
151a95655K42511O9499k32979J52015J12881k82714L7885K32225j62847q5172
161a12351K30250m6408j96588J49100N2899k13995J14813J77301j86938k4542
171e6459J47968j22746p4442J52494J1977j00165N6886N7837j24574l0566J33747
182E1957l1223p6435J01366J3786j16938J9104Q2333o2970m8366J34565R525j62672
194h5968P0158Q8178j52268M1854J56640j31418p1355J55420l4604j35715J10973
$$ plain form
120 -118571 -154548 199831 39766 -200868 99192 112906 -193390 14521 178336 -123316
130 -123316 -108241 151098 40856 -114443 25183 67388 -109596 -35310 168265 821
140 821 -139818 65276 69878 -116972 -7154 119795 -54097 -71718 145984 13859 -195655
151 -195655 46856 116355 -116624 35391 148272 -134442 -96557 135668 -27179 -112351
161 -112351 117899 71491 -125097 24003 76902 -137093 -22280 155021 -31917 -56459
171 -56459 91509 -31237 -105679 46815 58792 -41373 15513 73350 -51224 -81790 51957
182 51957 20734 -55701 45665 59451 -57487 -38383 43950 -19020 -67386 67179 76704 -85968
194 -85968 -15810 72368 -79900 -38046 118594 -12824 -84179 71241 36637 -99078 11895
205A1895P1176j49904M3909J33841j52460m7315J68545o4771r0339J22466p192
216C9851j09453O4634O9258q9780k4895R6518l4772o9961Q8149J1287q8747M4069
228c842M7431o4454j7225O4167L449o0278L7911M3323r5962L129R9404o1806l3785
241c8538R4435l2516q5536N7765M0358p5783K1547R4709p8494n9458J01211l9277
253D23p6363J11620K0366r1725L8949L3743p8644n510Q5347j2774n2834O1196
265C3794M85r4283L9974N3183n2823J8535N0497m1078m4193K4999K1079l5474
277b5305J8505O1418n0839l8708N3600k7620l7649O2537K2165m6250M37L0983
289B3274l8721l1049P1564L246o0418N5484J2320q0582L0285M4327m5235L926
$$ plain form
205 11895 83071 -66833 -22924 110917 -41543 -88858 79687 14916 -75423 47043 39851
216 39851 -69602 -4968 64290 -25490 -50385 46133 11361 -58600 29549 40836 -47911 -3842
228 -3842 43589 -20865 -38090 26077 29526 -30752 7159 50482 -45480 -42351 57053 -4753 -38538
241 -38538 55897 23381 -62155 -4390 35968 -39815 -18268 76441 -2053 -61511 39700 423
253 423 -75940 35680 56046 -35679 3270 37013 -41631 -47141 38206 25432 -27402 33794
265 33794 34279 -60004 -20030 33153 -19670 -1135 49362 8284 -35909 -10910 10169 -25305
277 -25305 -6800 54618 3779 -34929 18671 -8949 -46598 15939 38104 -8146 -7709 23274
289 23274 -15447 -46496 25068 28314 -32104 23380 35700 -44882 -14597 29730 -15505 -11579
301a1579M7582k3985m6443L5432K2157n4942K6518M8127o1019l078M9693l7165
313h702j6279L9559k017k8450Q393K8585k5954j6792M5938j7597l6563M2400J498
326A4019l2320K3181J6127k3344j5002K1892M190l1141L1445K5559n3961P998
338a1357L0092m1102M425M1579j2726k0128J4722L794l7067O763M7202k4463r823
351h089M1452l7892l0617L9620j518j1846K5274Q770k6008j9742J8974j981j5931
364a9534M1073P304l9675J0306M06k4472J4304K2309M253j2805k619N033l1290
377b5407L954M0659j6480l215K5118k7670k0192J8043P511m878P539J9599k1632
390B949k4995K8456q429j8984M0664k025k8633J6137k670j8884Q322J7471J16
$$ plain form
301 -11579 36003 12018 -34425 1007 23164 -31778 -5260 42867 -18152 -21230 28463 -8702
313 -8702 -24981 14578 12561 -15889 -7496 21089 -4865 -21657 24281 6684 -29879 12521 14019
326 14019 -18301 4880 21007 -2337 -17339 4553 8743 -22398 9047 34606 -19355 -11357
338 -11357 18735 -22367 -17942 23637 10911 -9217 5505 9299 -27768 -21005 26197 1734 -8089
351 -8089 33363 -4529 -35146 4474 2956 -8890 16384 25154 -854 -20596 -1622 -3603 -19534
364 -19534 21539 28843 -10832 -526 -120 -24592 -10288 12021 16274 3469 850 5883 -25407
377 -25407 -21453 19206 2726 -489 24629 -3041 -23233 -5190 2321 -2557 4982 24581 2949
390 2949 -22046 6410 -2019 -21003 19661 17636 -10997 5140 2470 -16414 -8092 9379 9495
403I495j5008R087J725k4858J7795J5179k3325R178J0319j2828N31J255L371l655
417a739k355J7982j4878j4265K7002n196j3635J4896q233j2211J1907J3171o324
430F122j5581J3982j144k2775K3740N526k4787K4649O676k9351L805N984l461
443f615Q796J2086k009k1886J139J0508j5053J3651J8157j6283K094j198j6050
456a2663L431M746J2116P175j3252M237q962j9705J8123J0593l519J1303m001
469I622j7433j0420J1049J2733r736J3642R664l0736O693J1118k7551J5798K6335
482B0778j2149l454k848j4690l002J6956J5231j5006l727J1032j7819J765J1988
495E055j6151J0096J4838j0158k354j1374k753J6249n79L699r05j5529O968P410
$$ plain form
403 9495 -5513 3574 5299 -19559 -1764 13415 -9910 -732 9587 -3241 -2710 -1455 1916 -1739
417 -1739 -4094 13888 -990 -15255 11747 6551 -7084 7812 -421 -12632 -725 12446 6122
430 6122 -9459 4523 3379 -19396 4344 9870 -14917 9732 16408 -12943 -9138 -3154 -6615
443 -6615 2181 14267 12258 -9628 -8489 2019 -13034 617 18774 2491 4585 3387 -12663
456 -12663 -9232 -4486 7630 14805 1553 5790 -3172 -22877 -4754 5839 2320 13623 9622
469 9622 -7811 -18231 -7182 5551 -4185 9457 19121 -11615 -4922 6196 -21355 -5557 20778
482 20778 8629 5175 2327 -12363 -15365 1591 16822 1816 -1911 9121 -8698 -6933 5055
495 5055 -11096 -1000 13838 3680 1326 -10048 -12801 3448 2869 6568 5663 -9866 -2898 4512
509D512n286k70j31N681l522j920R649j7146J185K4005k0340m959J9831j8012
523f723K95J9858j2649r361P545K352p895M522J6333j5070q887J6444j5888j683
537a0807K4641j1577l636R178j2389O23J199k755J1321J236J141k538j6398o86
551a1447P648R476O672r995j69n821j1082J8070l603j0514K6736n069j8659Q460
565G03j2162n703K4350R194r836r060J024o480m274K1470l103j1979K1896r715
579F325k1179J4129n033r07K1086m258r783m248n052M711J928O170L246p631K384
594A888n495n043R195m401P025Q069j7151O048L503j6720J5287P010j3279Q965
608D901Q2j1482K653P681N56q373O401K700j5646J3798O232k1376J3204N491j7208
$$ plain form
509 4512 -774 -1044 -1175 4506 984 -936 8713 -8433 -7248 16757 -3583 -8542 11289 -6723
523 -6723 -6428 13430 781 -8580 -1035 1317 -6578 -2056 14277 -793 -9680 6764 -9124 -10807
537 -10807 13834 2257 -1379 7799 -4590 -3967 -2768 -5523 5798 7034 8175 5637 -10761 -11447
551 -11447 -3799 5677 12349 2354 2185 -3636 -14718 3352 -251 -10765 15971 10902 -7757 703
565 703 -11459 -17162 7188 16382 6546 -2514 -1490 -7970 -12244 9226 6123 -5856 16040 6325
579 6325 -14854 -725 -5758 -6665 14421 10163 380 -3868 -8920 -4209 -2281 3889 7135 -496 1888
594 1888 -3607 -8650 545 -3856 3169 11238 -5913 135 3638 -13082 2205 9215 -4064 4901
608 4901 4983 -6499 -3846 3835 4391 -3982 2419 5119 -10527 3271 9503 -11873 1331 6822 -10386
623a0386J2512J859j0601R029J311m935l061j31O013j328N224J691j4212M774
637b241J711n350J3523l438n078R838j3954l105J0336p784Q226R770j1254m290
651c090j548j995J329O923R814j0031l698O422j7494L617J9215j0757N832Q865
665A3404j9644j639N743k994P353O295J55p881o144L348o238N666J3793r002J307
680C522R37j5988O103N355l372J2249l617q241L136o817J038O839P93K830k548
695B219j024l351o551J0884O72m327J2064j0628q895J3801o703j732J0675p001
709A03j959L922k616j496j044N734j230n294P690o546l544J3304p249l200P036
724C611r224L585P384n784L368j915m087L188k616L671K015j821M223p688k123
$$ plain form
623 -10386 2126 3985 -6616 2413 3724 -1211 -4272 -4403 1610 282 5506 7197 -7015 -2241
637 -2241 -530 -5880 7643 4205 -873 8965 -4989 -8094 2242 -5542 2684 12454 1200 -3090
651 -3090 -4638 -6633 -5304 1619 11433 1402 -2296 4126 -13368 -9751 9464 -1293 4539 13404
665 13404 -6240 -7879 -2136 -5130 2223 8518 8673 792 -5352 -2004 -8242 -2576 11217 2215 3522
680 3522 4459 -11529 -5426 -71 -3443 8806 5189 -3052 84 -6733 -5695 1144 1937 4767 2219
695 2219 1195 -2156 -8707 2177 2849 -1478 10586 -42 -8937 4864 -1839 -3571 7104 103
709 103 -1856 2066 -550 -2046 -3090 2644 1414 -3880 3810 -2736 -6280 7024 -225 -3425 3611
724 3611 -5613 -2028 5356 -428 2940 1025 -3062 126 -2490 1181 3196 1375 5598 -2090 -4213
739d213M481o138Q657N531j0197N146m566j0104J0691J656pO603o242m557k371
754e630Q66N665j519O659J734j1407M007l318q181J5668K740m071M613j1409m811
769h394N849Q74O320j82k259P06q123J063J184k779J2233l3o477K049j0668Q67
785g770J1197l493N045L75r333L812j960j883N799p25M139j477o066K865n802
800e277K843R781q168K539J860j0551O809J723n185P007k945k374K128l075L801
815I16j271j351N401o643J980M710p920O446J880p350N775l606k879Q397l101
830A384J184j81p240L625J33O63N460n469J496k89o994N736j401o24J0567o543
846A507l127K019q930N889O692k343M064m325m170P72l658O810K047j608O774
$$ plain form
739 -4213 268 -5870 2787 8318 -1879 3267 -1299 -11403 -712 944 937 7540 1298 -3259 -5630
754 -5630 -4764 901 -618 6041 7775 -3632 375 -2943 -11124 4544 7284 3213 7826 -3583 -8394
769 -8394 -2545 -1671 4649 4467 2208 2914 -5209 -4146 -2962 -5741 6492 6459 -18 2031 -8637 -7770
785 -7770 3427 -66 4979 5354 -3979 -167 -2127 -4010 1789 1064 5203 3726 -2340 525 -5277
800 -5277 -2434 7347 -821 1718 3578 -6973 -164 1559 -3626 3381 436 -1938 190 -2885 916
815 916 -355 -1706 3695 -2948 -968 3742 -4178 2268 4148 -3202 2573 -1033 -3912 4485 1384
830 1384 2568 2387 -4853 -1228 -1095 -432 5028 -441 1055 766 -6228 -492 -1893 -2517 8050 1507
846 1507 -1620 399 -8531 -2642 4050 1707 5771 1446 -2724 -1952 -5610 1200 3247 1639 8413
861H413q896n428N498n723O380Q010o870J227l848o272N212j86M480L880n589
876B88J457n319l703P821j890L867N112q952R17j274n132R308R6r92M543p942
892a795r25K084k994O021k11p28J816p308K305J190l987Q887k164n425O056n674
908b852o31O326m541K579Q90l531L125l285J703L570n107M295j808n194P770k395
924I14j488M967p471J145L191m370N585o87l094L815n459k13K830k035O072j032
940B670l551K072o946L071N620m228O344p55q152M156k958j128P618j055J000
955C778j529n294J495l110L290O793m789K975j757r425N091P82J50P865m272k612
971e69K81n245L962J658K8N686l849j957o72n639N925K741n82M999p707k979M961
$$ plain form
861 8413 -483 -5911 -413 -6136 244 8254 1384 2611 -1237 -7509 -2297 -2483 1997 5877 288
876 288 1745 -3574 -7277 544 -1346 2521 7633 -1319 -402 -1676 -6808 2500 2596 1604 6147 -1795
892 -1795 -2720 -636 -3630 2391 2180 1452 3268 -4040 -1735 -545 -4532 4355 2191 -3234 2822 -2852
908 -2852 -3483 2843 -1698 881 1771 -1760 1365 -1920 -217 3353 -1754 2541 733 -4461 3309 914
924 914 -574 4393 -3078 -1933 1258 -3112 2473 1786 -1308 2507 -2952 -3165 -335 -2370 3702 2670
940 2670 -881 1191 -5755 -2684 2936 -1292 5052 4297 -3855 301 -2657 -3785 3833 2778 3778
955 3778 2249 -3045 -1550 -4660 -1370 5423 634 3609 1852 -7573 -2482 -1700 -1550 6315 2043 -569
971 -569 -288 -5533 -1571 87 115 5801 1952 -5 -677 -6316 -391 2350 1768 6767 -940 -3919 1042
988A042n235M534L682n321M122j855m588K058j717M044K186l085K417n623r42
1003d281P213m826K407L516p271M022R64m757M934j656j76K586m447K199j81j623
1019a377M792l877p61K740n497M959J318m621N241l936l400N692l387K243L871
1034D000n199J280j410j626L994j931L579J187n515L496m058l151R140k221J29
1049A694L563q610M15K173k268N834n34j218J281n993J348J22j071P906j940k653
1065D9J998p921K478N323l333O197j349n719L270m051L8N250j390L310j807m402
1081b059J723m143L332N323m918L942j610p267N850j791q77O637l835m00Q77m665
1097c881L500j33J97M055m471J178N98n058N958p57k461N642n446q51M352n038
$$ plain form
988 1042 -4193 341 4023 -1298 2824 969 -3619 -1561 -3278 766 2952 -133 2284 -3339 -4281
1003 -4281 2932 -1894 513 4029 -3242 780 1744 -3013 1921 265 89 2675 -1772 427 246 -1377
1019 -1377 3415 -462 -1223 1517 -3980 979 2297 -2324 2917 -1019 -4419 1273 -2114 129 4000
1034 4000 -1199 81 -1329 -2955 1039 -892 2687 3874 -1641 1855 -2203 -5354 3786 1565 1694
1049 1694 5257 -3353 -2938 -765 -3033 2801 2267 1049 2330 -3663 -2315 -2193 -3264 4642 2702 49
1065 49 2047 -5874 -3396 1927 -1406 4791 3442 -2277 993 -3058 -3020 2230 840 4150 2343 -2059
1081 -2059 -336 -4479 -1147 4176 -742 3200 1590 -5677 173 -1618 -2495 4142 307 -93 784 -3881
1097 -3881 -381 -514 -317 3738 -733 445 1043 -4015 1943 1186 -1275 4367 -1079 -1930 2422 -2616
1113b616L569J647m785L414k133q69L100k817K755o11l826M527l211K22N709n476
1129a401J505J965o414M505J115k095M702l029j550O15l019M204N02r88L598n747
1145a532n01K426m787N334K202m050M029m373l309M247k278L711K970m138R78
1160I29l281j303M050j689M250J217n389K600l512k173P135k366J013L275o434
1175a678M36Q3k143N190l62L29L24n642K177j19j236O335l049j355L187n791J563
1192a751K584l068N228o55l220K027l706J357L302k209K833k280k346L810l724
1207a818J511K654m542L833m67m447M513k208l32L973m146N89N97j840M036j600
1223C06n36J744m297L047J074l339N076j795k863L651m162O95L708k697K863j050
$$ plain form
1113 -2616 953 2600 -2185 1229 -904 -1773 1327 -1490 1265 654 -3172 1355 -1856 -1634 4075 -1401
1129 -1401 104 2069 -4345 160 1275 -820 3882 853 -697 -82 -3101 1103 1605 617 4215 -1532
1145 -1532 -2033 393 -4394 940 3142 -908 3121 -1252 -4561 -314 -2592 1119 4089 -49 929
1160 929 -2352 -3655 395 -1294 2956 4173 -1216 1384 -2128 -4301 2834 468 1481 4756 -1678
1175 -1678 -1242 -1159 -3302 1888 1526 1855 2179 -3463 -1286 -1405 -2641 3694 645 -710 2477 -3314 -1751
1192 -1751 833 -2235 2993 2338 -882 1145 -2561 -1204 2098 -111 2722 442 -1904 1906 -1818
1207 -1818 -307 2347 -2195 1638 1171 -3276 1237 -971 -1303 2670 -1476 -887 -290 -2130 1906 306
1223 306 -230 1514 -2783 264 1338 -2001 3075 1280 -1583 2068 -2094 -1399 2309 -388 2475 1425
1239A425l362J946k553J744L294k539K427k514l641L668k169J680M364m257J235
1254G48J13m806L642N1J30M280l066r68q95k990M640J29K57L106n818P8J517l775
1272c627M507Q67j888L251m085j859J711j775M249R58k345J670l828k43L328k733
1288a842L776N49l718K977l039j345M548k480K155J262m585J985j053r00L899
1303B189k471R15N91l928L238j062j384M360l260k29K506m096K824J048k856L440
1319A825k082q84K265k539K617P88k974K750k746q78M068l033K016J107m466K505
1335C39j154j548M395k082M50J438m536J689J11r64M419j993l30J180m712K658
1351f40J121j769M946k148k212J835m033J819K871j812L121k138k509J697l221
$$ plain form
1239 1425 -1937 9 -2544 -800 2494 -45 2382 -132 -3773 -105 -2274 -594 3770 -487 748
1254 748 861 -3945 -303 -252 -122 4158 1092 124 -771 -3761 879 1008 1265 4371 -1447 -1369 148 -3627
1272 -3627 880 1747 -141 3110 -975 -2834 -1123 -2898 1351 2309 -36 1634 -2194 -2437 891 -1842
1288 -1842 1934 2483 -1235 1742 -1297 -2642 1906 -574 1581 2843 -1742 243 -810 -1710 2189
1303 2189 -282 633 1224 -2704 534 -528 -1912 2448 -812 -1041 1465 -2631 193 1241 -1615 1825
1319 1825 -257 -1141 1124 -1415 1202 1990 -984 1766 -980 -1858 2210 -823 1193 2300 -2166 339
1335 339 -815 -2363 2032 -50 400 1838 -2698 -1009 -898 -1862 2557 564 234 1414 -3298 -640
1351 -640 481 -1288 3658 1510 -702 1133 -2900 -1081 1790 -22 3099 961 -1548 149 -3072
1366c072K540K637k559K991k157l539L189k352J724L580l129J266j234l260L407
1381C2r30J033L245l709J029m16k988L728q62qL038l862M19O21l213L976p1j603
1399e41K562l590K42J976k404K918o38j877K885k999N75K159k982K880L48l278
1415a764K950k113K69L046k712R83Kk613L300j247n93K553l158J032O10k968L157
1432G34n61p56K858l626r0J538k243L387L52k185J883k790j27K296j712L027M1
1449B026k754K191l069l12L398j942K249N91l691J291j642m66L849j320Q55j16
1465A138l735K161p15l09L748k056J01J017l855J884K74o57M056k181o75N28l383
1482b659K497J498j672K736k216j043J509k624J712J338j855K847j994k099K298
$$ plain form
1366 -3072 -532 2105 -454 2537 380 -3159 30 -2322 -598 2982 -147 1119 -115 -3375 32
1381 32 -898 135 3380 -329 700 284 -2704 1024 162 154 3192 -670 -251 370 -2843 1133 1062 -541
1399 -541 2021 -1569 -1327 649 -1755 1163 525 -1352 1533 -1466 -891 1268 -1714 1166 1514 -1764
1415 -1764 1186 -927 -658 2388 -324 659 661 -1952 1348 101 -492 2061 -1097 -65 545 -2423 734
1432 734 173 -583 2275 -1351 -1441 97 -2146 1241 1593 -592 1291 -1499 -1626 670 -1042 1985 2026
1449 2026 -728 1463 -1606 -1918 1480 -462 1787 2378 -1313 -22 -1664 -2130 1719 399 1254 1138
1465 1138 -2597 -436 -1151 -1460 2288 232 333 1350 -2505 -621 -347 -1004 3052 871 196 724 -2659
1482 -2659 -162 1336 -336 2400 184 -859 650 -1974 -262 1076 -779 2068 74 -2025 273
1497B73k113J701K012k782J650j204j414K940j798R45J357k893K172n29j886L018
1513A449j465j3J735k943J364L95j596L052j934r49J895k826J396J502k020K317
1529A359j506j431K109k137J526J663k362K198j372j948K538j485J236K186k850
1544b76J038j204j820L376j088O71J714l445Q22r6k127L294m82k06J771l288L01
1561a045L78j623L909n47j236J717l298L39K022j860K860k32j614J518k640J70
1577a182K106j680K673l95k732J798k065J39K814j895J536l28k655K044j249k25
1593a296L144k310P59N14k571J976l41m33K500k137L39O57k614K691l2j722K768
1610A892k123n58J763k306J951L95j975K063k061k11K068k056J643L68k611K254
$$ plain form
1497 273 -1840 -139 1873 -909 741 -463 -1877 1063 -735 210 1567 -1326 846 317 -1569 1449
1513 1449 -16 -29 1706 -1237 127 522 -1074 1978 44 -905 990 -1836 -440 1062 -958 1359
1529 1359 -147 -1578 531 -1606 -80 1583 -779 1419 47 -1901 637 -848 388 2574 -276
1544 -276 762 -442 -2262 1114 26 697 2411 -1034 -212 -308 -2435 859 377 171 1942 -1346 -1045
1561 -1045 -667 -2290 1619 1072 -164 1553 -1745 -1406 616 -1244 1616 1384 -230 1288 -1352 -1182
1577 -1182 924 -756 1917 1522 -1210 588 -1477 -1338 1476 -419 1117 789 -1866 178 -1071 -1296
1593 -1296 1848 -462 297 811 -1760 216 -125 -558 1942 -195 144 801 -1813 878 846 -876 1892
1610 1892 -231 -789 974 -1332 619 1014 -961 1102 -959 -1170 898 -1158 485 853 -1758 496
1626D96j179o30K814k001O82R86k855J803k73o21K950j915j85P47k580J919K92
1643D50q66K557k191m74J162l111K557J027j945K543j835j462J767j709J665J128
1659A263j424J504j886j011K040j731K016J520k897J577j100j823K758j093P62
1674D75J598k704P17m79j472K817j033M70R60k857J127j4j407K947r57m53J784
1691A519l051Q63J280j965K562k12j339J140j778P72J115j453J936j111j384K312
1707A206k404O07J835k237J595j74j987J970p77q5J529j933P91J4j205K183j106
1724a78M2J562k528R92N98j626K533o58j045J593k289L96J504j387J634m87j464
1741h08J010j585P92J331j288J872q88k300K267j664M13K517k056Q45L79k529
$$ plain form
1626 496 -683 -1313 1501 -500 182 1168 -1687 116 -157 -778 2172 257 72 819 -1761 158 450
1643 450 -416 2141 -50 -524 638 -2473 84 1111 -834 1709 -126 -1588 179 -1530 135 1263
1659 1263 -161 1343 -543 -1554 486 -1245 771 2291 -606 971 -129 -1952 806 -287 475
1674 475 2073 -631 86 -393 -1865 952 -81 389 1349 -1508 -381 -395 -1802 1145 188 -265 1519
1691 1519 -1532 -669 611 -1354 1208 996 -343 797 -981 -209 906 -547 1389 278 -1106 1206
1707 1206 -1198 -591 1244 -993 602 428 -1559 411 -366 -451 1078 -855 -64 -50 -1255 928 -178
1724 -178 -136 1426 -1102 -110 488 -1138 1395 737 -308 1285 -1004 -608 896 -491 1143 656 -808
1741 -808 202 -1383 -591 740 -548 1324 436 -1864 403 -1261 -848 1669 -387 458 837 -1692
1757a692J682l31O6J956j627M51k90j914K358p45j37K379k597K40P40k640K170
1774F9M63j035K080j919p68J071j466J794M52j001J388j918j0J334j882K077O78
1791A407k265K196j533j218K307j199O39Q82j950J176p56n61J869j587J102J64
1807F73k318K017n32r91K692j774m64J594k242J324P76j441J824j054o36J082
1823E30j533J670J64j408J881j705n36K147k146J300J285k706J499p11j226K269
1839G74r67J39J035k004Q90m84n41K468j702O37J161l008J497K33j311K875r53
1856G39j098J283k077P76Q34r41J799r78o68Q23k017J338Q65j516K294j312j571
1873a427J824j809Q25K051j905R28rj830J602p80L38J541j705J110o90j248K080
$$ plain form
1757 -1692 -10 -341 -275 1681 54 505 215 -1699 659 -86 -223 2156 -441 -201 539 -2101 69
1774 69 532 -503 1577 -342 -1110 -39 -1505 289 741 -260 1128 -790 -800 534 -1348 729 1407
1791 1407 -858 1338 -195 -1413 894 -305 334 1216 -734 442 -314 -875 994 -593 509 673
1807 673 -1645 372 -160 -1151 1541 -233 -697 897 -1345 -21 755 -686 1138 84 -552 530
1823 530 -1003 667 831 -577 1304 -401 -937 1210 -936 364 1649 -1057 442 -269 -1495 774
1839 774 -193 -54 981 -1023 -133 -617 -1158 1310 -392 245 1406 -1602 -105 128 -1183 1692 739
1856 739 -359 924 -1153 -377 457 -484 1315 337 -331 492 -1525 -187 678 -838 1456 144 -1427
1873 -1427 397 -1412 -587 1464 -441 487 478 -1352 250 -530 -192 1349 -356 754 64 -1184 896
1890H96j216J26K148k612O61N72k197K210j3j225J653j850L40Q08j409J668o44
1907h4m91J696k151P37J164k003K099j06k176K080r87j83J882j856P62L00j699
1924a016J523o30l7J362k006J230j40k041K361o00p64K387k240k03J259j799J659
1941C05N76j254J120j201k8Q55j248K085m58j225J833k159k22K019j798J567P89
1958A556k455J067o15p85J843p50M52L65j706J171r35l2K031j672Q81N76k645
1975a653J651jj237K790j164l48Q04j802P05N93m89J105j037J72L93k125J842
1992A99K52j305K253j310j314J617j447Q17J228j522R53k74j022J480j190P70
2008A85O45j678J567p70q39K164j478J01J429k376J126M82j760K133p38n29P66
$$ plain form
1890 896 -320 -194 1954 -658 3 575 -1622 588 575 -650 1003 -847 -507 301 -1108 560 -84
1907 -84 -575 1121 -1030 -293 871 -1132 967 861 -1315 765 -222 -405 1477 -379 383 683 -1016
1924 -1016 507 -123 -160 1202 -804 426 286 -1755 606 6 -758 1629 -611 -814 445 -1354 305
1941 305 881 -373 747 -454 -482 373 -875 1210 752 -473 1360 -799 -1021 998 -800 767 1556
1958 1556 -899 168 -447 -1232 611 -139 313 678 -1028 143 -792 -824 1207 -465 416 992 -1653
1975 -1653 -2 -3 -1240 1550 386 38 842 -960 -255 338 -151 954 -83 89 482 -1643 199
1992 199 451 -854 1399 89 -1225 392 -1055 -238 990 -532 421 147 -875 605 -585 185
2008 185 830 -848 719 -51 -890 1274 -204 -103 1326 -1050 76 558 -1202 931 193 -336 430
2025D30j298P96K13q25J623j197n28J550k074J222J202j936J997q21j601J812
2041E65j100M22J255j232P49q52p49J612j221Q52R82k115J317m03j673K306q88
2058a73k46J769k160K01Q29j320J628j21l22Q13j818O38K57j066K462p79r94J726
2076A324k177K25J660k062J672N51j781J200j067k68J201q68J032l66j348J618
2092E46j500K45J948k067J210M77k290J920l08p21J829j268k2N93j415J101qm49
2110a79J288j640N44O46j839K000n24j348K073j601n56J999j576N18R73j726J331
2127C83q16k50J370j218J255j25j771J924j205m26K468j840K96J011k166J306
2143A96K47j039J769r69n09P67j555J187j49m37J585j708%J240k256J714Q13j839
$$ plain form
2025 430 -868 -72 141 -684 939 -258 -786 764 -1310 -88 1114 -822 1175 354 -1247 565
2041 565 -535 -113 1142 -90 659 -193 -942 670 -551 301 1283 -832 485 82 -1591 715 -173
2058 -173 -419 1350 -810 -609 220 -1100 528 407 85 898 -920 -282 -25 -1091 1371 592 -402 1324
2076 1324 -853 -628 1032 -1030 642 1193 -588 612 -455 -723 478 -390 642 276 -1072 546
2092 546 -954 -709 1239 -828 382 859 -1431 489 181 -540 1289 21 -1 592 -823 278 270 -179
2110 -179 1109 -531 13 659 -1180 820 296 -1052 1021 -580 -1136 863 -713 -195 778 -948 383
2127 383 -433 -683 687 -531 724 599 -1172 752 -453 -879 1589 -251 45 1056 -1110 196
2143 196 443 -596 1173 204 -305 462 -1093 94 -55 -492 1093 -615 -615 625 -1631 83 896 -943
2161i43J898r14j048J558q31L8J215j131P19o23o18J262j339J358N03j983J565
2178F86p52j369K475j350j51J455j718M09L97j002J348l91k4P68j675J152l0j065
2196h37K088j216p14J810j981N75J310j745J122n3r38J059q55JQ33r70J119p53
2214a45o69J557j599O99J329k423J305M36j961J968j03q43J405j280J95K87p61
2231f03J516p64j79R56k006J258M27j732K217o47j238J626j365m85J679j077N69
2248A52M07r13M39q33O14O24r73J395n23j519J871j269o8K162j910M23Q55j978
2266a044J144J31n58J165r28L86k38j133J552o47j41J499j942L40Q77j755J411
2283A19O10j466J521p55o63R82q90P17M22q21R44j086L3J151j592J355K89j995
$$ plain form
2161 -943 955 41 -1007 551 -280 -242 973 -158 561 -62 -680 582 -757 601 1104 -879 686
2178 686 -66 -1435 1040 -310 -461 994 -724 -315 82 -920 428 37 13 781 -894 258 228 -837
2196 -837 1251 35 -679 1131 -850 -275 1035 -710 412 359 -579 480 -375 -374 459 -511 608 -145
2214 -145 -814 743 -856 -157 1172 -1251 54 490 -1471 497 394 -449 956 -324 -129 158 -603
2231 -603 913 149 -30 926 -1080 178 605 -1127 1090 443 -795 831 -534 -1019 660 -417 152
2248 152 559 -354 85 -748 -134 490 -483 912 389 -1130 741 -528 -596 1566 -344 79 934 -1044
2266 -1044 100 231 -327 838 -90 296 58 -1075 477 -170 -311 1188 -754 -414 463 -1292 119
2283 119 729 -737 784 29 -634 348 -542 175 597 -224 720 -366 -333 818 -774 581 870 -1125
2301a125J896r28q58K115j430L6J009j422O10R1o15J129p84K77L32j344J500l94
2319I5r20K053j475k39J534j997Q96J046j480J120m75p43R37p12P65j05r68J442
2337G74j314k73J627j507Q43Q72k200J216J17j413J912n53l31J054j463N34J10
2354En01J485j101L48O47j943J188K69j500K244q49r57J303j363P6Q99o70R20
2372E00m40n29O01j037Q39O30j366J634p47j011J849j583K07J787j913R28K54
2389F03j492J148k24k92R46j034O27l04r64J667r93k03J409j705O59O93j684J439
2407B96J33q98Q00n57l02R85r50J047k03o70R56j180M46R32j584J190J29j581
2425a011J620p10n35J495r30m3M31j111P72p5j05Q71j122N09J21j300J828n70
$$ plain form
2301 -1125 771 -157 -1015 1100 -330 -294 715 -707 -97 -6 -621 508 -276 1 333 -1011 489 95
2319 95 -825 1228 -247 -486 1048 -949 -53 993 -487 633 158 -585 352 -360 405 300 -668 774
2337 774 -540 -813 814 -693 150 1022 -1178 38 155 -1258 654 101 -230 824 -639 -105 5
2354 5 -496 989 -112 236 883 -1060 128 397 -1103 1141 292 -665 638 -725 -649 250 -420 500
2372 500 60 -469 132 -905 -66 564 -802 832 85 -926 923 -660 -453 1334 -579 349 603
2389 603 -889 259 35 -257 689 -345 282 -22 -986 681 -312 -515 894 -811 -152 541 -1143 296
2407 296 429 -469 331 -226 -528 457 -493 554 351 -319 637 -543 -97 835 -749 441 570 -1011
2425 -1011 609 -101 -636 859 -71 -114 317 -794 -22 -97 -202 669 -453 56 177 -1123 705 135
2443A35o09J644j520j54J175j249Q07M31q70P08o40r7N89p43Q33m9p46J105j241
2462d91k51J397j189P11N18j524R37k11q11J333m04P4L22p94N42l11j23J297j279
2481b57M61O28j728J262o0j114J731p72n49J065j294M24M11n28P20o60M0M30j186
2500i76J246J20j102J392p05q87J654j140J15J050j100O58J4o72P10n32K17N19
2518E81j057R59n74o17J555j063l3J208j877O84N83j110J149j97o81P99q49M66
2536g4L47m76Q32o91l40R60j298Q00O96j327J202l33j204J330m98j06J020j083
2554b43N09k34p29R67p37O05M18j134R25m52r48J417m61k09J279j516K60P12j038
2573f09J049m4n88R33j095M38K79p52J145o06p26J430j498J51J047j194P20L78
$$ plain form
2443 135 -474 1170 -350 -504 671 -578 229 660 -210 498 -142 -239 350 -393 440 391 -355 750 -491
2462 -491 -742 655 -534 177 695 -829 108 -103 -914 419 15 89 411 -383 159 -152 -275 1022 -257
2481 -257 204 832 -896 366 306 -808 923 151 -398 667 -627 -203 208 -320 400 -260 -220 210 -976
2500 -976 270 390 -712 680 -25 -912 742 -398 -283 767 -333 325 339 -333 377 -155 62 581
2518 581 -476 483 -91 -708 847 -216 -249 959 -918 -234 349 -761 388 191 -490 309 -540 -74
2536 -74 273 -203 629 -62 -402 558 -740 60 756 -571 631 298 -906 424 -74 -180 840 -243
2554 -243 266 32 -697 270 -467 138 556 -578 347 -105 -1053 364 -97 -306 973 -543 -283 429 -609
2573 -609 440 396 -192 741 -354 84 363 -389 756 150 -576 854 -644 -493 554 -640 80 458
2591D58j243R81l19l78R31q30N36r4o21J027q30J57J097j383P87K46j436J370
2609D56k74p51J273p90j96Q04q90N37j7m78R50j129K81P51j382J218j47q08J191
2628E99q92l38J365j175N30M85j063O07n5k45P09o50M36K64j166J105p06l43J334
2647H01j153K08Q53j469P12J85o91R46l42m44O29p33O05P8l24Q66r72LO58j092
2667f76P86O00j138J128n05r98J344o88K5P36j043N90k80k34P06q41N77M47j318
2686g82J169l50r74J543p85j89R79j062M17M22q05Q56l20j48L66o57M72J21n49
2705b76J015q97k55J102j108K23Q22j297R08q9o67N52m99M89K18n57M67j61l91
2724d01R00p93K30Q75j304P07Q7j069J286k37n16P54r13O9M03m05N86k24j60N67
$$ plain form
2591 458 -785 196 -123 -501 430 -400 136 42 -579 448 -382 -225 872 -511 276 522 -914 456
2609 456 182 -569 704 -86 -282 522 -368 169 152 -326 624 -505 -224 527 -855 363 216 -592 599
2628 599 -293 -631 734 -441 89 574 -489 118 63 -182 527 -123 313 577 -589 516 -190 -533 801
2647 801 -352 -144 709 -760 -48 137 -554 392 50 -394 235 -498 107 185 -139 727 -245 -242 416 -676
2667 -676 110 710 -428 700 195 -803 541 -147 -122 614 -429 161 -119 -353 353 -488 89 536 -782
2686 -782 387 37 -937 606 -179 -368 611 -451 -34 388 -417 439 119 -29 337 -320 152 273 -276
2705 -276 739 -158 -413 689 -419 -196 626 -671 237 148 -519 33 -466 23 241 -316 151 -10 -401
2724 -401 499 -294 -64 811 -493 214 301 -768 518 281 -235 519 -394 -325 78 -327 259 35 -125 442
2744D42j089N46M21j029J286m00p40J070p43k07J017q47M09J02n37M90l44q1O08
2763C74n90P70k74p48J019p79k41J265j207L36N12j191Q24J67p60Q58o26J09L06
2782A24p91P80j69j62J002j137J27P22j025R67l1q45J020o74l11P63n78L82J47
2801C11o16N37l87j2O35j038O94J52j161J180l82p66J421p03o4O30j075O02J02
2820F0l07O01k70j35M02p83P23p6o67J304j007k45Q12q28K66O59j059P32j08n34
2840d60N21m98M56J40m35O55o40j87R40j000O51N67j425Q36J36q50J182l18m63
2859a92O83q37K73J10l09O56n27J55M34j063N90L07r78J228m77o07Q88p96J47
2878c15P99r43P80k08m34O79p04M38M48q90P59k74p46J112o72j14R94r21K9M76
$$ plain form
2744 442 -647 -101 320 -709 577 177 -563 507 -236 -443 574 -273 136 238 -299 191 -153 -234 374
2763 374 -216 554 280 -468 551 -228 -469 796 -411 -75 437 -754 70 237 -523 335 -291 -182 124
2782 124 -667 113 -56 -218 784 -353 -226 496 -529 438 407 -438 582 -92 -403 360 -218 164 311
2801 311 -305 232 -155 -167 468 -570 124 276 -885 295 -87 -853 568 -135 -199 431 -644 -42 60
2820 60 -247 354 84 -51 351 -432 291 215 -452 852 -155 -400 412 -416 -150 509 -550 182 74 -460
2840 -460 61 -437 19 159 -276 379 -261 -448 492 -508 143 710 -715 121 257 -593 589 271 -192
2859 -192 491 -346 -73 37 -272 384 -143 12 446 -617 -27 280 -698 530 53 -554 334 -462 -315
2878 -315 484 -459 321 113 -321 358 -346 92 540 -350 409 135 -611 501 -171 -285 709 -212 -183 293
2898B93p08N68k32k51P15p96N80k07n94J020n35pP60j003J23P66j035J006j54
2917C09p14J027q25pP29o91O56m38l92P11p39J07Q42j061Q63j39q78R15l23l83
2937d31J000q87J25M53q33P32o2j81N71o81K07L94r68Q10j03l72R85j045k38J207
2957F83j206N38L26o66N94n03j47M52n47O56Oo57P76n47k07Q83q86O40L09r92
2977d95O22J03p68R17m06M7J76o24O56k57k08R14r10K37M21j395J095m5n72J045
2997E53p32l35Q32p93K94M17l97M32k90k60N88o87O17J61r24Q24j69m48Q99p39
3017a57J26M89r23O16k20l37O54n12J42M99p92N77k36m09R20o20q1O79r25N76
3037F6L45r25J042l40n02N71n13K95L52o68P96o21j75O42p13K96M55p77P21j64
$$ plain form
2898 293 -415 153 -79 -330 385 -411 169 -38 -632 388 -147 -154 606 -397 -274 492 -543 463 309
2917 309 -405 622 -203 -210 519 -172 484 46 -346 365 -374 -267 575 -486 377 238 -640 275 -48 -431
2937 -431 569 -318 -193 260 -573 159 97 -84 487 -194 13 407 -561 249 146 -226 759 -286 -524 683
2957 683 -523 15 341 -325 269 -234 -381 71 -476 180 186 -471 305 -242 -449 434 -452 188 497 -495
2977 -495 127 230 -538 379 -27 20 196 -428 228 -29 -237 677 -233 4 425 -970 125 80 -492 553
2997 553 -179 -514 318 -475 -181 236 -161 271 -19 -279 309 -378 239 400 -524 300 131 -317 582 -157
3017 -157 -31 458 -465 151 -69 -406 248 -264 -122 377 -415 162 -74 -483 437 -183 -264 415 -510 66
3037 66 411 -514 528 188 -314 257 -256 39 391 -277 519 -102 -277 365 -348 -52 403 -374 347 183
3057A83q04R45n55N7M76p75N17J31n72P49m14M4M31q50P05j3r10J216m05l19P68
3078F05q56M2O91q13N52l5l79O00p06K15L63q53Q08k32n45J091j016J93O84q83
3098d74O09K05r30R19m16j84O77n99L44mm89O32m68k6Q22j119M93K91r69R13m6
3119A81o35Q53m94j93O11p18M59K3m22O89o77K64L68r11R15J57q74R65n05m51
3139c95J077j030M61K81o36L74q9m59O98m34J66K53p74P47m25j83P61o35o4O39
3159C33j018P60K66p57O52m54J26N24q77N83J66n82R12q34j14Q16r88N32M09q90
3179d35Q46m07m93P39m57jO16p86N56j52l00O10o63L61L69j022Q94m7q07R99n25
3200a05k57Q67q18K47M84o67O73m98j81O21p33M98J01n63N34l01m84J081r67J93
$$ plain form
3057 183 -621 324 -231 -174 302 -473 44 175 -397 352 -62 -18 413 -437 268 255 -655 561 156 -163 605
3078 605 -251 -209 482 -331 221 186 -193 407 -299 -84 279 -574 234 2 -543 548 -468 -275 409 -474
3098 -474 135 340 -590 329 -87 -271 406 -193 151 147 -342 290 -178 -204 618 -501 -8 283 -686 227 181
3119 181 -454 399 -95 -288 323 -395 64 87 -335 354 -323 -59 309 -602 313 470 -404 561 56 -395
3139 -395 682 -348 113 394 -242 132 43 -416 282 -152 14 267 -507 240 -185 -368 393 -242 -306 333
3159 333 -685 75 341 -416 236 -218 -92 432 -445 138 304 -278 634 -200 -314 502 -486 46 455 -435
3179 -435 411 4 -489 250 -207 -208 408 -378 178 26 -274 336 -327 34 403 -619 275 228 -579 420 -105
3200 -105 -362 505 -313 -66 418 -249 424 -74 -255 366 -367 131 232 -331 203 -98 -582 499 -468 -275
3220b75O93q87Q00j56l71M21k61j42O59o64K89q1m25Q20m30j32N73q19M16K53
3240B81p01Q02k50m99Q65p27J70J79l96M82k96k07P00o64J17M84p39P31r4n43
3260c05O25m42Q9O27q63N58K5n81N81l20j43O16p57L28M8m57N98j90k60N72o87
3281c38K41M40q18N27k2l11P05m30j92M03m85N06Ql97P85o89r6P36j013P33N7
3302C50o01O23l51m44P41p06M40K66p05N63l20j91O34o09M13J84p24Q23l26m39
3322c79Q76n98k5M77q58O13O1n38Q04m75j57N46o82M81o1k96N39l40m64R05q97
3343d68K13O93r46P57j99n05P80n34L37J75p07Q55m19l52Q75o60l6N92p94L48
3363EK50p88Q63l09j57L84m35K55J16n60O81n02K0O76r05L96J21m54P45l51l28
$$ plain form
3220 -275 418 -469 331 175 -196 225 -36 -178 481 -183 106 25 -400 420 -10 -142 431 -388 28 281
3240 281 -420 382 132 -367 498 -229 -59 120 -276 206 -90 -297 403 -261 -144 340 -399 332 238 -305
3260 -305 320 -122 -33 594 -269 289 314 -267 314 -6 -149 467 -290 38 86 -371 227 37 -223 349 -338
3281 -338 -97 343 -475 52 30 -281 424 -6 -198 205 -280 226 234 -163 622 -67 -163 573 -440 293 350
3302 350 -251 372 21 -423 318 -388 52 318 -387 176 -144 -335 299 -310 103 287 -437 386 60 -379
3322 -379 497 -101 -126 351 -507 106 167 -371 433 -42 -199 347 -335 146 85 -211 328 -12 -476 429 -468
3343 -468 -255 438 -508 249 50 -455 325 -209 128 303 -404 451 32 -320 555 -105 -141 451 -343 5
3363 5 255 -533 330 21 -136 248 -187 68 184 -376 305 -197 -177 499 -406 -10 111 -343 402 51 -277
3384b77P40p55K09M39p16N36k33l00O93o40K76L05o83N63m5o11R28n44k45P36
3404C76q28M46J82o18O79j03l68N26n16J75L33m83O43m14l81P22o65J63M48o87
3424c70O26j54n36P21n41j6N27o32N93l06l45O91m86N0N76p60M95n6o63Q57k04
3445F7l57R32o93k4M05p83Q09k69k25O73p22K06K69o25N36k7n02Q14o82l4O97
3466D65q31M50L0m66O49l23k54M47m19K85J56m23N36n54j36P96o20J72N16q06
3486c30M00N2l53O74n85J09K93m96M30k86k37N68m85J01M25o92N24n5n45R72m52
3507C2l04P46o45J66K48o27M89j29j46N40p49N29O9p23P54k74l17N86l48qM07
3528B96p75M50J59n38N19k48J59J79m83M58qn15O36j88l35O02n44K3L75l91M45
$$ plain form
3384 -277 463 -292 -83 356 -360 176 -57 -357 336 -304 -28 277 -406 157 112 -499 429 -115 -360 376
3404 376 -452 -6 176 -442 237 134 -234 292 -224 -49 284 -199 444 30 -351 371 -294 -131 317 -370
3424 -370 256 102 -434 287 -254 -270 257 -375 218 -88 -433 258 -228 -178 398 -362 133 77 -586 271 67
3445 67 -290 642 -51 -75 330 -453 356 87 -138 535 -187 19 288 -337 199 172 -330 484 -198 -232 465
3466 465 -366 84 114 -352 297 -26 -280 167 -252 33 189 -234 302 -252 -388 408 -212 -40 476 -330
3486 -330 70 122 -231 443 -142 -33 260 -236 194 -92 -329 239 -246 -145 280 -412 112 57 -488 484 32
3507 32 -272 474 -171 -5 243 -384 105 -24 -170 370 -379 150 219 -504 250 -24 -341 245 -103 -111 296
3528 296 -479 -29 130 -408 111 -137 22 201 -282 176 168 -347 289 101 -234 368 -176 -153 222 -169 276
3549B76j78k92N46m94J94J64n00N56k43m23P17o66J79M59p17N42K63q86P12l00
3569i1j11O86o74L14Q0m54N48k11j56M14m85J47J22m18P47m61k09O38p72J69M22
3590B45n33M02%n64M58k51J07L94o88P17k29m99P30o10J97N33o60N10M4n59M07
3611A51j97j40N34m44J48J61m58L84j37l20O31o32L37L44p85P66m01l62P74n47
3631a93k1M37l84M06m6l92M19m36k9N95o59N65M5o36O28l35l43Q40p81L24J87
3652A91m65K99k09M0M03o43L94J67n02N60j84k52O64n04j99N33n78K55L56m54
3672a28O53n05j3K23m41J36M12m24K75j92j96L36l95K11J81n35M81Mm34N02m50
3693b99J20M84m92M32j38m54P24n43O3N06n42K28J69m32M92r3m33N56o65L76J86
$$ plain form
3549 276 98 -194 352 -142 52 216 -284 272 29 -394 323 -343 -164 295 -422 120 383 -503 209 -91
3569 -91 -202 484 -190 124 204 -250 298 87 -69 345 -140 7 129 -289 458 -3 -212 426 -346 -177 245
3590 245 -288 114 114 -450 8 -243 -136 258 -430 287 58 -441 289 -321 -124 409 -251 259 303 -256 151
3611 151 -46 -186 348 -96 52 213 -245 139 2 -318 313 -319 18 362 -423 343 -58 -420 354 -193
3631 -193 -214 223 -161 245 199 -193 226 -210 -239 356 -303 262 307 -329 299 -36 -379 461 -320 4 191
3652 191 -274 25 -184 -144 259 -384 10 177 -325 235 51 -201 463 -41 -240 293 -285 -30 326 -128
3672 -128 525 20 7 230 -211 -75 337 -87 188 -4 -200 136 -259 -48 133 -402 79 83 -351 151 -299
3693 -299 -179 305 -187 245 107 -347 377 -166 -103 403 -139 89 258 -174 318 225 -208 348 -317 59 245
3714B45o90N76j38k16M11m93L93K35o74N56j78m15Q41o42J16N01o96L31N3l67
3734b51M32k48P7J70k97L37r3m08N37l16j04M18n86M37N2n42N02J41m19M94m51
3755a18MK34m33M00M2l88M23k49r8N44o27M55L7p41P22k73k38O07m05J38j24k14
3777c02N11k18k18L73p7k01K75n28L30K13n07P11m34K29J49o46L91R9l49N14m07
3798i2J27J24m12M46j67k16M18m23J3L52l45J99J35n29M90k80j65N78m12O7J90
3819I8k93L95j24k29N70l96k11M01o22O64r2n55P26l54j55M69m20J48J15m81M61
3840A15l06l9M49m68L52L0m36P36m86k33N69m81J16L14n18N47k18j73M82m88K44
3861A08J88m85K83m3l89N59l13M8L68o22J80K50k96L44k52k47O37m98J64K02m48
$$ plain form
3714 245 -445 131 -7 -223 188 -305 88 323 -351 205 27 -388 453 -189 -73 428 -268 63 116 -251
3734 -251 181 -67 10 180 -117 220 127 -281 256 -60 -164 254 -332 105 157 -385 117 258 -161 333 -118
3755 -118 -114 120 -313 87 129 -259 164 -85 -183 361 -266 189 226 -515 207 -66 -304 303 -102 36 -88 -302
3777 -302 209 -9 -227 146 69 -132 143 -385 -55 158 -349 362 -72 157 306 -340 51 150 -199 315 -92
3798 -92 35 159 -253 193 26 -190 228 -195 -182 170 -175 24 159 -370 120 -160 -325 253 -159 -92 98
3819 98 -195 200 76 -153 417 21 -190 211 -411 253 161 -394 332 -22 -177 292 -128 20 135 -346 115
3840 115 -191 -230 219 -249 103 133 -303 433 -53 -286 283 -198 -82 232 -286 261 43 -130 352 -136 108
3861 108 296 -189 94 51 -338 221 -92 -44 324 -298 -118 132 -164 180 -72 -319 318 -180 -16 186 -262
3882b62M92k82KL81n96L03O2l57N49k60l06O12m24j53N18n01K68j4l38N50l86
3903a42L3K59m88K82J19k80K77qk18M03n02K05J70l89N11l35j42O10l31m6K18
3924B06n43N42m2m39N61n79J69K01k86K63o9l66M16j33k33N91n77M31J64o65N74
3945A86k70L2L94m37J42K90o50N26j76j77M42k81JQ9k57K99J2m17O78n75P4J88
3967A13k67K01q4k38M99m90J33M14o30L39J30k86K19j45j09M22k38P6K29n93L54
3988D9p6k67O09l96NK04l44L77l26J0M19m29J24K51k85M8L4lK64k52j25M11l63
4011f1J06P9k71M01j77j71M91m49RL20o02M89m2k40L60k57m3L64n91L25Pm41N90
4034A96l68P4J52l27L50J69m74K84R3j51L33m78K08P2k75M08k31j65M18n43K89
$$ plain form
3882 -262 230 -52 -50 331 -265 38 100 -257 292 32 -274 338 -86 -239 279 -222 46 32 -306 244 -142
3903 -142 -109 150 -338 -56 63 -217 60 52 -166 237 -265 -60 110 -279 232 -103 -245 365 34 -12 206
3924 206 -337 205 163 -276 285 -294 -125 76 -210 53 -16 -382 34 -99 -332 259 -318 113 277 -388 186
3945 186 -84 -52 342 -95 47 337 -313 213 37 -140 302 21 22 111 -146 153 165 -252 426 -149 -75 113
3967 113 -154 47 -37 -275 224 -266 -133 281 -349 -10 120 -166 53 -92 -201 221 -17 59 288 -305 49
3988 49 -27 -294 315 -81 -76 128 -216 161 -165 -155 264 -165 -41 210 -75 -27 7 4 268 16 -109 302 -61
4011 -61 45 124 -147 254 77 -94 397 -52 -43 277 -325 164 122 -118 242 -15 -58 306 -285 40 47 -394 196
4034 196 -172 -98 54 -273 77 246 -228 56 149 -2 331 -147 61 133 -142 266 35 -130 288 -255 34
4055C4K06k56J45%m01M45l49n5K86m19M64p8l86O23l27K1M53m02l0R5l85O30l19
4078ep8M12l10J06o2k71K55r3j24N69n00j1L62m42L20p6l63N45m56J65K74l83
4100a66K82L0m70M30j76M2J99k92L03l6m59N67k44j90M07k40M1J19m16M39l29
4121a59J3M11l77O1K80m89N11j45k63L60l35L2K06m00L02K2l24M15k54j04N21
4142B84n60M07J67n75K94k05KL99m16K51Q0j94J86j44j99M56m56K80Q2m26M07
4163A20j11k34O72n25p9M69n84J75K88l64N68l65K6J22l44K29J9k10L08k30j52
4184b02M43o01K45K88m49M26j76k85M96l01K66J8l69M28j2l78L86l89J35N50r03
4205c84M69j1l53N05j58r1L30m78J84K8k88N03k64j23M21l88N0L32n80L87n1q2
$$ plain form
4055 34 240 -16 129 129 -272 173 -176 -231 55 -364 100 22 -364 259 -68 -47 406 4 -26 69 -316 314 -5
4078 -5 -83 329 19 125 63 -208 47 -46 -170 399 -101 -112 250 -192 128 52 -311 234 -222 -57 217 -166
4100 -166 116 146 -324 106 -70 -28 171 -121 182 146 -313 254 10 -180 227 -13 28 147 -269 170 -159
4121 -159 -146 265 -112 -51 229 -260 251 106 -157 203 -132 -100 106 -294 8 30 -294 121 -133 -237 284
4142 284 -276 131 298 -277 17 -188 -186 213 -203 48 128 -66 120 -24 -223 233 -223 57 139 -287 120
4163 120 9 -225 447 -78 -157 312 -272 -97 191 -173 395 30 56 178 -166 63 82 -128 180 -50 -202
4184 -202 241 -360 -115 173 -276 150 -26 -311 185 -116 150 168 -201 227 215 -163 223 -166 -31 519 -384
4205 -384 85 74 -279 226 68 -23 307 -171 13 41 -247 256 -8 -131 290 -98 -48 284 -296 91 40 -42
4227d2K60m99J65L18m85M15l7m28N38j82k42N34n81L52J1k41M28l65j89M21k83
4248a32J61M5l16M51k45j9J56k94L67o1k64K64m2k08M17m02L0M27n05J49M7r1
4270f5O7j94J53K87n22K63K9k22L70k53j51M75m23K34K5r0J05o1j58M65m98J75
4292A1K06m85L30P7j98K59l02O5J43m53O14k97j19L15j31j65M57p14L21K89m77
4313b54M35j13k37L79l53J03J06l46M20j48o6K09k60L19Q4l64J60O5l70L17j97
4334a11N6K98n72L32P7k66L21k37J96N1l90J39R4r0K93j42r9L92n19K50J50l45
4356a22K60r4k46M23l81L15J13n18L84j16o8K41k50JJ92m25J57M8k49M44m0j67
4378i8K97m30K82L6l14M50k24n4J97l43K47R1l07L53j64l03O24n59J61K72l08
$$ plain form
4227 -42 218 -281 -116 202 -283 132 95 -333 205 23 -219 315 -266 86 97 -144 284 -81 -270 151 -132
4248 -132 29 74 -242 209 -36 -55 101 -193 174 113 -151 113 71 -137 280 -122 -92 335 -170 -21 26 -65
4270 -65 2 -192 -39 248 -274 -11 18 -204 166 -87 -238 237 -186 48 73 -17 88 27 -131 334 -164 11
4292 11 217 -268 62 139 -59 200 -102 -37 106 -347 267 -30 -149 166 35 -130 327 -387 -66 223 -254
4313 -254 181 68 -169 210 -143 -40 66 -280 140 -8 -74 135 -125 194 278 -86 74 139 -231 86 -111
4334 -111 -55 243 -329 3 80 -186 135 -102 94 145 -245 -106 -12 -102 191 49 -50 342 -177 73 223 -122
4356 -122 138 44 -202 221 -160 155 268 -250 134 18 -50 191 -59 -58 134 -291 -134 -86 -335 109 69 -98
4378 -98 199 -231 51 87 -227 223 -1 -55 142 -201 46 137 -170 183 19 -284 340 -219 -58 214 -94
4399i4K04l0l34N55m67J13L17o31M51R6l86M15k81j1K60l76K48Q0m02M83k08r0
4421h8K86k83J94L0l42L11j58r4M27l67N5J33l84M09j36k24L23k13K6J75l23M03
4443A60kk90J88R3k88K92k31K69J0l96L81k22q2M40m09M6J73m25M06O7l25M18
4465B73m62J07K97n07K44J27k48M15l42j62N33k52N1Q5l79N10k70j31L35m27K52
4486D9J72n24M28j33n8K72k80K0K40l68K86r5k97M80l83O2L84n40M09j30%J91
4508A85Om05L38k82K49j22k49N01k16j48L34k96J92J69k53P8n1n3M4j76K58j34
4530c1p1K44j07j28L46k53j68M14l68J38J31k79L35k72K9K35l32K64j00MK30l07
4552d6o1K53k44Q9J16l10M36l88N7K03m04K56K72l67K46l13J21L56j90p0J22l53
$$ plain form
4399 -94 110 80 -254 301 -166 -53 264 -367 84 180 -206 209 -72 -83 177 -199 49 129 -273 210 2 -88
4421 -88 198 -85 109 139 -203 108 -50 -144 283 -84 -29 104 -280 129 -7 -231 92 -121 -95 80 -243 160
4443 160 158 -132 56 149 -139 153 -78 191 201 -195 186 -36 -118 322 -87 -41 132 -293 113 180 -145 273
4465 273 -189 -82 215 -292 -48 79 -169 246 -96 -258 275 23 74 159 -220 290 20 -111 224 -203 49
4486 49 221 -303 125 -8 -66 206 -74 -54 186 -182 104 9 -288 192 -191 -129 255 -285 124 -6 -6 185
4508 185 191 -214 124 -158 91 -31 -280 221 5 -143 191 -105 87 256 3 81 30 -23 21 -155 103 -31
4530 -31 -102 142 35 -93 253 0 -168 246 -122 16 147 -132 203 -69 -40 195 -137 127 27 31 261 -46
4552 -46 -107 146 -98 -9 107 -203 233 -155 -98 105 -299 -43 229 -138 108 -205 -84 272 82 12 134 -219
4574b19K81Q3l14K09r1N7J42l13K69M7l13L41k72q9L29m02L06k0l67N36j55k89
4596b44M20m40K14K04m62N15l39j04M17k07l8K95n05M32k9k12K70k54M5L15m85
4617a92J86M1l03K19m3J6K07l28j0L04j96J33Mq8K24l21R1J32k49L45ql05L06
4640A65j67m1J87l13K49Q5k76J62q6j18K33n1%J37l70K65m4k38M94l24J05L9k58
4663a65K81j43j51M22l12L8K16l72K16l4j52L69k44j97M54l91K25Ll43K57q4J33
4685B6L6j14k3J21k46J92M0p4J95k55K5K92m65L21J08k34J57l8j9J13j72J18O5
4708A69m51L36j59O1J66l91M20l5k99M04k26m4L50n09L03K18n63L20J06l28M38
4729B86l90K43J29m08K43j71J6J34k67J67K25k35J16Q4l36K93k12k0J91k11Q6
$$ plain form
4574 -219 62 145 -169 40 -51 6 148 -165 104 151 -162 179 -93 -182 147 -255 51 31 -336 200 45 -244
4596 -244 176 -264 -50 154 -308 207 -132 -236 181 -26 -64 231 -274 158 129 -83 187 -67 -22 293 -192
4617 -192 -6 35 -268 -49 -92 -76 131 -197 -207 97 -99 34 38 -50 174 -147 -56 76 -173 172 164 -141 165
4640 165 -2 -43 144 -169 80 165 -111 51 -35 -153 80 29 29 166 -204 61 17 -221 273 -51 54 93 -165
4663 -165 116 -27 -178 244 -68 -30 186 -186 30 -4 -156 213 -31 -228 226 -165 60 63 -280 -23 -107 26
4685 26 62 -52 -75 46 -200 -8 32 -42 153 -102 -77 215 -250 71 179 -55 102 64 45 158 -14 104 169
4708 169 -282 54 -105 -44 122 -269 151 116 -183 221 -5 -49 301 -208 95 313 -250 70 176 -152 286
4729 286 -104 139 268 -140 103 -68 -52 82 -185 -18 207 -28 88 172 -164 129 -83 -103 88 -123 -37
4750c7J84k98K82k93J08J74l09K38K8m21N86j74l00L93j39j75K97l01K82j16j44
4771a35L97l97K6L25l72K14j76k8K82k11p3K85m20K80K09l97K99k03o8L16k97
4792a44K21M2l68L82O6j89J83k41P7K5l27K87L0k01K39r0m3K14k49r5K31j89J29
4815a0p3j42L73k38J51Q3k89J82k6j15L73k27L6N1k71J29R2k06L42l04P0J91l43
4838a71K55j66j3L76l87J9J48k76N1L04l23J86M1m4K02k67L8K44l73K97k73o5
4860a97L69j38J5Q0j42J9j64k79M81m9j11K02j30J20R7l12L30k30j03K35j53j
4882f1K94k91L16j82j41J99k95J34Q7k46K68K3l27K56o0n5K87m79N09l59j01L77
4904A53j79q2J83j29J10q5j95J75J00k10L00j73J11o7r7K06j91j27M70l24K4K34
$$ plain form
4750 -37 147 -151 131 -162 -54 120 -189 49 77 -344 242 68 -232 161 22 -153 144 -157 125 9 -135
4771 -135 262 -135 -109 216 -156 58 -118 -146 136 -75 -148 137 -283 -3 206 -191 108 -95 -163 153 -144
4792 -144 77 119 -249 133 199 10 193 -48 29 54 -273 14 44 -157 82 -8 -51 163 -86 -181 50 -139 -10
4815 -10 -83 -225 148 -90 61 144 -145 37 11 -104 269 42 78 129 -142 -13 79 -127 215 -89 -19 172 -171
4838 -171 84 -82 -95 281 -106 -87 61 -215 -164 140 -183 3 44 0 202 -65 -27 217 -156 141 -132 -197
4860 -197 172 34 49 129 -13 6 -158 -437 44 -5 -116 86 -44 76 173 -139 191 -39 -142 93 -60 -61
4882 -61 233 -58 258 76 -65 134 -161 -27 60 -186 82 105 -222 34 -26 -81 206 -273 236 -123 -224 153
4904 153 -26 -108 75 -54 56 -29 -224 -49 51 -159 141 -32 79 12 -85 121 -70 -197 273 -51 -27 207
4926B07l12L30j65j38J10j86J17K00m57K13J54j88J30k6j79M22n21K43K09l12
4946a49L30k50N3Q8j05P3K3j29O9o6pQ8r3J54K6k24K71j14j14J59k73J12K12r3
4970D1p8Lj60L18j39j80K40j09J21N1j53L26k83j33J52o6N7J73k38J86j03j30
4992a04Q8k10M05N8l94K32q8o2J83k84J90J93l57K21k06M5L20l75J81J77k73R9
5014C9K09l04J69j71k3K91l39J62J29j45J27j27j92L19k19j7J99k66K68j97l7
5035a25L07l95K31J58l70K13O9l10M22j61k6J75l42lJ09N0k2j46n7K15n0O4N3
5058E9l05L13l4k39L15k53NJ08m0J99m7k59L63j52k18K84j20J67R5m65M19k19
5080b4n5J95k92L18Q1m44J22R8q8J56m9l6J66k88J92N1k89L46k39M8J76k65J52
$$ plain form
4926 207 -105 225 60 -78 32 -154 -37 163 -294 -81 73 -115 15 -11 -190 232 -289 -46 163 -149
4946 -149 181 -69 -16 72 -33 40 63 -66 3 -63 -70 18 -75 79 105 -119 152 38 -76 83 -190 -78 134 41
4970 41 -37 -34 -194 124 -15 -195 45 -64 57 108 -45 281 -2 -135 17 -49 8 181 -57 129 26 -104
4992 -104 -16 -226 179 237 -157 75 -13 -75 108 -176 14 207 -150 71 -135 -90 230 -145 36 213 -60 39
5014 39 248 -56 113 -58 -81 210 -129 33 162 17 144 17 -175 144 -75 -92 107 -159 109 -88 -125
5035 -125 182 -213 18 176 -194 19 88 -222 200 39 13 188 -154 -157 -48 2 -20 -166 -223 -8 -58 6 59
5058 59 -246 67 33 -206 109 -144 -139 -31 -71 128 81 -178 185 33 -185 99 -21 146 241 -224 195 -24
5080 -24 -79 116 -176 142 223 -221 -99 -1 -89 67 18 -18 148 -140 52 103 -186 160 -79 -31 145 -120 32
5103C2m2L2J38k81J49r4j35K97j98J0L10j91o1J00j88P6L1j44J95J5j90K05j31
5126f5J19j09j50K85j25r9J48j19K10K0j71K29j13j61L73l30k5J73o4n4R0j81
5148a19K85j26j13J40k07J38j08j22L55r0JJ87l64J16O5j63K81j95r0K06l9l1
5170GJ66k03K19j74j51K11o1j5P4k19J94J61l12L07k29l07N57l82R0J71l09L19
5192A14j23j01K63j86l2K99m10M14l89J35J16n7o7J18l18K67P6l09K89r1j93K86
5214A01k84J88L4k04L85l64J49J79l08kJ43j9J53j98M7J77l32J79n%P1m8j97L51
5238A96l83K05P6l19K62Rj62J83j47J32J20k44M5Q4k26K07l3O9J14l54M66k37
$$ plain form
5103 32 -10 22 160 -121 28 -66 -201 96 -102 -92 218 27 -34 66 -122 -46 -15 -159 36 51 -139 66 -65
5126 -65 54 -55 -205 80 -45 -144 4 -115 95 115 -56 173 60 -101 272 -58 -83 90 26 -28 62 -119
5148 -119 166 40 -73 67 -140 -2 -110 -232 123 33 34 221 -143 -27 38 -125 156 -39 -129 77 38 7
5170 7 173 -30 189 15 -136 75 14 -1 73 -146 48 209 -103 204 -25 -332 225 -157 -67 104 -205 114
5192 114 -9 -110 153 -33 -65 234 -176 238 -151 -16 100 43 -24 94 -224 43 119 -190 99 8 -185 101
5214 101 -183 5 39 -165 220 -144 5 184 -124 -126 17 -2 151 -47 0 177 -155 24 19 19 90 42 -155 196
5238 196 -187 18 94 -225 37 46 -116 67 -80 52 172 -72 -27 57 -169 38 5 74 188 -166 300 63
$$ [...]
8191a01
##END NTUPLES=NMR FID
##END=
