##TITLE=1H_Bau 14-2026
 200.13MHz,CDCl3.
 8 sc
 
 10.2.2026
##JCAMPDX= 6.0         $$ Bruker NMR JCAMP-DX V2.0
##DATA TYPE= NMR FID
##DATA CLASS= NTUPLES
##ORIGIN= UXNMR, Bruker Analytische Messtechnik GmbH
##OWNER= pz
$$ XWIN-NMR		Version 3.5
$$ Tue Feb 10 14:11:17 2026 Russian Standard Time (UT+4h)  she@DPX200
##.OBSERVE FREQUENCY= 200.1313
##.OBSERVE NUCLEUS= ^1H
##.DELAY= (6, 6)
##.ACQUISITION MODE= SIMULTANEOUS
##.ACQUISITION SCHEME= undefined
##.AVERAGES= 8
##.DIGITISER RES= 18
##SPECTROMETER/DATA SYSTEM= spect
##.PULSE SEQUENCE= zg30
##.SOLVENT NAME= CDCl3
##.SHIFT REFERENCE= (INTERNAL, CDCl3, 0, 14.3821)
##AUDIT TRAIL= $$ (NUMBER, WHEN, WHO, WHERE, WHAT)
$$ ##TITLE= Audit trail, XWIN-NMR		Version 3.5
$$ ##JCAMPDX= 5.01
$$ ##ORIGIN= Bruker BioSpin GmbH
$$ ##OWNER= she
$$ F:/spectra/data/she/nmr/H-C/1/audita.txt
$$ ##AUDIT TRAIL=  $$ (NUMBER, WHEN, WHO, WHERE, WHAT)
(   1,<2026-02-10 14:09:37.59 +0400>,<she>,<DPX200>,
      <created by zg, POWCHK disabled, PULCHK disabled
       configuration hash MD5:
       00 E9 B6 7A A2 85 ED C7 34 08 36 98 17 FE 4E 26
       data hash MD5: 16K
       55 78 C9 BC 6E B4 CF A7 71 DE 2D 9E EA DC 39 B8>)
$$ ##END=
$$ 
$$ hash MD5
$$ 51 22 E8 15 48 49 7D CB 2F E0 6D 8F BA 5C 3D 9B
##$RELAX= 
##$RELAX= 
##$RELAX= 
##$RELAX= 
##$RELAX= 
##$RELAX= 
$$ Bruker specific parameters
$$ --------------------------
##$DU= <F:/spectra>
##$EXPNO= 1
##$NAME= <H-C>
##$PROCNO= 1
##$TYPE= <nmr>
##$USER= <she>
##$AMP= (0..31)
100 100 100 100 100 100 100 100 100 100 100 100 100 100 100 100 100 100 
100 100 100 100 100 100 100 100 100 100 100 100 100 100 
##$AQSEQ= 0
##$AQ_mod= 1
##$AUNM= <au_zg>
##$AUTOPOS= <>
##$BF1= 200.13
##$BF2= 200.13
##$BF3= 200.13
##$BF4= 200.13
##$BF5= 200.13
##$BF6= 200.13
##$BF7= 200.13
##$BF8= 200.13
##$BYTORDA= 1
##$CFDGTYP= 0
##$CFRGTYP= 5
##$CHEMSTR= <none>
##$CNST= (0..31)
1 1 145 1 1 1 1 1 1 1 1 1 1 1 1 1 1 1 1 1 1 1 1 1 1 1 1 1 1 1 1 1 
##$CPDPRG= <>
##$CPDPRG1= <>
##$CPDPRG2= <>
##$CPDPRG3= <>
##$CPDPRG4= <mlev>
##$CPDPRG5= <mlev>
##$CPDPRG6= <mlev>
##$CPDPRG7= <mlev>
##$CPDPRG8= <mlev>
##$CPDPRGB= <>
##$CPDPRGT= <>
##$D= (0..31)
0 0.7 0 0 0 0 0 0 0 0 0 0.03 0 0 0 0 0 0 0 0 0 0 0 0 0 0 0 0 0 0 0 0 
##$DATE= 1770718176
##$DBL= (0..7)
120 120 120 120 120 120 120 120 
##$DBP= (0..7)
150 150 150 150 150 150 150 150 
##$DBP07= 0
##$DBPNAM0= <>
##$DBPNAM1= <>
##$DBPNAM2= <>
##$DBPNAM3= <>
##$DBPNAM4= <>
##$DBPNAM5= <>
##$DBPNAM6= <>
##$DBPNAM7= <>
##$DBPOAL= (0..7)
0.5 0.5 0.5 0.5 0.5 0.5 0.5 0.5 
##$DBPOFFS= (0..7)
0 0 0 0 0 0 0 0 
##$DE= 6
##$DECBNUC= <off>
##$DECIM= 32
##$DECNUC= <off>
##$DECSTAT= 4
##$DIGMOD= 1
##$DIGTYP= 9
##$DL= (0..7)
0 120 120 120 120 120 120 120 
##$DP= (0..7)
150 150 150 150 150 150 150 150 
##$DP07= 0
##$DPNAME0= <>
##$DPNAME1= <>
##$DPNAME2= <>
##$DPNAME3= <>
##$DPNAME4= <>
##$DPNAME5= <>
##$DPNAME6= <>
##$DPNAME7= <>
##$DPOAL= (0..7)
0.5 0.5 0.5 0.5 0.5 0.5 0.5 0.5 
##$DPOFFS= (0..7)
0 0 0 0 0 0 0 0 
##$DQDMODE= 0
##$DR= 18
##$DS= 0
##$DSLIST= <SSSSSSSSSSSSSSS>
$$ [...]
##$SUBNAM0= <"">
##$SUBNAM1= <"">
##$SUBNAM2= <"">
##$SUBNAM3= <"">
##$SUBNAM4= <"">
##$SUBNAM5= <"">
##$SUBNAM6= <"">
##$SUBNAM7= <"">
##$SUBNAM8= <"">
##$SUBNAM9= <"">
##$SW= 18.0517328524113
##$SWIBOX= (0..15)
0 0 2 0 0 0 0 0 0 0 0 0 0 0 0 0 
##$SW_h= 3612.71676300578
##$TD= 16384
##$TD0= 1
##$TE= 0
##$TE2= 300
##$TE3= 300
##$TEG= 300
##$TL= (0..7)
0 120 120 120 120 120 120 120 
##$TP= (0..7)
150 150 150 150 150 150 150 150 
##$TP07= 0
##$TPNAME0= <>
##$TPNAME1= <>
##$TPNAME2= <>
##$TPNAME3= <>
##$TPNAME4= <>
##$TPNAME5= <>
##$TPNAME6= <>
##$TPNAME7= <>
##$TPOAL= (0..7)
0.5 0.5 0.5 0.5 0.5 0.5 0.5 0.5 
##$TPOFFS= (0..7)
0 0 0 0 0 0 0 0 
##$TUNHIN= 0
##$TUNHOUT= 0
##$TUNXOUT= 0
##$USERA1= <user>
##$USERA2= <user>
##$USERA3= <user>
##$USERA4= <user>
##$USERA5= <user>
##$V9= 5
##$VALIST= <valist>
##$VCLIST= <CCCCCCCCCCCCCCC>
##$VD= 0
##$VDLIST= <DDDDDDDDDDDDDDD>
##$VPLIST= <PPPPPPPPPPPPPPP>
##$VTLIST= <TTTTTTTTTTTTTTT>
##$WBST= 1024
##$WBSW= 4
##$XGAIN= (0..3)
0 0 0 0 
##$XL= 0
##$YL= 0
##$YMAX_a= 17588
##$YMIN_a= -26215
##$ZGOPTNS= <>
##$ZL1= 120
##$ZL2= 120
##$ZL3= 120
##$ZL4= 120
##$ABSF1= 10
##$ABSF2= 0
##$ABSG= 5
##$ABSL= 3
##$ALPHA= 0
##$AQORDER= 0
##$ASSFAC= 0
##$ASSFACI= 0
##$ASSFACX= 0
##$ASSWID= 0
##$AUNMP= <proc_1d>
##$AZFE= 0.1
##$AZFW= 0.1
##$BCFW= 1
##$BC_mod= 2
##$BYTORDP= 1
##$COROFFS= 0
##$CY= -3
##$DATMOD= 1
##$DC= 2
##$DFILT= <>
##$DTYPP= 0
##$F1P= 0
##$F2P= 0
##$FCOR= 0.5
##$FTSIZE= 0
##$FT_mod= 4
##$GAMMA= 1
##$GB= 0.15
##$INTBC= 1
##$INTSCL= 1
##$ISEN= 128
##$LB= 0.25
##$LEV0= 0
##$LPBIN= 0
##$MAXI= 10000
##$MC2= 0
##$MEAN= 0
##$ME_mod= 0
##$MI= 1.114404
##$NCOEF= 0
##$NC_proc= 0
##$NLEV= 6
##$NOISF1= 3.799351
##$NOISF2= 2.8
##$NSP= 1
##$NTH_PI= 0
##$NZP= 0
##$OFFSET= 14.38212
##$PC= 1
##$PHC0= -3711.053
##$PHC1= 26.19233
##$PH_mod= 1
##$PKNL= yes
##$PPARMOD= 0
##$PSCAL= 0
##$PSIGN= 0
##$REVERSE= no
##$SF= 200.129724274929
##$SI= 16384
##$SIGF1= 3
##$SIGF2= 2
##$SINO= 400
##$SIOLD= 16384
##$SREGLST= <1H.CDCl3>
##$SSB= 0
##$STSI= 0
##$STSR= 0
##$SW_p= 3205.1282051282
##$SYMM= 0
##$S_DEV= 0
##$TDeff= 0
##$TDoff= 0
##$TI= <>
##$TILT= no
##$TM1= 0
##$TM2= 0
##$TOPLEV= 0
##$USERP1= <user>
##$USERP2= <user>
##$USERP3= <user>
##$USERP4= <user>
##$USERP5= <user>
##$WDW= 1
##$XDIM= 8192
##$YMAX_p= 0
##$YMIN_p= 0
$$ End of Bruker specific parameters
$$ ---------------------------------
##NTUPLES= NMR FID
##VAR_NAME=  TIME,          FID/REAL,        FID/IMAG
##SYMBOL=    X,             R,               I
##VAR_TYPE=  INDEPENDENT,   DEPENDENT,       DEPENDENT
##VAR_FORM=  AFFN,          ASDF,            ASDF
##VAR_DIM=   8192,          8192,            8192
##UNITS=     SECONDS,       ARBITRARY UNITS, ARBITRARY UNITS
##FACTOR=    0.0002768,     1,               1
##FIRST=     0,             0,               0
##LAST=      2.2672688,     0,               0
##MIN=       0,             -26215,          0
##MAX=       2.2672688,     17588,           0
$$ Real data points
##PAGE= N=1
##DATA TABLE= (X++(R..R)), XYDATA
$$ [...]
$$ plain form
2299 848 -643 -985 1027 -1143 -118 1091 -1049 563 700 -1043 1170 298 -880 1314 -353 -550
2315 -550 1300 -913 -41 947 -1087 294 366 -1574 879 98 -1081 1207 -519 -342 1256 -468 223
2332 223 1244 -911 579 660 -1080 878 -71 -1026 997 -629 -750 971 -1066 -355 902 -1296 394
2349 394 483 -1112 1103 282 -686 1400 -216 -270 1273 -615 -22 1120 -1044 338 508 -1413 743
2366 743 -194 -1130 742 -529 -756 963 -741 127 1085 -673 866 695 -779 1092 -98 -810 1041
2383 1041 -547 -530 873 -1014 -236 615 -1217 97 304 -1092 793 -102 -765 1220 -429 -228 1284
2400 1284 -505 461 892 -855 690 245 -1074 893 -266 -969 683 -1000 -413 615 -1165 290
2416 290 644 -852 752 408 -880 1121 -35 -334 1432 -559 -144 894 -983 170 543 -1239
$$ packed form
2299H48j491l42K012k170J025J209k140J612J37j743K213q72j178K194j667j97
2315e50J850k213Q72R88k034J381P2j940K453p81j179K288j726J77J598j724O91
2332B23J021k155J490Q1j740J958r49r55K023j626j21J721k037P11J257k198J690
2349C94Q9j595K215q21r68K086j616n4J543j888N93J142k164J382J70j921K156
2366G43r37r36J872j271k27J719j704Q68R58j758J539j71j474J871j190p12J851
2383A041j588J7J403j887P78Q51j832J314K07j396J885q95o63J985j649K01J512
2400A284j789R66M31j747J545m45j319J967j159p03J652j683N87J028j780J455
2416B90L54j496J604l44j288K001j156k99J766j991M15J038j877J153L73j782
$$ plain form
2432 -1239 437 -214 -1457 753 -232 -784 1238 -664 -220 1207 -983 192 1114 -870 840 617
2448 617 -794 1064 -19 -714 1070 -968 -587 815 -1103 -69 566 -1196 644 558 -989 1019
2464 1019 -162 -450 1277 -346 65 1328 -857 298 759 -1164 332 337 -1165 704 -335 -945 1189
2481 1189 -674 -432 926 -1047 222 892 -707 683 430 -758 1184 -7 -844 951 -553 -259
2497 -259 579 -1070 33 337 -1196 376 128 -800 980 -126 -550 1019 -493 170 1164 -651 361
2514 361 574 -645 876 176 -1092 611 -394 -795 632 -855 -277 599 -848 232 634 -756 724
2531 724 395 -677 984 55 -155 915 -524 -98 688 -947 115 352 -1007 351 -305 -917 844
2548 844 -525 -431 1058 -633 37 967 -781 617 600 -787 849 383 -612 946 -481 -359 1004
$$ packed form
2432a239J676o51j243K210r85n52K022j902M44J427k190J175R22j984J710k23
2448F17j411J858j083o95J784k038L81J402j918J034O35j762J840q6j547K008
2464A019j181k88J727j623M11J263k185J155M61j923J496Nj502J869j039o10K134
2481A189j863K42J358j973J269O70j599J390k53j188J942j191q37J795j504K94
2497b59Q38j649J103L04j533J572k48r28J780j106m24J569j512O63R94j815J012
2514C61K13j219J521p00j268J703j005m01J427j487N78Q76j447J080M02j390J480
2531G24l29j072J661r29k10J070j439M26P86j635J062K37j359J358o56o12J761
2548H44j369R4J489j691O70R30j748J398j7j387J636m66r95J558j427J22J363
$$ plain form
2565 1004 -1012 -415 581 -1179 158 373 -1175 713 56 -690 1094 -2 -277 899 -414 178 928
2582 928 -799 457 617 -1172 672 -157 -1004 748 -423 -663 1061 -916 -129 924 -824 339
2598 339 723 -854 824 495 -678 1141 -243 -441 886 -780 -247 623 -1087 249 520 -1051 588
2615 588 -103 -1035 732 -262 -407 1093 -517 38 1123 -723 431 666 -892 634 -202 -966 734
2632 734 -364 -602 875 -877 -254 674 -815 137 600 -718 700 76 -510 767 -157 -150 859 -692
2650 -692 29 567 -550 367 349 -1171 370 31 -849 524 -453 -286 654 -522 66 693 -569 578
2668 578 515 -660 800 -3 -490 728 -362 -290 433 -692 -163 350 -968 37 210 -815 667 84
2686 84 -699 865 -231 75 949 -704 237 489 -742 519 -12 -840 625 -255 -467 547 -676 -301
$$ packed form
2565A004k016N97R96j760J337K15j548J888o57p46J784j096k75J176j313N92P50
2582I28j727J256J60j789J844q29q47J752j171k40J724j977P87J053j748J163
2598C39L84j577J678l29j173J819j384j98J327j666N33Q70j710J336K71j571J639
2615E88o91r32J767r94j45J500j610N55J085j846J154K35j558J526q36p64J700
2632G34j098k38J477j752O23R28j489R52M63j318J418o24n86J277r24PJ009j551
2650f92P21N38j117R17j8j520J541l39q80J373r77J67R40j176N88O27j262J147
2668E78o3j175J460q03m87J218j090P2P23j125N29N13j318J005J73j025J482n83
2686H4p83J564j096L06Q74j653R41K52j231J261n31q28J465q80k12J014j223L75
$$ plain form
2704 -301 584 -1048 125 469 -773 617 386 -682 872 99 -371 1173 -324 -221 697 -797 103
2721 103 381 -1027 474 289 -895 593 -311 -452 814 -486 -211 977 -484 269 660 -784 691
2738 691 411 -738 592 -193 -552 792 -870 -468 734 -993 -20 596 -955 434 327 -469 885
2755 885 72 -333 1048 -280 -134 725 -758 155 473 -896 466 83 -914 569 -245 -630 753 -625
2773 -625 -228 776 -594 55 803 -471 626 455 -571 623 -109 -457 882 -439 -392 378 -826
2790 -826 -62 183 -805 318 133 -652 731 -138 -395 786 -214 45 693 -448 260 633 -753 521
2808 521 -9 -648 495 -344 -585 546 -464 -87 580 -638 312 207 -633 589 285 -603 1028 98
2826 98 -93 1036 -532 13 761 -646 236 220 -679 483 167 -907 603 -380 -308 677 -680 -63 853
$$ packed form
2704c01Q85j632J173L44j242J390k31j068J554p73m70J544j497J03R18j494R00
2721A03K78j408J501j85j184J488r04j41J266j300K75J188j461P53L91j444J475
2738F91k80j149J330p85l59J344j662M02J202j727R73O16j551J389j07p96J354
2755H85q13m05J381j328J46Q59j483R13L18j369J362l83r97J483q14l85J383j378
2773f25L97J004j370O49P48j274J097j71j026J194p32l48J339j321M7P70j204
2790h26P64K45r88J123j85p85J383q69k57J181j000K59O48j141P08L73j386J274
2808E21n30o39J143q39k41J131j010L77O67j218R50j05q40J222l04q88J631r30
2826I8j91J129j568N45P48j407Q82j6q99J162l16j074J510r83P2R85j357O17R16
$$ plain form
2845 853 -430 441 438 -795 555 146 -500 661 -308 -525 564 -797 -212 647 -841 0 135 -833
2863 -833 446 128 -813 889 -67 -187 750 -451 -95 476 -886 198 438 -701 352 -80 -749 528
2881 528 -229 -436 434 -559 -193 860 -605 313 521 -579 790 90 -604 665 -246 -323 802 -610
2899 -610 -219 358 -1070 112 278 -859 621 -71 -682 719 -130 -336 1078 -229 115 761 -404
2916 -404 298 117 -611 348 -33 -568 603 -434 -454 547 -641 -198 391 -402 264 479 -595 432
2934 432 138 -619 684 -105 -183 730 -262 -109 594 -694 142 180 -619 295 -99 -504 308 -609 -230 563
2954 563 -547 70 406 -412 449 493 -650 676 -54 -386 617 -646 -282 478 -598 -142 402 -755
2972 -755 474 335 -609 591 94 -644 638 -155 -82 630 -605 174 634 -768 481 -20 -813 474
$$ packed form
2845H53j283Q71lj233J350m09o46J161r69k17J089j361N85Q59j488Q41J35r68
2863h33J279l18r41J702r56j20R37j201L56N71j362J084K40j139J053m32o69J277
2881E28p57k07Q70r93L66J053j465R18K08j100J369p00o94J269r11p7J125j412
2899f10L91N77j428J182J66j137J480o92o11J401q49k06J414j307L44O46j165
2916d04P02j81p28R59l81n35J171j037k0J001j188M43N89p93O66K15j074J027
2934D32k94p57J303p89p8R13r92J53P03j288Q36L8p99R14l94m05Q12r17L79P93
2954E63j110O17L36q18Q61M4j143J326p30l32J003j263L64P60j076M56N44j157
2972g55J229j39r44J200m97p38J282p93P3P12j235P79M60j402J249n01p93J287
$$ plain form
2990 474 -230 -465 564 -589 -225 586 -587 84 673 -791 775 624 -643 736 168 -466 787
3007 787 -363 -237 737 -672 215 584 -930 277 86 -693 549 -391 -583 651 -375 40 820 -421
3025 -421 225 510 -613 406 171 -821 585 -159 -523 747 -746 -522 578 -800 141 390 -697
3042 -697 329 208 -634 388 96 -523 820 -554 -130 774 -448 118 199 -674 238 134 -635 500
3060 500 -239 -538 533 -401 -143 995 -554 135 411 -505 529 355 -417 650 -12 -530 374 -565
3078 -565 -158 378 -497 -1 105 -566 270 320 -545 431 -120 -257 618 -177 140 488 -385 375 561 -737
3098 -737 569 74 -651 623 -409 -362 505 -610 -129 386 -562 364 168 -802 387 325 -496 618 -298
3117 -298 -204 435 -528 -248 449 -723 250 377 -835 373 54 -521 547 -108 -279 709 -352 31 967
$$ packed form
2990D74p04k35J029j153L64Q11j173O71N89j464J566j51j267J379n68o34J253
3007G87j150J26R74j409Q87L69j514J207j91p79J242r40j92J234j026M15P80j241
3025d21O46K85j123J019k35r92J406p44l64J270j493K24J100j378R41K49j087
3042f97J026j21q42J022k92o19J343j374M24R04j222N66Q1q73R12j04p69J135
3060E00p39k99J071r34K58J138j549O89K76r16J034j74p72J067o62n18R04r39
3078e65M07N36q75M96J06o71Q36N0q65R76n51j37Q75p95L17L48q73P60J86j298
3098g37J306m95p25J274j032M7Q67j115M81N15r48R26j96r70J189o2q21J114r16
3117b98R4O39r63K80O97j172R73J27j212J208l19n75J068o55j71R88j061L83R36
$$ plain form
3136 967 -541 273 514 -543 623 299 -487 722 -202 -467 350 -694 -268 541 -702 149 308 -386
3154 -386 461 -7 -473 647 -104 -208 832 -301 -11 884 -642 127 297 -800 393 27 -618 353
3172 353 -140 -277 551 -396 -298 642 -611 418 251 -568 549 431 -593 546 -185 -369 563 -454
3190 -454 -272 205 -634 341 339 -817 345 140 -629 550 -206 -206 688 -422 29 316 -395 171 507 -464
3210 -464 259 119 -458 490 -387 -199 479 -587 -267 469 -473 342 325 -451 280 107 -503 460 -181 -150
3230 -150 602 -215 124 490 -609 223 35 -551 443 16 -443 668 -224 -73 279 -623 67 394 -349
3249 -349 277 454 -448 518 -89 -374 772 -279 -464 589 -468 3 375 -565 249 50 -610 484
3267 484 -238 -438 707 -174 -170 682 -450 48 584 -590 61 31 -814 358 -197 -485 529 -301 -95
$$ packed form
3136I67j508Q14K41j057J166l24p86J209r24k65Q17j044M26Q09j243Q51J59o94
3154c86Q47m68m66J120p51j04J040j133K90Q95j526P69J70j097J193l66o45R71
3172C53m93j37Q28r47R8R40j253J029j67q19J117j18j024J139p31j84R32j017
3190d54J82M77q39R75kj156J162k05p69J179p56%Q94j110M51K87p11N66L36r71
3210d64P23j40n77R48q77J88O78j066L20P36r42Q15j7p76P31j73o10R63o41L1
3230a50P52q17L39L66j099Q32j88n86R94m27m59J111q92J51L52r02O90L27p43
3249c49O26J77r02R66o07k85J146j051j85J053j057M71L72r40Q14j99o60J094
3267D84p22k00J145q81MQ52j132M98N36j174O51l0q45J172n55k88J014q30K06
$$ plain form
3286 -95 579 -646 149 425 -276 484 93 -469 541 -85 -275 659 -360 -187 669 -697 -47 328 -651
3305 -651 324 220 -420 639 -92 -535 616 -65 -142 809 -463 219 375 -513 427 378 -643 449 24
3324 24 -447 567 -436 -230 548 -610 -135 311 -601 316 340 -310 319 182 -423 521 -70 -150 289 -490
3344 -490 10 471 -612 283 94 -583 208 -136 -436 392 -316 66 515 -396 239 429 -667 391 233
3363 233 -412 464 -357 -469 584 -375 -165 548 -480 37 58 -501 116 163 -437 603 -102 -272 688 -376
3383 -376 -150 472 -370 81 468 -458 441 150 -429 352 -239 -402 398 -401 -288 555 -558 217 415 -393
3403 -393 483 209 -379 566 -64 -376 458 -188 -49 341 -531 171 161 -661 216 -224 -674 382 -243 -200
3423 -200 603 -330 -44 532 -527 303 448 -508 193 190 -391 544 -74 -404 611 -416 -160 278 -401 77
$$ packed form
3286i5O74j225P95K76p01P60l91n62J010o26j90R34j019J73Q56j366O50L75r79
3305f51R75j04o40J059p31m43J151o81p7R51j272O82J56q88R40m9j021J092m25
3324B4m71J014j003K06P78j158M75M46r12R17K4o50O29j37o05R44n91q0M39p79
3344d90N00M61j083Q95j89o77P91l44l00Q28p08L82M49r11O35J90j096J058j58
3363B33o45Q76q21j12J053r59K10P13j028N17K1n59O17M7o00J040p05j70R60j064
3383c76K26O22q42M51L87r26Q99k91n79P81n91j63Q00p99J13Q43j113P75J98q08
3403c93Q76k74n88R45o30l12Q34o46J39L90q72P02j0q22Q77m40m50J056o25M3
3423b00Q03r33K86N76j059Q30J45r56P01ln81R35o18l30J015j027K56M38o79M78
$$ plain form
3443 77 342 -678 668 7 -340 560 -68 -290 532 -396 -192 303 -533 13 313 -579 214 78 -561 367
3463 367 32 -415 402 -354 -62 303 -472 230 429 -356 234 -72 -234 554 -107 -345 463 -405 -151 164
3483 164 -390 109 244 -321 274 192 -523 447 -57 -177 540 -283 78 354 -303 148 345 -306 280 -143
3503 -143 -427 360 -365 -164 246 -413 -116 318 -355 228 344 -374 257 52 -423 670 -230 -151 570 -427
3523 -427 -134 113 -710 152 130 -573 90 27 -472 493 -219 -231 580 -391 156 222 -576 238 180 -439 338 -70
3545 -70 -381 542 -236 -356 474 -539 -97 232 -466 188 111 -479 457 61 -340 477 -35 96 699 -475
3565 -475 -31 372 -392 259 210 -412 401 -25 -370 545 -220 -17 433 -423 114 400 -252 201 153 -377 449
3586 449 61 -486 474 -332 -289 266 -426 72 424 -390 86 69 -452 427 123 -537 448 -207 -143 655 -177
$$ packed form
3443G7K65j020J346o61l47R00o28k22Q22r28K04M95q36N46L00q92P93j36o39R28
3463C67l35m47Q17p56K92L65p75P02J99p85N90l06j62P88o61k38Q08q68K54L15
3483A64n54M99J35n65N95q2p15R70n04j20P17q23L61K76o57M51J97o51N86m23
3503a43k84P87p25K01M10o59K97M34o73N83J16p18O31k05m75J093r00P9P21r97
3523d27K93K47q23Q62k2p03O63o3m99R65p12j2Q11r71N47O6p98Q14n8o19P77m08
3545g0l11R23p78j20Q30j013M42L29o98O54p7n90R36l96m01Q17n12J31O03j174
3565d75M44M03p64O51m9o22Q13m26l45R15p65K03M50q56N37K86o52M53m8n30Q26
3586D49l88n47R60q06M3N55o92M98L52q14M76j7n21Q79l04o60R85o55O4P98q32
$$ plain form
3607 -177 258 347 -474 97 215 -758 409 -83 -469 387 -321 -202 419 -138 -153 486 -306 448 216 -256
3627 -256 428 227 -143 533 -130 -307 380 -387 -118 223 -466 229 122 -526 305 -102 -378 425 -153 -172
3647 -172 459 -170 -22 296 -332 246 284 -186 419 -49 -347 94 -392 -160 442 -301 65 140 -358 200 203
3668 203 -388 207 -7 -363 461 -186 153 473 -250 17 327 -385 173 149 -492 355 -75 -337 490 -266
3688 -266 -112 414 -404 9 283 -693 503 124 -214 540 80 -311 431 -383 153 500 -286 -41 222 -586
3708 -586 340 179 -326 276 -85 -192 485 -155 -91 456 -118 -4 215 -409 269 133 -639 390 -7 -112
3728 -112 190 -385 -38 215 -230 127 353 -464 134 278 -500 368 -117 -171 441 -208 -81 374 -139 -132 112
3749 112 -381 95 124 -294 261 -220 -260 348 -319 41 310 -178 259 499 -205 459 46 -242 411 -139 -267
$$ packed form
3607a77M35Q9q21N71J18r73J167m92l86Q56p08J19O21n57j5O39p92P54k32m72
3627b56O84k01l70O76o63j77O87p67K69L41o89O95j07o48Q31m07k76Q03n78j9
3647a72O31o29J48L18o28N78L8m70O05m68k98M41m86K32O02p43L66P5m98N58L
3668B03n91N95k14l56Q24o47L39L20p23K67L10p12N58k4o41Q47m30k62Q27p56
3688b66J54N26q18M13K74r76J196l79l38P54m60l91P42q14N36L47p86K45K63q08
3708e86R26j61n05O02l61j07O77o40O4N47n74J14K19o24O78j36p72J029l97j05
3728a12L02n75L47K53m45L57K26q17N98J44p78Q68m85n4O12o49J27M55n13PK44
3749A12m93M76K9m18N55m81m0O08o67L60K69m88M37K40p04O64m13k88O53n50j28
$$ plain form
3770 -267 342 -166 -172 165 -69 61 246 -222 109 78 -414 479 -313 -98 180 -289 -139 251 -232 196 140
3791 140 -204 204 187 -349 472 -165 -246 449 -308 165 417 -187 -105 130 -202 177 -24 -405 98 -281 -51
3812 -51 334 -219 195 303 -474 78 130 -513 235 -67 -296 252 -190 -119 547 -567 -99 487 -190 239 428
3833 428 -348 276 60 -386 462 -231 -208 139 -464 12 277 -290 32 354 -404 378 -87 -223 460 47
3853 47 13 371 -363 -14 256 -375 109 69 -373 397 -40 -146 411 -45 -168 321 -244 -80 416 -239 208
3874 208 50 -462 356 -85 -144 238 -242 -206 359 -107 -55 200 -286 460 21 -414 356 -15 -322 534 53
3895 53 -176 280 -188 34 413 -374 120 226 -176 207 112 -396 101 -233 -142 271 -212 60 412 -193 121
3916 121 3 -487 317 122 -250 353 -56 -231 325 -144 62 402 -401 -26 47 -355 214 -147 -464 396
$$ packed form
3770b67O09n08oL37k34J30J85m68L31l1m92Q93p92K15K78m69J50L90m83M28n6
3791A40l44M08j7n36Q21o37q1O95p57M73K52o04Q2K35l32L79k01l81N03l79K30
3812e1L85n53M14J08p77N52N2o43P48l02k29N48m42P1O66j114M68N86o77M29J89
3833D28p76O24k16m46Q48o93K3L47o03M76K65n67L22L22p58P82m65j36O83m13
3853D7l4L58p34L49K70o31M84m0m42P70m37j06N57m56j23M89n65J64M96o55M47
3874B08j58n12Q18m41n9L82m80L6N65m66N2K55m86P46m39m35P70l71l07Q56m81
3895E3k29M56m68K22L79p87M94J06m02L83r5n08M97l34R1M13m83K72L52o05L14
3916A21j18m90Q04j95l72O03m09j75N56m69K06L40q03L75P3m02N69l61l17Q60
$$ plain form
3936 396 -89 -93 238 -406 -150 67 -259 212 152 -217 179 -35 -242 46 0 -223 191 -246 50 -23 -421 113
3958 113 26 -378 137 94 -171 219 -222 -12 64 -229 90 221 -356 79 -36 -288 207 -135 -243 115 11
3979 11 52 382 -530 -32 385 -205 275 282 -231 316 19 -313 341 -387 -5 257 -410 -16 214 -312 227
4000 227 70 -265 387 7 -230 244 -233 147 463 -326 125 282 -224 -69 61 -316 163 -153 -373 307
4020 307 -332 -11 233 -321 -64 240 -285 266 137 -331 292 -38 -276 251 -317 -22 249 -264 19 215
4040 215 -459 0 -15 -235 134 -6 -180 372 -169 138 191 -5 11 315 -301 102 233 -293 315 -42 -92
4061 -92 188 -475 52 370 -316 84 158 -407 146 -52 -130 202 18 -233 333 -189 191 418 -322 279 69
4082 69 -368 207 -151 -164 316 -303 -118 186 -154 154 140 -206 104 248 -427 138 20 -231 293 -50 -135
$$ packed form
3936C96m85mL31o44K56K17l26M71o0l69L96k14k07K88m6k23M14m37K96p3l98N34
3958A13q7m04N15m3k65L90m41K10P6k93L19J31n77M35j15k52M95l42j08L58j04
3979A1M1L30r12M98M17n90M80Pn13N47k97l32O54p28L82K62o67L94K30n26N39
4000B27j57l35O52l80k37M74m77L80L16p89M51J57n06J55J30l77M79l16k20O80
4020C07o39L21K44n54K57L04n25N51j29m68O23l30k38N27n68K95K71n13K83J96
4040B15o74M59j5k20L69j40j74N52n41L07N3j96J6L04o16M03J31n26O08l57n0
4061i2K80o63N27L18o86M00P4n65N53j98p8L32j84k51N66n22L80K27p40O01k10
4082F9m37N75l58j3M80o19J85L04l40L08j4l46L10J44o75N65j18k51N24l43q5
$$ plain form
4103 -135 198 -298 -73 231 -335 -28 197 -421 386 92 -436 499 -359 -30 245 -222 260 401 -422 138
4123 138 71 -452 283 -21 -322 557 -339 4 265 -323 167 327 -344 128 317 -189 238 -58 -113 527 -379
4144 -379 -288 209 -246 66 148 -258 78 151 -553 261 -106 -349 483 -104 -39 346 -298 -11 320 -410 191
4165 191 332 -225 334 6 -497 150 -233 -108 253 -304 21 159 -108 116 215 -239 457 64 -232 313
4185 313 59 -12 488 -170 81 226 -203 210 121 -237 194 86 -356 328 -246 -179 246 -94 -94 288 -230 87
4207 87 134 -60 359 63 -185 350 -343 189 181 -183 311 424 -293 223 67 -302 354 -6 -110 344 -20
4228 -20 -77 319 -335 -189 -21 -135 223 98 -217 162 -7 -241 319 -29 -211 328 -277 132 -22 -523 275
4249 275 126 -205 315 -41 -211 528 -79 -99 411 -275 136 257 -427 253 200 -361 59 -131 -142 213 -302
$$ packed form
4103a35L33m96K25L04n66L07K25o18Q07k94n28R35q58L29K75m67M82J41q23N60
4123A38o7n23P35l04l01Q79q96L43K61n88M90J60o71M72J89n06M27k96n5O40r06
4144c79R1M97m55L12Q2m06L36P3p04Q14l67k43Q32n87O5L85o44K87L31p30O01
4165A91J41n57N59l28n03O47l83J25L61n57L25J38k67K24R9m54O96l93k96N45
4185C13k54p1N00o58K51J45m29M13q9l58M31j08m42O84n74O7M25l40%L82n18L17
4207H7M7j94M19k96k48N35o93N32ql64M94J13p17N16j56l69O56l60j04M54l64
4228b0n7L96o54J46J68j14L58j25l15L79j69k34N60l48j82N39o05M09j54n01P98
4249B75j49l31N20l56j70P39o07k0N10o86M11J21o84O80n3n61M20j90j1L55n15
$$ plain form
4270 -302 -125 231 -176 -66 308 -161 205 25 -288 263 9 -119 329 -78 -179 228 -419 46 364 -330
4290 -330 321 269 -217 170 -106 -314 283 -103 -99 496 -265 -38 566 -159 -49 158 -155 147 -196 -216 277
4311 277 -174 -92 228 -118 -54 276 -310 118 167 -144 229 -343 -312 157 -84 -100 339 -281 33 23 -124 193
4333 193 -72 -362 336 -111 -13 290 -90 101 450 -252 -136 248 -282 72 -79 -279 148 -202 -51 421
4353 421 -182 -38 338 -263 -114 27 -334 122 -82 -255 113 -23 -18 571 -189 -13 180 -185 415 213 -113
4374 -113 367 -194 -466 526 -77 -347 129 -415 -34 211 -124 22 82 -259 56 157 -146 324 -203 -135 188
4395 188 -14 42 242 -314 37 74 -323 361 142 -263 264 -141 -55 273 -101 87 198 -470 141 222 -158
4416 -158 362 95 -221 174 -238 -77 523 -293 -81 53 -298 203 201 -342 448 172 -409 412 -116 -245 213
$$ packed form
4270c02J77L56m07J10L74m69L66j80l13N51k54j28M48m07j01M07o47M65L18o94
4290c30O51n2m86L87k76k08N97l86MN95p61K27O04p25J10K07l13L02l43k0M93
4311B77m51Q2L20l46O4L30n86M28M9l11L73n72L1M69k41j6M39o20L14j0j47L17
4333A93k65k90O98m47R8L03l80J91L49p02J16L84n30L54j51k00M27l50J51M72
4353D21o03J44L76o01J49J41l61M56k04j73L68j36NN89p60J76J93l65O00k02l26
4374a13M80n61k72R92o03k70M76n44L81K45l35J46O0l41L15J01l03M70n27O8L23
4395A88k02N6K00n56L51L7l97O84k19m05N27m05Q6L28l74J88J11o68O11Q1l80
4416a58N20k67l16L95m12J61O00q16K12J34l51N01kn43P90k76n81Q21n28j29M58
$$ plain form
4437 213 -312 -29 122 -325 52 86 -138 79 135 -212 390 25 -180 530 -191 2 237 -292 -25 42 -267
4458 -267 238 -140 -268 177 -277 -114 338 -214 17 63 -350 167 102 -357 122 22 -99 165 -203 -32 435
4479 435 -171 62 250 -440 179 301 -324 249 182 -215 223 -328 -113 106 -264 154 221 -268 177 82 -286
4500 -286 234 1 -232 73 -19 -205 250 -6 -108 330 -51 274 -142 -181 355 -189 -165 257 -159 -20 86
4521 86 -289 45 211 -410 207 145 -190 100 29 -8 -107 -171 -170 237 -339 204 0 -224 136 143 -212 314 -49
4544 -49 -155 397 -63 -184 301 -204 185 286 -187 232 -116 -110 16 53 -65 147 -198 -16 432 -312 93
4565 93 372 25 429 -21 -31 386 -11 -167 242 -224 53 259 -173 157 385 -292 274 93 -78 183 8
4586 8 -169 248 -29 -205 112 -100 69 310 -276 -41 -83 -195 0 -111 -277 94 -246 -244 105 -301 87 202
$$ packed form
4437B13n25K83J51m47L77L4k24K17N6l47O02l65k05P10p21J93K35n29K67O7l09
4458b67N05l78j28M45m54J63M52n52K31M6m13N17o5m59M79j00j21K64l68J71M67
4479D35o06K33J88o90O19J22o25N73o7l97M38n51K15K19l70M18O7m89M45r5l68
4500b86N20k33k33L05r2j86M55k56j02M38l81L25m16l9N36n44K4M22m16J39J06
4521H6l75L34J66o21O17o2l35K90p1l7r9o4JM07n76N43k04k24L60Pl55N26l63
4544d9j06N52m60j21M85n05L89J01m73M19l48OJ26L7j18K12l45J82M48p44M05
4565I3K79l47M04m50j0M17l97j56M09m66K77K06m32L30K28o77N66j81j71K61j75
4586Hj77M17k77j76L17k12J69K41n86K35m2j12J95j11j66L71l40KL49m06L88J15
$$ plain form
4608 202 -227 286 -77 -275 141 -43 -125 299 -235 53 297 -139 -49 177 -39 235 -33 -359 264 103 -67
4629 -67 320 -210 6 209 -491 144 -111 -416 293 -49 -145 290 62 -48 210 -376 305 92 3 117 18
4650 18 -402 66 -54 -174 155 -36 72 306 -103 53 246 -247 197 -75 -179 247 -27 -81 308 -257 -135
4671 -135 149 -236 -139 268 -183 77 177 -131 160 -64 -269 162 -217 47 87 -201 -133 242 -182 79 253
4692 253 -440 167 -122 -301 169 -85 -145 120 -144 -80 134 -182 -70 210 -246 -32 -55 -212 224 -126 -31
4713 -31 483 -63 20 304 -231 100 136 26 152 87 -262 299 -27 -166 214 57 6 46 -263 20 284 -297
4735 -297 225 -167 -208 149 17 -312 208 -96 166 418 -97 21 148 -149 195 40 -164 168 -247 -160 292
4756 292 -51 -171 81 -320 82 172 -286 145 68 -271 282 67 -91 408 -256 -115 182 -84 118 19 -288
$$ packed form
4608B02m29N13l63j98M16j84q2M24n34K88K44m36R0K26k16K74k68l26O23j61j70
4629f7L87n30K16K03p00O35k55l05P09l42r6M35k28j10K58n86O81k13q9J14r9
4650A8m20M68j20j20L29j91J08K34m09J56J93m93M44k72j04M26k74n4L89n65J22
4671a35K84l85R7M07m51K60J00l08K91k24k05M31l79K64M0k88O8L75m24K61J74
4692B53o93O07k89j79M70k54o0K65k64O4K14l16J12K80m56K14k3j57M36l50R5
4713c1N14n46Q3K84n35L31L6j10J26o5l49N61l26j39L80j57n1M0l09K83K64n81
4735b97N22l92m1L57j32l29N20l04K62K52n15J18J27k97L44j55k04L32m15Q7M52
4756B92l43j20K52m01M02R0m58M31p7l39N53k15j58M99o64J41K97k66K02r9l07
$$ plain form
4777 -288 99 86 -31 173 -306 -192 108 -127 -49 312 -213 -9 45 -288 276 -16 56 239 -145 -57 -36 -141
4799 -141 -13 139 -156 -7 90 -108 169 66 -157 290 -181 -100 246 -271 -49 300 57 100 -13 -118 154
4820 154 -144 -176 89 -139 32 79 -278 115 -182 -129 305 250 -315 73 -15 103 180 122 -41 156 -85 124
4842 124 107 -331 42 16 -257 137 -167 -183 163 -182 -174 121 -283 -128 -28 -296 144 -21 -155 69 63 -253
4864 -253 178 -219 -290 180 39 -145 152 -198 39 -66 -282 233 62 -309 279 -111 -71 9 -138 37 64
4885 64 -98 10 71 -229 19 -78 -103 171 -149 -177 173 -204 70 49 141 262 152 -326 295 -42 -181 91
4907 91 -44 -224 239 -107 81 86 -282 18 -42 -375 271 20 -275 243 11 159 49 -139 115 -35 -92 73
4929 73 83 -45 295 -57 -232 327 -221 110 272 -175 69 128 -215 -121 -17 -164 253 61 -261 427 -16
$$ packed form
4777b88L87j3j17K04m79J14L00k35P8L61n25K04N4l33N64k92P2J83l84Q8K1j05
4799a41J28J52k95J49R7j98K77j03k23M47m71Q1L46n17K22L49k43M3j13j05K72
4820A54k98l2K65k28J71M7l57L93k97N3M34n5n65L88q8J18P7n8j63J97k41K09
4842A24j7m38L73k6k73L94l04j6L46l45QK95m04J55J00k68M40j65j34K24ol16
4864b53M31l97p1M70j41j84K97l50K37j05k16N15j71l71N88l90M0Q0j47J75K7
4885F4j62J08O1l00K48r7k5K74l20k8L50l77K74k1R2J21j10m78O21l37j39K72
4907I1j35j80M63l46J88Nl68L00o0l33O46k51k95N18k32J48j10j88K54j50n7J65
4929G3J0j28L40l52j75N59n48L31J62m47K44N9l43R4J04j47M17j92l22O88m43
$$ plain form
4950 -16 33 159 -79 9 8 -202 156 127 -123 281 -107 60 248 21 41 -111 -291 2 149 -192 177 136 -118
4973 -118 231 -106 -119 230 -197 177 150 -118 45 30 -147 311 93 -55 130 -40 -130 279 -157 183 152 -238
4995 -238 72 277 -121 129 -9 -45 330 -157 -250 122 -45 -34 188 -548 -2 137 -184 97 -261 -326 16
5016 16 15 -79 52 -270 -193 149 -198 196 116 -305 -11 -10 -222 228 -74 -172 376 -310 78 145 -370 19 -49 -163
5040 -163 122 -35 -213 67 -3 -193 136 -175 -81 180 -270 92 258 -121 207 -116 -135 166 -226 139 118
5061 118 -45 45 16 -194 106 193 -250 259 -61 -87 169 -170 -14 143 -167 137 267 -75 197 82 -297
5082 -297 77 -116 -143 336 -258 105 77 -228 -35 -39 -144 -114 76 -204 116 -171 -122 153 -12 -50 101 -128
5104 -128 -118 211 -37 246 231 -90 127 -185 -225 48 -40 -88 138 -231 6 -62 -33 80 115 -189 302 127 -65
$$ packed form
4950a6M9J26k38Q8jk10L58k9k50M04l88J67J88k27K0j52j80K93J47l41L69m1k54
4973a18L49l37j3L49m27L74k7k68J63j5j77M58k18j48J85j70r0M09m36L40l1l90
4995b38L10K05l98K50j38l6L75m87r3L72j67J1K22p36N46J39l21K81l58o5L42
5016A6jr4J31l22P7L42l47L94q0m21K94Jk12M50l02r8N48o86L88O7n15L89o8j14
5040a63K85j57j78K80p0j90L29l11R4K61m50L62J66l79L28l23j9L01l92L65k1
5061A18j63R0k9k10L00Q7m43N09l20k6K56l39J56J57l10L04J30l42K72j15l79
5082b97L74j93k7M79n94L63k8l05J93mj05L0J90k80L20k87M9K75j65l8J51k29
5104a28J0L29k48K83j5l21K17l12m0K73q8m8K26l69K37o8K9J13L5l04M91j75j92
$$ plain form
5127 -65 72 -92 97 193 -255 97 -83 -261 27 58 91 201 32 -241 306 -97 11 162 -87 80 6 -139
5149 -139 21 151 -59 238 86 -152 130 -194 -77 184 -109 103 77 -260 -3 -7 -10 318 -2 -33 149 66
5171 66 -173 115 40 88 8 -78 16 48 -163 15 -241 104 162 -58 -117 332 -200 78 344 10 74 -13 -176 -94
5195 -94 -83 -136 144 -107 -138 -44 -341 147 -74 -298 35 93 -243 127 -25 -90 256 -143 -99 201 -160 -186 173
5218 173 -470 4 -75 -237 93 -131 3 150 -248 172 14 -97 85 282 -151 361 -42 -280 341 -121
5238 -121 -288 226 -318 79 231 -284 264 99 -355 265 -41 -85 198 -95 -326 227 -183 -147 175 -226 114
5259 114 -34 -338 196 94 -316 224 -333 -10 -15 -224 -218 205 -194 -1 106 -98 162 83 -204 77 83 23 144
5282 144 -175 -202 180 -86 329 -59 -100 8 148 12 156 -68 -120 88 -1 -81 49 -88 -72 -35 -178 -37
$$ packed form
5127f5J37j64J89R6m48L52j80j78K88L1L3J10j69k73N47m03J08J51k49J67p4j45
5149a39J60J30k10K97j52k38K82l24J17K61k93K12k6l37K57mlL28l20l1J82q3
5171F6k39K88p5M8q0q6R4L2k11J78k56L45N8k20n9M49n32K78K66l34O4q7j63Q2
5195i4J1n3K80k51l1R4k97M88k21k24L33N8l36L70j52o5L46l99M4L00l61k6L59
5218A73o43M74p9j62L30k24J34J47l98M20j58j11J82J97m33N12m03k38O21m62
5238a21j67N14n44L97J52n15N48j65m54O20l06m4K83k93k31N53m10L6L22m01L40
5259A14j48l04N34j02m10N40n57L23nk09OM23l99J93J07k04K60p9k87K81Oo0J21
5282A44l19k7L82k66M15l88m1J08J40j36J44k24n2K08q9q0J30j37J6L7j43J41
$$ plain form
5304 -37 -223 -140 384 89 -193 320 14 -73 87 -262 7 72 -65 -17 -38 -78 241 -218 19 117 -42 6 81
5327 81 -110 -75 142 -170 226 -208 -217 46 11 -24 260 -140 -69 132 -194 48 24 -208 205 36 59 325 -242
5350 -242 152 191 -179 347 229 -194 24 -65 -305 234 98 -60 176 -11 -118 16 -123 69 0 -195 -72
5371 -72 192 -32 194 -59 -138 145 -115 5 179 -252 137 32 -393 147 71 -72 202 -181 -109 315 -15
5392 -15 64 268 86 -40 177 -294 8 127 23 296 250 -235 305 -172 -11 70 -41 -20 139 -86 50 126
5414 126 -68 127 48 -222 205 -282 21 335 -108 -118 72 -97 106 4 -281 45 17 -277 367 -135 -247
5435 -247 -2 -29 35 124 -210 148 118 -180 184 0 126 2 -7 79 253 -92 -15 39 -39 37 47 -71 100 -297
5459 -297 -78 105 -63 -34 118 -283 -158 235 -288 135 -37 -104 172 22 -126 123 -51 121 -22 -155 118
$$ packed form
5304c7j86Q3N24k95k82N13l06q7J60l49K69O5j37M8k1m0L19m59K37R8j59M8P5
5327H1j91L5K17l12L96m34rK63l5l5K84m00P1K01l26K42k4k32M13j69K3K66n67
5350b42L94L9l70N26j18m23K18q9k40N39j36j58K36j87j07J34j39J92o9j95J23
5371g2K64k24K26k53p9K83k60J20J74m31L89j05m25N40p6j43K74l83P2M24l30
5392a5P9K04j82j26K17m71L02J19j04K73m6m85N40m77J61Q1j11K1J59k25J36P6
5414A26j94J95p9k70M27m87L03L14m43j0J90j69K03j02k85L26k8k94O44n02j12
5435b47K45k7O4Q9l34L58l0k98L64j84J26j24rQ6J74l45P7N4p8P6J0j18J71l97
5459b97K19J83j68K9J52m01J25L93n23M23j72o7K76j50j48K49j74J72j43j33K73
$$ plain form
5480 118 69 -161 335 62 63 154 -108 -133 -143 0 169 259 -101 204 110 -146 179 320 -42 9 -54 -98 175 -125
5504 -125 33 171 -103 19 -87 -170 221 20 -284 185 -121 -52 194 -184 -226 197 -284 185 73 40 63 -102
5526 -102 -131 135 -232 -157 172 -198 -94 155 2 81 156 -78 191 -66 -136 97 -172 -90 218 -152 86 58
5548 58 -113 175 183 -155 275 1 -197 283 -50 -64 183 -69 -39 246 -250 247 52 -159 75 -87 -11 121
5570 121 54 -31 111 145 90 126 -268 -30 -30 -87 187 16 -148 90 -58 38 176 -160 105 128 -251 8 185
5593 185 -195 198 -125 -278 173 -77 -95 144 34 72 222 -231 -51 122 -183 43 -206 -163 154 -137 -108
5614 -108 239 -186 115 105 -32 -34 61 -45 49 -257 -245 265 -226 96 -87 32 124 97 -331 30 18 -161 215
5637 215 -70 -153 268 -156 131 221 305 -4 23 -15 5 152 -81 95 -176 -45 118 -76 90 252 -173 197
$$ packed form
5480A18m9k30M96k73JR1k62k5j0J43J69R0l60L05r4k56L25J41l62N1o3m4K73l00
5504a25J58J38k74J22j06q3L91k01l04M69l06O9K46l78m2M23m81M69j12l3K3j65
5526a02k9K66l67P5L29l70J04K49j53P9P5k34K69k57p0K33k69Q2L08l70K38k8
5548E8j71K88Ql38M30k74j98M80l33j4K47k52L0K85m96M97j95k11K34j62P6J32
5570A21o7q5J42L4n5L6l94K38%n7K74j71j64K38j48R6J38l36K65K3l79K59J77
5593A85l80L93l23j53M51k50j8K39j10L8J50m53J80J73l05K26k49M3L17k91K9
5614a08L47m25L01j0j37kR5j06R4l06J2N10m91L22j83J19R2k7m28L61j2j79L76
5637B15k85q3M21m24K87R0Q4l09K7l8K0J47k33J76k71J31J63j94J66J62m25L70
$$ plain form
5659 197 38 -149 112 -27 -108 -105 -119 -40 392 -89 9 34 -28 -97 -131 -202 127 235 -297 64 -50 -87 110 -75
5683 -75 -14 100 -190 298 347 -264 -50 83 63 135 -33 42 100 -69 -142 -80 -180 13 279 -148 2 79 -69
5706 -69 319 23 -167 -79 -208 -75 194 -238 114 179 -169 -8 36 -237 178 -123 -280 72 78 -52 365 -83
5728 -83 -34 243 -54 149 263 -81 -41 65 -279 176 -29 -188 201 37 138 77 -278 140 -15 -169 111
5749 111 -147 -52 96 -200 100 156 -28 202 57 -156 174 -78 -157 94 -58 47 -113 -1 -67 130 -201
5770 -201 -122 206 -3 13 -48 -38 -28 -190 -69 223 -79 143 -19 -220 -114 110 -239 74 -115 -8 387 -128
5792 -128 -193 401 -208 96 229 -32 111 2 85 86 -175 27 304 -71 -57 -117 -68 99 263 -55 14 -94 -147
5815 -147 452 59 -71 93 -204 -119 52 -95 -189 212 -94 194 140 -144 141 -72 -56 95 325 -36 244
$$ packed form
5659A97j59j87K61j39q1Lj4P9M32m81R8K5o2o9l4p1L29J08n32L61j14l7J97j85
5683g5O1J14k90M88M9o11K14J33k0P2j68P5N8j69p3O2j00J93K66m27J50P7j48
5706f9L88k96j90Q8j29J33K69m32L52O5l48J61M4k73M15l01j57L52Oj30M17m48
5728h3M9K77k97K03J14l44M0J06l44M55k05j59L89j64J01o1l55M18j55j54K80
5749A11k58R5J48k96L00N6j84K30j45k13L30k52p9K51j52J05j60J12o6J97l31
5770b01P9L28k09J6o1J0J0j62J21K92l02K22j62k01J06K24l49L13j89J07L95n15
5792a28o5N94o09L04J33k61J43j09Q3Jk61K02K77l75J4o0M9J67J64l18O9j08n3
5815a47N99l93j30J64k97Q5J71j47r4M01l06K88n4k84K85k13J6J51K30l61K80
$$ plain form
5836 244 -25 -79 30 -349 116 50 -49 75 94 -95 83 -167 -84 207 -222 -62 81 45 27 213 54 -75
5858 -75 -73 -102 251 19 -86 58 -92 -146 -10 -266 4 198 -309 4 -246 -29 129 -61 -177 22 -30 72
5880 72 130 -10 -139 -38 -106 340 14 31 -29 -167 163 125 -221 -38 -41 -164 166 -128 -99 -45 96 -3 327 -138
5904 -138 116 -39 -66 99 217 6 153 -69 -317 156 92 -267 55 -313 3 104 -106 -30 33 -115 36
5925 36 32 -156 30 83 -197 -8 -105 -176 162 -83 85 18 -79 199 -253 31 114 -53 5 229 -9 -37 49 -86
5949 -86 228 -12 -81 202 -73 17 249 72 -223 279 29 17 -37 -195 54 163 0 -10 -81 -6 216 91 -75
5972 -75 154 -223 6 172 -166 -88 30 96 130 -92 -186 200 -184 64 158 -138 -6 -72 48 -100 54 -43 154
5995 154 7 72 60 -80 -136 70 -132 -6 119 -146 -83 -131 -172 150 93 62 28 -53 -286 56 -257 21 193
$$ packed form
5836B44k69n4J09l79M65o6r9J24J9j89J78k50Q3K91m29J60J43l6j8J86j59j29
5858g5Kk9L53k32j05J44j50n4J36k56K70J94n07L13k50K17J58j90j16J99n2J02
5880G2N8j40j29J01o8M46l26J7o0j38L30l8l46J83lj23L30k94K9N4J41r9L30m65
5904a38K54j55k7J65J18k11J47k22k48M73o4l59L22l68L16J01k10P6O3j48J51
5925C6mj88J86N3k80J89r7p1L38k45J68o7r7K78m52K84Q3j67N8K24k38k8Q6j35
5949h6L14k40o9K83k75R0K32j77k95N02k50j2n4j58K49J09j63j0p1P5K22j25j66
5972g5K29l77K29J66l38P8J18O6L4k22r4L86l84K48R4k96J32o6J20j48J54r7J97
5995A54j47O5j2j40n6K06k02J26J25k65O3m8m1L22n7l1l4q1k33L42l13K78J72
$$ plain form
6018 193 -72 -69 -35 -216 -59 248 -219 141 -14 -49 40 -74 -157 104 -21 11 100 -187 -90 37 -17 -27 -86 6
6042 6 86 -221 -164 54 23 143 -14 -184 135 59 -149 196 -104 79 140 -79 -1 239 56 -6 -38 -262 100
6065 100 -12 -142 160 -21 -92 117 -268 -73 33 -223 136 170 -190 142 36 -289 -20 -34 -184 76 73 -76
6087 -76 203 -159 53 83 3 205 -141 44 -22 -9 -58 176 -1 73 11 -175 265 -2 -161 142 -10 -97 92
6110 92 118 -17 -94 -136 11 56 -271 -83 84 -104 57 149 -28 18 97 -85 142 -169 94 10 -152 97 56
6133 56 -144 162 -32 -192 179 -69 -119 -92 -520 128 98 -58 -36 -120 -2 31 48 -173 197 -186 -3 184 -61
6156 -61 94 244 -38 69 54 -224 142 -276 -92 90 -204 17 -13 -72 28 56 -228 92 -55 66 191 2
6178 2 -13 49 -71 -90 -131 -171 101 45 74 31 -31 -244 52 72 -6 79 58 -38 276 -103 246 -59 175 151 110 -10
$$ packed form
6018A93k65LL4j81J57L07m67L60j55l5Q9j14q3K61j25L2Q9k87R7J27n4j0n9R2
6042FQ0l07N7K18l1J20j57j70L19p6k08L45l00J83O1k19P8K40j83o2l2k24L62
6065A00j12j30L02j81p1K09l85J95J06k56L59L4l60L32j06l25K69j4j50K60lj49
6087g6K79l62K12L0q0K02l46J85o6J3m9K34j77P4o2j86M40k67j59L03j52q7J89
6110I2K6j35p7m2J47M5l27J88J67j88J61R2j77M6P9j82K27l11K63q4j62K49m1
6133E6k00L06j94j60L71k48n0K7m28O48l0j56K2q4J18L3J7k21L70l83J83J87k45
6156f1J55J50k82J07j5k78L66m18J84J82k94K21l0n9J00K8k84L20j47J21J25j89
6178Bj5O2j20j9m1m0K72n6K9m3o2k13K96K0p8Q5k1r6L14l79L49l05K34k4m1j20
$$ plain form
6204 -10 87 -135 41 40 -444 131 -221 -109 -81 57 56 206 -42 -53 44 -191 -128 176 83 158 29 -69 -114 162 -239
6229 -239 67 86 -198 16 -125 -78 103 -23 -227 -87 -246 86 103 -102 22 71 79 87 -75 -130 36 6 44 -81
6253 -81 -351 0 115 -56 27 20 -310 255 -85 -112 87 -156 48 47 53 -171 110 49 31 -42 -123 1 -76 27 35
6278 35 27 190 8 40 25 179 -33 -6 133 78 132 -75 -189 320 -24 -252 381 -257 54 48 9 -47 -48 -8 113
6303 113 -227 36 196 -160 23 35 43 100 196 -178 26 -111 -11 96 51 -31 -22 -152 -123 -20 -133 52 244
6326 244 -64 -46 -22 -137 201 -246 -219 32 -51 186 234 36 374 -182 -71 267 39 -172 166 16 29 -93
6348 -93 -86 97 -123 -34 110 111 -234 246 25 -382 36 148 -61 185 -92 -19 51 -74 54 -114 -226 44 -47
6371 -47 33 39 15 -45 112 -200 34 88 -234 200 -41 -220 95 -93 -130 181 -176 88 230 -229 46 251 -252
$$ packed form
6204a0R7k22J76jm84N75l52J12K8J38jJ50k48j1R7k35O3L04r3P5j29r8m5K76m01
6229b39L06J9k84K14j41M7J81j26k04J40j59L32J7k05J24M9QQj62n5J66l0L8j25
6253h1k70L51J15j71Q3pl30N65l40k7J99k43K04jOk24K81o1j8p3q1J24p7J03Q
6278C5qJ63j82L2j5J54k12K7J39n5N4k07j14N09l44k28O33o38L11ol9n6jM0J21
6303A13l40K63J60l56J83J2QN7R6l74K04j37J00J07m5q2Rj30K9J03j13J85J92
6326B44l08J8K4j15L38m47K7K51q3K37M8j98L38n56J11L38k28k11L38j50J3j22
6348i3PJ83k20Q9J44Jl45M80k21m07M18J12k09K46k77P3P0j25J28j68j12K70r1
6371d7Q0Ok4o0J57l12K34N4l22M34k41j79L15j88l7L11l57K64J42m59K75K05n03
$$ plain form
6394 -252 111 69 -106 277 174 88 93 74 202 171 -256 -71 -102 -104 134 140 115 295 122 -177 323 -26 -204 86
6418 86 -73 237 21 -89 -13 -60 40 152 200 13 39 -24 -125 186 -114 130 206 -198 61 87 -148 129 136
6441 136 -57 313 -53 -27 104 -44 205 180 -256 -135 149 -39 194 18 -31 263 -22 32 122 40 -91 -87 -33
6464 -33 77 -136 -134 19 41 -115 76 43 -160 213 -290 5 -134 -158 126 -28 -80 206 -172 -290 130 18
6486 18 41 172 -72 242 7 -67 -92 62 -38 42 -59 66 28 15 -113 263 48 -66 147 38 -40 -202 -210
6509 -210 112 30 79 122 -92 144 56 101 -12 149 7 196 30 -189 160 7 -96 -21 -186 -183 149 -75 81
6532 81 45 -122 -149 -156 16 125 -110 -215 11 74 36 134 -89 -122 -11 -242 72 -51 -32 189 -156 -15 88
6555 88 -4 -298 56 -125 -8 -30 -21 -148 -162 3 250 25 -90 170 -205 -138 83 22 106 -157 -97 36 -119
$$ packed form
6394b52L63m2j75L83j03q6Nj9J28l1m27J85l1kK38Ok5J80j73k99N00l49j78K90
6418H6j59L10k16j10P6m7J00J12M8j87K6o3j01L11l00K44P6m04K59K6k35K77P
6441A36j93L70l66K6J31j48K49k5m36J21K84j88K33j76m9K94k85N4R0q2j31MN4
6464c3J10k13KJ53K2j56J91l3k03L73n03K95j39k4K84j54n2K86l78j18M20j12
6486A8K3J31k44L14k35p4k5J54j00Q0j01J25l8j3j28L76k15j14K13j09p8j62q
6509b10L22q2M9M3k14K36q8M5j13J61j42J89j66k19L49j53j03P5j65LL32k24J56
6532H1l6j67k7pJ72J09k35j05K26O3l8R8k23l3J11k31L14j23J9K21l45J41J03
6555H8r2k94L54j81J17k2Rj27j4J65K47k25j15K60l75O7K21o1Q4k63O0J33j55
$$ plain form
6578 -119 -129 -185 -75 -122 58 -54 362 145 91 149 14 -117 272 -64 -111 105 -17 -18 32 -107 212 -128 175
6601 175 -74 -48 -103 161 60 -123 366 -167 -97 -2 -74 -63 20 -103 103 -163 -116 71 -90 -240 -6 -141 -146
6624 -146 -20 -115 202 -38 -239 86 -32 -235 165 -20 -246 99 -72 -76 77 -313 23 95 -228 84 166 -137
6646 -137 289 -23 4 275 -108 57 -81 -78 -23 92 -142 -201 -123 -48 -112 -182 -86 206 96 -197 45 -177 -87 95
6670 95 72 150 43 -66 112 18 -300 282 -167 71 -54 -267 45 222 -134 26 38 -109 92 107 -45 -79
6692 -79 -135 146 -110 -124 73 13 -16 -93 -91 -149 4 69 -8 100 -163 -64 12 79 -49 6 -205 19 -122 -37 237
6717 237 69 -8 76 -162 128 265 -234 6 178 -250 -12 154 -40 54 -135 -17 153 -44 -72 47 -34 74
6739 74 92 -198 131 12 -117 -105 -108 6 84 -217 278 203 -21 -208 -2 -174 -130 34 48 102 -117 -19 224 38
$$ packed form
6578a19j0n6J10m7J80j12M16k17n4N8j35j31L89l36m7K16j22jN0j39L19l40L03
6601A75k49K6n5K64j01j83M89n33P0R5p2J1Q3j23K06k66M7J87j61j50K34j35n
6624a46J26r5L17k40k01L25j18k03M00j85k26L45j71mJ53l90L36P2l23L12Q2l03
6646a37M26l12K7K71l83J65j38LN5J15k34n9P8P5o4p0R6K92j10k93K42k22R0J82
6670I5k3P8j07j09J78r4l18N82m49K38j25k13L12J77l56J60J2j47K01J5j52l4
6692g9n6K81k56j4J97o0k9p7Kn8J53O5p7J08k63R9P6O7j28N5k11K24j41Q5K74
6717B37j68p7Q4k38K90J37m99K40J72m28K38J66j94R4j89J18J70j97k8J19q1J08
6739G4J8k90L29j19j29J2lJ14P8l01M95p5k24j87K06j72M4J64J4N4k19R8K43j86
$$ plain form
6763 38 -22 245 -215 -79 60 -105 152 -10 -137 105 -47 -190 176 -45 97 -37 -263 126 196 -230 47
6784 47 -58 46 130 -34 -33 -31 -56 -132 -104 -140 -208 132 -22 -150 -9 -134 13 48 -7 -142 20 96 125 -53 -27
6809 -27 111 -190 -60 -108 -204 -52 -2 62 46 -116 -65 77 -228 -102 123 -239 27 260 243 30 -224 62 82
6832 82 -11 117 99 -95 58 164 71 167 -121 -169 69 74 -22 -63 -288 -17 208 -289 -234 122 -237 197 -13 -119
6856 -119 40 226 10 41 -70 212 48 -23 6 84 -56 -246 -24 -146 31 -12 -17 236 -117 3 168 -35
6878 -35 21 -100 -43 180 -210 -218 167 -150 -93 -8 -83 131 140 -261 177 -70 -293 460 164 -144 159 39 -181
6901 -181 95 -223 76 45 -146 76 176 -266 16 -91 -49 -9 -102 145 180 -34 79 66 -71 -74 143 -52 -41
6924 -41 0 -157 36 -40 -141 91 -81 -204 -28 -169 -57 -9 -17 156 -98 -52 213 -169 -99 -138 -235 -58 -98 -104
$$ packed form
6763C8o0K67m60J36J39j65K57j62j27K42j52j43L66k21J42j34k26L89P0m26K77
6784D7j05J04Q4j64JKk5p6K8l6o8L40j54j28J41j25J47L5n5j35J62P6K9j78K6
6809b7J38l01J30m8r6J52N0O4j6j62N1J42l05J26K25l62K66K33j7k13k54K86K0
6832H2r3J28j8j94J53J06r3R6k88m8K38Nr6m1k25K71K25m97N5L56l59M34k10j06
6856a19J59J86k16L1j11K82j64p1K9P8j40j90K22j22J77m3nK53l53J20J65k03
6878c5N6j21N7K23l90qL85l17N7Q5p5K14Rm01M38k47k23P53k96l08L03j20k20
6901a81K76l18K99l1j91K22J00m42K82j07M2M0r3K47L5k14J13j3j37lK17j95J1
6924d1M1j57J93p6j01K32j72j23J76j41J12M8qJ73k54M6K65l82P0l9r7J77m0o
$$ plain form
6948 -104 9 4 -7 122 69 69 6 -57 -197 -77 -13 66 111 -9 60 -198 -11 -50 64 -135 59 -116 -34 185 -113
6973 -113 -2 -100 -125 -98 168 -192 112 -54 -3 68 -49 -17 146 33 -161 -23 102 -63 -205 25 42 18 -74
6996 -74 -127 -47 76 193 -102 -50 103 -146 99 -92 -60 146 -27 -13 195 36 -125 61 144 34 29 -2 13 -131
7020 -131 -240 47 28 59 108 -60 -78 126 88 168 158 -197 -188 -186 -27 -4 -44 -98 -110 -2 5 176 43 177 25 -134
7046 -134 3 168 122 -58 -23 -22 104 -17 55 155 -150 79 221 -158 137 29 -55 -187 25 -101 240 -56
7068 -56 238 152 -15 88 14 -15 109 -108 -187 241 -48 -46 167 -257 -81 -130 -265 -6 44 -44 176 97 -166 -42
7092 -42 -215 31 4 7 22 -59 -55 12 160 -26 190 -258 -75 205 84 -35 -26 -112 -2 106 -221 201 254 -19
7116 -19 44 -104 -54 -76 -41 -124 329 21 -111 50 -70 -45 99 156 26 256 -211 95 -60 -48 40 -35 -190 61
$$ packed form
6948a04J13nj1J29n3%o3o3j40J20O4P9M5j20O9k58J87l9J14j99J94j75Q2K19k98
6973a13J11r8k5K7K66l60L04j66N1P1j17L2J63j13j94J38J25j65j42K30J7k4r2
6996g4n3Q0J23J17k95N2J53k49K45j91L2K06j73J4K08j59j61J86Q3j10nl1J5j44
7020a31j09K87j9L1M9j68j8K04l8Q0j0l55RKJ59K3m0n4j2J08PJ71j33J34j52j59
7046a34J37J65m6j80L5JJ26j21P2J00l05K29J42l79K95j08q4j32K12j26L41k96
7068e6K94q6j67J03p4k9J24k17p9M28k89KK13m24J76m9j35K59N0q8K20p9k63J24
7092d2j73K46k7LJ5q1MO7J48j86K16m48J83K80j21j19Rq6J10J08l27M22N3k73
7116a9O3j48N0k2L5q3M53l08j32J61j20K5J44N7j30K30m67L06j55J2Q8p5j55K51
$$ plain form
7140 61 -146 -75 98 -25 207 -35 20 38 -47 -111 6 -85 31 -34 -175 -125 -121 -42 -142 96 -277 -40 -94 -18 94
7165 94 -62 49 -119 -122 150 -75 5 -30 145 -100 -110 -56 -60 31 -216 -7 44 -129 -46 244 -47 160 8 32
7189 32 90 -138 48 13 -18 9 -54 -173 129 -135 33 50 -275 -208 -46 -255 61 392 -331 26 55 -253 -37
7212 -37 -33 29 118 191 -29 -88 167 34 146 26 -6 178 -78 242 68 -64 13 -38 45 45 51 169 -14 -100 25
7237 25 -30 -99 -68 57 -60 -63 -118 36 79 -258 54 78 -181 -89 20 -183 -164 -38 98 60 -21 -112 -37 -62 -27 210
7263 210 -77 -132 -85 169 148 -15 -184 -123 11 30 -2 -100 -124 73 -280 -14 210 -38 -17 -60 -8 194 -133 -186
7287 -186 -41 -58 87 277 -130 43 18 -7 -47 -167 -216 186 247 -126 1 -70 -20 -17 -132 42 -135 -251 3
7310 3 120 25 -171 65 62 274 81 -123 35 167 9 -16 -120 -47 -198 21 167 -187 -54 151 -21 94
$$ packed form
7140F1k07P1J73j23K32k42N5J8q5o4J17r1J16o5j41N0MP9j00K38l73K37n4P6J12
7165I4j56J11j68lK72k25Q0l5J75k45j0N4mR1k47K09N1j73Q3K90k91K07j52K4
7189C2N8k28J86l5l1K7o3j19L02k64J68J7l25O7J62k09L16L31p23L57K9l08K16
7212c7MO2Q9P3k20n9K55j33J12j20l2J84k56L20j74j32P7n1Q3%OJ18j83q6J25
7237B5n5o9L1J25j17ln5J54M3l37L12K4k59R2J09k03J9J26J36l8q1r1P5k5L5K37
7263B10k87n5M7K54k1j63j69O1J34J9l2r8k4J97l53K66K24k48K1m3N2K02l27n3
7287a86J45j7J45J90m07J73k5k5m0j20m9M02O1l73J27p1N0Lj15J74j77j16K54
7310CJ17r5j96K36lK12j93k04J58J32j58k5j04P3j51K19J46l54J33K05j72J15
$$ plain form
7332 94 207 64 22 -8 -3 49 -51 -134 86 -281 -103 21 -115 -98 64 -23 203 238 32 22 5 -98 51 -3
7356 -3 75 125 161 4 -124 -165 -155 4 -1 -222 -62 -193 -70 53 -64 -6 -135 -54 -4 125 118 1 145 37 57
7381 57 -17 155 -99 78 16 115 10 -2 -35 119 22 -216 -98 58 -87 95 -46 120 -14 -39 210 149 -167
7404 -167 73 109 72 140 301 -69 107 30 -4 -69 86 205 -18 16 -50 164 76 -8 -12 10 -11 134 -103 124 -256
7429 -256 202 134 -64 205 121 -245 6 1 82 221 -82 -9 129 -194 -86 202 -118 185 147 -312 102 -17
7451 -17 -51 -46 10 -93 137 64 11 20 -56 -89 99 210 -79 86 -19 112 -39 -62 46 -85 -89 56 -106 -19 72
7476 72 -86 -191 74 -23 8 -131 10 171 0 48 71 -199 -139 -110 -179 331 -160 37 161 87 -121 -92 -114 83
7500 83 31 -225 -119 -142 59 256 -42 42 -96 -53 -103 87 -1 -229 -124 3 20 101 18 121 -27 -98 149 -45
$$ packed form
7332I4J13j43m2l0NN2j00q3K20l67J78J24j36J7J62q7K26L5k06j0j7j03J49n4
7356cP8N0L6j57j28m1J0J59nk21J60j31J23J23j17N8j29Q1N0J29pj17J44j08K0
7381E7p4J72k54J77o2R9j05j2l3J54r7k38J18J56j45J82j41J66j34k5K49o1l16
7404a67K40L6l7O8J61l70J76p7l4o5J55J19k23L4o6K14q8q4mK2k1J45k37K27l80
7429b56M58o8j98K69q4l66K51nQ1J39l03P3J38l23J08K88l20L03l8m59M14j19
7451a7l4NN6j03K30p3n3Rp6l3J88J11k89J65j05J31j51k3J08j31mJ45j62Q7R1
7476G2j58j05K65r7L1j39J41J61j71M8K3k70O0K9o9N10m91J97J24p4k08K9k2J97
7500H3n2k56J06k3K01J97k98Q4j38M3n0J90q8k28J05J27J7Q1q3J03j48p1K47j94
$$ plain form
7524 -45 46 -110 60 159 14 -219 -28 115 -14 -132 201 185 124 -160 -230 278 -118 189 -6 -141 58 -84
7546 -84 31 246 5 -47 92 102 73 -11 -307 10 61 -306 109 55 -175 85 104 -8 134 -3 -130 272 -54
7569 -54 -135 189 -55 -13 106 -229 -322 -203 -78 12 40 -11 -23 132 93 8 134 -31 35 -95 -135 -204 116 46 -58
7594 -58 -93 -48 -138 205 -42 -193 262 -161 23 149 51 128 68 -136 24 39 -110 -213 129 62 -56 152 -71
7617 -71 254 4 -96 -5 -114 129 5 -66 -73 219 52 28 58 1 -85 -235 -14 3 -31 114 89 -25 51 21 -65
7642 -65 38 -70 -67 -1 -161 -41 54 -175 12 87 161 -132 111 -96 -30 -171 213 -99 -44 187 -5 -49 -22 -8
7666 -8 -80 -19 -131 26 232 161 -189 -118 -121 29 235 -7 118 57 81 -205 63 -89 122 329 42 99 -10 102
7690 102 69 55 1 -15 -105 94 27 31 78 -179 38 60 -80 31 90 -63 -14 83 -103 85 233 -150 36 -267
$$ packed form
7524d5R1j56J70R9j45k33J91J43j29j18L33j6o1k84p0N08l96L07j95j35J99j42
7546h4J15K15k41n2J39J0k9q4k96L17N1l67M15n4k30K60J9j12J42j37j27M02l26
7569e4q1L24k44M2J19l35r3J19J25R0K8n1j2J55l9q5J26j65O6j30m0o9L20p0j04
7594e8l5M5r0L43k47j51M55m23J84J26r8P7o0k04J60J5j49j03L42o7j18K08k23
7617g1L25k50j00R1j09K43j24p1pK92j67k4L0n7q6j50K21J7l4J45k5j14P6l0q6
7642f5J03j08LO6j60J20R5k29J87P5P4k93K43k07O6j41L84l12N5K31j92m4K7J4
7666hp2O1j12J57K06p1l50P1lJ50K06k42J25o1K4k86K68j52K11K07k87N7j09J12
7690A02l3j4n4j6r0J99o7MM7k57K17K2j40J11N9j53M9R7j86J88J48l83J86l03
$$ plain form
7714 -267 102 -48 -102 159 -53 -158 -115 -62 -135 124 -207 -61 134 -28 -180 -134 -251 -14 -84 38 69 -221
7736 -221 148 62 -59 -182 71 53 -17 221 -78 -54 235 36 31 -184 -66 165 -83 -288 19 26 90 -18 -37
7759 -37 130 -17 310 179 -235 111 -106 102 18 -100 -87 6 185 -149 -3 -7 -128 -11 91 -245 67 -70
7781 -70 7 61 90 -32 -23 -107 151 44 -16 67 -6 -246 93 72 -111 -42 -25 -32 136 -138 85 -125 111 212 70
7806 70 -35 12 -3 -125 251 17 -118 -99 -21 44 155 -140 -2 177 -218 103 -65 152 51 87 -9 20 -174
7829 -174 73 18 130 38 35 -154 -108 18 -52 4 -49 -20 46 44 -55 109 -161 129 -129 135 33 147 -41 31 -62
7854 -62 -13 34 -112 -41 -31 -10 113 -159 53 -55 35 46 -50 59 -71 91 -76 90 135 -131 121 153 216 37
7878 37 -102 58 -52 84 189 -103 199 -119 125 113 -89 -16 98 -155 92 -89 -2 4 137 182 -107 165
$$ packed form
7714b67L69j50n4K61k12j05M3N3p3K59l31J46J95j62j52M6j17K37p0J22L1k90
7736b21L69q6j21j23K53j8p0K38k99K4K89j99nk15J18K31k48k05L07PO4j08j9
7759c7J67j47L27j31m14L46k17K08q4j18J3R3J79l34J46mj21J17J02l36L12j37
7781g0P7N4K9j22Rq4K58j07o0Q3p3k40L39k1j83O9J7pJ68k74K23k10K36J01j42
7806G0j05M7j5j22L76k34j35J9P8O5J11k95J38J79l95L21j68K17j01L6r6K9j94
7829a74K47n5J12r2lj89M6J26p0N6n3K9O6kr9J64k70K90k58K64j02J14j88P2r3
7854f2M9M7j46P1J0K1J23k72K12j08R0J1r6J09j30J62j67J66M5k66K52L2O3j79
7878C7j39J60j10J36J05k92L02l18K44j2k02P3J14k53K47j81Q7OJ33M5k89K72
$$ plain form
7900 165 18 -289 -25 20 -103 -90 -55 -30 11 35 -92 -21 1 0 -6 -55 -27 133 25 182 -123 47 66 -116 112
7925 112 146 -38 -108 82 63 181 162 57 -89 -157 -34 193 -133 -72 61 -106 153 126 -110 -71 -236 -115 281
7948 281 14 -200 240 146 -26 63 -220 -129 79 -45 -52 -9 -252 -12 -7 105 19 118 -139 128 109 133 139 30 30
7973 30 -253 -167 -106 -36 -258 201 42 -94 30 88 -39 17 56 -110 -111 -65 125 6 -170 208 51 84 22 -84
7997 -84 194 271 -128 63 97 26 -61 -97 -109 -55 -23 39 81 16 76 186 -39 91 -79 -33 222 -170 -121 161 10
8022 10 -30 45 -64 102 48 -302 137 -80 93 49 -105 233 183 44 123 213 -38 117 -189 -240 10 -254 -221
8045 -221 54 -52 157 30 120 -188 113 108 -75 -8 -51 140 -126 57 -19 -64 152 30 -56 -30 -163 -28 -184
8068 -184 -103 -87 -7 -108 -163 112 76 123 -144 -1 78 110 -20 110 -84 -117 162 185 -135 -132 -84 -13 -123 102 -81
$$ packed form
7900A65j47l07K64M5j23J3L5K5M1K4j27P1K2jom9K8J60j08J57l05J70J9j82K28
7925A12L4j84p0J90j9J18j9j05j46o8J23K27l26O1J33j67K59k7k36L9j65J21L96
7948B81k67k14M40r4j72Q9k83R1K08j24pM3k43K40NJ12q6R9k57K67j9K4Oj09%
7973C0k83Q6O1P0k22M59j59j36J24N8j27N6L9j66jM6J90j19j76L78j57L3o2j06
7997h4K78P7l99J91L4p1q7l6j2N4L2O2M2o5O0J10k25J30j70M6K55l92M9K82j51
8022A0m0P5j09J66n4l50M39k17J73m4j54L38n0j39P9R0k51J55l06n1K50k64L3
8045b21K75j06K09j27R0l08L01nj83O7m3J91k66J83p6m5K16j22q6K6j33J35j56
8068a84Q1J6Q0j01n5K75l6M7k67J43P9L2j30J30j94l3K79K3l20LM8P1j10K25j83
$$ plain form
8093 -81 204 255 57 -43 25 91 81 -114 162 -51 -68 46 60 -68 104 194 -154 -115 -61 130 -105 4 -90 -18
8117 -18 50 52 45 -78 100 -145 75 -106 77 102 -50 55 -62 10 -48 -36 -37 -12 49 41 -35 -91 -67 12 -2 -92 -78 87
8145 87 46 157 -95 -2 87 -94 -122 -221 0 231 -51 -130 231 -101 -75 40 24 135 82 -161 -135 34 -139 -42
8169 -42 21 14 138 97 24 -59 -63 -108 149 -12 13 -53 -187 33 -59 -22 73 92 18 23 185 102
$$ packed form
8093h1K85N1j98j00O8O6j0j95K76k13j7J14J4j28J72R0l48L9N4J91k35J09r4P2
8117a8O8Kpj23J78k45K20j81J83K5j52J05j17P2n8J2jK5O1qp6n6K4P9j4r0J4J65
8145H7m1J11k52R3Q9j81k8r9K21K31k82p9L61l32K6J15j6J11n3k43K6J69j73R7
8169d2O3pJ24m1p3q3mm5K57j61K5o6j34K20r2L7R5J9p4NJ62q3
8191A02
$$ Imaginary data points
##PAGE= N=2
##DATA TABLE= (X++(I..I)), XYDATA
$$ plain form
0 0 0 0 0 0 0 0 0 0 0 0 0 0 0 0 0 0 0 0 7 -8 8 -8 8 -8 13 -16 16 -16 24 -24 30 -32 38 -41 48 -54 61 -67 75 -84
40 -84 94 -105 116 -128 143 -156 172 -191 210 -231 255 -281 308 -340 377 -416 463 -515 576 -647
60 -647 734 -840 971 -1144 1376 -1716 2248 -3221 5579 -26215 -14200 14225 -12162 5368
74 5368 -1974 -3983 13247 1269 294 13719 -5089 7179 10198 -9290 8895 9516 -11853 3989
88 3989 -1271 -8230 4617 -10218 -9527 5451 -9736 -1730 5572 -8195 4454 5242 -5874 8508
102 8508 3579 107 11570 -757 2554 10855 -6507 1071 2404 -13642 907 -1451 -14258 2161
116 2161 -2413 -6729 5336 -4518 -169 8283 -4647 5626 7747 -4575 11164 6427 -6226 8802
130 8802 909 -5425 4525 -7970 -4969 3244 -10045 -2402 639 -8901 3800 -419 -8151 7141
$$ packed form
0@%%%%%%%%%%%%%%%%%%Pj5J6j6J6j6K1k9L2l2M0m8N4o2P0p9Q9j02J15j28J42j59
40h4J78j99K21k44K71k99L28l63M01m41M86n36N89o48P17p93Q79r78J091j223
60f47J381j574J811k115K520l092L964n469Q800l1794J2015K8425k6387J7530
74E368p342k009J7230j1978r75J3425j8808J2268L019j9488J8185O21k1369J5842
88C989n260o959J2847j4835O91J4978j5187Q006P302j3767J2649P88j1116J4382
102H508m929l472J1463j2327L311Q301j7362P578J333j6046J4549k358j2807J6419
116B161m574m316J2065r854M349Q452j2930J0273K121j2322J5739m737j2653J5028
130H802p893o334R950j2495L001Q213j3289P643L041r540J2701m219p732J5292
$$ plain form
144 7141 1364 -1195 8960 -217 5249 10647 -3574 3864 4697 -6407 3161 -3114 -9001 3666
158 3666 -5436 -7974 2377 -6880 -1481 2594 -7561 4485 4870 -4281 8702 3639 -754 11901
172 11901 -277 -1567 8352 -5039 -789 2690 -9781 1452 -118 -10769 2695 -4073 -8680
185 -8680 6484 -5034 -4091 8996 -2347 3839 9130 -4260 7674 6774 -5320 7111 -288 -5970
199 -5970 7746 -5871 -7299 4624 -8064 -3823 1295 -10749 1432 2340 -7445 6951 2086 -2299
213 -2299 11677 -328 -679 11044 -2896 560 6363 -6161 3324 1604 -9984 3002 -3003 -9468
227 -9468 3102 -7136 -5763 6985 -5655 -885 7547 -2823 6223 5537 -4245 8784 3653 -3759
241 -3759 7374 -2152 -2831 6413 -7322 -4307 1714 -8670 -1416 -1629 -8423 4239 -194 -4304 7200
$$ packed form
144G141n777k559J0155r177N466N398j4221P438Q33j1104R568o275n887J2667
158C666r102k538J0351r257N399M075j0155J2046L85r151J2983n063m393J2655
172A1901j2178j290R919j3391M250L479j2471J1233j570j0651J3464o768m607
185h680J5164j1518R43J3087j1343O186N291j3390J1934r00j2094J2431p399n682
199e970J3716j3617j428J1923j2688M241N118j2044J2181R08r785J4396m865m385
213b299J3976j2005l51J1723j3940L456N803j2524R485j720j1588J2986o005o465
227i468J2570j0238J373J2748j2640M770Q432j0370R046o86r782J3029n131p412
241c759J1133r526o79R244j3735L015O021j0384P254k13o794J2662m433m110J1504
$$ plain form
256 7200 -539 351 8939 -2612 2573 7648 -2566 4530 2626 -5000 5038 -2442 -7471 2302 -6895
271 -6895 -5181 2679 -7878 -1066 4468 -4827 3334 2636 -2626 8127 1405 -1621 8926 -187 892
286 892 6439 -4964 606 2932 -8648 -756 -2105 -7648 2622 -4489 -5569 5712 -3195 -807
300 -807 5374 -3911 4476 6720 -3432 6195 4670 -1532 7115 -2388 -3783 5620 -6500 -4413 1675
315 1675 -8789 -103 1410 -8786 2698 1090 -4544 6194 -1617 -941 9907 -1806 2183 8701
329 8701 -3567 3834 4412 -7008 3039 -469 -7829 2810 -4732 -5707 4398 -7006 -2793 4876
343 4876 -6346 2001 4804 -4508 7195 4967 -2574 8390 1331 -1203 7326 -5049 -2289 4964
357 4964 -7355 -1244 920 -8973 2112 -669 -8093 3379 -1941 -2960 7209 -2819 983 9304
$$ packed form
256G200p739Q90Q588j1551N185N075j0214P096j904p626J0038p480n029R773r197
271f895J714P860j0557O812N534r295Q161o98n262J0753o722l026J0547r113J079
286H92N547j1403N570K326j1580P892j349n543J0270p111j080J1281q907K388
300h07O181r285Q387K244j0152R627j525o202Q647r503j395R403j2120K087O088
315A675j0464Q686J513j0196J1484j608n634J0738p811O76J0848j1713L989O518
329H701j2268P401N78j1420J0047l508p360J0639p542r75J0105j1404M213P669
343D876j1222Q347K803r312J1703k228p541J0964p059k534Q529j2375K760P253
357D964j2319O111K164r893J1085k781p424J1472n320j019J0169j0028L802Q321
$$ plain form
371 9304 -2044 4274 5909 -4479 4943 1777 -6568 3753 -2182 -5160 3222 -6865 -3524 3085
385 3085 -7733 -747 2609 -5507 4560 2999 -3154 7700 2372 -376 7104 -2051 541 5498
399 5498 -5348 454 2276 -6436 974 -2137 -7223 1970 -3606 -5013 2954 -3376 537 5478 -3016
414 -3016 4350 5748 -2019 5613 2334 -2301 5774 -1502 -2617 3432 -4828 -1047 949 -8481 -52
429 -52 20 -6724 2150 -927 -3021 6763 -401 -196 6850 -1239 3501 5385 -3999 4562 3157 -4676
445 -4676 3510 -1820 -5319 2766 -5505 -5239 1911 -6072 -568 2480 -5105 4205 3317 -3289 6361 1791
461 1791 -940 6863 -1311 124 6354 -3840 271 1926 -6937 1272 -1539 -8547 2202 -2085 -5035
476 -5035 4232 -3364 -810 6741 -3358 2090 5513 -2628 6193 3545 -4208 6550 733 -4481 4264
$$ packed form
371I304j1348O318J635j0388R422l166q345J0321n935k978Q382j0087L341O609
385C085j0818O986L356q116J0067j561o153J0854n328k748P480r155K592M957
399E498j0846N802J822q712P410l111n086R193n576j407P967o330L913M941q494
414c016P366J398p767P632l279m635Q075p276j115O049q260L781J996r430Q429
429e2P2o744Q874l077k094R784p164K05P046q089M740J884r384Q561j405p833
445d676Q186n330l499Q085q271K66P150p983N504L048p585R310q88o606R650m570
461A791k731P803q174J435O230j0194M111J655q863Q209k811p008J0749m287k950
476e035R267p596K554P551j0099N448L423q141Q821k648p753J0758n817n214Q745
$$ plain form
491 4264 -4890 -4232 2895 -7216 -2272 1545 -6448 2280 1059 -5501 5568 1206 -2551 7165 -144
506 -144 641 7480 -2472 1844 4754 -4640 1542 -101 -7061 2348 -2757 -6414 2634 -3952 -3000 3584
522 3584 -4465 845 4961 -2734 3957 3854 -1469 6548 1475 -2182 5393 -1712 -2110 2397 -5809 -894
538 -894 1227 -6582 230 -745 -5239 3341 -1847 -3200 5764 -613 591 6135 -1399 3563 5306 -2918
554 -2918 3237 1156 -3556 3165 -3020 -4569 2853 -4720 -3502 1761 -5359 -142 1889 -4513 3237
569 3237 1691 -1244 6037 545 236 6426 -1384 461 3799 -3580 1227 770 -5503 1568 -1855 -5562
585 -5562 1876 -4103 -2986 3607 -3763 67 4715 -2074 3965 3357 -2134 6122 1722 -2686 5168
600 5168 -2349 -1593 4537 -5549 -2207 2412 -6474 -430 -568 -6504 2964 -224 -3512 5698 -799
$$ packed form
491D264r154O58P127j0111M944L817p993Q728j221o560J1069m362l757R716p309
506a44P85O839r952M316K910r394O182j643o960R409n105l657R048o586R52O584
522C584q049N310M116p695O691j03n323Q017n073l657P575p105l98M507q206M915
538h94K121p809O812r75m494Q580n188j353Q964o377J204N544p534M962J743q224
554b918O155k081m712O721o185j549P422p573J218N263p120N217K031o402P750
569C237j546k935P281n492l09O190p810J845L338p379M807m57o273P071l423l707
585e562P438n979J117O593p370L830M648o789O039o08n491Q256m400m408P854
600E168p517P56O130j0086L342M619q886O044j38n936R468l188l288R210o497
$$ plain form
615 -799 2 7412 -2404 1666 5972 -3310 3021 2979 -4703 3403 -699 -5504 2706 -4400 -4574 2813
631 2813 -5525 -1379 3923 -4675 2205 3595 -2782 5413 2064 -2525 6832 177 -1312 5318 -3286
646 -3286 -455 3391 -6181 -838 513 -6524 1162 -1462 -5315 3992 -1195 -2117 5075 -2027 1190
661 1190 5724 -2421 2902 4440 -2292 4105 729 -3532 3266 -2672 -3771 1817 -5045 -1821 1940
676 1940 -5509 723 2063 -3537 3318 663 -1706 5872 29 5 5624 -1397 1697 3667 -3943 1216
692 1216 602 -5324 878 -2202 -4537 2118 -3542 -2218 3409 -3311 716 3319 -2736 3818 3243 -1946
708 -1946 4775 1481 -1065 4488 -2016 -1717 2622 -4492 -1532 269 -5624 1041 -305 -5062 2314
723 2314 -679 -2174 4046 -1556 801 5512 -1332 2686 3688 -2371 3773 986 -3942 2744 -2230
$$ packed form
615g99Q01P410r816M070M306r282O331m2p682Q106m102m805Q210p106j74P387
631B813q338M146N302q598O880J390o377Q195l349m589R357o655j489O630q604
646c286K831L846r572N343J351p037P686k624l853R307n187r22P192p102L217
661A190M534q145N323J538o732O397l376m261O798n938j099N588o862L224L761
676A940p449O232J340n600O855k655k369P578n843k4N619p021L094J970p610N159
692A216o14n926O202l080k335O655n660J324N627o720M027K603o055O554n75n189
708a946O721l294k546N553o504K99M339p114K960J801n893O665j346m757P376
723B314k993j495O220n602K357M711o844M018J002o059O144k787m928O686m974
$$ plain form
738 -2230 -3414 2044 -4659 -1994 1977 -5348 480 1772 -4251 3677 1175 -2456 5869 694 -697
753 -697 5870 -1442 546 4296 -4328 819 1901 -5643 1392 -1095 -5785 2897 -2490 -4158 3473
768 3473 -2772 -644 4548 -3279 2474 4895 -2544 4042 2506 -2963 4680 -250 -3715 3434 -3243
783 -3243 -2131 1967 -5541 -790 1396 -5396 1612 468 -3405 4288 59 -1111 5377 -323 868
798 868 4644 -2208 1905 2679 -3820 2028 -135 -4683 2247 -3022 -4067 2081 -3758 -1651 2763 -3504
814 -3504 1920 3108 -2658 4127 2376 -1534 4873 -36 -1302 4310 -2254 -1070 2371 -4178 -285
829 -285 16 -5517 859 -933 -4149 2601 -1464 -1393 4652 -1674 717 4176 -1470 2884 2789 -2392 3406
846 3406 667 -3031 2499 -2614 -2750 1982 -4213 -2038 1244 -4153 986 815 -3477 3615 679 -1380
$$ packed form
738b230j184N458o703K665L971p325N828J292o023P928k502l631Q325n175j391
753f97O567p312J988L750q624N147J082p544P035k487m690Q682n387j668P631
768C473o245K128N192p827N753K421p439O586j536n469P643m930l465P149o677
783c243J112M098p508M751K186o792P008j144l873P693m229j170O488n700J191
798H68L776o852M113P74o499N848k163m548O930n269j045O148n839K107M414o267
814c504N424J188n766O785j751l910O407m909j266N612o564J184L441o549L893
829b85L01n533O376j792l216O750m065P1O045o326K391L459n646M354r5n181N798
846C406k739l698N530n113j36M732o195K175L282n397N139j71m292P092k936k059
$$ plain form
862 -1380 4799 -309 288 5209 -1740 1094 3192 -3628 1311 213 -4804 1732 -2097 -4361 2216
877 2216 -3041 -2160 3029 -3353 855 3637 -2844 3206 2783 -1813 5236 833 -2122 4591 -1766 -1632
893 -1632 2940 -4553 -838 1768 -5462 221 232 -4538 2887 -952 -3302 4832 -1135 -171 5605 -1765
909 -1765 1848 4766 -3111 2428 1985 -4051 2593 -1542 -4562 2831 -3239 -3100 3007 -4197 -755 2721
925 2721 -3942 1976 2721 -2724 4602 1564 -1433 5351 -542 -1139 4096 -2884 -352 2087 -4526 613
941 613 479 -4813 1435 -1111 -3595 3186 -1854 -1347 3996 -1564 1291 3906 -2087 3071 2534 -2642
957 -2642 2980 -13 -2617 2780 -2800 -2469 2015 -4030 -1254 994 -4408 1188 884 -3047 3308 515
973 515 -850 4418 -416 355 4458 -1743 985 2487 -3414 1436 334 -3790 1409 -1948 -3172 1938
$$ packed form
862a380O179n108N97M921o949K834K098o820M939j098n017O536l829k264O577
877B216n257Q81N189o382M208K782o481O050m23m596P049m403k955O713o357J34
893a632M572p493L715K606p230N683J1m770P425l839k350Q134n967R64N776p370
909a765L613K918p877N539m43o036O644m135l020P393o070J39O107p204L442L476
925B721o663N918P45n445P326l038k997O784n893n97N235o980K532K439o613N139
941F13j34n292O248k546k484O781n040N07N343n560K855K615n993N158n37n176
957b642N622k993k604N397n580L31M484o045K776K248n402N596l04l931O355k793
973E15j365N268m834P71M103o201K728J502n901M850j102m124N199l357j224N110
$$ plain form
989 1938 -3273 -1452 2461 -2893 1238 2596 -2114 3389 1914 -1459 4115 113 -1057 3462 -2061
1004 -2061 -347 2237 -4101 -137 562 -4553 812 -1199 -3600 2876 -1179 -1354 3809 -1398 1254
1019 1254 4178 -2308 2233 2979 -2313 3049 410 -3151 3046 -2062 -2760 2153 -4087 -1570 1992
1034 1992 -4674 573 1705 -3560 3244 1013 -2064 4530 -3 -804 4606 -1433 288 3463 -3272
1049 -3272 1099 1134 -4632 1268 -691 -4318 2106 -2270 -2534 3564 -2393 -46 3620 -2608 2370 3177
1065 3177 -2666 3442 1675 -2068 3564 -1031 -2068 2833 -3331 -1595 1793 -4450 13 1044 -4351
1080 -4351 1600 592 -2703 3445 -267 -864 4370 -1112 756 3649 -2135 1471 2075 -3357 1719
1095 1719 35 -3553 1591 -2057 -2528 1881 -3011 -815 2220 -2790 1676 1974 -1964 3230 1451
$$ packed form
989A938n211J821L913n354M131J358m710N503j475l373N574m002j170M519n523
1004b061J714K584o338L964O99n115N365k011k401O476m055j75N163n207K652
1019A254K924o486M541P46n292N362k639l561O197n108o98M913o240K517L562
1034A992o666N247J132n265O804k231l077O594m533q01N410o039J721L175o735
1049c272M371L5n766N900j959l627O424m376k64O098n957K347L666o228M978Q07
1065C177n843O108j767l743N632m595j037M901o164J736L388o243M463J031n395
1080d351N951j008l295O148l712n97N234n482J868K893n784L606O04n432N076
1095A719j684l588N144l648m71M409m892K196L035n010M466K98l938N194j779
$$ plain form
1110 1451 -1281 3855 -203 -441 3231 -2393 -481 1604 -3738 94 -135 -3937 1287 -1185 -3186
1125 -3186 2396 -1139 -763 3055 -1587 1390 3432 -1835 2362 1804 -1857 3043 -377 -2358 2513
1140 2513 -1990 -2067 1595 -3680 -587 1443 -3575 1130 451 -2458 3109 237 -1293 4155 -531 482
1156 482 3860 -2324 1074 2314 -3202 1638 74 -3774 1881 -1689 -3302 2220 -2749 -1560 2914
1171 2914 -2830 1018 2724 -2555 2959 2087 -2189 3812 202 -1645 3880 -2068 -1641 2588 -3598
1186 -3598 -535 1199 -4434 667 398 -3559 2451 -498 -1858 3762 -1019 -488 4010 -1540 1248
1201 1248 2977 -2637 2093 1404 -3343 2019 -1073 -3117 2280 -2666 -2379 2173 -3092 -403 1945
1216 1945 -2924 1987 1711 -2164 3502 740 -927 3824 -797 -640 2929 -2205 -13 1565 -3483
$$ packed form
1110A451k732N136m058k38L672n624J912K085n342L832k29l802N224k472k001
1125c186N582l535L76L818m642K977K042n267M197n58l661M900l420j981M871
1140B513m503p7L662n275L093K030n018M705o79k909N567k872j530N448m686J013
1156D82L378o184L398J240n516M840j564l848N655l570j613N522m969J189M474
1171B914n744L848J706n279N514q72m276O001l610j847N525n948M27M229o186
1186c598L063J734n633N101k69l957O010k949j360N620m781N31M498n550K788
1201A248J729n614M730o89m747N362l092k044N397m946K87M552n265K689K348
1216A945m869M911k76l875N666k762j667M751m621J57L569n134K192J578n048
$$ plain form
1231 -3483 639 -191 -3716 1551 -853 -2340 2530 -1313 -837 3377 -1577 974 2893 -1790 2502
1246 2502 1530 -1817 2692 -6 -1981 1877 -2439 -1457 1297 -3299 -780 872 -2532 1200 260 -2101
1262 -2101 2830 218 -919 3299 -417 599 3202 -1438 954 1529 -2258 1219 -330 -2970 1431
1277 1431 -1806 -1958 1592 -2390 -764 1870 -2435 1046 1811 -1728 2620 1121 -894 3320 -609
1292 -609 -641 2848 -1968 -482 1399 -3510 330 350 -3605 998 -552 -2429 2431 -1267 -1084 3125
1308 3125 -1376 683 3031 -1730 1960 2093 -2241 2216 202 -2300 2179 -1686 -2248 1989 -2957
1323 -2957 -1012 1507 -3325 816 1352 -2673 2484 973 -1257 3577 -201 -670 3690 -1447 32
1338 32 2355 -2707 461 794 -3551 1118 -510 -3048 1666 -1518 -1773 2440 -2054 167 2622 -1681
$$ packed form
1231c483M122q30l525N267k404j487M870l843M76M214m954K551J919m683M292
1246B502r72l347M509k698j975L858m316R82K754m596K519J652l404L732r40k361
1262b101M931k612j137M218l716J016K603m640K392N75l787L477j549k640M401
1277A431l237j52L550l982J626K634m305L481P65l539M348j499k015M214l929
1292f09l2L489m816J486J881m909L840K0l955M603j550j877M860l698J83M209
1308C125m501K059K348m761L690J33m334M457k014k502M479l865n62M237m946
1323b957J945K519m832M141N36m025N157j511k230M834l778m69M360n137J479
1338C2K323n062L168L33m345M669j628k538M714l184k55M213m494K221K455m303
$$ plain form
1354 -1681 1644 2094 -1769 2560 903 -1665 2530 -972 -1476 2037 -2492 -1062 1327 -3157 45
1369 45 447 -2745 1669 265 -1762 2674 -67 -141 3289 -941 658 2568 -1713 1281 1094 -2469
1385 -2469 1410 -316 -2658 1491 -1566 -1754 1586 -2323 -349 1800 -2039 1413 1514 -1445 2300
1400 2300 726 -864 2772 -368 -709 2072 -1883 -256 999 -2816 544 222 -2726 1091 -822
1415 -822 -1912 1858 -1223 -645 2235 -1233 1197 2101 -1466 2117 1121 -1648 2138 -294 -1617 1732
1431 1732 -1902 -1341 1015 -2780 -134 907 -2702 1215 418 -2002 2497 -17 -729 3284 -799 56
1447 56 2787 -1798 914 1459 -2607 992 180 -3105 1506 -1165 -2387 1696 -1866 -971 2379 -1812
1463 -1812 593 2109 -1828 2103 1502 -1637 2903 170 -1206 2606 -1449 -976 1764 -2577 -571
$$ packed form
1354a681L325M50l863M329j657k568M195l502n04L513m529J430K389m484L202
1369D5M02l192M414j404k027M436k741p4L430m230J599J910m281K994j87l563
1385b469L879j726k342M149l057j88L340l909J974K149l839L452J01k959L745
1400B300j574j590L636l140l41K781l955J627J255l815L360l22k948L817j913
1415h22j090L770l081N78K880l468K430R04l567L583r96k769L786k432j323L349
1431A732l634N61K356l795K646J041l609L917p97k420M499k514p12M013m083Q55
1447E6K731m585K712N45m066L599q12l285M611k671j222M083l562Q95L350m191
1463a812K405J516l937L931o01l139M540k733j376L812m055M73K740m341K006
$$ plain form
1478 -571 790 -3026 713 106 -2867 1765 -193 -1575 2506 -566 89 2914 -1197 597 2176 -1792
1494 -1792 1232 546 -2443 1537 -680 -2368 1280 -1916 -1277 1574 -2249 -207 1395 -1726 1775
1509 1775 1221 -1257 2504 587 -592 2799 -663 -646 2032 -1880 -95 893 -2526 436 -1 -2554
1525 -2554 1238 -856 -1641 1820 -910 -349 2371 -1047 1040 1885 -1163 1491 792 -1147 1758 -506
1541 -506 -1513 1402 -1737 -752 569 -2402 51 437 -2174 746 -7 -905 1955 45 -386 2222
1557 2222 -422 591 1699 -1495 985 894 -1898 1062 -620 -1994 1287 -1221 -1572 1293 -1871 -443
1573 -443 1417 -1612 967 1333 -1171 2238 687 -911 2448 -561 -611 2215 -1681 -273 1008 -2477
1589 -2477 440 140 -2490 1209 -293 -1818 2103 -714 -596 2365 -1049 500 2224 -1490 1322
$$ packed form
1478e71J361l816L739o07k973M632j958j382M081l072O55K825m111J794J579l968
1494a792L024o86k989L980k217j688L648l196O39K851l823K042J602l121L501
1509A775n54k478L761j917j179L391l462J7K678l912J785R88l419K962m37k553
1525b554L792k094p85L461k730N61K720l418K087Q45l048K654o99j939K905k264
1541e06j007K915l139R85J321k971K453L86k611K920p53q98K860j910m31K608
1557B222k644J013J108l194K480r1k792K960j682j374L281k508l51K865l164J428
1573d43J860l029K579L66k504L409j551j598L359l009n0K826l896J408J281l485
1589b477K917l00k630L699j502j525L921k817J18K961l414J549J724l714K812
$$ plain form
1604 1322 1570 -1565 1583 102 -2035 1517 -1402 -1294 1492 -2094 -1110 1160 -2416 648 1205 -1914
1620 -1914 1911 727 -1118 2462 -88 -533 2300 -840 -190 1848 -1913 133 475 -2517 768 -534
1636 -534 -2063 1369 -1223 -1086 2024 -1081 34 2044 -1212 1309 1459 -1278 1691 386 -1101 1744
1652 1744 -821 -1024 1172 -1822 -386 937 -2497 136 472 -2093 1363 285 -1083 1999 -4
1667 -4 -296 2309 -707 597 1519 -1065 606 854 -1674 1019 -463 -1780 848 -1247 -1080 1054 -1453
1684 -1453 -18 1399 -1543 1108 897 -1061 1758 570 -478 1976 -432 -138 1470 -1602 -229
1699 -229 870 -1924 514 -114 -2058 1079 -674 -1359 1674 -824 -110 2217 -1245 788 1649 -1122
1715 -1122 1625 858 -1435 1593 -368 -1384 1472 -1481 -656 1212 -2058 -9 684 -2153 997 509
$$ packed form
1604A322K48l135L148j481k137L552k919J08K786l586R84K270l576L064N57l119
1620a914L825j184j845L580k550m45K833l140O50K038l761K046L42k992L285j302
1636e34j529L432k592J37L110l105J115K010l256K521J50k737K969j305j487K845
1652A744k565k03K196k994J436J323l434K633L36k565L456j078j368L082k003
1667dk92K605l016J304R22k584J671K48k528K693j482j317K628k095J67K134k507
1684a453J435J417k942K651k11j958K819j188j048K454k408K94J608l072J373
1699b29J099k794K438o28j944L137j753o85L033k498P14K327l462K033Q61k771
1715a122K747p67k293L028j961j016K856k953Q25J868l270K049O93k837L150m88
$$ plain form
1731 509 -1458 1830 126 -673 2341 -632 -108 2198 -1211 551 1138 -2070 1066 167 -2219 960
1747 960 -1048 -1507 1422 -1481 -618 1604 -1250 878 1641 -1579 1548 1211 -1337 1790 -136 -1064
1763 -1064 2135 -1292 -836 1436 -1988 -377 583 -2410 541 70 -1872 1609 -103 -930 2068 -503
1779 -503 -26 2000 -1044 517 1512 -1542 892 403 -1809 1138 -386 -1581 1260 -1355 -859 1067
1795 1067 -1564 -33 1116 -1339 1104 761 -935 1848 129 -525 1813 -784 -148 1506 -1702 -271
1811 -271 535 -1912 287 -253 -1514 990 -379 -881 1317 -811 -24 1706 -799 1050 1206 -818
1827 -818 1308 639 -1237 1152 -760 -752 1103 -1525 -747 487 -1526 96 277 -1535 1365 117 -762
1844 -762 1672 -198 -304 1992 -692 463 1334 -1297 742 495 -1520 735 -597 -1621 1070 -1097
$$ packed form
1731E09j967L288j704p99L014k973N24K306l409J762N87l208L136q99k386L179
1747I60k008m59K929k903Q63K222k854K128P63l220L127l37k548L127j926r28
1763a064L199l427M56K272l424J611R60k993K951m71j942L481j712q27K998k571
1779e03M77K026l044J561R95l054K434m89k212K947j524j195K841k615M96J926
1795A067k631J531J149k455K443l43j696K783j719o54K338k597O36J654l208J431
1811b71Q06k447K199n40j261K504j369n02K198k128P87J730k505J849J56k024
1827h18K126o69j876K389j912QJ855k628P78J234k013J622J81j812K900j248q79
1844g62K434j870j06K296k684J155Q71k631K039k47k015K255j332j024K691k167
$$ plain form
1860 -1097 -1048 1169 -1473 -83 1430 -1332 949 1023 -1091 1870 454 -1003 1995 -334 -856 1331
1876 1331 -1372 -400 1095 -2073 156 269 -1945 898 -362 -1579 1461 -459 -363 2073 -948 380
1892 380 1702 -1079 1010 910 -1426 1323 -232 -1400 1435 -1096 -1140 1147 -1646 -536 1126 -1630
1908 -1630 435 1037 -1374 1525 640 -873 1953 2 -675 1661 -952 -195 1273 -1516 229 309
1924 309 -1772 842 -266 -1687 1178 -721 -776 1532 -937 -28 1505 -840 1161 1105 -981 1561
1940 1561 323 -980 1483 -700 -975 1137 -1445 -570 560 -1875 136 426 -1358 1153 333 -829
1956 -829 1545 -288 -342 2005 -640 339 1126 -1147 635 398 -1440 806 -563 -1324 1028 -1026 -962
1973 -962 996 -1282 130 1050 -1162 1106 664 -755 1734 50 -684 1763 -515 -414 1230 -1574
$$ packed form
1860a097M9K217k642J390J513k762K281P4k114K961j416j457K998k329n22K187
1876A331k703R72J495l168K229J13k214K843j260j217L040j920R6K436l021J328
1892C80J322k781K089j00k336K749j555j168K835k531m4K287k793J110J662k756
1908a630K065O02k411K899q85j513K826j951o77K336k613P57J468k789J745Q0
1924C09k081K614j108j421K865j899n5K308k469R09J533k345K001n6k086K542
1940A561j238j303K463k183k75K112k582Q75J130k435K011K90j784K511q20j162
1956h29K374j833n4K347k645R79P87k273J782k37j838K246j369p61K352k054O4
1973i62J958k278J412R20k212K268m42j419K489j684p34K447k278J01J644k804
$$ plain form
1989 -1574 -4 753 -1886 446 42 -1652 1077 -423 -834 1581 -781 13 1627 -938 596 1371
2005 1371 -1420 1228 768 -1257 1192 -463 -1145 1114 -1143 -778 1086 -1880 -8 757 -1798 956
2021 956 408 -1238 1627 145 -645 1896 -582 -23 1791 -1377 6 940 -1755 581 107 -1929
2037 -1929 885 -596 -1351 1363 -1093 -548 1490 -1104 436 1319 -1181 1154 887 -968 1426 226
2053 226 -979 1213 -834 -734 1061 -1568 -167 394 -1724 341 551 -1345 1055 42 -658 1850
2069 1850 -336 -196 1355 -724 456 1105 -1433 804 408 -1378 880 -515 -1161 1043 -1044 -790
2085 -790 909 -1189 250 1026 -1167 1059 693 -701 1310 49 -529 1291 -562 -347 1046 -1289
2101 -1289 259 592 -1548 494 -137 -1360 895 -487 -763 1251 -819 262 1166 -1030 896 821
$$ packed form
1989a574J570P57k639K332m04j694K729j500m11K415k362P94J614k565J534P75
2005A371k791K648m60k025K449j655o82K259k257L65J864k966J872P65k555K754
2021I56n48j646K865j482p90K541k478N59J814l168J383R34k695K336m74k036
2037a929K814j481p55K714k456N45K038k594J540Q83k500K335k67j855K394j200
2053B26j205K192k047J00J795k629J401N61k118K065K10j896K400j013p00K508
2069A850k186J40J551k079J180O49k538K237l96j786K258j395o46K204k087K54
2085g90J699k098J439P76k193K226l66j394K011j261n78J820j853K15J393k335
2101a289J548L33k140K042o31j223K255j382k76K014k070J081R04k196J926p5
$$ plain form
2117 821 -742 1082 -36 -864 1212 -565 -819 926 -1390 -728 685 -1507 263 213 -1184 1229
2133 1229 -61 -697 1714 -205 -48 1567 -950 502 1003 -1360 484 497 -1574 856 -156 -1443
2149 -1443 1067 -997 -839 1306 -1166 -132 1298 -1333 1036 1036 -1071 1294 385 -1098 1458 -560
2165 -560 -531 1482 -1348 -269 1019 -1779 232 478 -1673 648 -105 -959 1338 -236 -389 1842 -828
2182 -828 194 1305 -1095 1057 877 -1356 1104 33 -1538 1124 -836 -1025 943 -1289 -390 963
2198 963 -1409 688 962 -1310 1311 417 -817 1545 -131 -346 1645 -983 -115 1050 -1458 324
2214 324 345 -1562 656 -284 -1255 1093 -528 -396 1384 -917 183 1181 -791 887 877 -879 1026
2231 1026 100 -943 1160 -655 -953 860 -1200 -392 734 -1138 340 338 -1350 1136 139 -948 1350
$$ packed form
2117H21j563J824j118q28K076j777k54J745k316O62J413k192J770n0j397K413
2133A229j290o36K411j919J57J615k517J452N01k363J844J3k071K430j012j287
2149a443K510k064J58K145k472J034J430k631K369%k107K365r09j483K556k018
2165e60K9K013k830J079J288k798K011K46k151K321p53q54K297j574j53K231k670
2182h28J022J111k400K152j80k233K460j071j571K662j960j89J968k232Q99J353
2198I63k372K097K74k272K621q94j234K362j676k15J991k628Q68J165k508J782
2214C24K1j907K218r40r71K348j621J32J780k301J100R98j972J678j0j756J905
2231A026r26j043K103j815k98J813k060Q08J126j872J478kj688K486r97j087K298
$$ plain form
2248 1350 -243 -157 1584 -648 276 934 -961 624 264 -1131 743 -542 -998 955 -858 -713 1122
2265 1122 -1363 275 740 -1063 1055 565 -872 1419 98 -571 1483 -704 -377 1101 -1294 164
2281 164 438 -1551 624 -188 -1488 857 -452 -957 1471 -575 17 1604 -1088 692 1137 -1086
2297 -1086 1022 486 -1286 1077 -480 -1217 1066 -1083 -638 981 -1351 -86 777 -1383 797 237
2313 237 -1175 1327 60 -614 1614 -541 -196 1402 -1156 128 818 -1417 427 -121 -1552 841
2329 841 -421 -814 1235 -809 -225 1385 -862 338 1042 -854 763 398 -984 1345 -163 -1019
2345 -1019 1059 -1072 -684 748 -1125 -136 469 -1329 615 266 -1148 917 -19 -482 1344 -433
2361 -433 -143 1472 -559 395 1153 -1109 479 400 -979 727 -453 -898 813 -774 -533 877 -831
$$ packed form
2248A350j593Q6J741k232R24O58j895J585l60j395J874j285m56J953j813J45J835
2265A122k485J638M65j803K118m90j437K291j321o69K054k187L27J478k395J458
2281A64K74j989K175q12j300K345j309n05K428k046N92J587k692J780M45k223
2297a086K108n36j772K363j557p37K283k149M45J619k332J265Q63k160K180n60
2313B37j412K502j267o74K228k155L45J598k558J284O90k235J844n48j431K393
2329H41j262l93K049k044N84J610k247J200P04j896J617l65j382K329j508q56
2345a019K078k131L88J432j873R89O05j798J944l49j414K065r36m63J826j777
2361d33K90J615k031R54P58k262J588p9j379J706j180m45J711j587K41J410j708
$$ plain form
2378 -831 263 790 -731 829 400 -572 1092 -77 -358 1091 -398 -318 646 -1046 145 302 -1329
2395 -1329 353 -164 -892 765 -507 -576 950 -600 68 824 -593 456 763 -719 892 -3 -854
2412 -854 927 -618 -734 877 -922 -381 721 -1168 73 558 -1133 1004 -14 -783 1158 -148
2428 -148 -400 1271 -413 -112 938 -1046 637 442 -1499 657 -426 -1199 943 -440 -766 1265
2444 1265 -780 -116 924 -991 542 708 -1092 1136 231 -507 1058 -512 -363 1013 -1033 -280
2460 -280 599 -1365 65 423 -1321 743 36 -943 985 -203 -522 1431 -581 312 1170 -935 581
2477 581 572 -1233 595 -53 -976 954 -578 -661 969 -753 -345 825 -959 474 794 -602 793
2494 793 237 -518 1132 -311 -358 842 -726 -127 582 -1035 222 261 -1256 599 -122 -1152 823
$$ packed form
2378h31J094N27j521J560m29r72J664j169k81J449j489Q0R64j692J191J57j631
2395a329J682n17p28J657j272o9J526j550O68P56j417J049L07j482J611q95q51
2412h54J781j545j16J611j799N41J102j889J241M85j691K137j018p69J941j306
2428a48k52J671j684L01J050j984J683j95j941K156j083p73K142j383l26K031
2444A265k045O64J040j915J533J66j800K228r05p38J565j570J49J376k046P53
2460b80Q79j964J430L58j744K064p07r79J928j188l19J953k012Q93Q58k105J516
2477E81rj805J828o48r23J930j532q3J630j722M08J170j784J433L20j396J395
2494G93n56p55J650j443m7J200j568N99P09j617J257L9j517J855p21j030J975
$$ plain form
2511 823 -440 -443 830 -299 258 824 -633 445 650 -904 733 -63 -879 721 -491 -437 742 -961
2529 -961 -12 298 -1140 380 25 -966 807 91 -614 1217 -364 -108 1071 -592 227 522 -940
2546 -940 540 115 -1069 707 -624 -930 921 -687 -79 711 -845 460 794 -706 793 316 -791
2563 -791 944 -128 -440 946 -537 -441 863 -1075 -47 580 -1153 249 128 -829 752 -208 -534
2580 -534 1096 -360 -121 899 -812 458 885 -917 599 329 -1193 1015 -134 -702 734 -853
2596 -853 -396 873 -910 -80 710 -778 511 566 -762 1197 89 -331 1176 -426 -286 742 -719
2613 -719 137 445 -960 261 240 -1012 730 -118 -724 817 -361 -182 909 -377 320 689 -502
2630 -502 629 387 -730 783 41 -584 705 -610 -468 523 -856 -164 549 -789 620 186 -573
$$ packed form
2511H23j263lJ273j129N57N66j457J078K05j554J637p96q16J600j212N4J179j703
2529i61R49L10j438J520l55r91J773p16p05J831j581K56J179j663Q19K95j462
2546i40J480m25j184J776j331l06J851j608O08P90j556J305L34j500J499m77j107
2563g91J735j072l12J386j483R6J304j938J028O27j733J402j21r57J581r60l26
2580e34J630j456K39J020j711J270M27j802J516k70j522K208j149n68J436j587
2596h53M57J269j783Q30P90j488J289N5j328J959j108m20J507j602J40J028j461
2613g19Q56L08j405J221k1j252J742q48o06J541j178J79J091j286O97L69j191
2630e02J131k42j117J513p42o25J289j315J42R91j379O92P13j338J409m34p59
$$ plain form
2647 -573 782 92 -296 989 -295 13 854 -550 159 234 -699 178 -163 -771 625 -531 -738 591
2665 591 -714 -363 522 -451 267 552 -489 711 280 -526 748 -280 -171 818 -686 -21 546 -918
2683 -918 225 117 -1003 435 -63 -772 726 -352 -314 861 -417 320 812 -532 317 456 -607
2700 -607 793 102 -593 786 -300 -537 722 -752 -144 666 -1032 440 362 -745 714 244 -425
2717 -425 967 -319 -236 966 -398 132 836 -888 150 427 -1001 576 -220 -907 638 -572 -496
2734 -496 781 -537 -163 874 -740 323 569 -772 721 168 -584 1036 -365 -615 638 -667
2750 -667 -216 381 -1028 77 244 -906 548 48 -601 848 -227 -162 949 -533 2 669 -757
2767 -757 297 401 -744 229 -201 -577 659 -378 -505 633 -876 -119 686 -716 409 400 -697 547
$$ packed form
2647e73J355o90l88J285j284L08Q41j404P09P5r33Q77l41o08J396j156k07J329
2665E91j305L51Q85r73P18K85j041J200m31q06J274j028J09R89j504O65N67j464
2683i18J143j08j120J438m98p09J498j078L8J175j278P37M92j344Q49J39j063
2700f07J400o91o95J379j086k37J259j474O08Q10j698J472p8j107J459m70o69
2717d25J392j286Q3J202j364N30P04j724J038K77j428J577p96o87J545j210P6
2734d96J277j318L74J037j614J063K46j341J493n53p52J620j401k50J253j305
2750f67M51N97j409J105J67j150J454n00o49J449j075O5J111j482N35O67j426
2767g57J054J04j145R73m30l76J236j037j27J138j509P57Q05j402J125rj097J244
$$ plain form
2785 547 43 -568 755 -242 -195 731 -631 -48 551 -874 144 90 -821 289 51 -645 914 -209
2803 -209 -227 964 -589 217 633 -403 653 220 -604 612 -89 -675 502 -618 -232 550 -804 -53
2821 -53 231 -708 586 121 -535 816 46 -285 891 -364 -59 868 -642 19 620 -1027 469 -28
2839 -28 -1016 502 -165 -612 1068 -445 -315 706 -600 185 574 -620 376 488 -598 707 -145 -428
2857 -428 817 -467 -537 814 -777 -95 283 -828 186 176 -762 607 -1 -348 913 -303 -272 825
2875 825 -572 85 563 -646 434 144 -729 666 -205 -662 673 -569 -385 723 -542 42 464
2892 464 -745 647 406 -648 834 67 -589 909 -279 -254 890 -730 61 484 -821 245 133
2909 133 -747 699 -224 -348 1016 -444 -335 704 -543 9 304 -465 534 432 -754 527 -137 -525
$$ packed form
2785E47n04o11J323r97M7R26j362N83N99j425J018n4r11J110k38o96J559j123
2803b09j8J191j553Q06M16j036J056m33q24J216p01n86J177j120L86P82j354P51
2821e3K84r39J294m65o56J351p70l31J176j255L05R27j510O61O01j647J496m97
2839b8r88J518o67m47J680j513J30J021j306P85L89j194R96J12j086J305q52k83
2857d28J245j284p0J351j591O82L78j111J014j0r38J369o08l47J261j216L1J097
2875H25j397O57M78j209J080k90q73J395q71m57J335j242J84J108j265N84M22
2892D64j209J392k41j054J482p67o56J498j188K5J144j620P91M23j305J066j12
2909A33q80J446r23j24J364j460J09J039j247N52K95p69R99j02j186J281o64l88
$$ plain form
2927 -525 618 -538 -428 304 -712 178 342 -639 94 227 -302 571 -112 -493 729 -130 194 721 -623
2946 -623 279 240 -628 153 4 -722 547 -118 -527 500 -325 -55 458 -469 196 505 -489 410 32 -380
2966 -380 836 -164 -350 475 -544 -181 535 -828 147 314 -863 241 -104 -582 584 -408 -488 900
2984 900 -461 337 589 -687 126 538 -676 597 29 -849 688 -255 -257 590 -628 -156 571 -792
3002 -792 463 378 -633 597 168 -675 821 -55 -325 851 -477 -206 648 -477 156 312 -768 323
3020 323 -116 -747 752 -528 -331 747 -607 20 725 -382 337 487 -472 594 348 -509 682 18
3038 18 -328 405 -655 -324 229 -820 193 296 -755 435 120 -659 591 -82 -221 790 -299 -27
3056 -27 840 -428 6 453 -695 407 22 -430 177 -90 -310 574 -228 -19 591 -620 116 449 -562
$$ packed form
2927e25J143j156J10P32j016Q90J64r81P33J33n29Q73o83l81J222q59L24N27j344
2946f23R02l9q68P81j49p26J269o65m09J027q25K70N13r27O65L09r94Q99l78m12
2966c80J216j000j86Q25j019L63P16j363R75J67j177J104l45m78J166r92q0J388
2984I00j361P98K52j276Q13M12j214J273n68q78J537r43kQ47j218M72P27j363
3002g92J255q5j011J230m29q43J496q76k70J176j328K71Q54j125O33J56j080J091
3020C23m39o31J499j280J97J078j354O27P05j107P19J50r59J066k46q57J191o64
3038A8l46P33j060L31N53j049J013J03j051J190l15p79J250o73j39J011j089K72
3056b7Q67j268M34M47j148J102l85m52O07k67k20Q84q02K09O10j211P36L33j011
$$ plain form
3075 -562 361 65 -426 858 21 -173 532 -402 -144 289 -838 154 224 -702 191 -172 -362 571 -264 -98
3095 -98 617 -483 102 546 -494 424 136 -413 464 -154 -512 462 -145 -388 451 -557 -46 433 -641
3114 -641 346 186 -649 635 142 -451 816 -502 -183 765 -606 138 443 -824 409 200 -701 468
3132 468 -170 -512 628 -398 -281 803 -584 24 616 -661 520 333 -629 748 -119 -476 711
3149 711 -335 -331 629 -619 -172 417 -730 107 289 -609 519 -18 -420 869 -254 -112 497 -336 -13
3168 -13 505 -583 405 245 -665 477 -171 -737 481 -471 -373 588 -511 172 662 -538 447 586 -562
3187 -562 706 41 -244 553 -582 -96 364 -461 41 208 -501 -4 101 -513 217 -41 -530 494 -341
3206 -341 65 396 -457 17 269 -436 303 227 -448 565 -68 -378 531 -383 -289 349 -575 133 432 -515
$$ packed form
3075e62R23k96m91J284q37j94P05r34K58M33j127R92P0r26Q93l63j90R33q35J66
3095i8P15j100N85M44j040R18k88n49Q77o18l58R74o07k43Q39j008N11M79j074
3114f41R87j60q35J284m93n93J267j318L19R48j371P44L05j267J233k09r01J169
3132D68o38l42J140j026J17J084j387O08N92j277J181j87r62J377q67l57J187
3149G11j046MR60j248M47N89j147Q37J82q98J128n37m02J289j123J42O09q33L23
3168a3N18j088R88j60r10J142o48n66J218r52R8R61j099O83M90j200R85J39j148
3187e62J268o65k85P97j135M86M60q25N02J67p09M97J05o14P30k58m89J024q35
3206c41M06L31q53M74K52p05P39p6o75J013o33l10R09r14R4O38r24P08K99r47
$$ plain form
3226 -515 366 18 -422 674 -164 -117 682 -205 -19 524 -431 159 214 -689 255 -95 -558 284 -138 -395
3246 -395 392 -451 -51 529 -255 304 229 -550 850 -40 -343 433 -210 -128 504 -366 -167 493 -534 131
3266 131 2 -721 480 -22 -457 553 -165 -471 592 -281 73 654 -499 394 230 -615 337 25 -573
3285 -573 589 -260 -492 563 -477 -31 546 -832 306 316 -453 512 294 -522 718 -148 -201 788 -385
3304 -385 -110 437 -651 -24 340 -717 558 148 -510 489 -62 -438 619 -369 110 544 -236 138 426
3323 426 -568 334 154 -739 589 -114 -271 341 -513 -336 681 -439 25 157 -682 427 331 -484 487
3342 487 -162 -196 651 -398 12 529 -632 237 229 -539 475 238 -426 371 -313 -456 493 -326 -100 393
3362 393 -330 358 372 -396 527 -110 -348 566 -99 -115 557 -299 -131 307 -607 63 184 -737 312 -105
$$ packed form
3226e15Q81l48m40J096q38M7P99q87J86N43r55N90N5r03R44l50m63Q42m22k57
3246c95P87q43M00N80p84N59p5p79J400q90l03P76o43Q2O32q70J99O60j027O65
3266A31j29p23J201n02m35J010p18l06J063q73L54N81j153Q93j64q45R52l12n98
3285e73J162q49k32J055j040M46N77j378J138J0p69R65k18q16J240q66n3R89j173
3304c85K75N47j088O27L64j057J275m10o58R99n51l76J057r88M79M34p80L74K88
3323D26r94R02j80q93J328p03j57O12q54J77J017j120M64J32q39J109r6q15R71
3342D87o49l4Q47j049M10N17j161Q69qp68J014k37o64P97o84j43R49q19K26M93
3362C93p23O88J4p68R23o37k38R14o65j6O72q56J68M38r14O70J21r21J049m17
$$ plain form
3382 -105 -536 422 -80 -124 580 -301 -37 498 -276 204 201 -391 583 -80 -357 314 -333 -286 434 -473 -132
3403 -132 282 -540 351 54 -402 440 -101 -308 459 -194 -161 671 -493 -11 383 -699 37 142 -620 578
3423 578 -46 -496 756 -250 -360 470 -340 -183 580 -533 452 325 -367 320 124 -528 659 -256 -236
3442 -236 453 -521 28 281 -477 153 139 -545 453 55 -353 637 -117 -109 602 -291 -9 373 -547 234 230 -231
3464 -231 418 -10 -481 321 -346 -442 385 -510 45 328 -390 349 358 -371 407 4 -211 609 -105 -166 397
3485 397 -495 -149 76 -393 14 147 -545 220 -67 -414 749 -260 -36 422 -344 10 278 -422 172
3504 172 73 -403 305 -155 -271 180 -518 -307 420 -477 131 232 -410 331 181 -111 482 90 -157 410
3524 410 -267 -15 579 -350 302 367 -484 186 53 -687 193 -279 -236 364 -163 195 637 -387 38 422
$$ packed form
3382a05m31R58n02m4P04q81K64N35p74M80ln92R74o63k77O71o47M7P20r07L41
3403a32M14q22Q91k97m56Q42n41k07P67o53L3Q32j164M82L94j082P36J05p62J198
3423E78o24m50J252j006j10Q30q10J57P63j113R85j27o92O87j96o52J187r15K0
3442b36O89r74N49K53p58O30j4o84R98l98m08R90p54QP11q93K82L82r20P81mm61
3464b31O49m28m71Q02o67r6Q27q95N55K83p18P39Rp29P78m03k15Q20p14o1N63
3485C97q92L46K25m69M07J33o92P65k87l47J163j009K24M58p66L54K68p00N94
3504A72r9m76P08m60j16M51o98K11P27q97O08J01o42P41j50k92N93l92k47N67
3524D10o77K52N94r29O52O5q51O70j33p40Q80m72M3O00n27L58M42j024M25L84
$$ plain form
3544 422 -326 534 36 -315 528 -280 -115 560 -404 45 334 -562 132 180 -488 287 53 -399 509 -55
3564 -55 -285 582 -281 -48 645 -394 99 409 -592 441 -67 -183 385 -8 -252 513 -392 -88 465
3583 465 -460 263 383 -425 249 338 -399 478 -119 -272 523 -325 -111 484 -640 69 332 -411 66 111
3603 111 -450 385 -44 -300 527 -341 -164 425 -504 -79 159 -389 173 262 -336 395 12 -214 234 -257
3623 -257 -324 297 -354 -11 282 -418 297 250 -88 348 -214 -42 478 -273 -122 371 -506 10 271 -407 377
3644 377 -263 -225 541 -182 -257 341 -181 -28 184 -480 109 120 -376 410 120 -243 357 -243 -264 483 -436
3665 -436 -98 144 -444 5 56 -341 245 59 -582 371 -186 260 504 -192 138 230 -459 338 247 -285 519
3686 519 68 -418 532 -129 -121 253 -584 84 225 -358 194 145 -394 383 210 -223 261 -93 -186 430 -271
$$ packed form
3544D22p48Q60m98l51Q43q08J65O75r64M49K89q96O94M8o68P75k34m52R08n64
3564e5k30Q67q63K33O93j039M93L10j001J033n08j16N68l93k44P65r05L04N53
3583D65r25P23J20q08O74Q9p37Q77n97j53P95q48K14N95j124P09K63p43M77M5
3603A11n61Q35m29k56Q27q68J77N89r29M25K38n48N62Q9n98P31l83k26M48m91
3623b57o7O21o51L43K93p00P15m7l38M36n62J72N20p51J51M93q77N16K61o78P84
3644C77o40L8P66p23p5N98n22J53K12o64N89J1m96P86k90l63O00o00k1P47r19
3665d36L38K42n88M49N1l97N86j86o41R53n57M46K44o96L30R2o89P97r1n32Q04
3686E19m51m86R50o61QL74q37O68J41n83N52m9n39P77j73m33M84l54r3O16p01
$$ plain form
3707 -271 -54 407 -446 221 18 -345 84 -43 -324 236 -237 -173 262 -116 107 415 -159 166 160 -272 277
3728 277 -181 -415 350 -209 -268 130 -555 -146 387 -284 -15 58 -344 216 -52 -430 551 -28 -199 486 -257
3749 -257 -88 201 -354 139 71 -324 338 -136 -292 271 -74 -201 458 -157 -204 259 -301 261 329 -522 335
3770 335 80 -308 228 -276 90 379 -388 250 238 -445 7 154 -334 446 207 -138 264 -344 -154 480
3790 480 -276 102 3 -268 125 141 -377 423 -98 -312 321 -178 -264 457 -240 230 181 -344 173 178 -210 229
3812 229 -61 -90 533 -411 106 422 -71 -43 32 -214 397 -44 -339 282 -170 -102 401 -277 -1 417 -293
3833 -293 130 166 -437 345 16 -377 363 15 -349 212 -371 12 317 -288 127 74 -435 521 44 -464 155
3854 155 -45 -242 441 -259 -161 450 -321 66 196 -386 281 60 -448 392 -204 -426 217 -227 62 447
$$ packed form
3707b71K17M61q53O67k03l63M29j27k81N60m73O4M35l78K23L08n74L25om32N49
3728B77m58k34P65n59n9L98o85M09N33o71K69P3m02N60k68l78R81n79j71O85p43
3749b57J69K89n55M93o8l95O62m74j56N63l45j27O59o15m7M63n60N62O8q51Q57
3770C35k55l88N36n04L66K89p67O38j2o83M52J47m88P80k39l45M02o08J90O34
3790D80p56L78r9k71L93J6n18Q00n21k14O33m99q6P21o97M70m9n25N17Nl88M39
3812B29k90k9O23r44N17L16m93K8P5k46O11m41k95O21m52O8N03o78K76M18p10
3833b93M23L6o03P82l29l93P40l48l64N61n83L83L05o05M15n3n09R56m77n08O19
3854A55k00j97O83p00R8O11p71L87J30n82O67k21n08Q40n96k22O43m44K89L85
$$ plain form
3874 447 -321 -33 132 -415 351 199 -242 261 24 -315 440 -242 156 330 -433 -125 366 -715 89 -34
3894 -34 -261 125 77 -264 243 -105 -8 300 -150 93 372 -241 194 262 -439 247 -261 -156 273 -29 -125 304
3916 304 -196 132 287 -176 50 -10 -147 377 -182 -222 338 -313 -15 266 -168 160 95 -239 178 -18 -295
3937 -295 350 -88 -223 154 -122 -9 371 -278 161 131 -191 437 261 -214 268 -175 -323 398 -318 -40
3957 -40 366 -341 88 -130 -222 146 138 -290 491 -177 -69 561 -117 -74 235 -155 123 152 -239 417 -181 -474
3979 -474 30 -280 -253 572 -479 -144 164 -365 187 221 -187 148 60 -203 363 7 -127 191 -203 10 221
4000 221 -240 55 146 -325 66 127 -340 464 5 -216 421 -402 -162 520 -292 140 272 -618 272 -152 -298
4021 -298 377 -167 59 367 -207 131 25 -303 41 119 -167 210 -120 -223 533 -296 -281 357 -244 120 466
$$ packed form
3874D47p68K88J65n47P66j52m41N03k37l39P55o82L98J74p63L08M91j081Q04j23
3894c4k27L86m8l41N07l48R7L08m50K43K79o13M35O8p01O86n08J05M29l02r6M29
3916C04n00L28J55m63K26o0j37N24n59m0N60o51K98K81m34L28o5l34M17j96k77
3937b95O45m38j35L77k76J13L80o49M39l0l22O28j76m75M82m43j48P21p16K78
3957d0M06p07M29k18r2L68qm28P81o68J08O30o78M3L09l90K78K9l91O56n98k93
3979d74N04l10K7Q25j051L35L08n29N52L4m08L35q8k63N66l56j34L18l94K13K11
4000B21m61K95R1m71L91O1m67Q04m59k21O37q23K40O82q12M32J32q90Q90m24j46
4021b98O75n44K26L08n74L38j06l28L44P8k86L77l30j03P56q29J5O38o01L64L46
$$ plain form
4042 466 -439 153 201 -357 39 18 -375 382 -200 -273 358 -131 123 74 -565 194 7 -195 336 55 -202
4063 -202 219 -134 58 346 -129 145 271 -226 97 132 -161 464 -223 -160 449 -10 52 395 -156 272 362
4084 362 -294 235 0 -379 284 109 -316 276 -366 -252 261 -329 -113 386 -473 382 226 45 253 127
4104 127 -22 319 -228 -387 388 -337 161 95 -283 72 -15 -419 385 70 44 413 -132 -115 366 -167 79
4125 79 249 -421 259 268 -241 103 -67 -199 118 -227 -182 236 -398 46 264 -664 59 108 -237 348 -102 -358
4147 -358 251 -47 -210 404 -307 160 299 -344 302 63 -509 145 -96 -222 279 -272 -90 253 -101 28
4167 28 295 -387 119 96 -203 337 -58 -149 318 -26 -175 287 -109 160 297 -416 311 54 -172 280 62
4188 62 -263 287 -152 -131 172 16 26 185 -473 311 249 32 201 -111 -209 319 -211 -57 370 -533 202 158
$$ packed form
4042D66r05N92M8n58L96k1l93P57n82p3O31m89K54m9o39P59j87k02N31k81k57
4063b02M21l53J92K88m75K74J26m97L23L5k93O25o87O3O09m59O2L43n51M28R0
4084C62o56N29k35l79O63j75m25N92o42J14N13n90K16M99q59Q55j56j81K08j26
4104A27j49L41n47j59P75p25M98o6l78L55q7m04Q04l15k6L69n45J7M81n33K46
4125G9J70o70O80Rn09L44j70j32L17l45M5M18o34M44K18r28P23M9l45N85m50k56
4147c58O09k98j63O14p11M67J39o43O46k39n72O54k41j26N01n51J82L43l54J29
4167B8K67o82N06k3k99N40l95r1M67l44j49M62l96K69J37p13P27k57k26M52k18
4188F2l25N50m39K1L03j56J0J59o58P84o2k17J69l12r8N28n30J54M27r03P35m4
$$ plain form
4210 158 -395 200 -157 -228 431 50 -57 366 -266 -196 329 -457 -171 89 -186 179 -51 -633 180 -226 -191
4231 -191 173 -53 -64 238 -200 368 191 -391 341 -193 -195 159 -120 0 262 -290 -78 206 -237 -5 365
4252 365 -159 301 -145 -350 295 -217 -114 219 -82 9 429 -282 210 77 -66 -52 105 -391 397 -136 -377
4273 -377 175 -241 19 409 -195 -26 103 -252 206 -13 -259 394 -275 -143 317 -360 -25 108 -477 80
4293 80 254 -242 153 143 -277 338 -94 -325 365 -377 156 255 -412 36 210 -22 311 162 23 250 -115
4314 -115 -282 33 -311 -287 145 -151 153 37 -267 0 103 116 350 -149 -138 295 -88 79 198 -234 18
4335 18 -96 -288 244 -10 -53 352 -324 -264 151 -208 223 380 -307 293 8 -322 341 86 -340 411 -420
4356 -420 -133 342 -292 254 108 -193 32 8 -360 260 6 -289 470 -258 -99 398 84 112 154 -342 41
$$ packed form
4210A58n53N95l57p1O59l81j07M23o32P0N25p86K86K60k75L65k30n82Q13m06L5
4231a91L64k26j1L02m38N68j77n82P32n34kL54k79J20K62n52K12K84m43K32L70
4252C65n24M60m46k05O45n12J03L33l01R1M20p11M92j33j43J4J57m96P88n33k41
4273c77N52m16K60L90o04J69J29l55M58k19k46O53o69J32M60o77L35J33n85N57
4293H0J74m96L95j0m20O15m32k31O90p42N33R9o67M48J74k32L33j49j39K27l65
4314a15j67L15l44K4M32k96L04j16l04K67J03J3K34m99J1M33l83J67J19m32K52
4335A8j14j92N32k54m3M05o76O0M15l59M31J57o87O00k85l30O63k55m26P51q31
4356d20K87M75o34N46j46l01K25k4l68O20k54k95P59p28J59M97l14K8M2m96L83
$$ plain form
4377 41 102 -239 195 107 -274 80 -220 -99 243 -258 14 129 -181 118 228 -131 238 -116 -143 276 -178
4398 -178 -7 232 -298 152 114 -214 220 23 -140 127 -217 -192 225 -213 -46 320 -263 -42 251 -288 197
4419 197 11 -149 280 -67 -243 331 -227 -51 453 -312 -67 11 -173 170 32 -351 347 -151 -120 352 -248
4440 -248 -20 381 -295 -89 400 -258 60 240 -345 279 11 -104 152 36 -1 235 -286 -27 219 -327
4460 -327 243 -10 -235 235 -83 -153 262 32 -213 152 -104 52 16 -163 188 19 -366 173 -244 -248 185
4481 185 -191 3 198 -195 88 93 -334 225 157 -95 288 -155 -371 84 -289 -105 102 -100 99 106 -225 202
4503 202 35 -25 336 102 -53 -39 -247 0 310 -169 107 204 -269 21 -55 -360 285 -231 -312 271 53 -30
4525 -30 213 -167 209 120 -418 -31 11 -252 247 -236 -81 190 -118 -95 64 27 -44 147 -283 85 -175 -45
$$ packed form
4377D1O1l41M34q8l81L54l00J21L42n01K72J15l10K99J10l59L69l54k7M19m54
4398a78J71K39n30M50l8l28M34j97j63K67l44K5M17m38J67L66n83K21K93n39M85
4419A97j86j60M29l47j76N74n58J76N04p65K45P8j84L43j38l83O98m98L1M72o00
4440b48K28M01o76K06M89o58L18J80n85O24k68j15K56j16l7K36n21K59K46n46
4460c27N70k53k25M70l18p0M15k30k45L65k56J56l6j79L51j69l85N39m17mM33
4481A85l76J94J95l93K83Nm27N59o8k52L83m43k16M55l73J84K07k02J99Pl31M27
4503B02j67o0L61k34j55J4k08K47L10m79K76R7m73K90p6l05O45n16q1N83k18q3
4525c0K43l80L76q9n38L87M2k63M99m83J55K71l08K3J59l7p1J91m30L68k60J30
$$ plain form
4547 -45 172 -49 -111 229 -205 181 341 -359 50 -50 -177 274 61 -178 144 121 -49 226 -227 -7 181
4568 181 -145 -39 93 -281 346 168 -397 337 -73 -118 265 -321 -392 129 -314 -66 74 -354 93 31 -120
4589 -120 358 -58 -143 182 -379 -142 175 -121 91 237 -243 7 131 -329 67 50 -89 175 -54 -156 132
4610 132 68 25 7 -237 203 1 -39 211 -104 37 297 -56 -62 276 -105 164 80 -405 293 -63 -165 94
4632 94 -111 -115 76 -74 20 98 22 166 9 -165 170 -245 -414 290 -176 91 262 -200 -155 182 -187 -145 6
4655 6 -392 51 -2 -263 135 26 -96 -27 88 160 54 61 -222 128 -354 61 -194 -126 253 -192 -135 152 -396
4678 -396 214 236 -265 285 298 -110 459 -188 -205 293 -56 -140 141 -268 18 -36 -285 234 46 -192 138 -209
4700 -209 -167 273 -353 122 469 -237 33 405 -330 161 94 -269 78 -155 -132 113 -98 -53 428 -364 -187
$$ packed form
4547d5K17k21o2L40m34L86J60p00M09j00j27M51k13k39L22k3j70K75m53K20J88
4568A81l26J06J32l74O27j78n65P34m10m5L83n86p1N21m43K48J40m28M47o2j51
4589a20M78m16q5L25n61K37L17k96K12J46m80K50J24m60L96j7j39K64k29j02K88
4610A32o4m3j8k44M40k02m0K50l15J41K60l53oL38l81K69q4m85O98l56j02K59
4632I4k05mJ91j50R4P8p6J44j57j74L35m15j69P04m66K67J71m62M5L37l69M2J51
4655Fl98M43n3k61L98j09j22O9J15P2j06Pk83L50m82M15k55O8L79m45N7K87n48
4678c96O10K2n01N50J3m08N69o47j7M98l49q4K81m09K86n4k49N19j88k38L30l47
4700b09M2M40o26M75L47p06K70L72p35M91o7l63L47k33K3K45k11M5M81p92J77
$$ plain form
4721 -187 223 -228 -25 68 -333 324 -183 13 406 -70 -261 307 -172 140 290 -211 103 50 -101 232 -132
4742 -132 -243 159 32 138 268 -323 -59 74 -112 159 -120 -23 453 -96 -4 161 -165 -140 541 -132 87
4763 87 -44 -320 31 -109 -12 114 316 -137 284 -229 297 357 -194 146 271 -211 -25 52 -286 119 -50
4784 -50 152 225 -301 -113 136 -174 45 209 -196 99 39 -48 184 68 -257 265 -65 52 193 -396 -34
4805 -34 52 -573 40 119 -15 246 -13 -134 188 1 13 261 -241 336 25 -118 211 183 -89 211 121 -176
4827 -176 206 -157 -97 207 -216 -108 100 -90 169 238 -159 271 -117 -73 274 -88 86 -8 -455 299 130
4848 130 -135 157 -112 88 202 -53 -117 -10 -275 -221 -1 -264 110 -56 -143 215 103 -68 152 -40 -52
4869 -52 -131 -178 32 198 -237 14 230 -91 -28 68 -316 133 -54 -14 84 -281 -149 215 -156 164 44 -71
$$ packed form
4721a87M10m51K03R3m01O57n07J96L93m76j91N68m79L12J50n01L14n3j51L33l64
4742a32j11M02j27J06J30n91K64J33j86K71k79R7M76n49R2J65l26K5O81o73K19
4763H7j31k76L51j40R7J26K02m53M21n13N26O0n51L40J25m82J86P7l38M05j69
4784e0K02P3n26J88K49l10K19J64m05K95o0q7K32j16l25N22l30J17J41n89L62
4805c4Q6o25O13P9j34K61k59j21L22j87J2K48n02N77l11j43L29k8k72L00r0k97
4827a76L82l63O0L04m23J08K08j90K59O9l97M30l88M4L47l62J74r4m47P54j69
4848A30k65K92k69K00J14k55o4J07k65N4K20k63L74j66q7L58j12j71K20j92j2
4869e2p9m7K10J66m35K51K16l21O3R6l84M49j87M0R8l65J32L64l71L20j20j15
$$ plain form
4891 -71 144 -114 -64 233 3 -93 272 -199 -109 188 -95 -89 198 -137 252 -86 5 85 -101 40 160 -317 -64
4914 -64 82 -211 -8 -151 -215 98 182 -293 114 -136 197 437 -93 194 -4 -205 237 96 -106 196 -155
4935 -155 -123 97 -147 -130 148 -371 249 116 -285 79 142 -183 286 -44 -243 175 -57 33 112 -153 -131 310
4957 310 -187 176 -58 -6 126 -194 -179 209 -16 -101 -7 -321 2 66 -176 33 174 -285 -60 -142 -111 17
4979 17 -195 -179 150 -117 54 93 -371 213 68 -194 175 37 -94 12 -130 42 90 -259 -77 4 -399 82
5001 82 12 -240 139 -261 -82 106 41 -292 4 -169 -12 195 -123 -6 -78 -45 174 29 -86 295 -93 -141
5023 -141 37 -138 36 179 -232 256 137 -211 65 40 -269 190 -71 -70 279 -83 53 159 -138 223 -5
5044 -5 -244 79 8 -109 77 -237 -76 318 -366 -64 -44 -132 170 -69 -5 237 102 -46 199 -211 -98 309
$$ packed form
4891g1K15k58N0K97k30r6L65m71R0K97k83OK87l35L89l38R1Q0j86J41J20m77K53
4914f4J46k93K03j43o4L13Q4m75M07k50L33K40n30K87j98k01M42j41k02L02l51
4935a55L2K20k44J7K78n19O20j33m01L64O3l25M69l30j99M18k32R0P9k65K2M41
4957C10m97L63k34N2J32l20J5L88k25q5R4l14L23O4k42K09J41m59K25q2L1J28
4979A7k12J6L29k67J71L9m64N84j45k62L69j38j31J06j42J72M8l49J82Q1m03M81
5001H2p0k52L79m00J79J88o5l33K96j73J57K07l18J17p2L3K19j45j15L81l88m8
5023a41J78j75J74J43m11M88j19l48K76k5l09M59k61JL49l62J36J06k97L61k28
5044ek39L23p1j17J86l14J61L94o84L02K0q8L02k39O4K42j35j48K45m10J13M07
$$ plain form
5066 309 -55 28 249 -137 18 93 -108 84 -45 57 214 170 -117 60 -166 137 248 -186 43 -163 -196
5087 -196 303 -98 -37 339 -180 -65 88 -159 89 -20 22 76 116 -224 61 -9 -26 143 -139 214 190 -284
5109 -284 39 156 -141 -11 -39 46 170 73 -156 260 -154 -78 116 -255 -98 140 -349 12 134 -96 190
5130 190 26 -73 191 -175 -30 354 -122 19 272 -259 274 -133 -163 74 16 -244 149 -11 61 254 -164
5151 -164 -30 59 57 138 76 -153 186 -134 49 85 -232 -132 65 -163 140 -81 22 143 111 -133 24 59 56
5174 56 183 60 1 13 -140 -38 83 -343 141 -7 -25 8 -59 1 160 -177 -96 65 -110 -106 184 -344 181
5197 181 135 50 257 -59 21 210 -101 154 276 -189 112 26 -317 271 5 -209 -95 -103 -181 200 -277 93
5219 93 58 21 18 -168 -257 171 -21 -198 230 -73 -218 84 -386 -58 47 -181 271 165 -6 12 20 -30 38 -234
$$ packed form
5066C09l64Q3K21l86J55P5k01J92j29J02J57m4k87J77k26L03J11m34K29k06l3
5087a96M99m01O1L76n19J15J53k47K48j09M2N4M0l40K85p0j7J69k82L53k4m74
5109b84L23J17k97J30k8Q5J24r7k29M16m14P6J94l71J57K38m89L61J22k30K86
5130A90j64r9K64l66J45L84m76J41K53n31N33m07l0K37n8k60L93j60P2J93m18
5151a64J34Q9kQ1o2k29L39l20J83L6l17J00J97k28L03k21J03J21l2k44J57L5l
5174E6J27j23n9J2j53J02J21m26M84j48j8L3o7O0J59l37Q1J61j75MK90n28N25
5197A81m6q5K07l16Q0J89l11K55J22m65L01q6l43N88k66k14J14qp8L81m77L70
5219I3l5l7lj86q9M28j92j77M28l03j45L02m70L28J05k28M52j06j71J8Qn0O8k72
$$ plain form
5243 -234 115 118 -152 79 -10 -201 19 165 -183 158 -95 -127 81 -144 -136 143 -168 141 234 -104 396 -133
5265 -133 -311 207 -154 -43 235 5 -171 135 -212 136 222 -416 136 84 -285 249 -45 -159 172 -282 -169
5286 -169 173 5 -28 317 -239 157 117 -251 318 -95 -153 278 78 -93 402 -54 -27 -114 -75 183 -83 -229
5308 -229 20 -149 -170 -4 -17 73 83 -131 -152 143 -267 89 103 -167 116 8 -228 138 -81 -58 235 -138
5330 -138 -74 207 48 163 95 -25 146 65 -110 -61 -189 -2 103 -71 82 -72 -61 139 -27 -336 208 -176
5352 -176 -115 324 -265 -51 208 44 18 125 -220 157 -114 -91 182 -136 -244 -125 -230 99 331 -74 222
$$ packed form
5243b34L49Lk70K31q9j91K20J46l48L41k53l2K08k25QK79l11L09R3l38N00n29
5265a33j78N18l61J11K78k30j76L06l47L48Q6o38N52n2l69N34k94j14L31m54J13
5286a69L42j68l3L45n56L96m0l68N69m13n8M31k00j71M95m56K7q7L9K58k66j46
5308b29K49j69k1J66j3R0J0k14k1K95m10L56J4k70K83j08k36L66k19K3K93l73
5330a38O4K81j59J15o8j20J71q1j75M9j28J87J05j74J53j54J1K00j66l09N44l84
5352a76O1M39n89K14K59j64k6J07l45L77k71K3K73l18j08J19j05L29K32m05K96
$$ [...]
8191A17
##END NTUPLES=NMR FID
##END=
