##TITLE=1H_14-2023
 CDCl3
 8 sc, 
 17.3.2023
##JCAMPDX= 6.0         $$ Bruker NMR JCAMP-DX V2.0
##DATA TYPE= NMR FID
##DATA CLASS= NTUPLES
##ORIGIN= UXNMR, Bruker Analytische Messtechnik GmbH
##OWNER= root
$$ XWIN-NMR		Version 3.5
$$ Fri Mar 17 14:53:04 2023 Russian Standard Time (UT+4h)  she@DPX200
##.OBSERVE FREQUENCY= 200.13135
##.OBSERVE NUCLEUS= ^1H
##.DELAY= (6, 6)
##.ACQUISITION MODE= SIMULTANEOUS
##.ACQUISITION SCHEME= undefined
##.AVERAGES= 8
##.DIGITISER RES= 18
##SPECTROMETER/DATA SYSTEM= spect
##.PULSE SEQUENCE= zg30
##.SOLVENT NAME= Acetone
##.SHIFT REFERENCE= (INTERNAL, Acetone, 0, 15.7039)
##AUDIT TRAIL= $$ (NUMBER, WHEN, WHO, WHERE, WHAT)
$$ ##TITLE= Audit trail, XWIN-NMR		Version 3.5
$$ ##JCAMPDX= 5.01
$$ ##ORIGIN= Bruker BioSpin GmbH
$$ ##OWNER= she
$$ F:/spectra/data/she/nmr/H-F/1/audita.txt
$$ ##AUDIT TRAIL=  $$ (NUMBER, WHEN, WHO, WHERE, WHAT)
(   1,<2023-03-17 14:51:59.37 +0400>,<she>,<DPX200>,
      <created by zg, POWCHK disabled, PULCHK disabled
       configuration hash MD5:
       00 E9 B6 7A A2 85 ED C7 34 08 36 98 17 FE 4E 26
       data hash MD5: 16K
       AB CF 99 74 07 F1 15 43 7E 84 66 75 DF F5 27 F1>)
$$ ##END=
$$ 
$$ hash MD5
$$ BA BA F5 EA A1 87 B7 82 E4 AE 19 15 09 51 57 A4
##$RELAX= 
##$RELAX= 
##$RELAX= 
##$RELAX= 
##$RELAX= 
##$RELAX= 
$$ Bruker specific parameters
$$ --------------------------
##$DU= <F:/spectra>
##$EXPNO= 1
##$NAME= <H-F>
##$PROCNO= 1
##$TYPE= <nmr>
##$USER= <she>
##$AMP= (0..31)
100 100 100 100 100 100 100 100 100 100 100 100 100 100 100 100 100 100 
100 100 100 100 100 100 100 100 100 100 100 100 100 100 
##$AQSEQ= 0
##$AQ_mod= 1
##$AUNM= <au_zg>
##$AUTOPOS= <>
##$BF1= 200.13
##$BF2= 200.13
##$BF3= 200.13
##$BF4= 200.13
##$BF5= 200.13
##$BF6= 200.13
##$BF7= 200.13
##$BF8= 200.13
##$BYTORDA= 1
##$CFDGTYP= 0
##$CFRGTYP= 5
##$CHEMSTR= <none>
##$CNST= (0..31)
1 1 145 1 1 1 1 1 1 1 1 1 1 1 1 1 1 1 1 1 1 1 1 1 1 1 1 1 1 1 1 1 
##$CPDPRG= <>
##$CPDPRG1= <>
##$CPDPRG2= <>
##$CPDPRG3= <>
##$CPDPRG4= <mlev>
##$CPDPRG5= <mlev>
##$CPDPRG6= <mlev>
##$CPDPRG7= <mlev>
##$CPDPRG8= <mlev>
##$CPDPRGB= <>
##$CPDPRGT= <>
##$D= (0..31)
0 1.2 0 0 0 0 0 0 0 0.06 0 0.03 0 0 0 0 0.0002 0 0 0 0 0 0 0 0 0 0 0 0 
0 0 0 
##$DATE= 1679050318
##$DBL= (0..7)
120 120 120 120 120 120 120 120 
##$DBP= (0..7)
150 150 150 150 150 150 150 150 
##$DBP07= 0
##$DBPNAM0= <>
##$DBPNAM1= <>
##$DBPNAM2= <>
##$DBPNAM3= <>
##$DBPNAM4= <>
##$DBPNAM5= <>
##$DBPNAM6= <>
##$DBPNAM7= <>
##$DBPOAL= (0..7)
0.5 0.5 0.5 0.5 0.5 0.5 0.5 0.5 
##$DBPOFFS= (0..7)
0 0 0 0 0 0 0 0 
##$DE= 6
##$DECBNUC= <off>
##$DECIM= 32
##$DECNUC= <off>
##$DECSTAT= 4
##$DIGMOD= 1
##$DIGTYP= 9
##$DL= (0..7)
0 120 120 120 120 120 120 120 
##$DP= (0..7)
150 150 150 150 150 150 150 150 
##$DP07= 0
##$DPNAME0= <>
##$DPNAME1= <>
##$DPNAME2= <>
##$DPNAME3= <>
##$DPNAME4= <>
##$DPNAME5= <>
##$DPNAME6= <>
##$DPNAME7= <>
##$DPOAL= (0..7)
0.5 0.5 0.5 0.5 0.5 0.5 0.5 0.5 
##$DPOFFS= (0..7)
0 0 0 0 0 0 0 0 
##$DQDMODE= 0
##$DR= 18
##$DS= 0
##$DSLIST= <SSSSSSSSSSSSSSS>
$$ [...]
##$SUBNAM2= <"">
##$SUBNAM3= <"">
##$SUBNAM4= <"">
##$SUBNAM5= <"">
##$SUBNAM6= <"">
##$SUBNAM7= <"">
##$SUBNAM8= <"">
##$SUBNAM9= <"">
##$SW= 18.05172834244
##$SWIBOX= (0..15)
0 0 2 0 0 0 0 0 0 0 0 0 0 0 0 0 
##$SW_h= 3612.71676300578
##$TD= 16384
##$TD0= 1
##$TE= 0
##$TE2= 300
##$TE3= 300
##$TEG= 300
##$TL= (0..7)
0 120 120 120 120 120 120 120 
##$TP= (0..7)
150 150 150 150 150 150 150 150 
##$TP07= 0
##$TPNAME0= <>
##$TPNAME1= <>
##$TPNAME2= <>
##$TPNAME3= <>
##$TPNAME4= <>
##$TPNAME5= <>
##$TPNAME6= <>
##$TPNAME7= <>
##$TPOAL= (0..7)
0.5 0.5 0.5 0.5 0.5 0.5 0.5 0.5 
##$TPOFFS= (0..7)
0 0 0 0 0 0 0 0 
##$TUNHIN= 0
##$TUNHOUT= 0
##$TUNXOUT= 0
##$USERA1= <user>
##$USERA2= <user>
##$USERA3= <user>
##$USERA4= <user>
##$USERA5= <user>
##$V9= 5
##$VALIST= <valist>
##$VCLIST= <CCCCCCCCCCCCCCC>
##$VD= 0
##$VDLIST= <DDDDDDDDDDDDDDD>
##$VPLIST= <PPPPPPPPPPPPPPP>
##$VTLIST= <TTTTTTTTTTTTTTT>
##$WBST= 1024
##$WBSW= 4
##$XGAIN= (0..3)
0 0 0 0 
##$XL= 0
##$YL= 0
##$YMAX_a= 170704
##$YMIN_a= -106451
##$ZGOPTNS= <>
##$ZL1= 120
##$ZL2= 120
##$ZL3= 120
##$ZL4= 120
##$ABSF1= 10
##$ABSF2= 0
##$ABSG= 5
##$ABSL= 3
##$ALPHA= 0
##$AQORDER= 0
##$ASSFAC= 0
##$ASSFACI= 0
##$ASSFACX= 0
##$ASSWID= 0
##$AUNMP= <proc_1d>
##$AZFE= 0.1
##$AZFW= 0.1
##$BCFW= 1
##$BC_mod= 2
##$BYTORDP= 1
##$COROFFS= 0
##$CY= 11.3945322036743
##$DATMOD= 1
##$DC= 2
##$DFILT= <>
##$DTYPP= 0
##$F1P= 2.36226072786647
##$F2P= -0.459571619588291
##$FCOR= 0.5
##$FTSIZE= 0
##$FT_mod= 4
##$GAMMA= 1
##$GB= 0.15
##$INTBC= 1
##$INTSCL= 1
##$ISEN= 128
##$LB= 0.24
##$LEV0= 0
##$LPBIN= 0
##$MAXI= 10000
##$MC2= 0
##$MEAN= 0
##$ME_mod= 0
##$MI= 1.114404
##$NCOEF= 0
##$NC_proc= 0
##$NLEV= 6
##$NOISF1= 3.799351
##$NOISF2= 2.8
##$NSP= 1
##$NTH_PI= 0
##$NZP= 0
##$OFFSET= 15.70392
##$PC= 1
##$PHC0= -19101.65
##$PHC1= 6.60075
##$PH_mod= 1
##$PKNL= yes
##$PPARMOD= 0
##$PSCAL= 0
##$PSIGN= 0
##$REVERSE= no
##$SF= 200.130013532006
##$SI= 16384
##$SIGF1= 3
##$SIGF2= 2
##$SINO= 400
##$SIOLD= 16384
##$SREGLST= <1H.CDCl3>
##$SSB= 0
##$STSI= 0
##$STSR= 0
##$SW_p= 3612.71676300578
##$SYMM= 0
##$S_DEV= 0
##$TDeff= 0
##$TDoff= 0
##$TI= <>
##$TILT= no
##$TM1= 0
##$TM2= 0
##$TOPLEV= 0
##$USERP1= <user>
##$USERP2= <user>
##$USERP3= <user>
##$USERP4= <user>
##$USERP5= <user>
##$WDW= 1
##$XDIM= 8192
##$YMAX_p= 0
##$YMIN_p= 0
$$ End of Bruker specific parameters
$$ ---------------------------------
##NTUPLES= NMR FID
##VAR_NAME=  TIME,          FID/REAL,        FID/IMAG
##SYMBOL=    X,             R,               I
##VAR_TYPE=  INDEPENDENT,   DEPENDENT,       DEPENDENT
##VAR_FORM=  AFFN,          ASDF,            ASDF
##VAR_DIM=   8192,          8192,            8192
##UNITS=     SECONDS,       ARBITRARY UNITS, ARBITRARY UNITS
##FACTOR=    0.0002768,     1,               1
##FIRST=     0,             0,               0
##LAST=      2.2672688,     0,               0
##MIN=       0,             -106451,         0
##MAX=       2.2672688,     170704,          0
$$ Real data points
##PAGE= N=1
##DATA TABLE= (X++(R..R)), XYDATA
$$ [...]
1553A451o98R9M60j079M66l65o84K08r01k69j4j057P46M85J05J301K18L36M38
$$ 1451 753 852 1312 233 699 334 -350 -142 -1043 -1312 -1326 -2383 -1637 -1152 -1047 254 472 808 1246
1572A246p46j3k27n85R47q1M19R64p51J16k23j173l17o57o06L01m89N40Q38J13
$$ 1246 500 487 260 -325 622 541 960 1924 1173 1289 1066 -107 -424 -1081 -1687 -1386 -1875 -1335 -497 -384
1592c84J258M4m57M39j142j61k5n28J123N66Q4Q82o37m35k39j293Qj31o18Q40
$$ -384 874 918 461 900 -242 -403 -428 -956 167 733 817 1699 1062 627 388 -905 -897 -1028 -1646 -806
1612h06K8J77J057j66N63K36p95J56o80m55P83j74O04Q70n36P11p36j139J3p06
$$ -806 -778 -601 456 290 853 1089 294 450 -230 -685 98 -76 528 1398 862 1573 837 -302 -289 -995
1632i95j41N82m96Q59J23l78O26l33j71N88p82K39Q7n28Q98n2K92M91n19L74j74
$$ -995 -1136 -554 -1050 -191 -68 -446 180 -153 -324 264 -518 -279 -192 -720 178 126 418 909 390 764 590
1653E90q77L18k60j55J010k22J21L87r35J78k93j42N46l18j11K48r01L48k23m69
$$ 590 -287 31 -229 -384 626 404 525 912 -23 155 -138 -280 266 -52 -163 85 -816 -468 -691 -1160
1673a160Q34k66R1L87o53O71L53j64Q31j61k17M03j023K18J91n19Q98J65l15J52
$$ -1160 -326 -592 -501 -114 -767 -96 257 93 924 763 546 949 -74 144 335 -184 714 879 564 716
1693G16r19k49j97j005Q67J99J23N18m48L42O65o02Q03j02l06J64m58l87M82l66
$$ 716 -203 -452 -649 -1654 -787 -588 -465 53 -395 -53 612 10 813 711 405 569 111 -276 206 -160
1713a60M49L63o53L40q27n28J53m92M77K61j87Q12j55j22O57k31L97O35k44K02
$$ -160 289 652 -1 339 -488 -1016 -863 -1355 -878 -617 -804 8 -147 -269 388 157 554 1189 945 1147
1733A147k34m19J42n06J96K47p74K64m15p67M89o50J74O04l75L34q0n51Q14J58
$$ 1147 913 494 636 130 326 573 -201 63 -352 -1119 -630 -1280 -1106 -502 -877 -543 -623 -1174 -360 -202
1753b02L27Q57L0L89J42j063K10l97l95N62q04J46J9n72K84Nj97O24m95k25K65
$$ -202 125 982 1012 1401 1543 480 690 293 -102 460 -344 -198 -179 -751 -467 -462 -659 -35 -530 -755 -490
1774d90p33O54K60J73J097J18J28K22o83j08j60l63M53n54j08J53r10K53mm53
$$ -490 -1223 -569 -309 -136 961 1079 1207 1429 746 638 478 115 568 14 -94 59 -851 -598 -602 -1055
1794a055Q89l47j42K39o60J69L01Q9Q31J95J86M55n00J39J47l33M32k80n48J86
$$ -1055 -166 -513 -655 -416 -1076 -907 -606 -517 314 509 695 1150 650 789 936 603 1035 755 207 393
1814C93p89j03J43m70N94K17k44M10o07k89J10k36M74K76k44N62j33n6N71l22
$$ 393 -396 -499 -356 -826 -232 -15 -259 151 -456 -745 -635 -871 -397 -121 -365 197 64 8 579 257
1834B57M15L78p88M3n23l18L28l32L02O88k98L61k83l80K52m08l6M61o78L57K0
$$ 257 672 1050 262 305 -218 -536 -208 -540 -238 450 152 513 230 -150 102 -306 -342 119 -559 -202 -182
1855a82l83P59j01N93N18p19K16m58o34K5m48J38O64k88N53J47n10L74k17l83
$$ -182 -565 194 93 686 1204 485 701 243 -391 -366 -814 -676 -12 -300 253 400 -110 264 47 -336
1875c36M20o98p4k7k66N97N52L33R12l18m1j29r13k74o2l12P64p1L63L51o72L31
$$ -336 84 -614 -688 -715 -981 -384 168 501 1413 1095 1054 925 12 -262 -324 -636 128 57 420 771 99 430
1897D30j67o56J37n34m36J84l65N50O64K54Q72J60k73K9p45l64K42k94P07J26
$$ 430 263 -393 -256 -790 -1226 -1042 -1407 -857 -193 61 933 1093 820 849 104 -260 -18 -312 395 521
1917E21j63O42n70j97o7o51K34n15l21L77m48K30Q06j70N88M06n22K97l79j14
$$ 521 358 1000 430 233 166 -485 -251 -766 -1087 -710 -1158 -928 -122 -292 296 702 180 477 98 -16
1937a6L16m12O79K91m92L81l30m61J23m38Q2L1n65K09j93j45N20k9L11M42j79
$$ -16 300 -112 567 858 366 747 417 -44 79 -359 -277 -246 -811 -602 -795 -940 -420 -449 -138 304 125
1958A25M95j70l70J86o4K67q3k55J57j12m18K60m6q8K08n63N3l43l04P03N0J78
$$ 125 620 450 80 266 202 469 386 131 288 176 -242 18 -28 -116 92 -471 -418 -761 -1065 -362 -312 -134
1980a34R30k58J75R8n64P9m43n8L31j41K63L16o82L19j27k43J68p57j11J67n95
$$ -134 796 538 713 811 247 326 -117 -175 156 15 278 594 -88 231 104 -139 29 -728 -839 -672 -1267
2001a267P59M01K08Q15k44J38o8p94L9k35j41O41J4j94N75n09Q4O3n81K65n63
$$ -1267 -508 -107 101 916 672 810 742 -52 -13 -248 -389 252 266 72 647 138 222 285 -296 -31 -594
2022e94m34N09k79N61M69k70O84n6l55J72n40j60J47k43O70k2j13K97m31k70J62
$$ -594 -1028 -519 -798 -237 232 -38 646 590 235 407 -133 -293 -146 -389 281 259 146 443 12 -258 -96
2043i6n26L29O5j99M24k4j57L10j50M18j18l42K55k43j72P12n94L82J00o34K53
$$ -96 -622 -293 -228 -427 -3 -27 -184 126 -24 394 276 -66 189 -54 -226 486 -108 274 374 -260 -7
2064gl74k64K80k11M54K81k43N02j02l04K47k49n1K94n15M22J44k80N94m34L6
$$ -7 -381 -645 -365 -576 -122 159 -84 418 316 12 259 10 -41 253 -262 160 304 24 618 184 220
2085B20K49p62K0j35l41M15L8m2O47k86K81m6n44K20M4j41N82j56J8K13o54M68
$$ 220 469 -293 -273 -408 -749 -334 -296 -338 309 23 304 258 -286 -66 -22 -163 419 263 281 494 -160 308
2107C08j44j28J76m32K27K3k98J29l5m2L25r1j66J00l09L82J85m12Q39l08k59
$$ 308 164 36 212 -220 7 30 -268 -139 -174 -216 109 18 -148 -48 -357 25 210 -202 637 329 70
2128G0K88p52L51j07k67N96kl02M60l17k0K11m17K46l29Q8K22j29%L64o7L44j99
$$ 70 358 -394 -43 -150 -417 179 177 -125 335 18 -2 209 -208 38 -291 -203 19 -110 -110 254 187 531 332
2151C32l66J16l89j14L43k53M30O8k19L61k75j77M00l95M0K38m55M14k3j02J00
$$ 332 -34 82 -307 -421 -78 -331 99 167 -52 309 34 -143 257 -138 -98 140 -315 99 76 -26 74
2172G4l07L23Q6m97M52j0j84M09m06J45o5j21QK82n53N72j30J4L66n98J67p5m26
$$ 74 -233 90 176 -321 131 121 -63 346 -60 85 20 -101 -93 189 -364 208 78 92 458 -140 27 -48 -474
2195d74P4Jm3M27j58L70K20l29L61l08k43K70n46J90L67j83L41L07k56K10l44
$$ -474 -400 -399 -442 -15 -173 197 417 88 449 141 -102 168 -378 -188 179 -4 337 644 388 598 254
2216B54l72j50n05J04K7q8N40lR3N61l69L24j61m90N16m70nM21k42M32L16m82
$$ 254 -118 -268 -773 -669 -642 -730 -190 -193 -100 461 92 416 255 -235 281 -189 -194 227 -15 417 733 251
2238B51L29m82j48J00n04Pm6j15M39L5J06M37m97J30J72k35J76k21r9K68pJ10
$$ 251 580 98 -50 50 -454 -447 -493 -608 -169 -134 -28 409 -88 42 214 -21 155 -66 -165 103 96 206
2260B06K12l95L54k9l31L09n59KJ43k26J31K17l39M94M0l24L39m48K91j8j66L91
$$ 206 418 23 377 348 17 326 -233 -231 -88 -314 -183 34 -305 189 229 -95 244 -204 87 69 -97 294
2282B94k62J15K30l26J36J18m80L75k17r5K40n16J70K81l61L37J39n49M52k51
$$ 294 32 147 377 51 187 305 -175 200 -17 -112 128 -388 -218 63 -298 39 178 -371 81 -170
2302a70K6K48l42M10M1j88L96j28k55K55k76J31j0l19K04m0j41L42k63M8p8j71
$$ -170 -144 104 -238 172 213 25 421 293 38 293 17 148 138 -181 23 -17 -158 184 -79 -31 -109 -280
2324b80N3l2k87L99j09J78K99m8K66M9l81K01j31k89K96m19K18J02k44L23j37
$$ -280 -227 -259 -546 -147 -256 -78 221 173 439 488 107 308 177 -112 184 -235 -17 85 -159 164 27
2345B7p4J74k20j20j8j61J87J54k2M68k16j5L35m50L08l39j8J54k71K87j36l42
$$ 27 -47 127 -93 -213 -231 -392 -205 -51 -73 395 179 164 499 49 357 18 0 154 -117 170 34 -308
2367c08L88J42k64K85j52l08K33l36K41j34r4L78j94K43J64k69Q5J70l24L02k52
$$ -308 80 222 -42 243 91 -217 16 -320 -79 -213 -307 71 -123 120 284 15 100 270 -54 248 -4
2388dq6P3j12o9L39j68L38q9o3J47n24K13o7j88J20K24l20M82l64P6K84m37L27
$$ -4 -90 -17 -129 -198 141 -27 311 222 159 306 -218 -5 -72 -260 -140 84 -236 246 -118 -42 242 -195 132
2411A32j27k72K67j92l1K23r3L19N1l61L5r5m8L14k99K47J56k36J78k34K2J58
$$ 132 5 -267 0 -192 -223 0 -93 226 277 -84 -49 -144 -192 122 -177 70 226 -10 168 -66 -44 114
2433A14k50J98O3j52J41N5k05J99j71n1k3j62L47j10l96L21o5J9K01k05K32j32
$$ 114 -136 62 125 -27 114 169 -36 163 -8 -59 -82 -244 103 -7 -403 -82 -147 -128 73 -132 100 -32
2455c2k53L49j90p6M12N8J26p4k65R3o3m4j1j80R8L4j55K50n4o7J92k33j20J15
$$ -32 -285 64 -126 -202 210 268 394 320 55 148 85 41 30 -150 -52 -18 -173 77 23 -44 148 -85 -205 -90
2479i0k90R0L02j8N74l54j15K76o87K23j04N8J85N0j06K50l08J22m1l40L91j99
$$ -90 -380 -290 12 -6 568 214 99 375 -312 -89 -193 -135 50 100 -6 244 -64 58 17 -323 68 -131
2501a31m6K24j54r2N19k41N66k99l03J00k43n6L8o5K42m2k25M14n13q2K40k17
$$ -131 -177 47 -107 -199 320 79 645 346 43 143 -100 -156 -118 -183 59 17 -208 206 -307 -389 -149 -366
2523c66K65n4KK78j59P2M14l01K75m6k93J69l6l21L29k15Q5J20k14J1l10k28M38
$$ -366 -101 -155 -153 125 -34 38 452 151 426 380 87 256 220 -101 228 13 98 218 4 15 -295 -523 -85
2546h5k86J95K68k90K14q8J61L6K7k2J48r6M3N2l12J46k16O7J43l04p0K55k42
$$ -85 -371 -176 92 -198 16 -72 89 125 152 130 278 182 225 277 -35 111 -105 -38 105 -199 -269 -14 -256
2569b56P3J04j67M13l44K8J04k55K40j0J14N58l03K0q2m62K16p8LJ18j36J48j51
$$ -256 -183 -79 -246 167 -177 -149 -45 -300 -60 -70 44 602 299 319 237 -225 -9 -87 -84 34 -102 46 -105
2592a05oJ6Q0k26K89j28j75J50j86l5M70r2L11k93Q3P0l75K08j40o6J92J63l03
$$ -105 -111 -95 -15 -241 48 -80 -255 -105 -291 -326 144 52 363 70 153 223 -152 56 -84 -150 42 205 -98
2615i8K01j5k67R4j94L41j12k53M38l54K48K31j54J51K38n05l6j21J12K04j40
$$ -98 103 88 -179 -85 -279 62 -50 -303 135 -219 29 260 106 257 495 -10 -46 -167 -55 149 9
2636IL40J4k74Q8l16p7R8k60K41Q0m2K50o2j51J60l8m7M9l49L47K8k30N10l8j09
$$ 9 349 363 89 177 -139 -216 -118 -378 -137 -57 -99 151 89 -62 98 60 13 62 -287 60 88 -142 368 330 221
2661B21K26k41r2k8k54J29n8n1K25l18O3K57n12K54n4N9J82k61K29J6j42M84k7
$$ 221 447 206 114 86 -168 -39 -97 -148 77 -241 -178 79 -433 -179 -233 -174 8 -253 -24 -8 -150 334 307
2684C07k15M02k99j03R8k32PJ4k6J47o3k12R5k84P8j2k69N29o0j44M02l60K50
$$ 307 92 494 195 92 190 -42 -35 -21 -47 100 37 -175 -80 -364 -286 -298 -567 -38 -98 -242 160 -200 50
2707E0J5J76J64p6k14J62j43j9K7k95K33j59k39M5k69K27R9r0K07J19q5K34k16
$$ 50 65 241 405 329 115 277 134 115 142 -153 80 -79 -318 -273 -542 -315 -216 -306 -99 20 -65 169 -47
2730d7N7J30p8J85J54l03J87Nj12K2m00L84j85n30J74k10Q8K99J2J84q0k7K70
$$ -47 10 140 62 247 401 98 285 290 178 200 -200 184 -1 -531 -357 -567 -479 -180 -168 16 -64 -91 179
2753A79j76P8J98m30L15R5k25J36J76k76P8L7k28Q5l39J79j89k45M94m00J78K73
$$ 179 3 81 279 -151 164 259 34 170 346 70 148 185 -43 42 -297 -118 -307 -552 -58 -458 -280 -7
2775gj46K70j09j90K23J12o8R2k25k3M38m60K01J77k22J20j68j4j68o4n3q5J26
$$ -7 -153 117 8 -182 41 153 85 177 -48 -71 367 -93 108 285 63 183 15 1 -167 -231 -284 -369 -243
2798b43K29q3N1K39j95J77o0m08K52l4n0J96k42K93J32j97K70j06j45J3m84L19
$$ -243 -14 -97 -46 193 -2 175 115 -293 -41 -75 -125 71 -171 122 254 57 327 221 76 89 -395 -76
2820g6j31k9K41q7J07LM0K0Q5l64J58Q2k04K15n5mK56j84J78L3l09J10j19j14
$$ -76 -207 -236 5 -82 25 28 68 88 173 -191 -33 49 -155 60 5 1 257 73 251 284 -25 85 -34 -148
2844a48O0j82J96Oo2L3J28n6O3j81K00q0k39L03j50j45L93k1j6M4R9K9l61LN3
$$ -148 -88 -270 -74 -68 -130 -97 31 -25 38 -143 57 -23 -262 41 -109 -254 139 118 102 146 245 274 -87 -84 -31
2869c1r7K4Q3j36K38j83p6L84m07P9K85k96J09L0l3J50P1k5K45l28n9P2n1o7o8
$$ -31 -128 -104 -21 -157 81 -102 -178 206 -201 -122 163 -133 -24 6 -27 123 194 169 414 86 27 99 48 -19 -87
2894h7P9pk31R9J45k83K25j37j7k3J38j85L87k19K93o8J3L0j20M0J08n5l3O6j95
$$ -87 -8 -15 -246 -147 -2 -285 -60 -197 -214 -237 -99 -284 103 -116 177 109 122 152 32 72 180 125 92 158 -37
2919c7J41j60J1J91m44J79Rl60L41j4L6L18l25K0L88m69K91j60l4K88j61J65r2
$$ -37 104 -56 -45 146 -298 -119 -110 -470 -129 -143 -107 211 -114 -94 294 -175 116 -44 -78 210 49 214 122
2942A22j27J79rk78K93j32k30L66k64J96k2k08k9j27J29pP0P6R9o0P0j36j06K92
$$ 122 -5 174 165 -113 180 48 -182 184 -80 116 94 -114 -143 -270 -141 -148 -78 -2 97 37 107 -29 -135 157
2966A57l42J69L5k30L44k32l6Q6PN4Kp9o3J11n4K48j61J21j3k7l6j6MQ3R5l10
$$ 157 -185 -16 19 -211 133 -99 -135 -49 -42 12 14 -65 -128 -17 -71 177 16 137 124 97 61 45 49 132 227 -83
2992h3K65k64L6J5J81q3j00l1P8j83J22Or9j2J9m9K32k98K64Q6k49K98j7k45L00
$$ -83 182 -82 -46 -31 150 67 -33 -64 14 -169 -47 -41 -140 -152 -133 -182 50 -248 16 102 -147 151 134 -111 189
3017A89j28P1l9j3j6k3j92J64k57J00K79m26K36K4j16K85j94m8J33m8J38k0J4
$$ 189 61 132 93 80 64 41 -151 13 -244 -144 135 -291 -55 -31 -147 138 -56 -104 29 -19 119 99 113
3040A13J23p6j77K32l12R3Q9j99Q4J06n6Q2l09K79p7j63J1kO4Q3M2r5J47j39K04
$$ 113 236 160 -17 215 -97 -4 85 -114 -30 76 20 102 -207 72 -5 -168 -157 -159 -95 -12 30 -65 82 -57 147
3065A47r6m4lK4M5o7OJ85j87j23J17o8p7J81j68J27n1P2J78k17j31K10j9o7R8
$$ 147 51 7 4 28 73 6 12 197 10 -113 4 -64 -141 40 -128 -1 -52 20 198 -19 -150 60 41 -26 72
3090G2j58K52mj89K34k02l6J45l38qK7J25J50m1j71K98k53J58Q8j26J38j34j04
$$ 72 -86 166 162 -27 207 5 -31 114 -224 -232 -205 -80 70 29 -142 156 -97 61 149 23 161 27 -77
3113g7K46j33p3L13l85J54M4k92L01l21N8J65j55K43J71l55L0J9J16J01m84J16
$$ -77 169 36 -37 276 -109 45 89 -203 98 -223 -165 0 -155 88 259 -96 -66 -47 69 170 -314 -198
3135a98K18k49M38Nk86L51l14J32q5j97L34j83j48K49k01OJ35o7J10q4j06K80
$$ -198 20 -229 209 214 -72 279 -35 97 12 -185 149 -34 -182 67 -134 -128 7 -60 50 -34 -140 140
3157A40k68J31j08J30J14j42N4j7j41K2M2k01J22L21k10k2l8L1J11n3l3o4l1O7
$$ 140 -128 3 -105 25 139 -3 51 34 -107 -85 -43 -244 -122 199 -11 -33 -71 -40 71 18 -15 -79 -110 -43
3181d3P5r1K3r6Q8N4O5p6k56J05K62L0k15Q2q0j04J71j46J91j70NK41j08N5N6
$$ -43 32 -59 -36 -132 -44 10 75 -1 -257 -152 110 140 -75 7 -73 -177 -6 -152 39 -131 -126 115 7 62 118
3206A18j84K5K3r9M3lJ94j92L3oQ9O9J29l31R9p0m9P2Rj98M89k01j76K84k12n1
$$ 118 -66 -41 -18 -117 -74 -77 117 -75 -42 -48 41 110 239 -92 7 -63 -112 -40 -31 -229 260 59 -117 167 -45 -96
3232i6R4KJ32j39P8J23p3P5l6k22K47j8l00L52m18J78q0J9J61j47j01L68l64n8
$$ -96 -2 0 132 -7 71 194 121 196 160 -62 185 167 -133 219 -199 -21 -101 -82 79 -68 -169 199 -165 -223
3256b23R2M8K64k9k01J9R0m9K52j96K33j31j96K5J8j51K30j37r1K35k18J70j86
$$ -223 -131 -83 181 152 -49 -30 60 11 263 67 300 169 -27 -2 16 -135 95 -42 -133 102 -116 54 -132
3279a32J92l4o2P4j41J5Q0N7p7K87j80j6N9k03R3o4l5J82k06r9K48k16R9J41n4
$$ -132 60 26 -36 38 -103 -88 -8 49 -28 259 79 63 122 -81 12 -52 -87 95 -111 -210 38 -178 -79 62 8
3304HJ00j22j88L54j74K17k11m9K76j46k02K64k27P2J46k21K15j72m2R1p6Nj40
$$ 8 108 -14 -202 152 -22 195 -16 -65 211 65 -137 127 -100 -28 118 -103 112 -60 -102 -11 -87 -82 -222
3327b22pK84p7o8L24l96K13k4k6J9L7j05J61ol24K71j30Q3m1j08J42m9j47J34
$$ -222 -229 55 -22 -90 234 -162 51 27 1 20 57 -48 113 107 -217 54 -76 7 -34 -142 0 -49 -196 -62
3351f2k6L7J30k73R2Q2j71J24pJ70n6j25K29j51k8J42k18J8K35l17K27n8m5J37
$$ -62 -88 -51 79 -194 -102 -20 -191 -67 -74 96 40 -85 144 -7 -35 107 -111 -93 142 -175 52 -6 -51 86
3375H6j90L1J47r7R9j00M8R7n3k06L20k36J22L7k98K55j60J2K04n4j33O9L0K19
$$ 86 -104 -73 74 -23 76 -24 24 121 68 -138 182 -54 68 105 -193 62 -98 -86 118 64 -69 0 30 249
3399B49k11l1N1J6o2j55QK22Mj57J92q7j32R8o2j34J33J03J7l2J01j7k07J70M9
$$ 249 38 7 58 74 12 -143 -135 87 91 -66 126 39 -93 5 -57 -191 -58 45 62 30 131 114 -93 77 126
3424A26j48N3n2KK3o3J53lj79J11p9k2J03k44j6M10l48R7J76J1J09j68j60J77
$$ 126 -22 31 -21 -19 4 -59 94 91 -88 23 -56 -78 25 -219 -235 175 -173 -76 100 111 220 52 -108 69
3448F9l64M39p7%j3q3o3K02K8r7k3r6mk1M4K98l89K05M1p5R2N7j53M1l1o1N1l4
$$ 69 -295 144 67 67 54 -29 -92 110 138 41 18 -78 -82 -103 -59 239 -150 55 96 21 113 170 17 58 27 -34 17 -17
3476a7J01j22j26P2L3j57L03k30K10j51LJ89k2j61J83j57K32J1j41K59l50l8K95
$$ -17 84 -38 -164 -92 -59 -216 87 -143 67 -84 -81 108 86 -75 108 -49 183 194 53 312 -38 -76 219
3499B19l45K60l85O5K42J25j43P9j01p2j29J29Qo9j64K12P1J28N1j53O3j60K6
$$ 219 -126 134 -251 -186 56 181 38 117 16 -56 -185 -56 -48 -117 -281 -69 2 130 181 28 91 -69 -43
3522d3J90k86q2K14o4O4Np4L23k35o4J33j33Q2l8r7N0R9j16J40m3j78L25m14K64
$$ -43 147 -139 -221 -7 -71 -7 -2 -76 247 12 -52 81 -52 30 -8 -105 -55 44 -72 68 25 -153 172 -242 22
3547B2j00l1J73k35K85J28j15N3j10r1n1N2j58P1L3K14mk71K14k33J03J2R8l0
$$ 22 -78 -109 64 -171 114 242 127 180 70 -21 -72 -20 -178 -107 -74 140 136 -135 79 -154 -51 -39 59 29
3571B9Q5l28K76R6j38r0P3J29j57k0r5J82j33L27j00l4j97N3m2Q0n3J30o7P4q3
$$ 29 114 -214 62 158 20 -70 3 132 -25 -45 -140 42 -91 236 136 102 -95 -42 -84 -4 -57 73 6 80 -3
3596cj46P2J66j53K16J4p4P0p5r5J21k28K43j22q3N8r6Q9o5p6J24N0j49L85m09
$$ -3 -149 -77 89 -64 152 166 92 162 87 -8 113 -115 128 6 -77 -19 -115 -26 -91 -167 -43 7 -142 243 -166
3621a66R7R8j30J89J57k49Q7q1J31o2j8k4q6L0K8j01j10J91j15M2l2K31o2n8j34
$$ -166 -69 29 -101 88 245 -4 83 2 133 71 53 29 -57 -27 1 -100 -210 -19 -134 -92 -124 107 45 -13 -147
3646a47K52j95K93N0j19j1J56l66K98k65m4J68l25K11R9k54J19K5k27K55o0rQ2
$$ -147 105 -90 203 253 134 123 279 -87 211 -54 -98 70 -255 -44 55 -199 -80 -55 -282 -27 -87 -96 -14
3669a4nN2J08j33J42Nj17R4k08m2K09j60K07m5j29J87j80Km5K9J35j05rJ70k26
$$ -14 -19 33 141 8 150 155 38 132 -76 -118 91 -69 138 93 -36 151 -29 -27 -72 -43 92 -13 -22 148 -78
3694g8J11r7m6L63j30p1j12q4O7L0j99K71j97M1K01j04j12J51m8J42j54J29O8
$$ -78 33 -64 -110 253 123 52 -60 -144 -77 -47 -246 25 -172 -131 70 -34 -146 5 -43 99 -55 74 142
3717A42j83J27J43j34q6J18j73L4O1o4j60m7J57K5j45J70j06J58k9j05K23j2p5
$$ 142 -41 86 229 95 9 127 -46 -12 49 -15 -175 -222 -65 -40 -185 -15 -121 37 8 -97 126 114 39
3740C9M7K0k21M00j51q4Rj81K18k31Q0J60k95J03J64O1Qj73k8J12qmJ76l13K06
$$ 39 86 106 -115 285 134 50 59 -122 96 -135 -55 105 -190 -87 77 138 146 -27 -55 57 49 45 221 -92 114
3765A14k1l6J17j95J05Q7o3j32o8j65P9RM2K21j90J12N8m0J21N5k07J74j76J78
$$ 114 93 57 174 -21 84 171 108 -24 -92 -257 -178 -169 -127 94 -96 16 74 34 155 210 3 177 1 179
3789A79j66q6j0P4J1R0m1j90O4r2K54k28kK3P0O8K52k88K76L5j56N5j82J04j13
$$ 179 13 -73 -83 -9 2 92 51 -139 -75 -167 87 -141 -143 -120 -50 18 270 -18 258 293 137 192 10 114 1
3814Aq0O9J05j77J20m1Q4P6j31r0j04J44l7oQ3L2j91K39J01j97LJ10k58K17k5
$$ 1 -79 -10 95 -82 38 -3 81 157 26 -64 -168 -24 -61 -67 16 48 -143 96 197 0 3 113 -145 72 47
3839D7k11K57j37Pm1L9M2n6n2QK47j15O8J4N7q3j16P5k7Q0J30l31Q8O6j36P2j82
$$ 47 -164 93 -44 -37 -78 -39 3 -53 -105 -97 150 35 103 117 174 91 -25 50 23 103 233 -98 -10 56 -80 -8 -190
3866a90J43K16k82K59q8j52L0J22k80L54k29K93J5l05Q7l7O1L4o5Q2p0m8j6R6
$$ -190 -47 169 -113 146 58 -94 -64 58 -222 132 -97 196 211 -94 -7 -44 17 51 -14 68 -2 -50 -66 30
3890C0j51L8L1j9J78j71K06L4l49L44j86j93K38l0k4mROJ00J2p6k1k2M0O0j51
$$ 30 -121 -83 -52 -71 107 -64 142 176 -173 171 -15 -208 30 0 -24 -28 -19 -13 87 99 23 2 -20 20 80 -71
3916g1M2J23j14J59n8J18j62oP9j46L0j1M6j55Q4l8Q2j88J41J2j06L26j47l9M7
$$ -71 -29 94 -20 139 81 199 37 31 110 -36 -6 -17 29 -126 -42 -80 2 -186 -45 -33 -139 187 40 1 48
3941D8j08Q4r8J92n2j09J5J09l07M12k20j87J38P1j51J67j00Q1l9K5M3J23k63
$$ 48 -60 24 -74 118 66 -43 -28 81 -226 186 -34 -221 -83 -12 -163 4 -96 -15 -54 -29 14 137 -126
3964a26R7J15j00J72k13%M7J45j54OK6K6m5J54j41j51J38N9Q7k03m5K15k21M8
$$ -126 -29 86 -14 158 -55 -55 -8 137 -17 -11 15 41 -4 150 9 -142 -4 55 142 -61 -106 109 -112 -64
3988f4J10j05j3K52j70O9j63q7L05m7j43o2M8k4J6K9J25n5k27L73m0m4k84M1L29
$$ -64 46 -59 -72 180 10 79 -84 -171 134 87 -56 -118 -70 -94 -78 -49 76 21 -206 167 127 83 -201 -160 169
4013A69k19j8L22n1O9j94m6j02J77k70jK7r3K43j40P7p7N4J48j46J11R4m34M61
$$ 169 -50 -68 254 203 272 78 32 -70 107 -163 -164 -137 -230 13 -127 -50 -127 -73 75 -71 40 134 -300 161
4037A61k44J20Q1J2L1Lj79Ol7j69K35K72l82K62j33r9O5NJ64k72J13j45lJ78O2
$$ 161 -83 37 118 130 161 164 -15 -9 -46 -215 20 292 -90 172 39 -60 5 10 174 -98 15 -130 -133 45 107
4062A07l5J09k20q6J21j3k02J63J02r7m1k3L25j51R2j42j53J34K0j50L01m01J41
$$ 107 72 181 -39 -125 -4 -17 -219 -56 46 -51 -92 -115 210 59 151 9 -144 -10 10 -140 161 -240 -99
4085i9J89l9Ok3j52K42j54p7Q8J2P4J8M6Pm9j42J8M7j31J33j93K60M2k23K27k61
$$ -99 90 51 57 34 -118 124 -30 -107 -19 -7 67 85 131 138 89 -53 -35 12 -119 14 -179 81 123 -100 127 -134
4111a34K6P9O4N3j50m6P4K2J46j02k09J88P9j75J34l1j37J47j47J38K07j59O0
$$ -134 -108 -29 35 88 -62 -108 -34 -12 134 32 -177 11 90 -85 49 18 -119 28 -119 19 226 67 127
4134A27J0j32J43k77J70j8p2JJ3%K21q7m9j3j14j34J56pQ6J1j14R0j26J09J19
$$ 127 137 5 148 -129 41 23 -49 -48 -35 -35 186 99 50 37 -77 -211 -55 -62 24 35 -79 11 -115 -6 113
4159A13j37J1n7p8K85j61pJ39j77Q6m0K2J46k64J74n6q7J83j98j25J32Q0k8O9
$$ 113 -24 -13 -70 -148 137 -24 -31 108 -69 17 -23 -1 145 -119 55 -1 -88 95 -103 -228 -96 -16 -44 25
4183B5k1N0j38R8J01j63n6J54o0N9P1j82J62k57J01K71r6j13j27l2O5J15j45J21
$$ 25 4 54 -84 14 115 -48 -104 50 -10 49 120 -62 100 -157 -56 215 119 6 -121 -153 -88 27 -118 3
4207Cj20P1J85j83M2P1j58N0%J18m8N6K5k21M2J06m9k22M72r4k25J00p0J20l5
$$ 3 -117 -46 139 -44 -2 69 -89 -39 -39 79 31 87 112 -109 -67 39 -10 -232 240 146 -79 21 -49 71 36
4232C6qq0j1M4J34j24l3Q4k8Lj9m2M8o1P2p3j35L20j59N6P2o4K5j07j32J85k03
$$ 36 28 -52 -63 -19 115 -9 -42 42 14 17 -2 -44 4 -57 15 -58 -193 127 -32 24 96 32 57 -50 -182 3 -200
4259b00P3L78l05M3kj2L6q5Q8m8j58J41J22j40L50k82n1N7r0M6J4J1J7o1l1P2
$$ -200 -127 251 -54 -11 -13 -25 11 -74 14 -34 -192 -51 71 -69 281 -1 -52 5 -85 -39 -25 -14 3 -58 -89 -17
4285a7lj2Nl7K06o7p7Q5q9J54n9r1J50J4j75m0nJ22M0r7j6l1L9l9l8o9J86j16
$$ -17 -20 -32 -27 -64 142 75 -2 83 -6 148 89 -2 148 162 -13 -53 -58 64 104 7 -9 -40 -1 -40 -78 -147 39 -77
4313g7N3K26k04P8j3M4k59K31N9q8o3k07K12k16K25L6O0J31k70J74j09mJ56j69
$$ -77 -24 202 -2 76 63 107 -152 79 138 50 -13 -220 -8 -224 1 37 97 228 -42 132 23 19 175 6
4337FJ77k45q2J09J52k43K43m3M9K04k92j23L9j30L2J32n6J04n5N8j04j23P0R1
$$ 6 183 -62 -144 -35 117 -126 117 74 123 327 35 -88 -49 -179 -147 -15 -71 33 -22 36 -68 -191 -121 -30
4361c0k2J69m9j80J27J07k8j90K30M2p1j58n9P0n3J81m1N9k30Q0J44k88K45j86
$$ -30 -52 117 68 -112 15 122 94 -96 134 176 105 -53 -112 -42 -95 86 45 104 -126 -46 98 -190 55 -131
4385a31r8K58o8K8J06j42p7L46j18o1J79l04J77j17J77j60j2j7P7j25J38r7M5
$$ -131 -229 29 -39 -11 95 -47 -124 222 104 43 222 -82 95 -22 155 -5 -17 -34 43 -82 56 -41 4
4408Dj7n8R1O9j08R1j20L7P0q4J00j4J29q4L0j65J46j31k4J20j73K14n0j86N8
$$ 4 -13 -71 20 89 -19 72 -48 -11 59 -25 75 61 190 106 136 -29 117 -14 -38 82 -91 123 73 -113 -55
4433e5o0K74j21m8j14J87m8K1M5n8m6J13r0J88k75j1J40M2q9k0m5J64Mp8j16j05
$$ -55 -115 159 38 -10 -124 63 15 36 81 23 -23 90 0 188 -87 -98 42 84 -5 -25 -70 94 98 20 -96 -201
4459b01J99N9qP4j0j53L1k1M7m2J2J17k25P7J55J31q5j85Mj6O3j24J23k50K31
$$ -201 -2 57 49 123 113 -40 -9 -30 17 -25 -13 104 -121 -44 111 242 157 -28 -24 -40 23 -101 22 -228 3
4484Cmj25L7R6N5oL7k0L3j14K3k2l7K61j75Q6K3k60R3l3l5m7qM5K7Q2j32l2J92
$$ 3 -1 -126 -89 7 62 56 93 73 106 -8 15 -7 -44 217 42 128 151 -109 -16 -49 -84 -131 -139 -94 -67 15 -117 -149 43
4513D3j12J6M8K3r8P7rQ7J65j91qp5pJ53k09J45n5j23n1L56j95l9N6r4j7K33o3
$$ 43 -69 -53 -5 18 -80 -3 -12 75 240 49 41 -34 -41 112 -97 48 -7 -130 -181 175 -20 -59 -3 -97 -114 119 56
4540E6j59P8o3J94k25J61j54J04J24K0J5k06kM3o2nJ9j46J03K00j81J19j28J67
$$ 56 -103 -25 -88 106 -119 42 -112 -8 116 136 151 -55 -57 -14 -76 -81 -62 -208 -105 95 -86 33 -95 72
4564G2n8J10l4K0k34J55K1o8J01l6J0j18lP9m8p9J99jq9j8j20J12J10n0P0J26
$$ 72 14 124 90 110 -124 31 52 -16 85 49 59 -59 -62 17 -31 -110 89 88 -1 -19 -139 -27 83 33 103 229
4590B29k89k6R0L2J04q8q8O5j66K83k58j09L02j27m5P1J06j00q4pJ42p8P0Mn3
$$ 229 -60 -86 4 36 140 52 -36 29 -137 146 -112 -221 81 -46 -91 -20 86 -14 -98 -105 37 -41 29 33 -20
4615b0LJ9j28Q1jM2J72j93J95n3k10J26J3O5p6j96K41j35k4J30j73J25M3j35P2
$$ -20 -17 2 -126 -45 -46 -4 168 -25 170 117 -93 33 46 111 35 -161 80 -55 -79 51 -122 3 46 -89 -17
4640a7m4k00M42k75M7O7k05J05N7P6J25j83oP2j76K2K7P1K6N8k01O9J09k05J20
$$ -17 -61 -261 181 -94 -47 20 -185 -80 -23 53 178 -5 -11 61 -115 -93 -66 5 31 89 -112 -43 66 -139 -19
4665a9n1J2l0p9J32l2k4J13j37J94j64j66L17j27p0K30j68J4P4l7O7Oq5J22j89
$$ -19 -70 -58 -88 -167 -35 -67 -91 22 -115 79 -85 -251 66 -61 -131 99 -69 -55 19 -18 49 55 -30 92 -97
4690i7R7R3k43L48k23J32q2j08K31j30K4R1k38J00P5j34NO6m7K13j28J06j59J1
$$ -97 0 93 -150 198 -25 107 25 -83 148 18 42 133 -105 -5 70 -64 -59 7 -40 173 45 151 -8 3
4714Cj9K6L4j44J10nl0J63j80N4l4J89j81q5N8r1J13l6J6N8N1J1P8j23j94J71
$$ 3 -16 10 44 -100 10 5 -25 138 -42 12 -22 167 -14 -99 -41 -132 -19 -55 -39 19 70 81 159 36 -158 13
4740A3l1P1k10J30knM9j29N9Q5P3q2n4J91j92R6o2M7o9N9k1j1q4J18j24j57J77
$$ 13 -18 53 -157 -27 -29 -34 15 -114 -55 30 103 21 -33 158 -34 62 0 47 -22 37 16 5 -79 39 -85 -242 -65
4767f5qN2J1j16K25j54o6J51p3q4J44j0J47k43J60J6j23J15K8jq2P8l72L45l5
$$ -65 -73 -21 -10 -126 99 -55 -121 30 -43 -127 17 7 154 -89 71 87 -36 79 107 106 24 102 -270 75 40
4792D0j66J39p4j23J4rK06K1j38K22j67k3M3l2L3N4k08J30n2K65j66j16J55Jj51
$$ 40 -126 13 -61 -184 -170 -179 27 48 -90 132 -35 -58 -15 -47 -14 40 -168 -38 -90 175 9 -107 48 49 -102
4817a02J43j28R5r3K1P9r8J51j07O5K3nm6R2o0Q6l8j15J26k53L6P1j7K7K0J58
$$ -102 41 -87 8 -85 -64 15 -83 68 -39 26 49 44 -2 90 30 116 78 -37 89 -164 -128 -57 -74 -47 -27 131
4843A31r4j7J5N6m8J23j81j79J63O0R7k44M7J43j70J74n7j33K04Pk06PJ94k3k50
$$ 131 37 20 35 91 43 166 -15 -194 -31 29 126 -118 -71 72 -98 76 19 -114 90 97 -109 -102 92 69 -181
4868a81K63o6O0n9j90J85m8P1n8J34j11n3l7J32Q3k27Q5o7N0L7J50l26K09q1L9
$$ -181 82 16 76 17 -173 12 -36 35 -23 111 0 -53 -90 42 125 -102 -17 -84 -34 3 153 -173 36 -45 -6
4893fJ31k84j3L86j79J4j31J06k22K19k2qN7j18j32K54p8J37j06l3n2Q8j22n8
$$ -6 125 -159 -172 214 35 49 -82 24 -198 21 -1 -9 48 -70 -202 52 -26 111 5 -28 -80 8 -114 -172
4917a72K46j00J51j40L9M8mj27P0k10K54o5O6m6MR6j17K8j24l8K4N9j06M7J92
$$ -172 74 -26 125 -15 24 72 68 -59 11 -199 55 -10 56 10 14 110 -7 21 -103 -141 -117 -58 -164 -117 75
4942G5j12n3L54j09Q8k07k2j61J90O7j05P4j4r1n8J51j64K9J39j89P0JpP1L2M
$$ 75 -37 -90 264 155 243 36 14 -147 43 110 5 79 65 -26 -84 67 -97 -68 71 -118 -48 -47 -54 17 49 53
4968E3M1lj76K19Qj52Q3Q6j46Pj52K51l9j09J49o5n4o5j7M6M8N4jn7R2j18Q4j18
$$ 53 94 91 -85 134 142 -10 73 159 13 20 -132 119 80 -29 120 55 1 -64 -81 -35 13 67 66 9 101 -17 67 -51
4996e1j05J0Q7l5M6O9j02K24p7k3j5n5J60k31m0R3K2j37LO1J71l5J5Np4j5k8R1
$$ -51 -156 -146 -59 -94 -48 21 -81 143 66 43 28 -27 133 -98 -138 -45 -23 -160 -157 -96 75 40 55 60 -14 -29 -57 34
5024C4j0j90K37P2k30p3J24m2J72Rn5l6p3M9J3L5Jj67M9J75j38j29L04q4Q1Q0
$$ 34 24 -166 71 143 -87 -160 -36 -78 94 103 48 12 -61 -12 1 36 37 -130 -81 94 -44 -173 131 47 128 208
5050B08k66jR1J89j96j75K06j36qJ84r5PJ26k04J93k37M2K17l07J79j12j23P6
$$ 208 -58 -59 32 221 25 -150 56 -80 -88 96 1 8 134 -70 123 -114 -72 145 -162 17 -95 -218 -142
5073a42J68k6K7MM2N8k41L0j6O8RJ3J19k21J95j08O5qO8o3m1k3O9%j29N5o6J83
$$ -142 26 0 27 31 73 131 -110 -80 -96 -28 -19 -6 113 -108 87 -21 44 36 104 41 0 -23 46 46 -83 -28 -94 89
5101H9j00O0k4K1j6m2M4m2J5J45p0r1O6j64J71n8m0N2J56j02j34n7J77Q1l70Q2
$$ 89 -11 49 25 46 30 -12 32 -10 5 150 80 -11 55 -109 62 4 -36 16 172 70 -64 -121 56 137 -233 -151
5127a51J38mL6j05K00Lj63J07J4k34K29k07M4J13j0QK1r4o8J97o7l4Q4K4q5m2
$$ -151 -13 -17 19 -86 114 117 -46 61 75 -159 70 -137 -93 20 10 18 39 -55 -123 74 7 -27 57 81 -4 -46
5153d6J49n0j06L6k5q8J70j47K20O3j48q4n1J6L2k10J53K27L7j35mJ60j56M4j59
$$ -46 103 53 -53 -17 -42 -130 40 -107 113 176 28 -56 -107 -91 -59 -269 -116 111 148 13 9 169 13 57 -102
5178a02Q6m5K7P5o3Kj23O1J77k16R4j70K6J67J43k96J59R8K9p7q9J68l6n1m7J45
$$ -102 -16 -61 -34 41 -22 -20 -143 -82 95 -121 -27 -197 -171 -4 139 -157 2 100 129 52 -37 131 95 44 -3 142
5204A42j87lJ31j42O9J86k00M2l0N2j47M7J92k00Rj9M6L7j40J56r4p9L15l31J97
$$ 142 -45 -48 83 -59 10 196 -4 38 8 60 -87 -40 152 -48 -39 -58 -12 25 -115 41 -53 -132 183 -148 49
5229D9k8p1J46J08k73J57J14k22J13j32J44j06J1R7lj9M1q9o4J23m1p6n0r8K87
$$ 49 21 -50 96 204 -69 88 202 -20 93 -39 105 -1 10 107 104 85 126 37 -27 96 55 -21 -71 -169 118
5254A18j2L9j98R5k1L4N7q9J7j2k1j2j48K5J02P4j96K32K8l34L77j43m0n2O5K4
$$ 118 106 145 -53 42 21 55 112 23 40 28 7 -5 -153 -128 -26 48 -148 84 112 -222 155 12 -28 -80 -15 9
5280Ir6KJ88j79J87j0k29J75p0L7nK7k3J15j38K5M1j1n5O7j7j45nJ83j23K17o2
$$ 9 -87 -85 103 -76 111 101 -128 47 -23 14 9 36 13 128 -10 15 56 45 -10 57 40 -105 -110 73 -50 167 105
5307A05M3r3P1r1j52J15J32j80o6K5L6j1q8J17L8j4P5k10J45rR5P4o3k80K98j34
$$ 105 148 55 126 35 -117 -2 130 -50 -116 -91 -55 -66 -154 -37 1 -13 62 -148 -3 -12 83 157 94 -186 112 -22
5333b2l0M8L1J3nK5j96K3J5K72k05O5K0j04O0k4K0n6J15j69J4K34qJ9l1j32n7
$$ -22 -52 -4 27 40 35 60 -136 -113 -98 174 -31 34 54 -50 10 -14 6 -50 65 -104 -90 144 136 155 124 -8 -65
5360f5O6L6j01L4l6J47O8j87J05L9j22R0N5l30J31Qn8J67o9J5k6j18J14L2q2M8
$$ -65 1 37 -64 -30 -66 81 149 -38 67 106 -16 74 129 -201 -70 -62 -120 47 -22 -7 -33 -151 -37 -5 -87 -39
5386c9l4Q5r4jO4J30j67J51j29k8L0J45l14L54j82o5P9rJ29j65J45j11O7K6R3
$$ -39 -73 12 -82 -83 -19 111 -56 95 -34 -62 -32 113 -201 153 -29 -94 -15 -24 105 -60 85 -26 41 67 160
5411A60k67R5Mo2K24j37J84l20P4L6p3J79K5j43N1oL5J22j70J4k7N0m2n7J08O
$$ 160 -107 -12 -8 -70 154 17 201 -119 -45 -9 -82 97 122 -21 30 24 59 181 11 25 -2 48 6 -51 57 63
5437F3o7r8Q1L9N3j95J9J34n7N7q3M8n0p4K39r1j16J58R2j05R9m4j49Q7l8n6J11
$$ 63 -4 -102 -21 18 71 -124 -105 29 -28 29 -54 -6 -56 -130 109 18 -98 60 152 47 146 102 -47 40 2 -54 57
5464E7k23L57j48%j38j09K39%n6j20K13o9l5n6M2n0Q4Kn6m8J37rk7J1j3n1L0l
$$ 57 -166 191 43 43 -95 -204 35 35 -21 -141 72 3 -32 -88 -46 -96 -12 -10 -66 -114 23 14 -13 -2 -15 -66 -36 -39
5492c9J63m3q3J29q1M6OO8j51p6k0j11K36R1J01k52n6J71j85O1M5j62J29P4M6
$$ -39 124 81 -2 127 46 92 98 166 15 -61 -81 -192 44 135 236 -16 -72 99 -86 -25 20 -142 -13 61 107
5517A07l5M4k00Q7j1N3P0r9j71J00J23nq0J16J18j95J51k32N6Q3J15k84J34j54
$$ 107 72 116 -84 3 -8 45 115 16 -155 -55 68 63 -17 99 217 22 173 -59 -3 80 195 -89 45 -109
5541a09K9l9J91j58J89R5k49M3m9P6o2M7r5pQ1J0N2j05R0j12J58N6l5L9lj78j
$$ -109 -80 -119 72 -86 103 198 -51 -8 -57 19 -43 4 -91 -98 -17 -7 45 -60 30 -82 76 132 97 136 133 -45 -46
5568d6j3P4j9J61n4q7j8n5J24j60J75J01j75P3n7o8J17l1p0O3o6J32q9Rn2q7K09
$$ -46 -59 15 -4 157 103 16 -2 -57 67 -93 82 183 8 81 24 -44 73 42 -28 35 -31 101 12 21 -31 -118 91
5595I1o4q7R1j99J36J25kj20qo7P0M9o4j0L4j04N6Q1L0j0r6o3M0kK15j62j6m7
$$ 91 27 -60 31 -168 -32 93 91 -29 -37 -104 -34 15 -49 -59 -25 -129 -73 8 38 28 -68 -131 -91 -93 122 -40 -56 -103
5623a03R7Ll4n7rMJ50Q6p0j83J51K6R9j28n7Q8q1Q5n5j9L4j63N2J28j60J76M3
$$ -103 -6 -3 -37 -94 -103 -99 51 137 67 -116 35 61 160 32 -25 63 -18 67 12 -7 27 -136 -84 44 -116 60 103
5650A03k30M9n7K3M7J07j22J52nm1J6j5j12L7p0R5q3M1n3J9K29n2pP1j69r2J68
$$ 103 -127 -78 -135 -112 -65 42 -80 72 67 26 42 27 -85 -48 -118 -23 -106 -65 -118 -99 130 78 71 142 -27 -119 49
5677D9o9J7j12K04j40n2J19j25J44k0J62j80q3J53jk2O0j04q7N5Pj37J56J07k13
$$ 49 -20 -3 -115 89 -51 -103 16 -109 35 15 177 -3 -86 67 66 44 104 0 -87 -32 -25 -162 -6 101 -112
5702a12J98j96O0N5j19J87j67K15k20J22o7M9N3j04M4k09J79K0J03L6j38j1J49
$$ -112 86 -110 -50 5 -114 73 -94 121 -99 23 -44 5 58 -46 -2 -211 -32 -12 91 127 -11 -22 127
5725A27o2L9Jj35j08K19j69J00q7L3L3J66k1j32l1P2O7k14J0K2KK48j42L0l7n0
$$ 127 65 104 105 -30 -138 81 -88 12 -75 -42 -9 157 136 4 -27 45 112 -102 -92 -70 -68 180 38 68 31 -19
5751a9j0N0P2j28J79m8j05m9j5R6j17J12L7r8k9J15O8j19N7r0j37P3K68j08M0
$$ -19 -29 21 93 -35 144 96 -9 -58 -73 23 -94 18 55 -43 -72 43 111 -8 49 -41 -178 -105 163 55 95
5776I5j49J24l9p6mJ35r9Q7r1OR8j7p3j31K33k24J75j27J46L9q4Q5j77n7R0q4
$$ 95 -54 70 31 -45 -49 86 -13 74 -17 -11 87 70 -3 -134 99 -125 50 -77 69 108 24 109 -68 -125 -35 -119
5802a19k0K31j04r9Q9O5l9k9N3r7m0J65o5N8k5J16%j07L5p6J4M1j7Ok08L39j89
$$ -119 -139 92 -12 -111 -22 43 4 -25 28 -69 -109 56 -9 49 24 140 140 33 68 -8 6 47 30 36 -172 167 -22
5829b2l5P3j01M0J41n8l2k14L10k22R2L5q8j41K53n5R6L1k89L20J0j20l2R3j39
$$ -22 -57 16 -85 -45 96 38 6 -208 102 -120 -28 7 -81 -222 31 -24 72 103 -186 134 144 24 -8 85 -54
5854e4J89q8M2O4q4l0j30J49j07J12n3j67J03M2M9p9j3q4J68r7L7J15m6j7K7j48
$$ -54 135 47 89 153 69 39 -91 58 -49 63 10 -157 -54 -12 37 -42 -55 -139 29 -68 -31 84 38 21 48 -100
5880a00K30j4j22J45P1k40k1kP0o5LJ07JJ1q3J06j7n4j7k2J73j22J42j29L2N6
$$ -100 130 116 -6 139 210 -30 -51 -53 17 -48 -45 62 63 74 -9 97 80 26 9 -13 160 38 180 51 83 139
5906A39m3m0k3j44J10L5l6m2oJ22j23Q9j20j6J24N4r2J09N0n6M2m9q3m1O0l9J12
$$ 139 96 56 33 -111 -1 34 -2 -44 -50 72 -51 38 -82 -98 26 80 -12 97 147 91 133 84 1 -40 20 -19 93
5933I3k15N4J65j31O7k63R7O0J23m8j12M7r8P1j7M7K44k71J39o5N9r3K3j51K62
$$ 93 -122 -68 97 -34 33 -230 -133 -73 50 2 -110 -63 -161 -90 -107 -60 184 -87 52 -13 46 -47 -24 -175 87
5958H7k79J73J6J66j96J11j23J26j40LJ1J5M8j15K95k59J22r0QpJ53j62M7o2m1
$$ 87 -192 -19 -3 163 -33 78 -45 81 -59 -56 -45 -30 18 -97 198 -61 61 -29 -21 -28 125 -37 10 -52 -93
5983i3J16j8J05j03k2L6k85J20K24l3N6j33J50n1o2M8P0j58N8J29k49K97l00p8
$$ -93 23 5 110 7 -15 21 -264 -144 80 47 103 -30 120 69 7 55 125 -33 25 154 -95 202 -98 -176
6007a76K13N2o5m6J09j16M9j36J28q7J74o7j3J0o3l0J19K6j08K02N2j05k29J92
$$ -176 37 89 24 -22 87 -29 20 -116 12 -75 99 32 19 29 -34 -64 55 81 -27 175 227 122 -107 85
6031H5j91J40O2m4J06r5k4M6j47L8O7j1j36J43K0j46L38l60k6J80j02n9K5J44
$$ 85 -106 34 96 52 158 63 39 85 -62 -24 43 32 -104 39 59 -87 251 -109 -135 45 -57 -116 -91 53
6055E3J12k09l2J25Jr1l1k15K20k8L03j43j01K21l12J55j10K52l2j48q6J70N0
$$ 53 165 -44 -76 49 50 -41 -72 -287 -67 -95 208 65 -36 185 -127 28 -82 170 138 -10 -96 74 124
6078A24j13P1K5j01J29q8k41J52j35J20J27q9J4L9pp7L4J31p8k67K07n9j2O8O6
$$ 124 11 82 107 6 135 47 -194 -42 -177 -57 70 -19 -5 34 27 -50 -16 115 37 -230 -23 -82 -94 -26 40
6103D0l6o2J19J1j99J76j47R9o0jJ13k4j06J18k03q3K01J91r3j66J41O7n0p9n8
$$ 40 4 -58 61 72 -127 49 -98 1 -59 -60 53 29 -77 41 -162 -245 -44 147 54 -112 29 96 46 -33 -91
6128i1Q2r5Q9k16K82k4mp7n7O9J04j4j1qJ02j15PK1o7m6N8O6jP5j95M7Qn5q3K86
$$ -91 -9 -104 -15 -231 51 27 23 -54 -111 -42 62 48 37 29 131 16 23 44 -23 -69 -11 55 54 129 -66 -19 -11 -66 -149 137
6158A37j62q2J00m9J3L3m6J9J32k6r6J55M6j98l4J62M2j61Qj1j3kR2p9K8J27o
$$ 137 -25 -107 -7 -56 -43 -10 -56 -37 95 69 -27 128 174 -24 -58 104 146 -15 -7 -18 -31 -33 59 -20 8 135 129
6185A29j15N4J9j89K67j66LJ4k1p1K28p5j50J17q2P8J25k50L24k72R9j13L6J17
$$ 129 14 68 87 -102 165 -1 2 16 -5 -76 152 77 -73 44 -38 40 165 -85 239 -33 66 -47 -11 106
6209A06j41L5l5o9J01Qj56L39r9k26K56j81k9J33j63K23Pj71K01j13k23o2K62
$$ 106 -35 0 -35 -104 -3 5 -151 188 89 -137 119 -62 -91 42 -121 102 109 -62 139 26 -197 -259 3
6232Cqj0O4K9j44J35l2m5J4J42k22N1J11j59K3N3J03Lj17M4j36L10j21j20nl3
$$ 3 -5 -15 49 78 -66 69 37 -8 6 148 -74 -23 88 -71 -48 5 108 111 -6 38 -98 212 91 -29 -34 -67
6258f7J97j08J08jk53Q4Jj34J00P7Pn5R0j35J24m7P2l2L7j75P0m5J76k19J12L7
$$ -67 130 22 130 129 -124 -40 -39 -173 -73 4 11 -44 46 -89 35 -12 60 28 65 -110 -40 -85 91 -128 -16 21
6284B1j46J10O1j14m6K45k00J88N2j57K1k15j34L25j35QM0k4K29k09M5J58Mk70
$$ 21 -125 -15 46 -68 -114 131 -69 119 171 14 35 -180 -314 11 -124 -116 -76 -100 129 -80 -35 123 127 -143
6308a43J73j7m9J14q4r6J66P0q9k2m2R3k19%R6m1K38j29m4J60o4k8O2j38j61J30
$$ -143 30 13 -36 78 -6 -102 64 134 45 23 -19 74 -145 -145 -49 -90 148 19 -25 135 71 43 105 -33 -194 -64
6334f4J63Q7k32J82j01J27j46Rr0K26k70J98m8k6J9k2k00J48r5K52q9j05K3L1
$$ -64 99 186 -46 136 35 162 16 25 -65 161 -109 89 41 15 34 12 -188 -40 -135 117 28 -77 -54 -23
6358b3o0K14j21jJ4m3%j46K42mr4J6O2L5r1j01J18J12j27J79k55p9K6K33m8l3
$$ -23 -83 131 10 9 23 -20 -20 -166 76 72 -22 -6 56 91 0 -101 17 129 2 181 -74 -153 -127 106 58 25
6384B5J20o2j55J18J7M8j56o6P3N9n6j54J53J28k7r3j51K01n5Q4J92k01k0p8J30
$$ 25 145 83 -72 46 63 111 -45 -111 -38 21 -35 -189 -36 92 65 -28 -179 22 -33 51 243 42 22 -56 74
6409G4k20J34j64J83J93k04L2K3r0O2K50k92J5j77K93j97P6R3j81K96k05q8K87
$$ 74 -146 -12 -176 7 200 -4 28 51 -39 23 273 -19 -4 -181 112 -85 -9 84 -97 199 -6 -94 193
6432A93j61j18J86j44J70Rk47p9L66j11o0j40j8K07k5J0Q3j91OQ0j90K50R8k21
$$ 193 32 -86 100 -44 126 135 -112 -191 175 64 4 -136 -154 53 28 38 121 -70 -64 16 -174 76 174 -47
6456d7Q8j75K02lk06M4J69j82J38J9j0J05j96O6%o4q4R4KJ5N3L8j66J95J37k58
$$ -47 41 -134 68 65 -141 -97 72 -110 28 47 37 142 -54 12 12 -52 -136 -42 -40 -25 28 66 -100 95 232 -26
6482b6m6J44j63l1K01k27J14K9M3J7M4P2k45m7M7M6j69J12J23Q6k23N7j02R2L7
$$ -26 -72 72 -91 -122 79 -148 -34 -5 38 55 99 171 -74 -121 -74 -28 -197 -85 38 124 -99 -42 -144 -52 -15
6507a5j30J53j8Nq2j7O1R8m0n7j18J68J9N6k41J54j33K12o2j21J23J04j89J41
$$ -15 -145 8 -10 -5 -87 -104 -43 55 15 -42 -160 8 27 83 -158 -4 -137 75 13 -108 15 119 -70 71
6531G1l0J10j57J05r3j14R8m6L5M9j24N3L3K6j64K67j56J17n0P7j22L1q6M9m4
$$ 71 41 151 -6 99 6 -108 -10 -56 -21 28 -96 -43 -10 16 -148 119 -37 80 30 107 -15 16 -70 -21 -65
6556f5M6j4J50j61R1r9k7N9R6O3n8lj83OQ5J62j63p3MJ6n4J56r2M1O4M5k04J56
$$ -65 -19 -33 117 -44 47 -52 -79 -20 76 139 81 78 -105 -99 -14 148 -15 -88 -84 -68 -122 34 -58 -17 47 92 -112 44
6584D4j28R0J97j67J45l36R6K04k97L58k85J54m7n6Q6O2j23p8J21p3L6M7P4k03
$$ 44 -84 6 203 36 181 -155 -59 145 -152 206 -79 75 28 -28 58 120 -3 -81 40 -33 3 50 124 -79
6608g9k2J59qp5k6n5J42o6J67j23L7r2k0%Q2lm0j30K27%k53K30J9l2P0j03k6q2
$$ -79 -101 58 50 -25 -51 -106 36 -30 137 14 51 -41 -61 -61 21 18 -22 -152 75 75 -178 52 71 39 109 6 -20 -102
6636a02K5N8j1P4M6p4j8J22j71l1J16J9p6J30q8o3O2kk1K9M9m3j42J77N9j15k4
$$ -102 -77 -19 -30 44 90 16 -2 120 -51 -82 34 53 -23 107 19 -44 18 16 -5 24 73 30 -112 65 124 9 -15
6663a5L5R4j70Lj9J18o7l1Q3l5j05J77j91J77l3j05K23j13J96k11k8N5J60l28
$$ -15 20 114 -56 -53 -72 46 -21 -52 31 -4 -109 68 -123 54 21 -84 139 26 222 11 -17 38 198 -130
6687a30K29k75J51L12k73P9l0j06J45j09L1o3R1j04J33Mq2L6K3j98k9J87P2o3
$$ -130 99 -176 -25 287 14 93 63 -43 102 -7 24 -39 52 -52 81 85 3 39 62 -136 -165 22 94 31
6711C1q2M9p8J10j14l1J17l3P5j62R3l9q4K76k22J32K5M3L5n2o7Lj4n0K7J12q9
$$ 31 -51 -2 -80 30 -84 -115 2 -31 44 -118 -25 -64 -148 128 -94 38 63 106 141 89 22 25 11 -39 -12 100 11
6738A1l6p0K32l30K18n2K05j96J24k94R5N3q1J47J80k24n5LJ56p6r4j8L06l50
$$ 11 -25 -95 137 -193 25 -27 178 -18 106 -188 -93 -40 -121 26 206 -18 -73 -70 86 10 -84 -102 204 -146
6762a46N0J43k33K70m1P1q0J4nO3k47P6k0K3J4M6J41j15j49Q7lR4j16N2k15K79
$$ -146 -96 47 -186 84 43 114 34 48 43 106 -141 -65 -85 -62 -48 -2 139 24 -125 -38 -41 53 -63 -11 -226 53
6788E3p3j3n2KJ28j29jR6p1%KR9K7j20P1Q1n6q4J08j33o2N5p7N8J50k20L78k59
$$ 53 -20 -33 -85 -83 45 -84 -85 11 -60 -60 -58 41 68 -52 19 100 44 -40 68 -65 -127 -72 -149 -91 59 -161 217 -42
6816d2K48k09L6m4O2Q7j06N8o2j03j5M7k9pJ9j3J34J7j11j41J2K61m3j82J38m1
$$ -42 206 -3 33 -11 51 138 32 90 28 -75 -90 -43 -72 -79 -60 -73 61 78 -33 -174 -162 99 56 -126 12 -29
6842b9l2m8J27r0K84j95Mq5J8N6o6J88m3j39n6K30p1j33R8J4k1M7J1J9j53qp7
$$ -29 -61 -109 18 -72 212 17 21 -64 -46 10 -56 132 89 -50 -106 124 53 -80 18 32 11 58 69 88 -65 -73 -150
6869a50J30K0M2j93J01m8KL3R4j17P8Q9pj84L2J36j68R3J42j40Q8j2j26Q0j07
$$ -150 -20 0 42 -151 -50 -98 -96 -63 31 -86 -8 81 74 -110 -78 58 -110 -17 125 -15 73 61 -65 15 -92
6894i2J43o1J33j22O8j41k3K0R2j92J38J20j32K00j57J12k75K43j75K07k30J16
$$ -92 51 -10 123 1 69 -72 -95 -75 17 -175 -37 83 -49 151 -6 106 -169 74 -101 106 -124 -8
6916hK33l19J28k2J95k46r5R7MpnK14k32N8L2Ro7l8j9R5l5n1J2m5O1K50k53K8
$$ -8 225 -94 34 12 207 -39 -134 -37 -33 -40 -45 169 -63 -5 27 36 -31 -69 -88 7 -28 -79 -67 -112 -51 199 -54 -26
6944b6J41q6L8k16R9o6K04o1q3m1J62j00L6j5J2J17k02Q9p7Q9R5j21J4M9m0o9
$$ -26 115 29 67 -149 -50 -116 88 27 -56 -97 65 -35 1 -14 -2 115 -87 2 -75 14 109 -12 2 51 11 -58
6970e8k3O6l2j2J46o4L6j06j19P5K32k36J17J35m7p3p5JQ2p4p3NK6R8l4J00l8
$$ -58 -81 -15 -47 -59 87 23 59 -47 -166 -91 141 -95 22 157 110 37 -38 -37 45 -29 -102 -97 -71 27 -7 93 55
6997E5j25J19n3Lr7J27p5M7J20j67k0O2k7J36l8%j08l6pK07j73r6K51j53J21o6
$$ 55 -70 49 -4 -1 -98 29 -46 1 121 -46 -66 -4 -31 105 67 67 -41 -77 -84 123 -50 -146 105 -48 73 7
7023Gj74J58J13q9j07J01k4L4j66K87j70J38k57J20j5J48j28M0L1o4pp4J39K2
$$ 7 -167 -9 104 15 -92 9 -15 19 -147 140 -30 108 -149 -29 -44 104 -24 16 47 -17 -24 -98 41 63
7047F3nj88J39J31J1j57nJ63k45j0R8j10K57j30J31L8l14J51P9j31l4r1K37p3
$$ 63 58 -130 9 140 151 -6 -11 152 -93 -103 -5 -115 142 12 143 181 -133 18 97 -34 -68 -159 78 5
7071EM9k01J41q9QJ40q9N2j1r1R3J07n0k03k7J21j72J32j1J57r5L5j5R2k49J92
$$ 5 54 -147 -6 -95 -87 53 -36 16 5 -86 7 114 64 -139 -166 -45 -217 -85 -96 61 -34 1 -14 78 -171 21
7097B1j03j47J47K8J10rkj49N5N7l3Jj3M1m8J03j05m3K8J24j09P7r8k6Q1J07o3
$$ 21 -82 -229 -82 -54 56 47 45 -104 -49 8 -25 -24 -37 4 -44 59 -46 -89 -61 63 -46 31 -67 -93 -12 95 32
7124C2n3Ro2O3O2mj5pj54M3K72k65M4L7l3J60j25q1J16n0r2J38k44K28n4J0K4
$$ 32 -21 -12 -74 -11 51 47 32 25 -129 -86 186 -79 -35 2 -31 129 4 -77 39 -11 -103 35 -209 19 -35 -25 -1
7151aJ43j54K6q0K3J31j15J9Rn3K51k02j63J36J5q8M0L6j78J88J46Rpk95K35p2
$$ -1 142 -12 14 -66 -43 88 -27 -8 1 -52 199 -3 -166 -30 -15 -103 -63 -27 -205 -17 129 138 131 -164 71 -1
7177aR5r5J20k30o5J40J68k52J58j67K67j01j10r0L41j15j32L2Q8J28j65Q7j77
$$ -1 94 -1 119 -111 -176 -36 132 -120 38 -129 138 37 -73 -163 178 63 -69 -37 51 179 14 101 -76
7200g6J04N8m0j79J48J0r9M3K11j87n2J05P2j77K0J24j4m5L7q7K33l03P2J08L
$$ -76 28 86 46 -133 15 25 -74 -31 180 -7 -59 46 118 -59 -39 85 71 26 63 -24 209 -94 -22 86 89
7225H9j37R0k5J6L9p8J8q3J17k8j19J57m3j08J69MJ9j02K7L8j04J50j59P6J23
$$ 89 -48 42 17 33 72 -6 12 -71 46 18 -101 56 13 -95 74 78 97 -5 22 60 -44 106 -53 23 146
7250A46k07j6Q4j76J80P0j23L1NK3o8P4oM7n9J07j00L3N8k8j11RJ76j43o9K06
$$ 146 -61 -77 7 -169 11 81 -42 -11 -6 17 -51 23 17 64 5 112 12 45 103 75 -36 -27 149 6 -63 143
7276A43j63P2Ok7L3m7J7L5o3j7jm4j3KJ2N1P6k01J64j04J77j21O6j97K64k77K21
$$ 143 -20 52 58 31 64 17 34 69 6 -11 -12 -56 -69 -67 -55 -4 72 -129 35 -69 108 -13 53 -144 120 -157 64
7303F4j01L1j03P1R3k1n1J50j15j7k3r4N9M3Q9j27J14J83l14J4Q9r2J93j91J14
$$ 64 -37 -6 -109 -38 55 34 -17 133 18 1 -22 -116 -57 -14 75 -52 62 245 -69 -55 34 -58 135 -56 58
7328E8k4j8n3k2J56k05j7K27n5Kj35Q6N3j33l1J23j07J48j64L0J0Q3j58K05K1
$$ 58 34 16 -37 -59 97 -108 -125 102 47 49 -86 0 53 -80 -111 12 -95 53 -111 -81 -71 12 -146 59 80
7353H0Lr3J20j78J06q7k1K2R6K6K9j49J05J13k41Q4Q3j15K2Q4m3k6Ol7j00P2m0
$$ 80 83 -10 110 -68 38 -49 -70 -48 48 74 103 -46 59 172 -69 15 98 -17 5 89 46 20 26 -11 -111 -39 -79
7380g9J53r4K13k27j21J50k1R1j67Q4J61m8moj61j9PQ4o5j1nQ7qq3J91n6l9l9
$$ -79 74 -20 193 -34 -155 -5 -26 65 -102 -18 143 95 91 85 -76 -95 -88 -4 -69 -80 -85 2 -6 -89 102 46 7 -32
7408c2J94j18j12j9M3J53J7r1p3M0Kk2q8J56j09L5J56j97R0J81j61m3m9J75n2
$$ -32 162 44 -68 -87 -44 109 126 35 -38 2 4 -18 -106 50 -59 -24 132 -65 25 206 45 2 -47 128 76
7433G6j10N3L6j0j41J93k6q1n8M7J1j27K47p2j20N2L4K24k24J70l52J63R5r4M8
$$ 76 -34 19 55 45 -96 97 71 -10 -68 -21 -10 -137 110 38 -82 -30 4 228 4 174 -178 -15 80 -14 34
7458C4l7J34k07Q4K1O7R7k42k2O8K28k06QJ7L2K2l4j35O9r2O5K62m09K35n7M6
$$ 34 -3 131 -76 8 29 96 193 -49 -71 -3 225 19 27 44 76 98 64 -71 -2 -94 -29 233 -176 59 2 48
7484D8j47K48n5O0j74m3NM8J3o6J1q4R0J55rl1J5l0j53N8J4N0k37L11j03p9N8
$$ 48 -99 149 94 154 -20 -63 -58 -10 3 -63 -52 -136 -46 109 100 69 84 54 -99 -41 -27 23 -214 97 -6 -85 -27
7511b7%q4j5K65j77Qj38J50k5m7j8P5O9j74J04J26j93O0J03r3P5j29J3K21o4j06
$$ -27 -27 -111 -126 139 -38 -30 -168 -18 -43 -90 -108 -33 36 -138 -34 92 -101 -41 62 -31 44 -85 -72 149 85 -21
7537b1k03J52O4r0J55n1j32L8q6K28j03n4K23j38J57l9J4k08l2J20J00M0j46o2
$$ -21 -224 -72 -8 -98 57 6 -126 -88 -174 54 -49 -103 120 -18 139 100 114 -94 -126 -6 94 134 -12 -74
7561g4K36j11j42M8O6L6l4Q3j23J27j32K6nk4J6P5j17M4J2k0K1k05K77k04l1L14
$$ -74 162 51 -91 -43 23 59 25 108 -15 112 -20 6 1 -23 -7 68 -49 -5 7 -13 8 -197 80 -124 -155 159
7587A59j00j84J55Q9n1p1r1K53j80r8O9n3K24o9j17O1R7j98K49k91M3K54j63Q1
$$ 159 59 -125 30 119 68 -3 -94 159 -21 -119 -50 -103 121 52 -65 -4 93 -105 144 -147 -104 150 -13 68
7611F8j65J91j06J1k1M3n1L9j69M52j95nl1j50M7q1J25K4l2M9P1r5O4r6j4L2o7
$$ 68 -97 94 -12 -1 -22 21 -30 9 -160 292 97 92 61 -89 -42 -123 2 26 -6 43 114 19 83 -13 -27 5 -62
7638f2K6k8P7k12R6J5j7J87k01j1JJ50J53n3rk20K52j29J5N3r5k3J05J0j76Oj1
$$ -62 -36 -64 13 -199 -103 -88 -105 82 -119 -130 -129 21 174 121 112 -108 144 15 30 83 -12 -35 70 80 -96 -90 -101
7665a01J56k97L33j64P2Om1J66j88K20q1j34r6K42n9j11m7P2j8L3R0rL3n3Nr3
$$ -101 55 -242 91 -73 -1 5 -36 130 -58 162 81 -53 -149 93 34 -77 -124 -52 -70 -37 53 44 77 24 29 -64
7691f4K0J60j19l1N9O7j55j5j3J13r7l4J21O7j54PJ12j16j1Q0k6R4j09Q3j1j67
$$ -64 -44 116 -3 -34 25 92 -63 -78 -91 22 -75 -109 12 79 -75 -68 44 -72 -83 -3 -29 65 -44 39 28 -139
7717a39J20L3P8k0k2j85J16q4J13J40j12r9J19j04J82m9j56N1j80r8K73O8j15
$$ -139 -19 14 92 72 50 -135 -19 -103 10 150 38 -61 58 -46 136 87 -69 -18 -198 -296 -23 45 -70
7740g0K13k60J16R3j47K5K7O8j10j6j9oJ87q8r9J55ol7N3j33Q8J11j01K6j34P9
$$ -70 143 -117 -1 92 -55 -30 -3 65 -45 -61 -80 -86 101 13 -86 69 63 26 79 -54 34 145 44 70 -64 15
7766A5P3j22n9K82l07N7J10N6n0k5j04J38l8j5oP6k2L9k39J23J23q2J1l5J37k26
$$ 15 88 -34 -93 189 -118 -61 49 105 55 30 -74 64 26 11 5 81 59 98 -141 -18 105 23 34 -1 136 -90
7792i0N5M5Qj5P6j36J4J02jj70J30o6j05J69j23J34jl5Qj02J18J9M1K0O6J5o2
$$ -90 -35 10 18 3 79 -57 -43 59 58 -112 18 -48 -153 16 -107 27 26 -9 -1 -103 15 34 75 95 161 176 114
7819A14k20J31K3k9j25P8N2rm3J33j13l6Q6O2k9p4J56o7m6n4N3K4K0k72J89K1
$$ 114 -106 25 48 19 -106 -28 24 15 -28 105 -8 -44 42 104 75 1 157 90 44 -10 43 67 87 -185 4 25
7845B5J35k33J48k5P5l2k60P2J47j51O1P9j28J68l3j08P4R9j31L5n1k0J74k30
$$ 25 160 -73 75 50 125 93 -167 -95 52 -99 -38 41 -87 81 48 -60 14 113 -18 17 -34 -54 120 -110
7869a10R3l9J32J73k30J3J4q2j45J40l1J52r2m3Q3O1j46J52j23j5j2J93j53mP8
$$ -110 -17 -56 76 249 19 32 46 -36 -181 -41 -72 80 -12 -55 28 89 -57 95 -28 -43 -55 138 -15 -19 59
7894E9N4j5mk16JJ79M4n8M8j4rj9j54J4J07l2j50L02j1j41j2Q5k07J90j95K44
$$ 59 113 98 94 -122 -121 58 102 44 92 78 69 50 -104 -90 17 -15 -165 137 126 -15 -27 58 -149 41 -154 90
7920I0j88Q8q4J68j69Q0j41K91j36Q5n4j62J02L0O3j59K37j13J2m3K7%K4r4J03
$$ 90 -98 -10 -94 74 -95 -15 -156 135 -1 84 30 -132 -30 0 63 -96 141 28 40 -3 24 24 48 -46 57
7945E7Op1K54k95rpJ28k3o8R4P8j09p4L2J1n8N2o4J32k9j35O6mJ01k17P0Q9J18
$$ 57 63 -8 246 -49 -58 -65 63 40 -28 66 144 35 -39 -7 4 -54 -2 -66 66 37 -98 -32 -36 65 -152 -82 7 125
7973A25J3k61K05%j15N0L0j89Q5J61j35l1j43J69P7j4j66J25j22P3J80j86J43
$$ 125 138 -123 82 82 -33 17 47 -142 -57 104 -31 -62 -205 -36 41 27 -139 -14 -136 -63 117 -69 74
7996G4m6n2L9j51J64N8k46K11L1j30J08r9J54J5j47k5Pj02J02l2j1l8J25o4J44
$$ 74 28 -24 15 -136 28 86 -160 51 82 -48 60 -39 115 130 -17 -42 -35 -137 -35 -67 -78 -116 9 -55 89
8021H9j67Q8p1N1k2J8p5J80l1j04M6j46J04q7J18q2J18j37J36L0j3R8j97J08j57
$$ 89 -78 10 -61 -10 -32 -14 -89 91 60 -44 2 -144 -40 -127 -9 -91 27 -110 26 56 43 141 -56 52 -105
8046a05K7J26j97L17j06j6P8o5j56N4J00P6l2j52Q4j18l4Q8O3qj27j01J80J38
$$ -105 -78 48 -149 168 62 46 124 59 -97 -43 57 133 101 -51 33 -85 -119 -31 32 24 -103 -204 -24 114
8070A14k3j61k3O2l4J80m2j22J7J26o7K0l4L3J69k84K8J72j43j02K77j90J86j29
$$ 114 91 -70 -93 -31 -65 115 73 -49 -32 94 27 47 13 46 215 -69 -41 131 -12 -114 163 -27 159 30
8094C0j4J46j34O2k28P5J08o8J57k40K49j9j97J66o2m5M4q2O3J1m8K9pJ16j37
$$ 30 16 162 28 90 -138 -63 45 -23 134 -106 143 124 -73 93 31 -14 30 -52 11 22 -26 3 -4 112 -25
8119b5K5J6j3J1O4q3o9K6R2j30k8J18o0j3j1J46q8O3l6j53J49j4j27J28K6L0J1
$$ -25 0 16 3 14 78 -5 -74 -48 44 -86 -114 4 -56 -69 -80 66 -22 41 5 -148 1 -13 -140 -12 14 44 55
8146E5q0J48m8p6l0n0J79j21J7J33j8j36J3l0K8NL1J3n6o4J61m0j85k2O2K33n8
$$ 55 -25 123 75 -1 -31 -81 98 -23 -6 127 109 -27 -14 -44 -16 -11 20 33 -23 -87 74 34 -151 -173 -111 122 64
8173F4p5n7J57j51L7M8O2j15Q5j11L0J30j89Q5mm0l8K13
$$ 64 -11 -68 89 -62 -25 23 85 -30 55 -56 -26 104 -85 0 -4 -44 -82 131
8191A31
$$ Imaginary data points
##PAGE= N=2
##DATA TABLE= (X++(I..I)), XYDATA
0@%%%%%%%%%%%%%%%%%%%mJ2j6J6j6J6j6K3l1L2l2M0m8N3o1O9p7Q6r8J07j18J33
$$ 0 0 0 0 0 0 0 0 0 0 0 0 0 0 0 0 0 0 0 0 -4 8 -8 8 -8 8 -8 15 -16 16 -16 24 -24 29 -32 37 -40 46 -52 55 -63 70
41G0j48J64j82K04k25K47k74L03l35L69m04M44m91N43o00O64p38Q25r28J051j200
$$ 70 -78 86 -96 108 -117 130 -144 159 -176 193 -211 233 -258 285 -315 349 -389 436 -492 559 -641
62f41J385j625J950k412L127m393P276k4148L381O6997K1923K7999P516j2521
$$ -641 744 -881 1069 -1343 1784 -2609 4667 -19481 -16100 50897 72820 100819 108335 95814
76I5814m32j8301k5738r473k9493r425q256j7261J4012K077j1702j970l0336k1600
$$ 95814 95382 77081 51343 41870 12377 2952 -5304 -22565 -8553 -6476 -18178 -20148 -50484 -72084
90g2084j3335k1032J6322L0492L8111N6050K6781K3870J6724k0897j4204k2893
$$ -72084 -85419 -106451 -90129 -59637 -21526 34524 61305 85175 101899 81002 66798 43905
102D3905l2406r151k2247j2431R786q98J3912P469p736M210k2202k7697q101j3235
$$ 43905 11499 2348 -19899 -32330 -22544 -23442 -9530 -2061 -9797 -5587 -27789 -55486 -63587 -76822
116g6822J7679L4048K6042M6055K8277P343L953k3957j6930j4540k8972m748p025
$$ -76822 -59143 -25095 947 47002 75279 82622 86575 62618 45688 31148 2176 -2572 -9597
129i597q774R115q513j72J0254j1017l142j0342j6252M668l653R682K8738J5625
$$ -9597 -18371 -9256 -17769 -17941 -7687 -18704 -21846 -32188 -48440 -43772 -47425 -37743 -9005 6620
143F620K5654J2850q310L139j3785j6170N48q307N253L813j1795K911o691p980
$$ 6620 32274 45124 36814 39953 26168 9998 10546 2239 7492 11305 -490 2421 -4270 -12250
157a2250N160r976K996P502q696O091L529J655J6009N66L470O221j2676l247p935
$$ -12250 -7090 -17066 -14070 -6568 -15264 -9173 -5644 -3989 12020 12586 16056 22277 9601 6354 -1581
172a581r222J1591j333k03P226j0773k672n488j2118R138L304M850J2872l090
$$ -1581 -10803 788 -545 -748 6478 -4295 -6967 -12455 -24573 -15435 -12131 -7281 5591 2501
186B501N696L054r951O889M10k907O071j0111k264K942q481N558R11j956P307
$$ 2501 8197 11251 1300 8189 8599 5692 11763 1652 -612 2330 -6151 -593 318 -1638 5669
201E669r845n178L328n893R413P300J642J2975l934p087p97j1243J672J148n960
$$ 5669 -4176 -9354 -6026 -11919 -2506 4794 6436 19411 15477 8390 7593 -3650 -1978 -830 -6790
216f790Q451k969n467J739j0508J614M367o042P043N01p22R221k129P804J1991
$$ -6790 1661 -1308 -6775 -5036 -15544 -13930 -9563 -15605 -8562 -8061 -8783 438 -1691 6113 18104
231A8104j446N850l543r363J873r944k561O493l700M569l040j0721P78q675m331
$$ 18104 16658 22508 18965 9602 11475 1531 -1030 5463 1763 6332 3292 -7429 -6651 -15326 -19657
246a9657N536l037R166N519l876Q762O21R12Q071m281L310K209r581J463l741
$$ -19657 -14121 -17158 -7992 -2473 -6349 2413 3034 3946 12017 7736 11046 13255 3674 5137 1396
261A396k672P235n995l18P71j1340q32m469k991J1424J773N429Q961l353M522
$$ 1396 -1276 5959 -36 -354 417 -10923 -11755 -16224 -19215 -7791 -6018 -589 8372 5019 9541
276I541j288n468P630j515k99L899p211J384p66q287L897l679m305R47j0764q95
$$ 9541 8253 2785 10415 8900 8601 12500 5289 6673 5907 -2380 1517 -2162 -6467 -5520 -16284 -17179
292a7179K481l841R430M566L687R887m288L8K953n196N353P9k187P004n506k849
$$ -17179 -14698 -18539 -9109 -4543 -856 9031 4743 4781 7734 2538 7891 7970 5783 12787 7281 4432
308D432R82p174L359q72o063L978n456l713K475n480O498N606j790P731p64r09
$$ 4432 5414 -1760 1599 727 -5336 -1358 -6814 -10527 -8052 -13532 -7034 -1428 -3218 4513 3749 2840
324B840M370o008K613L562n221L054m181m745M204n427J502N024l172M533k356
$$ 2840 7210 1202 3815 7377 2156 5210 1029 -3716 488 -4939 -3437 1587 -1585 2948 592
339E92n799M133m204M69N344k284O293J393n014M571k849r50L501o161J836n17
$$ 592 -5207 -1074 -5278 -4809 535 -1749 4544 5937 923 5494 2645 1695 5196 -965 871 354
355C54p079K757k743J45O816l352L385L112m478L873k070j436O635l834K60J938
$$ 354 -6725 -3968 -6711 -6566 250 -3102 283 3395 -1083 2790 720 -716 5919 2085 2345 4283
371D283o173L044j508k662P115j816K85J731p545R26k480n577N052m90K625O822
$$ 4283 -1890 1154 -354 -3016 4099 2283 2568 4299 -3246 -2320 -4800 -10377 -5325 -5815 -3190 3632
387C632k401M706K973m402K731m892m308R97p621O03L592o11Q251J683l28M015
$$ 3632 1231 5937 8910 4508 7239 2347 -1961 -964 -8585 -7982 -4390 -5001 3250 4933 4605 8620
403H620p064l925j809o168M284J655J165R406J077K762K989o529J93l907q538
$$ 8620 1556 -2369 -4178 -10346 -6062 -4407 -3242 6164 7241 10003 12992 6463 6656 2749 -5789
418e789J54m189L8N695r65O563L876l230K282n626m434K064m871L155N466N00
$$ -5789 -5635 -9824 -9786 -4091 -5056 1507 5383 2153 4435 -1191 -5625 -3561 -8432 -5277 189 689
434F89P213K35k098K963o122j968p70n774K915o49k188N705j487P95K441m986
$$ 689 7902 8137 6039 9002 2880 912 142 -5632 -2717 -3366 -5554 151 -1336 -541 1900 -3086
450c086K225k76l086M637n14K582N576l745J802l78n968J205l898j844M353k463
$$ -3086 -861 -1137 -4223 414 -100 2482 8058 4313 6115 5737 -231 974 -2924 -4768 -415 -2878
466b878K165J828l722K344l639l521L286k965K350M466p18O857K326j892K969
$$ -2878 -713 1115 -2607 -263 -3902 -7423 -4137 -7102 -4752 -286 -1004 5853 8179 6287 9256
481I256m222k104k09o437K500L71j881N265j806n36J797o265n12n69l316M459
$$ 9256 5034 2930 2721 -3716 -1216 -845 -2726 2539 733 197 1994 -4271 -4783 -5352 -8668 -4209
497d209J1K367P014j069K657J057m731K002l312l545L365k483J546J928l511J988
$$ -4209 -4198 -1831 5183 4114 6771 7828 3097 5099 1787 -1758 1607 -876 670 2598 -913 1075
513A075l065n033P69m208Q14M259j310O137M055J58M466k650j246J237m586J836
$$ 1075 -1990 -7023 -6254 -10462 -9648 -5389 -6699 -562 3493 3651 8117 5467 4221 5458 872 2708
529B708J308j037N583q84j451K021p112l813l296o686J778l22P81O386P40M021
$$ 2708 4016 2979 8562 7678 6227 8248 1136 -2677 -5973 -12659 -10881 -11203 -10422 -4036 -3296 725
545G25K742m039K153j795l405L388j060K685N354o34L831J56l659n20p175l845
$$ 725 3467 -572 1581 -214 -3619 -231 -1291 1394 6748 6114 9945 10101 6442 5922 -1253 -5098
561e098N65m495L078L178J57N445o62k106J238m927J74O01j056N980R24Q19M692
$$ -5098 -4533 -9028 -5950 -2772 -2615 2830 2168 62 1300 -3627 -3453 -2852 -3908 2072 2996 3815 8507
578H507l010o16r92o614P9j775k137L443o89K720L884k786J457k377m633J272
$$ 8507 5497 4881 3889 -2725 -2646 -4421 -6558 -3115 -3804 -1084 2800 14 1471 -906 -5539 -4267
594d267k776J356O233R85M988K723j776J471n007m346L0m419J840K054j090N474
$$ -4267 -7043 -5687 546 1531 6519 9242 7466 8937 3930 -416 -386 -4805 -2965 -911 -2001 3473
610C473M48r92J851m860k085k228n411K006P35J324O851N59K851K842n138o29
$$ 3473 3921 2929 4780 -80 -2165 -4393 -9804 -7798 -7063 -5739 1112 1671 4522 7364 2226 1597
626A597k495l722K941j028K000M443p08K932o8l229J842l866k973J648l553J012
$$ 1597 -898 -4620 -1679 -2707 -707 3736 3028 5960 5892 2663 4505 639 -2334 -686 -4239 -3227
642c227J297j576L946Kj019J559l802L35R35k474M164J035O4L309k488m13J053
$$ -3227 -1930 -3506 440 442 -577 982 -2820 -2485 -1550 -4024 140 1175 1239 4548 2060 1647 2700
659B700l510J949L83o91L205k919j014Q08m400P19m29k883L302m70K70L794r30
$$ 2700 -810 1139 1522 831 4036 1117 103 911 -3489 -2770 -3199 -6082 -2780 -3250 -2980 814 -116
676a16K686J045k711J864k465k386K510j929L124L653j437K095j517l946l23m929
$$ -116 2570 3615 904 2768 303 -2083 427 -1502 1622 5275 3838 5933 4416 470 147 -4782
692d782j020J535j834L831J332l88M033j863k45J581l236J047p06j829L626j67
$$ -4782 -5802 -4267 -6101 -2270 -938 -1326 2707 844 599 2180 -1056 -9 -715 -2544 1082 915
708I15J387L485k232O92j222n498L44k211j234L486o56K787K181k473J613j319
$$ 915 2302 5787 3555 4247 3025 -2473 -2129 -4340 -5574 -2088 -2744 43 2224 -249 1364 45
724D5k013K729k140Q57K684k167K498L57j261K560k368j387K89m154P94M2j251
$$ 45 -1968 761 -1379 -522 2162 -5 2493 2850 1589 4149 1781 394 683 -3471 -2677 -2635 -3886
741c886M232l12J10J945l477K51Pk553K989M21Q59K814k281J203N78k911J677
$$ -3886 346 34 144 2089 -1388 -1137 -1130 -3683 -694 -273 586 3400 1119 2322 2900 -11 1666
758A666j024j436J952k813R2J744j893K432J11j594K072k694p96J514j947K704
$$ 1666 642 -794 1158 -1655 -1563 181 -1712 720 831 -763 1309 -1385 -2181 -667 -2614 90
774I0J135j309K497j760j116J235k567J608J231j855K515j262j160K048k552J129
$$ 90 1225 -84 2413 653 -463 772 -1795 -187 1044 -811 1704 442 -718 1330 -1222 -93
790i3J580k155J788p99j520K380k025O48K011k387J426j021k399K054j658N05
$$ -93 1487 -668 1120 321 -1199 1181 -844 -196 1815 -572 854 -167 -2566 -512 -2170 -1665
806a665K321j769K083p1k258J980j194j41K448j868J498M08k395J985r44k09K432
$$ -1665 656 -1113 970 899 -1359 621 -573 -714 1734 -134 1364 1772 -623 1362 418 209 2641
823B641k008N37L76l119J185j300p72K607j912P60J322k185J714j93j228K728
$$ 2641 633 1170 1546 -1573 -388 -1688 -2460 147 -1765 -1005 317 -1868 -154 -347 -1575 1153
839A153j418k30J291k380J802M94p77L032p46k66J084l448K07k91j932K035l02
$$ 1153 -265 -495 796 -1584 218 712 -65 2967 2221 1955 3039 -409 -202 -493 -2425 -390 -692
856f92j32K064k130P82N21k208K016j033j106K332j861O96K004j266K604%j679
$$ -692 -824 1240 -890 -108 413 -1795 221 -812 -1918 414 -1447 -751 1253 -13 2591 2591 912
873I12J193k481p19P99j886K120O25j273K044k122p31J006k422J439J276j371
$$ 912 2105 -376 -1095 -296 -2182 -62 563 -710 1334 -788 -1519 -513 -2935 -1496 -220 -1591
889a591K913p48k10K248j801R46O24k073J360j143q86J999j560Q04O79k633P90
$$ -1591 1322 574 364 2612 811 1757 2381 308 1668 525 -361 1638 78 882 1561 -1072 -282
906b82j781k336J710j216Q52K780q09K337L40j650J753j492J0J980j880K074R47
$$ -282 -2063 -4399 -2689 -3905 -3053 -273 -1082 1255 1595 -55 1698 206 216 2196 316 2390 3337
923C337j415J909j378j220R22l236o19m13k317J760m44K16K651j284N41P57k275
$$ 3337 1922 3831 2453 1233 2155 -1081 -1700 -2113 -4430 -2670 -3114 -2898 -247 -1531 -990 -233 -2508
940b508J692M9l26L276l43J171J429j988R34j074k177J250j875l56J214k061J245
$$ -2508 -816 -767 -1093 2183 1840 3011 4440 2452 3386 2312 135 1385 -490 -846 368 -1693 -448
957d48L18j816J493j998q06J158j450J488J878k24L328K22j049R67k465n14j3
$$ -448 -130 -1946 -453 -2451 -3257 -2099 -3549 -2061 -183 -407 2921 3143 2094 3061 596 82 69
974F9j732J981M04j61K101j515q1j82l018M45q12j459K176l14J154L088r02J435
$$ 69 -1663 318 722 561 2662 1147 1066 884 -2134 -1689 -2501 -3960 -1784 -2098 -944 2144 1242 2677
992B677M8k286O65k175q65J775r90J970J680q12J208j395j930Q1k426K34R65j351
$$ 2677 2725 439 1104 -1071 -1936 -161 -1151 819 2499 1687 2895 1500 -430 -349 -2775 -2541 -1576 -2927
1010b927K883K59l63K137j681k68K65k185R80j43l27K473j16P88J474k189L32
$$ -2927 -44 215 -148 1989 308 40 305 -1880 -900 -1043 -1370 1103 987 1775 3249 1060 1392
1027A392o49k126J418p01J3K252q90J007j67k230P89j862j278J582j620J507J758
$$ 1392 743 -1383 35 -666 -653 1599 709 1716 1549 -681 108 -1754 -3032 -1450 -3070 -1563 195
1044A95j057K205j23j272Q95j870K73O54j077K408P38j79K366j541j077J15l533
$$ 195 -862 1343 1220 -52 843 -1027 -754 -100 -1177 1231 1969 1790 4156 2615 1538 1653 -1880
1061a880Q2m07q59J913j56Q57J804j713O29m67k377J670p16O5K474m8J786J667
$$ -1880 -1798 -2205 -3064 -1151 -1307 -450 1354 -359 270 -197 -2574 -904 -1620 -1555 919 871 2657 4324
1079D324j395Q54j631k018J77k294J80O61j050J776L39j127R30k054o00P98j621
$$ 4324 2929 3783 2152 134 311 -1983 -1803 -1142 -2192 -416 -77 -1204 -274 -2328 -2928 -2130 -3751
1096c751J703J168J81L212l5M59J354k057n4l65j686J276o73j98J523j644M39
$$ -3751 -2048 -880 -699 2513 2478 2937 4291 2234 2180 1815 129 1405 732 534 2057 413 852
1113H52n83k455O65j427j006J714n95J241J754l23J532j79j148J155j713K83J311
$$ 852 269 -2186 -1521 -2948 -3954 -2240 -2835 -1594 160 -163 1369 1190 42 1197 -516 -233 1078
1130A078j267J653N97j065J296j709j196J88k171O51J89m29K223RJ10K038j614
$$ 1078 -189 1464 2061 996 2292 583 -613 -425 -2596 -1945 -1756 -2185 38 47 157 2195 581
1147E81K59K73j828J290p1k79J714p14M70N43k102N70j657j730R69j235O22J369
$$ 581 840 1113 -715 575 504 225 1939 1225 1695 2238 136 706 -951 -2681 -1712 -2947 -2325 -956
1165i56q16J330M32j185J363j137j23J318j088J821Q50p12J800n28r02P46j861
$$ -956 -1772 -442 -10 -1195 168 -969 -1092 226 -862 959 1809 1097 2897 2369 1467 2213 352
1182C52R2O6j388J516l90l52J331j606K6K78k228J208m92m10J802n41M28J264
$$ 352 444 510 -878 638 248 -104 1227 -379 -353 -75 -2303 -1095 -1587 -1997 -195 -736 -308 956
1200I56j531Q77m79j435J396r31N48J607o97J171M17j178R92j186j032O31j479
$$ 956 -575 302 -177 -1612 -216 -1147 -599 1008 311 1482 1899 721 1713 527 -505 126 -1353
1217a353J010O50n80J690k79p23P93j971k10K15j396J349P0M26J876p76L09P45
$$ -1353 -343 307 -273 1417 1138 415 1208 -763 -973 -758 -2154 -805 -735 -309 1567 791 1100 1845
1235A845j835P19p12j387J295r25J68J133j011R14K30j572Q08r81m92R94q66J108
$$ 1845 10 729 17 -1370 -75 -1000 -832 301 -710 204 434 -1138 -330 -1311 -1803 -809 -1675 -567
1253e67J147n10J655k41j54J008j302J54O05j422R49o54j021J264j307k51M38
$$ -567 580 70 1725 1484 1330 2338 1036 1190 1795 373 1322 668 -353 911 -396 -647 -209
1270b09j174L21r0j068J264r30N39R07p70J158N06o35J664n53o5J111j151K36
$$ -209 -1383 -1062 -1152 -2220 -956 -1886 -1347 -440 -1210 -52 454 -181 1483 930 865 1976 825 1061
1288A061Qj498Q86o04o53J097j034K74L97j138J085k70n43J222p06K71J183r15
$$ 1061 1069 -429 457 -147 -800 297 -737 -463 -66 -1204 -119 -389 -932 290 -416 -145 1038 123
1306A23J254R7o20J273j413m6K54j649M98k66j144J058q57k8R19j188M40M63q07
$$ 123 1377 1474 854 2127 714 668 922 -727 -229 -495 -1639 -581 -1438 -1466 -547 -1735 -1295 -832 -1639
1325a639J466n02J94J354o63P48O61p27J215n19n00P61j265k0K69j170N20m15
$$ -1639 -173 -675 -481 873 210 958 1619 892 2107 1588 1088 1849 584 564 833 -337 183 -232
1343b32r17J089q74P2O30j066Q57O1p94J057o14J45J209j036P38N27j032Q95p59
$$ -232 -1149 -60 -934 -862 -232 -1298 -441 -380 -1174 -117 -731 -586 623 -413 325 852 -180 715 -44
1362d4m15Q79j125M01O99p04J199l21l45Q65j113P2N26j312R73Q3o99J591o96
$$ -44 -459 420 -705 -304 395 -309 890 569 224 1089 -24 48 574 -738 235 318 -381 1210 514
1381E14j7M88j524K25k86j035J051l52J1J480q79P65K65q75N19r25l74J000r98
$$ 514 497 985 -539 -314 -600 -1635 -584 -936 -925 555 -324 441 706 -169 350 -575 -949 51 -947
1400i47Q47O72n20J181l23o47N66j384L3J96q53R69L12r2J066m26N7M47j305J91
$$ -947 -100 572 52 1233 910 263 829 -555 -522 -326 -1179 -210 102 10 1076 650 707 1154 -151 40
1420D0j94r41J136n31J57R08p68M97j3j141N31m23k66J137m65O47M93n80P38m03
$$ 40 -154 -1095 41 -490 -333 575 -193 304 291 -850 -319 -742 -1008 129 -336 311 804 224 962 559
1440E59o68R95q43K44M35p96O43m32o72N47o92o5K95q81P32L15L3J138m45M4N13
$$ 559 -109 886 43 287 722 -74 569 137 -535 12 -680 -745 -450 -1331 -599 -284 -251 887 442 486 999
1461I99j043K14j8o60J151l01L13O71j113L01l93j273N45o58k69J002n61Q43O86
$$ 999 -44 170 152 -508 643 342 655 1326 213 514 121 -1152 -607 -1265 -1534 -532 -1093 -250 436
1480D36n18R27k84m80N52q23J75M64l96O72K53m23N33j035p83J75r90M26L04l16
$$ 436 -82 845 561 81 633 -190 -15 449 53 725 978 555 1088 53 -730 -555 -1545 -1119 -815 -1131
1500a131J206k70k05R49q06L11L75m73J024m6j56R53q14K89k70j265K00r30p72
$$ -1131 75 -195 -400 549 -257 54 429 -44 980 934 778 1731 917 1206 936 -329 -129 -1059 -1831
1519a831O91l29N91R22l55L68N9r98M07p84K56J225o2J413N46l82P73o51j188
$$ -1831 -1140 -1469 -878 44 -311 57 116 -882 -475 -1259 -1003 222 160 1573 2119 1737 2510 1859 671
1538F71m1j497j34k11p41R06L01K76J069p98R3o1j313N03k76J8J592M65R54J032
$$ 671 630 -867 -1001 -1212 -1953 -1047 -746 -470 599 -199 -106 -167 -1480 -977 -1253 -1235 357 822 1776 2808
1558B808q52J66p42j248J15r44l33M22p17P75K24m26R62p69k50J75r14L24L61
$$ 2808 1956 2122 1380 132 247 -697 -1030 -608 -1325 -550 -326 -752 210 -559 -809 -634 -1548 -1224 -863
1577h63O1J757K79O0Q19q55j91l21q56L99k37l22P18q35J22J34q86N83Pm10O94
$$ -863 -802 955 1234 1294 2113 1258 1067 746 -110 289 52 -270 448 -387 -265 -131 -1017 -434 -427 -837 -143
1598a43m57J4Q46m11Q80m7l91O13n77l88M81o91M60K41o99N37p95o03L22m00M62
$$ -143 -600 -586 260 -151 729 682 291 904 327 -61 420 -271 189 430 -269 268 -527 -1130 -808 -1208 -746
1619g46O41j16J011l39l70M58m98j44O06k80N04L4k87L94n00M1L59r40O2m68q37
$$ -746 -105 -221 790 451 81 539 41 -103 503 223 727 761 474 868 368 409 768 -172 -110 -578 -1415
1640a415P57j04M62P60k86M01k79r43K66p02o4J017k89O90L51m20N25j73l99K70
$$ -1415 -658 -762 -300 460 174 575 296 -647 -381 -1083 -1147 -130 -419 271 622 202 727 554 155 425
1660D25p60J43K03m97P87J68J30J128n91k03k82j409J13k18l96Q84N9K81L85q01
$$ 425 -335 -192 11 -486 301 469 599 1727 1136 933 651 -758 -645 -863 -1259 -375 -316 -35 350 -451
1680d51R2k25m36N73p2J6P77l40K99M04L7N45k35j51o0q14j31J95n93N45J71m61
$$ -451 -359 -584 -1020 -447 -519 -503 274 -66 233 637 674 1219 984 833 773 -41 -172 23 -570 -25 146 -315
1702c15M61q56k15M55n74Q97L78Q1P25o33j75M21o86N92J26l26L51n96k53J59
$$ -315 146 -710 -925 -470 -1044 -147 231 312 1037 404 229 650 -36 556 682 356 707 111 -142 17
1722A7o16K53K2r00K50l90k80P03J0Q04Q55j05O12l27n80K64l39L98M04m87N40
$$ 17 -599 -346 -324 -1224 -974 -1364 -1644 -941 -931 -127 728 623 1235 908 328 592 253 651 1055 568 1108
1743A108k39n74O8n84j72K32p79j51k2o22P22O8M15P54KM92L5o11K88j9j45P16
$$ 1108 869 295 363 -221 -393 -161 -940 -1091 -1113 -1735 -1013 -945 -530 224 226 718 753 142 430 411 266 982
1765I82l69O5qo97O3j14l92O02n56j78o4p48K25K03M1Q72J17L90N09o92L99P0
$$ 982 613 678 670 -27 36 -78 -470 132 -424 -602 -666 -1414 -1189 -986 -945 -73 44 434 943 251 650 720
1787G20k4O16n45j49Q2p47K8k4k67O26l10m13J69q60j86L63l58O65K32j02N76
$$ 720 696 1312 767 618 700 -47 -19 -43 -310 316 6 -407 -238 -1098 -1284 -921 -1279 -614 -382 -484 92
1808I2l12L86O12n09Q92k07j99J86n93m56L29l71N69K56n14L76n46l06P3m53K40
$$ 92 -220 166 778 269 1161 954 755 941 348 -108 221 -150 419 675 161 537 -9 -315 -242 -695 -455
1829d55J89n46L75l56K02P66j60M70N33n56K93o57o29K50k02K31M57r3M73q9n17
$$ -455 -266 -812 -437 -793 -591 175 15 485 1018 462 755 98 -531 -281 -483 -252 205 112 585 496 -21
1850b1M88n76k6K47r32L73j21l59P43K88L07O97m20k2p7r28P4k70K19M85j25L10
$$ -21 467 -109 -135 112 -820 -447 -568 -927 -184 104 411 1108 688 666 589 -339 -265 -535 -316 169 44 354
1872C54K28n92N64k19o69L72n64k56J73o49N00M21R5P87j01l3J98o34J3n9n3N84
$$ 354 582 -10 554 335 -334 38 -526 -782 -609 -1258 -758 -337 -242 545 444 411 609 -25 -12 -71 -124 460
1894D60k10L22L63o37L68R1m33L20m49p00O3r34J02M92k75R28L8M29J41m21l9
$$ 460 250 572 935 298 666 757 324 644 195 -505 -442 -1376 -1274 -782 -1057 -129 -91 338 479 58 19
1915A9J40m27O28j45o6L29j40K70L18j93J74l46p57j14q40j73M56j81Q30L75L4
$$ 19 159 -268 360 215 149 478 338 608 926 733 907 561 -196 -310 -1150 -1323 -867 -1048 -218 157 191
1936A91K68m48j13J8l04M20Q2j23N62m5J47M95m89K0j00r29J3p25m11O74L2O00
$$ 191 459 11 -102 -84 -388 32 114 -9 553 508 655 1150 661 681 581 -348 -335 -1060 -1471 -797 -765 -165
1958a65P66m87L59k91n50Q4k56K28O32j87N68K27m23M03n13k32J3o19k35m2k41
$$ -165 601 114 473 182 -368 -284 -540 -312 320 133 701 928 505 908 395 163 176 -443 -678 -720 -961
1979i61N61K27O4N48j09k16j13n92N20j28J27P46j56J59K8l81M6j61n29K10k04
$$ -961 -400 -173 -109 439 330 114 1 -591 -71 -199 -72 674 518 677 705 324 370 209 -320 -110 -314
2000c14l3n4l81L93J77j90N45j5r6J30l95L24J06j02M14k09m8L42n34o9K54l45
$$ -314 -347 -401 -782 -389 -212 -402 143 128 32 162 -233 91 197 95 509 300 252 594 60 -9 245 -100
2022a00M78l50l17K30n86j22M22l11M10K08r6O34k71r6M62m89J52R2l87L00n49
$$ -100 378 28 -289 -59 -645 -767 -345 -656 -246 -38 -134 500 229 133 595 106 258 350 -37 263 -286
2043b86R8M37j03K13J36p08L23o83k10M33j68L83M84k08K65K4k45J94l49l0K27
$$ -286 -188 249 146 359 495 -213 110 -573 -783 -350 -518 -135 349 141 406 430 185 379 30 0 227
2064B27n46M56r0j46M36m03jR5l50Q2r2k95O39j84L83L64m60J17K1m57M39k78
$$ 227 -319 137 47 -99 337 -66 -67 28 -322 -240 -332 -627 12 -172 211 575 115 232 253 -204 235 -43
2086d3P7L16q6K13j92m14N2j99j60N2j01Q8K84j04L30PJ2L72n15j70O8k74N25
$$ -43 34 350 264 477 285 -129 -77 -276 -436 -384 -485 -397 -113 -217 113 120 132 504 -11 -181 -113 -387 138
2109A38M1Q0N33l02j30L3o56J48j56m41P44k46O2L42k59L2K99k72K39l18k30K19
$$ 138 179 259 792 490 360 393 -263 -115 -271 -712 32 -214 -152 190 -69 -37 262 -10 229 -89 -319 -100
2131a00l17L83L97j53J46p9k56K44o16K49K66m49M13P3k50J89l61L2K90k89J61
$$ -100 -417 -34 363 210 356 277 21 265 -351 -102 164 -285 128 201 -49 140 -221 -189 101 -188 -27
2152b7J33k00L45l09K27J42m48J58j32l74L42o2K1N33k33L05j76k43K52m17j95
$$ -27 106 -94 251 -58 169 311 -137 21 -111 -485 -143 -205 -184 349 116 421 245 2 254 -163 -358
2173c58K33o2o4L58L4K59j05j82K59n36n1j6k45L98o3L8N06m4k34L17m95M5j32
$$ -358 -125 -187 -251 107 141 400 295 113 372 -164 -215 -231 -476 -78 -141 -103 403 359 125 442 -53 -8 -140
2196a40m83L52o0k1L63j96K71o2l25N16l22p9L51m84J62L28k09M61l8l45N35k16
$$ -140 -623 -271 -331 -352 11 -185 86 24 -301 215 -107 -186 165 -319 -157 171 -38 423 385 40 575 359
2218C59j28J24o07Q8l9l46M33k22q4K76j44M07o6k03K93l68j09M30l89J67M33
$$ 359 231 355 -252 -164 -203 -549 -116 -338 -422 -146 -290 117 51 -152 141 -227 -336 94 -295 -128 305
2239C05k99O08p8k64M36m79k33km47J60j19K8L65j38K45K13l64J78k72k75L04
$$ 305 6 614 536 272 708 229 -4 -6 -453 -293 -412 -384 -19 -157 88 301 -63 115 -157 -432 -128
2260a28n9k6K63m6K53K46k91K11j91j79J25m64J3J82j99L01p1O3L01m79O1M0k63
$$ -128 -187 -213 50 4 257 503 212 423 232 53 178 -286 -273 -91 -290 11 -60 3 304 -175 -114 -74 -337
2283c37M54p1j11L54l06J37J97l46L24r5k83K99j03k82J71k42L35R3m75L40k66
$$ -337 117 46 -65 289 -17 120 317 -29 295 200 -83 216 113 -169 2 -240 95 188 -287 53 -213
2304b13O8k2j77J43J83p4L56j54m5K41k24J68nl00J43K10l88L66r0j99L39n82
$$ -213 -145 -167 -344 -201 -18 -92 264 110 65 306 82 250 245 -55 88 298 -90 276 186 -13 326 -256
2326b56K86j82j20J75k48K54K24k40L11q2J1K13j83o1L02m22J20Rk82L28J98k56
$$ -256 30 -152 -272 -97 -345 -91 133 -107 204 122 133 346 163 102 404 -18 102 111 -171 157 355 99
2348I9L45m87L6m8l87O0J00j13L44q6n2N14k74M20l31k27L12l41J25K22l85M43
$$ 99 444 -43 -7 -55 -442 -382 -282 -395 -51 -137 -189 325 51 471 140 -87 225 -116 9 231 -154 289
2370B89j81J17K64k86j57K75n88J7K3M5J37L4q5L36l20k6P9p0R8Q7k53M03k06
$$ 289 108 225 489 203 46 321 -267 -250 -227 -182 -45 -11 -96 240 -80 -106 -27 -97 1 88 -165 238 32
2393C2k31K78j58K90k38J4j6Q9r6J08o6L6O3j47K23m19QK68k28J25K43j83J89
$$ 32 -199 79 -79 211 -27 -13 -29 60 -36 72 6 42 105 -42 181 -238 -230 38 -190 -65 178 -5 184
2416A84m1l40K12l54R6L69j43J56J3j84J61j62P6J18k52M1k46pL62p7J05K49j65
$$ 184 143 -197 15 -339 -243 126 -17 139 152 -32 129 -33 43 161 -91 -50 -296 -303 59 -18 87 336 171
2439A71k7j31k10K16j57P6L07k06K60j37j73J42l34o2L02l64j7L47l40L04j18
$$ 171 144 13 -197 19 -138 -62 245 39 299 162 -11 131 -203 -265 37 -327 -344 3 -337 -33 -151
2460a51J44K80j76q6J70l62J71L8l6L57j51o9J52n19K79j45j54M36j50p1J08l50
$$ -151 -7 273 97 11 181 -181 -10 28 -8 349 198 129 281 -238 41 -104 -258 178 28 -43 65 -285
2482b85J67Q1j34L16j35rJ41k65L11k34l2L53l5j04q8j64j16M10m25L91l6l22
$$ -285 -118 -37 -171 145 10 1 142 -123 188 -46 -78 275 240 136 48 -116 -232 178 -247 144 108 -214
2504b14K10m11R3K94j86L80r5K31lk51K10J37m01J02J01k38K19n49K34K07k25
$$ -214 -4 -415 -322 -28 -214 166 71 302 299 48 258 395 -6 96 197 -41 178 -371 -137 70 -155
2525a55J10L2k42N9j65p9K63n3M51L11m50K91n3m07K05l60L14j6p4O9J61k48J74
$$ -155 -45 -13 -255 -196 -361 -440 -177 -230 221 532 82 373 320 -87 118 -242 72 56 -18 51 212 -36 138
2548A38k73o5J97m63K20j54j32M64Q1N1M21k86L3j14l02K11n9LL34l07J72J45
$$ 138 -135 -200 -3 -466 -246 -400 -532 -68 13 64 485 199 232 118 -184 27 -32 -29 305 -2 170 315
2570C15l75J49j45n1O4l18R4ojQ9J89o4N84n33J24L6k96J10j0J54L18k38R5q5
$$ 315 -60 89 -56 -107 -43 -361 -267 -273 -274 -185 4 -60 524 -9 115 151 -145 -35 -45 109 427 189 284 199
2594A99n40L34j72j09L60j35k25K71j08L05j69j02J84k1j22K13k45qL74j23O3
$$ 199 -341 -7 -179 -288 72 -63 -288 -17 -125 180 11 -91 93 72 -50 163 -82 -90 284 161 224
2615B24m8j78J41n63K97L1j35M37k22j68L75j03k74O4p7K22p7j26K66K6j76K58
$$ 224 176 -2 139 -424 -127 -96 -231 206 -16 -184 191 88 -186 -122 -199 23 -54 -180 86 112 -64 194
2637A94j62P0rj73L32l41k69M36k18L85k13k07J79j79K6J16j38K02J8j3k5j02
$$ 194 32 102 93 -80 252 -89 -358 78 -140 245 32 -175 4 -175 -149 -33 -171 31 49 36 11 -91
2659i1K8Q0K7Q1K24j43O3m6k18J84k61J58J16l80N6J1k26K49M1L2qk17q%o6K62
$$ -91 -63 17 44 125 349 206 269 223 5 189 -72 86 202 -178 -122 -111 -337 -88 -47 -15 -23 -240 -248 -248 -314 -52
2685e2L8J05J16l5J77J98m18J97k79J06J9j77OK38m04n1J87k38K33k35j29J12
$$ -52 -14 91 207 172 349 547 129 326 47 153 172 -5 1 239 -165 -216 -29 -267 -34 -269 -398 -286
2707b86j28K67J76k32N60j05l2J46k26j84J27m5K86j71k92K41k92k3J75k24K75
$$ -286 -414 -147 29 -203 357 252 220 366 140 -44 83 38 324 153 -139 102 -190 -213 -38 -262 13
2728A3l6n01K70k4K41J61k09R7K41l44K82pj16M22k96J33Rk86J3j47m47M44l44
$$ 13 -23 -524 -254 -278 -37 124 -85 12 253 -91 191 184 68 490 194 327 336 50 63 -84 -531 -87 -431
2751d31K56K22k74O7K9K3J53l5K7J26k76L12j16j28M12K9J47j85k45O9j00m11
$$ -431 -175 47 -227 -160 -131 -108 45 10 37 163 -113 199 83 -45 367 396 543 358 113 182 82 -329
2773c29J92k12n6L40k28K52p9NJ17j62M1Q2k5pR5J5J35L3R5Q2l30J83p7l17NM8
$$ -329 -137 -349 -405 -65 -293 -41 -120 -115 2 -160 -119 -37 -62 -69 26 41 176 209 304 386 56 239 162 -155 -150 -102
2799a02k01K67o2j55L49k30J04M4k11L14r9j65M1o9J48K70k15K50L0k50K02j71
$$ -102 -303 -36 -98 -253 96 -134 -30 14 -197 117 18 -147 -106 -175 -27 243 28 278 308 58 260 89
2821H9j06j45o6L82j07j24K08k13K00m8p4j61J1q0R0n9K28J60r9P0Q9j33l2R3
$$ 89 -17 -162 -228 154 47 -77 131 -82 118 70 -4 -165 -154 -234 -144 -203 25 185 86 156 245 112 80 173
2845A73p0L6k02KK81l38K90L5m22J72n1R4m7j92LJ04O3J53J6o7O3j1R9k1k67K09
$$ 173 103 139 -63 -61 220 -118 172 207 -215 -43 -94 0 -47 -239 -236 -132 -69 84 100 33 96 85 184 163 -104 105
2871A05n1j22Rl6K67p1k56K71j45%R7k74j03R5k9J91j21K40k3J24o5o6q7J72l6
$$ 105 54 -68 -59 -95 172 101 -155 116 -29 -29 68 -206 -309 -214 -243 -52 -173 67 44 168 103 37 -50 122 86
2896H6j35P9j55J89Q5l57J71P2j12O1k98P5J06j18J39M7k2K50j78L12o9r6j34
$$ 86 -49 30 -125 64 149 -208 -37 35 -77 -16 -314 -239 -133 -251 -112 -65 -87 163 -15 297 228 132 -2
2919bK26k53J21p6P1L5j8L0J93k99Q5j36k19J00j35P5K41k24L63K5k30K14l05
$$ -2 224 -29 92 16 87 122 104 134 327 28 113 -23 -242 -142 -277 -202 39 -185 178 203 -27 187 -118
2942a18J29j9m1J05k7J26N3L0k12J92l12j1j11J67N4J1J62J9l19J42M9j84R7N1
$$ -118 11 -8 -49 56 29 155 208 238 26 218 -94 -105 -216 -49 5 16 178 197 -122 20 69 -115 -18 33
2966C3j31K72k12R3J71k09O5q5Q9Mj57M4M8k90K72nj73L92l45M2J24k79J42J6
$$ 33 -98 174 -38 55 226 17 82 -3 86 90 -67 -23 25 -265 7 2 -171 221 -124 -82 42 -237 -95 -79
2990g9N9K56j04p4J05J1j97J20k43N63m21LL47k43J21k52j82qJ64k18L61k38p2
$$ -79 -20 236 132 58 163 174 -23 97 -146 417 -4 -1 346 103 224 -28 -210 -218 -54 -272 89 -149 -221
3013b21L04j07J43m2j83K12n2j79K33j79J20l4O6L43m03q2K37m30J88j0M2M6k59
$$ -221 83 -24 119 77 -106 106 54 -125 108 -71 49 15 81 424 21 -61 176 -254 -66 -76 -34 12 -247
3036b47K39J53k02k04L13j60L4j08k5L36j08qJ83j68K54k86m1j5RJ9nM7Q8M0l19
$$ -247 -8 145 -57 -261 52 -108 -74 -182 -207 129 21 13 196 28 282 -4 -45 -60 -51 -32 -37 10 98 138 -181
3061a81K80l52K2O2k28L07J52j11J77Kmj15j09J86n4j94J38J48k40K04k4J20j37
$$ -181 99 -253 -231 -169 -397 -90 62 -49 128 130 126 11 -98 88 34 -160 -22 126 -114 90 66 186 49
3084D9q8k7J2j37J79LO6j4l8J25n0j57K6P4j02n7J9K15o1k1J40j74k77K53j9j39
$$ 49 -39 -66 -54 -191 -12 -9 57 43 5 130 80 -77 -51 23 -79 -136 -117 98 37 16 156 -18 -295 -42 -61 -200
3110b00L13l20L22j68K7K45l58J5K33j81J27j43O6L43k22j68J3o4K14q0l01K16
$$ -200 113 -207 115 -53 -26 219 -139 -124 109 -72 55 -88 -22 321 99 -69 -56 -120 94 14 -287 -71
3132g1J4r4K31L3j75L4j09K9J62k01J68P7l6J5j01J98j51lJ12l35J03Q2O3QJ57
$$ -71 -57 -151 80 113 -62 -28 -137 -108 54 -147 21 98 62 77 -24 174 23 20 132 -203 -100 -18 45 53 210
3157B10k41K20k73j07J93q0P8j18l0K68j03OK39k74k8L0k79J53K28k34K88k55
$$ 210 -31 189 -84 -191 2 -78 0 -118 -148 120 17 23 262 -12 -40 -10 -289 -136 92 -142 146 -109
3179a09J08o2q4J65j30O1J05j68J16j55k1R2K07j47J67n6p2n2o6J50J20j83K05
$$ -109 -1 -63 -147 18 -112 -51 54 -114 2 -153 -174 -82 125 -22 145 89 17 -35 -101 49 169 -14 191
3202A91j64O1J6k51L65j80p5N4mr4J05j53J49J61k19O7Q5k07K52j04k5Q3j28N0
$$ 191 27 88 104 -147 218 38 -37 17 13 -81 24 -129 20 181 -38 29 114 -93 159 55 30 113 -15 35
3226C5l2o8K3j32N3J79j95J60L3k12J04o7L9K38k11N9l8J29K10p3n4R4l57J06
$$ 35 3 -65 -42 -174 -121 58 -137 23 56 -156 -52 -119 -80 158 -53 6 -32 97 307 234 180 274 -83 23
3250B3r4J34q9o0J28p9Qm1k0j16J19k9j35K61%j07K40j95J40Q7k46K13o7q8N3
$$ 23 -71 63 -26 -86 42 -37 -29 -70 -90 -206 -87 -116 -251 10 10 -97 143 -52 88 175 -71 142 75 -13 40
3275D0k73J91L9j31J44J07k28P0Mq4P8q4K19j3j79J84p9J1K0j4P7j63J39P4l39
$$ 40 -233 -42 -3 -134 10 117 -111 -41 -37 -121 -43 -127 92 79 -100 84 5 16 36 22 99 -64 75 149 -190
3300a90J55Jp1J01j21J1J26j94K1K45k86J40K41k78J95r8k2l4J15J07j44q7J93
$$ -190 -35 -34 -105 -4 -125 -114 12 -182 -161 84 -202 -62 179 -99 96 -2 -24 -58 57 164 20 -67 126
3323A26j13j33K27j29P1n3l4Q7O7l19L05l16K17P6j24J99p0k5J64n8j12j6n9l
$$ 126 13 -120 107 -22 49 -4 -38 49 116 -203 102 -214 3 79 -45 154 84 59 223 165 53 37 -22 -25
3347b5K67l41J53o9n9N0r9R4J27k25R5J34o9N0k07J57L0l6l8K58l03O5j08k9J52
$$ -25 242 -99 54 -15 -74 -24 -123 -29 98 -127 -32 102 33 83 -124 33 63 27 -11 247 -56 9 -99 -128 24
3372B4j25K46j41j40K54j29q6L12l34K22j94K4K00j09RK3q9M8J0j7lj43MJ80j66
$$ 24 -101 145 4 -136 118 -11 -97 215 -119 103 -91 -67 133 24 33 56 -33 15 25 8 5 -138 -134 46 -120
3397a20J89J7j76J92j92Q2L00l96R2Q2n0N7O9k54L03k60j31L02o0K8M0l04J07
$$ -120 69 86 -90 102 -90 -8 292 -104 -12 70 20 77 146 -108 195 -65 -196 106 46 74 114 -190 -83
3420h3j50J98m7l5N8J93q0R9j13l5P0j91N9J56m9M4Q9l35J79l6j12J00k54K09
$$ -83 -233 -35 -82 -117 -59 134 54 153 40 5 75 -116 -57 99 50 94 183 -152 27 -9 -121 -21 -275 -66
3444f6J58m10N31k52J08J00k15O3L5q1L6j31J5oQ7P8J2j82J27p8k9J3j26J39J86
$$ -66 92 -318 213 -39 69 169 -46 17 52 -29 7 -124 -109 -115 -28 50 62 -120 7 -71 -100 -87 -213 -74 112
3469A12N3K6l45O6Q7J10j72O5M4p3j0j06L80k37q1P0p1o0J50l10L06l9o7J40r1
$$ 112 165 191 -154 -88 -1 109 -63 2 46 -27 -37 -143 237 0 -81 -11 -82 -142 8 -302 4 -35 -102 38 -53
3494e3j3J50j14K98k60k5P3m5P0j71L2R6p0p3L26k98N9J18m69M05j03r2K45j08
$$ -53 -66 84 -30 268 8 -17 56 11 81 -90 -58 38 -32 -105 221 -77 -18 100 -369 36 -67 -159 86 -22
3518b2Q4j82J75o8J52l01J96q4q1K76k71kL47m11J78J17j38m7n3J40L16k05o7
$$ -22 62 -120 55 -13 139 -162 34 -50 -131 145 -126 -128 219 -192 -14 103 -35 -82 -135 5 321 116 49
3541D9jJ05o6k73J93r3N6J05q1Q4j32P9j09P6m0K07j9k77O2K29k9Q6k56J69k69
$$ 49 48 153 87 -186 7 -86 -30 75 -6 78 -54 25 -84 -8 -48 159 140 -137 -75 154 125 211 -45 124 -145
3566a45rP4j42K22K3q7N9m7j40M6J71j73J63J41p3L0j22K3R2k52J11J80j47R9
$$ -145 -154 -80 -222 0 23 -64 -5 -52 -192 -146 25 -148 15 156 83 113 -9 14 106 -146 -35 145 -2 97
3590I7j20JLj12J37k8j54J73n3J21rl42M38n3n2J55p1j10O7k04L0J96j60J60q1
$$ 97 -23 -22 -19 -131 6 -22 -176 -3 -56 65 56 -286 152 99 47 202 131 21 88 -116 -86 110 -50 110 29
3615B9j17J4j53K64k27K2J68j37J15J14j10M8L8l2K4q7k1K35l49R4K91p5r7k38
$$ 29 -88 -74 -227 37 -190 -168 0 -137 -22 92 -18 30 68 36 60 -27 -48 187 -162 -68 223 148 51 -187
3639a87K71J5k44P3q1q0J25j9P6J9KN8N0K4p7J45l46K62r4K0J38j62m6K23l02
$$ -187 84 99 -145 -72 -153 -233 -108 -127 -51 -32 -30 28 78 102 25 170 -176 86 -8 12 150 -12 -58 165 -137
3664a37NJ13j31K41k75N4J79MO9j80O9J53j85P4P1q1o5j4m9J06m3l2n6P8jq6N5
$$ -137 -132 -19 -150 91 -184 -130 49 53 122 -58 11 164 -21 53 124 43 -22 -36 -85 21 -22 -54 -110 -32 -33 -119 -64
3691f4J93j02j05K84j85j21J35j00J44P5k8kl2j07K9j27J44p0n3j05K3J16M6r2
$$ -64 129 27 -78 206 21 -100 35 -65 79 154 126 124 92 -15 14 -113 31 -39 -92 -197 -174 -58 -12 -104
3715a04J66jp9J58l20K51k0j7Q3N6L8o6j9j15P9j48p7l1J20J0q1J7K37j18j4j4
$$ -104 62 61 -18 140 -180 71 51 34 117 173 211 145 126 11 90 -58 -135 -166 -46 -36 -117 -100 137 19 5 -9
3741in8P4j03K9R3j16K19o7j79K23J41l22J06k6j81J01j18J60q5Q3K7q8Q9M7L
$$ -9 -67 7 -96 -67 26 -90 129 62 -117 106 247 -75 31 5 -176 -75 -193 -33 -118 -35 -8 -96 -7 40 43
3766D3Rl0p1m1K17j14J64j05j19M3n8p1j34K83r9l8k8J23n1J10l4J2L2j40J11
$$ 43 52 22 -49 -90 127 13 177 72 -47 -4 -62 -133 -267 16 -83 -121 -149 -26 -77 33 -1 11 43 -97 14
3791A4K49k86P0n2L4J50j00Ln1j77k5L1j03J90j58L5J92oj06J51r3J78N8j45J02
$$ 14 263 -23 47 -5 29 179 79 82 31 -146 -171 -140 -243 -53 -211 -176 16 10 -96 55 -38 140 198 53 155
3816A55k15o3K01k28K79k65J92J09k19q8J17j91J55J85o2M3n7m7J10k07K17O4
$$ 155 -60 -123 78 -150 129 -136 56 165 -54 -142 -25 -216 -61 124 62 105 48 1 111 -96 121 185
3838A85k35L7j14K0J66q9K24j49j06J5n1J14m2m8R5j10n1O1J70k06K09k1j21J47
$$ 185 -50 -13 -127 -107 59 -30 194 45 -61 -46 -97 17 -25 -73 22 -88 -139 -78 92 -114 95 74 -47 100
3862A00j87P3L0M8m3jj07J17j3n2R5j89R1N7j9L9q9J81j97j19K34J26j20J30j76
$$ 100 -87 -14 16 64 21 20 -87 30 17 -35 60 -129 -38 19 0 39 -50 131 -66 -185 49 175 55 185 9
3887IJ65j31j6O6j14K7M4m7j72K97k38P4R8M4l9n3J13K0k05k0Lk3J53q9L1J4r4
$$ 9 174 43 27 93 -21 6 50 3 -169 128 -110 -36 62 106 67 14 127 147 -58 -78 -75 -98 55 -34 -3 11 -83
3914h3K7J06j03P2o6M2J44k45J76J21j60NK3lP7p2j20J17o6lN5p9KJ9Jk3J33j9
$$ -83 -56 50 -53 19 -47 -5 139 -106 70 191 31 36 59 56 133 61 -59 58 -8 -11 44 -35 -33 -14 -13 -36 97 78
3942G8p4J4O7j60K24L0j99J40M4J33j20j07j58J14o5O4k56j6K66n2m9K62o8o1
$$ 78 4 18 85 -75 149 179 -20 120 164 297 177 70 -88 26 -39 25 -231 -247 19 -33 -82 180 112 51
3966E1m4Q8j00j07J3J24K22j97J83k61NJ37o1l9k45J04R4M6J14j97J4P8oJ02N7
$$ 51 7 95 -5 -112 -99 25 247 50 233 -28 -23 114 53 14 -231 -127 -33 13 127 -70 -56 22 16 118 175
3991A75j49M9j31rJ51j95J33j9M1J10j40k15K52j7j99J62J5k40J99o9J63k10J33
$$ 175 26 75 -56 -65 86 -109 24 5 46 156 16 -199 53 36 -163 -1 14 -226 -27 -96 67 -143 -10
4014a0J08p3K6L6p6P9K3k39K52k70nK54k71J55J42j25R2m7K8l23L5J4K45j59J73
$$ -10 98 25 51 87 11 90 113 -126 126 -144 -149 105 -166 -11 131 6 98 51 79 -244 -209 -195 50 -109 64
4039F4p1J22j23J62r5J1j11k0J44j91K12p8p1J69j23J0N3o7J1KQ8l8j46J05q3
$$ 64 -7 115 -8 154 59 70 -41 -61 83 -108 104 26 -45 124 1 11 64 -3 8 10 98 60 -86 19 -64
4064f4JJ24p2ML9K7J62l8k93J07M4K0p3j80M4J19oJ48M7k0p0j59N7K7R0r8J69
$$ -64 -63 61 -11 -7 32 59 221 183 -110 -3 41 61 -12 -192 -148 -29 -35 113 160 140 70 -89 -32 -5 85 -13 156
4091A56k17K23k40j08K96k61R5J9Q9k6ql04L65N5n5m1k17K01P6k47K72j57l2L04
$$ 156 -61 162 -78 -186 110 -151 -56 -37 52 26 18 -286 79 134 79 38 -179 22 98 -149 123 -34 -66 238
4115B38j53r6j89K02M5k26J98J98l09K38R3j71J57j69l0Pj84j2N2J12L1J29j10
$$ 238 85 -11 -200 2 47 -179 19 217 -92 146 239 68 225 56 26 33 -151 -163 -111 1 32 161 51
4138E1n3j07o8K44l07J85LN6Q1p3P6P8l77K44k2p3lj5MJ36o7K12j02j53J7J23
$$ 51 -2 -109 -177 67 -240 -55 -52 4 85 12 88 166 -211 33 11 -62 -65 -80 -76 60 -7 205 103 -50 -33 90
4164I0j18pj08P1l8l3K04J7J51j01r7k8R0r0J21p8l5J08j38O6K48j41L6j54n8
$$ 90 -28 -35 -143 -72 -110 -143 61 78 229 128 31 3 93 3 124 46 11 119 -19 47 295 154 190 36 -22
4189b2P2j60O3K8R3l9J42j61J37j21J7l1r8J28l0j00Q9J16k80L79l03J37Pk61
$$ -22 50 -110 -47 -19 74 35 177 16 153 32 49 18 -80 48 18 -82 7 123 -157 222 -81 56 63 -198
4213a98L44j57K1l8J57qj20p9J30J1j46J74mq2J95k60P1J61k10L3j20L0L7K58
$$ -198 146 -11 10 -28 129 121 1 -78 52 63 -83 91 87 5 200 -60 11 172 -38 -5 -125 -95 -58 200
4237B00k64Q6n1J0J03k5K89l57J60nk15K02k52J90p3q9Q7P7l7o5Q6j08Kn9n1J64
$$ 200 -64 22 -29 -19 84 59 348 -9 151 146 -69 133 -119 71 -2 -91 -4 73 36 -29 57 -51 -49 -108 -159 5
4263El3J01j18J55o6K8j14J12j40q9L8k8L03j69P1Lj63K56J7r9Q9j26k08J67l2
$$ 5 -28 73 -45 110 44 72 -42 70 -70 -159 -121 -149 154 -15 56 59 -104 152 169 70 159 33 -175 -8 -40
4288d0j0Lm4J32l5j47K78j60r7J51Mm1l6j03K00N2nk5j02J65q2J6m5J09k38K46
$$ -40 -50 -47 -91 41 6 -141 137 -23 -120 31 35 -6 -42 -145 55 107 102 77 -25 140 58 74 29 138 -100 146
4314A46j73J18j74o4MK33j10l8J54j62L20l76R8M8J7J12k73J60L8l0p0p1J2J47
$$ 146 -27 91 -83 -147 -143 90 -20 -58 96 -66 254 -122 -24 24 41 153 -120 40 78 48 -22 -93 -81 66
4338F6k2m8K13m13K00J0j17L70m3m94M17j83O3N0k03K09j4k56L85j38j33J47j18
$$ 66 44 -4 209 -204 -4 6 -111 259 216 -278 139 -44 19 69 -134 75 61 -195 190 52 -81 66 -52
4361e2Q3J70j69L9r3q8R0q3l1J31N3J14J09j72L9k44n0J07%J43j41N8L6j62K65
$$ -52 31 201 32 71 -22 -110 -20 -103 -134 -3 50 164 273 101 140 -104 -154 -47 -47 96 -45 13 49 -113 152
4386A52j57L6p9Np6P0p2J17J19j54K2J37k75K32m4J2K6j34K20j31q5Q4k05J50
$$ 152 -5 31 -48 -43 -119 -49 -121 -4 115 -39 -17 120 -155 77 33 45 71 -63 157 26 -59 25 -180 -30
4410c0J76j62k22L56j30P0j39n5J64n9j18K54j02J4R2k95K98k96L41k6j79M8k5
$$ -30 146 -16 -238 118 -12 58 -81 -136 28 -31 -149 105 3 17 109 -186 112 -184 157 131 -48 0 -25
4433b5Nj1O4j93K43q3O3n9pmK5j5J09k96NQ8j7o4J51l5K31j57n7l2QK52j25o0
$$ -25 -20 -31 33 -160 83 0 63 4 -3 -7 18 3 112 -184 -179 -91 -108 -172 -21 -56 175 18 -39 -71 -63 189 64 4
4461Dm8j2k1J74j53N8J92k36j07l2L13q7Oj58Q3L6O2J6pR0j68l9R9k14K97k12
$$ 4 -44 -56 -77 97 -56 2 194 -42 -149 -181 132 45 51 -107 -24 12 74 90 83 173 5 -34 65 -149 148 -64
4487f4j24K01l8M3j0j05P7j80Q9m8J7J84lR1j41O4j51L08k37O9N3q7J39k08j29
$$ -64 -188 13 -25 18 8 -97 -20 -200 -111 -159 -142 42 39 130 -11 53 -98 210 -27 42 95 8 147 -61 -190
4512a90K07j4j41K1j0J25j5%R6l98K25J56o0J30j15L1J45j13Lj5o8JN2j54O7M0
$$ -190 17 3 -138 -117 -127 -2 -17 -17 79 -319 -94 62 2 132 17 48 193 80 83 68 0 1 53 -101 -34 6
4538FJP1j25R4j49J9m8K53r5Q6r7MJ43j73J07j87J03kO3r6O7q3j45L79l90J31
$$ 6 7 78 -47 47 -102 -83 -131 122 27 113 16 20 163 -10 97 -90 13 11 74 -22 45 -38 -183 196 -194 -63
4564f3L6j13J23j30L11n6k96K37jl2J05p5j26J93k27K42j44o5J9J7j0J69j73N3
$$ -63 -27 -140 -17 -147 164 108 -188 49 48 16 121 46 -80 113 -114 128 -16 -81 -62 -45 -55 114 -59 -6
4588fr6m0O3R7m4M9p2q9J97k8n4l5k6J88q9k9J44l35K45j18K9p7j59J68J21r3
$$ -6 -102 -142 -79 18 -26 23 -49 -138 59 31 -23 -58 -84 104 15 -14 130 -205 40 -78 -49 -126 -285 -117 4 -89
4614h9R6j12m5K6J64k04K84j36K67j79p0R8j13J3l2J47J7Mm37L57q2q9J49J55
$$ -89 7 -105 -150 -124 40 -164 120 -16 251 72 2 100 -13 0 -32 115 132 136 -301 56 -26 -115 34 189
4638A89k37J17K5j6K6j49J77p2l3O5j92K12j72R1mj91J79J01k12j8kJ05l6J88
$$ 189 -48 69 94 78 104 -45 132 60 27 92 -100 112 -60 31 27 -164 15 116 -96 -114 -116 -11 -47 141
4662A41r0j3l7N4J9r4r0k9R8O9Pr8J3k8J40n1r9J78q9j98K17j15R3qL2n9J6J98
$$ 141 51 38 1 55 74 -20 -110 -139 -41 28 35 -63 -50 -78 62 11 -88 90 1 -197 20 -95 -2 -10 22 -37 -21 177
4690A77L6mk99P0j72L11j90J9K8J5K27j71j05O5K10k20J3m2K2PJ08Rn3J4m6j92
$$ 177 213 209 -90 -20 -192 119 -71 -52 -24 -9 218 47 -58 7 217 -3 10 -32 -10 -3 105 114 61 75 29 -163
4716a63R6J15j29O6K12j61J3qlkJ38j95j76R8J00P4n9R7p8q2K0L8k1R7p5J33k87
$$ -163 -67 48 -81 -15 197 36 49 41 38 36 174 -21 -197 -99 1 75 16 113 35 -47 -27 11 -10 87 12 145 -142
4743a42J92l6n4J8j20R3j24K62j6p5n2o1K5j77L02j74L12k2j5nP7j26j10K20p7
$$ -142 50 14 -40 -22 -142 -49 -173 89 73 -2 -54 -115 -90 -267 35 -139 173 151 136 131 208 82 -28 192 115
4768A15q7k23K28M3j24MJ47r4jm6M1j06m7J92j04J38m5q3Q1k3j77K75j53p5K59
$$ 115 28 -195 33 76 -48 -44 103 9 8 -38 3 -103 -150 42 -62 76 31 -52 29 6 -171 104 -49 -124 135
4793A35j88rJ31r2K0L7j6J5n2O9j67R1J27k48J74q4L2q0J61j49J05j3k15L10j70
$$ 135 -53 -62 69 -23 -3 34 18 33 -19 50 -117 -26 101 -147 27 -57 -25 -105 56 -93 12 -1 -216 94 -76
4818g6Q7q4J1P2o0q9J17Q6j07P5m0M3Q3j88J16q1K1J17r7N6n1o4Q2o3mK83l37
$$ -76 11 -73 -62 10 -50 -139 -22 64 -43 32 -8 35 118 -70 46 -35 -14 103 6 62 11 -53 29 -34 -38 245 -92
4845i2P5L19m45K41j31O2L8l2J1%k2P4j09n9Q0K04j93O2j96Q2n2nJ21j7p3J06
$$ -92 -17 302 -143 98 -33 29 67 35 46 46 24 98 -11 -70 10 214 21 83 -113 -31 -83 -88 33 16 -57 49
4871D9J7j71J00J6l0P0L3j49L4M8J45j79J44l1R5j74K1K1q2j73K13J27k22k1J29
$$ 49 66 -105 -5 11 -19 51 84 -65 -31 17 162 -17 127 96 191 17 38 59 -23 -196 17 144 -78 -99 30
4896C0j29K56j57J19j8j76O8rLl4n6R6R8k28J27Lj22J61p0j43J06j44J57qK16
$$ 30 -99 157 0 119 101 -75 -7 -16 -13 -47 -103 -7 91 -137 -10 -7 -129 32 -38 -181 -75 -219 -62 -70 146
4921A46p6j21K16j20o4J03r5l0q5Q7k5J86j57o9J99p7l5K8j04JJ27m0PJ4k8K1
$$ 146 70 -51 165 45 -19 84 -11 -41 -126 -39 -64 122 -35 -104 95 18 -17 11 -93 -92 35 -5 2 16 -12 9
4947Ij13J53Mk8QrN3p7j14L0J03P1m3L1m0j33m9O1M3n1J91q1L9R0l45K82j45J23
$$ 9 -104 49 53 25 33 24 77 0 -114 -84 19 90 47 78 38 -95 -144 -83 -40 -91 100 19 58 148 -197 85 -60 63
4975F3o6j5j99K80m0j8M9j54J40j33Q9O5m2j03j8Q0J10m0n0Q5p4J03m0J3l9j34
$$ 63 -3 -18 -217 63 23 5 54 -100 40 -93 -4 61 19 -84 -102 -22 88 48 -2 83 9 112 72 85 46 -88
5001h8L4J18n1L4q5O3n5P4k24J30J73j34J4j33R8J8M4O6j19l6J20R0j41J16nk22
$$ -88 -54 64 13 47 -38 25 -30 44 -180 -50 123 -11 3 -130 -32 -14 30 96 -23 -59 61 151 10 126 121 -101
5027a01N3Q0r6J15j62J26Mj87k4RJ04k1L9J40k13M3jP3J62k77L1J09O5J5nm7M4
$$ -101 -48 32 -64 51 -111 15 19 -168 -192 -183 -79 -100 -61 79 -134 -91 -92 -19 143 -134 -103 6 71 86 81 34 78
5054G8o1j83J97j11O2N0o3rJ45j17m8j4M5J73P9k67j78J94J16k24J69k4L1J2Q9
$$ 78 17 -166 31 -80 -18 32 -31 -40 105 -12 -60 -74 -29 144 223 -44 -222 -28 88 -136 33 9 40 52 141
5079A41j97o9J16o4R4m4N6P1j13J19j88Q0J24r1p7K89k95N4q2J52k6K7l8j19l5
$$ 141 -56 -125 -9 -73 21 -23 33 104 -9 110 -78 2 126 35 -42 247 -48 6 -76 76 50 77 39 -80 -115
5104a15N4P2P4J5j64P9k5j43K24p1q1J34J1m0L1k81J24J38j40J51k02J89n3j09
$$ -115 -61 11 85 100 -64 15 -10 -153 71 0 -81 53 64 24 55 -226 -102 36 -104 47 -155 34 -19 -128
5128a28K61j18p3O4m4l2jO0Q3L4j33L3K8j13K18k62JJ55M1j09R2k64L33Ok07J36
$$ -128 133 15 -58 6 -38 -70 -71 -11 72 106 -27 6 34 -79 139 -123 -122 33 74 -35 57 -207 126 132 -75 61
5154F1k62K63q2J38O5j75o5J30j57L7J47R0j51jk5N9j20j10J76K1j61J88k38K66
$$ 61 -201 62 -20 118 183 8 -57 73 -84 -47 100 190 39 38 13 72 -48 -158 18 39 -122 66 -172 94
5178I4o5j37K41k45J80P0j96Q9n9j64K56k35K15n2L6K9k07J09J51k0j72m0O3P0
$$ 94 29 -108 133 -112 68 138 -58 31 -28 -192 64 -171 44 -8 28 57 -150 -41 110 90 -82 -122 -59 11
5202A1N8j75J35o1M9L5o6Q3Q1r9J02n1j0j96k8J30K6r8N7J21j56J43k0q6j3O0
$$ 11 69 -106 29 -32 17 52 -14 69 150 51 153 102 92 -104 -132 -2 24 -74 -17 104 -52 91 71 -15 -28 32
5228C2n3J7j38N0m5J68L2j54J1J74k32J8K15p0J26j92Q2l1J5O0m1n9q5J96k14
$$ 32 -21 -4 -142 -92 -137 31 63 -91 -80 94 -138 -120 95 25 151 -41 41 10 25 85 44 -15 -100 96 -118
5253a18J02K3m0O3K9l5j18J56j37N9J82k48j7J28p4m6M2J07Q1k80J07J15r3R1
$$ -118 -16 7 -33 30 59 24 -94 62 -75 -16 166 -82 -99 29 -45 -91 -49 58 139 -141 -34 81 -12 79
5277G9J5j74K39l82K79p7N9q0K88l14J96j69J5Q8k58J27R0q6M5Q5j27L0j1K8j3
$$ 79 94 -80 159 -223 56 -21 38 -42 246 -68 128 -41 -26 62 -196 -69 21 -65 -20 65 -62 -32 -43 -15 -28
5302b8p0o5K23m34K82J1K38l7r8J87l88M7J63k4J17k39K3R6J92j30n3L8j8O9j35
$$ -28 -98 -163 60 -374 -92 -81 157 120 22 209 -179 -132 31 7 124 -115 -92 4 196 66 13 51 33 102 -33
5327c3R7L7j37N9L0r5J96l45K52J16k24QP4k89K52r2K11Q5j90J73j71N4jo9P3
$$ -33 64 101 -36 23 53 -42 154 -191 61 177 -47 -39 35 -254 -2 -94 117 202 12 185 14 68 67 -2 71
5352G1R1k62J75o1nP0j12J1J96k40o1J92o7L2r0k3N5q2N2N5m3K4l2J5j8R9q5J44
$$ 71 162 -100 75 14 9 79 -33 -22 174 -66 -127 65 -2 30 -60 -83 -28 -110 -58 -3 -46 -22 -54 -39 -57 42 -43 101
5380A01k1k22K82k87K87j30J05j81j52J84j2m3K88l28K02L5j48J19p8j6j02L1
$$ 101 80 -142 140 -147 140 10 115 -66 -218 -34 -46 -89 199 -129 73 108 -40 79 1 -15 -117 -86
5402h6J06p9J52j6k6m3P6k23J23R0k07J22MJ7%pr5J51j6j53K05j64N4O7L9m8j17
$$ -86 20 -59 93 77 51 8 84 -139 -16 74 -133 -11 -7 10 10 3 -92 59 43 -110 95 -69 -15 52 91 43 -74
5429g4J00P7j22Ql5q8J30k42J38J61j15J71j4o4l6j38J60K0l0P2J0q6mJ32j60
$$ -74 26 103 -19 -11 -46 -134 -4 -246 -108 53 -62 109 95 31 -5 -143 17 37 7 79 89 3 -1 131 -29
5454b9M2l9J59j18j23J23o2R4J17k57L3l4j01L63j85k97K31j8L5l3K13l1j6N9
$$ -29 13 -26 133 15 -108 15 -47 47 164 -93 -60 -94 -195 168 -17 -314 -83 -101 -66 -99 114 83 67 126
5478A26o0j31q0J73j36Q6O7r9r9jJ55J29j33N9O5q4j33J23p9K59K1p7j3j22J01
$$ 126 66 -65 -145 28 -108 -22 45 -54 -153 -154 1 130 -3 56 121 37 -96 27 -52 207 228 151 138 16 117
5503A17Pk10n8J66J09j39l1Q0P5k07R4Nl2J6P6O0k9j58J77n5k05J27J1o0K0J87
$$ 117 124 -86 -144 22 131 -8 -39 41 116 -91 3 8 -24 -8 68 128 99 -59 118 63 -142 -15 -4 -64 -44 143
5529A43j17q1ok2JJ54P6j19K22k56L6J19j00j07J51j68M5j72J47O4l4j54m9J73
$$ 143 26 -55 -61 -83 -82 72 148 29 251 -5 31 150 50 -57 94 -74 -29 -201 -54 10 -24 -178 -227 -54
5553e4P4M9o0o2j57J35Q6j18J59pJ8K01k08m6jN9n3j42J24R2r7j16R0J06K0o6
$$ -54 20 69 9 -53 -210 -75 11 -107 52 45 63 264 56 10 9 68 15 -127 -3 89 -8 -124 -34 72 92 26
5579B6K7n5m5J5L3nj05J79K6m8j44J27j74jN8K6pM1L2j65K19r6j6J76j69J03M3
$$ 26 53 -2 -47 -32 1 -4 -109 70 96 48 -96 31 -143 -144 -86 -60 -67 -26 6 -159 60 -36 -52 124 -45 58 101
5606A01j52J27l6j47P7O2j35J38j36O5J06k06O1P7j0k5o2J45j76k6K43L1o9n8
$$ 101 -51 76 40 -107 -30 32 -103 35 -101 -36 70 -136 -75 2 -8 -33 -95 50 -126 -152 91 122 53 -5
5630el4l1J04N5kp7k9J3R8l5o8J7J8m9j08R4M6%M7J33k77M2Q6k0l2K1j2l2p9L00
$$ -5 -39 -70 34 89 87 10 -19 -6 92 57 -11 6 24 -25 -133 -39 7 7 54 187 -90 -48 38 18 -14 7 -5 -37 -116 184
5660A84k67p1R7J55n9l21O5K52j21J50J3j24J08R8k81N5P5KJ08o9j0j8R5j92P1
$$ 184 -83 -154 -57 98 39 -282 -217 35 -86 64 77 -47 61 159 -122 -67 8 10 118 49 39 21 116 -76 -5
5685er1R7K8M2m1m3J21r0%J82k6j5j14o3P2j73J14P3k41P8J59j18R6l4J07j71
$$ -5 -96 1 29 71 30 -13 108 18 18 200 174 159 45 -18 54 -119 -5 68 -173 -95 64 -54 42 8 115 -56
5711e6l1J18J25j79q6K31j36k4J45k27K74k14M4J29q7k6j06J8J82k73K78j33j19
$$ -56 -87 31 156 -23 -109 122 -14 -38 107 -120 154 -60 -16 113 26 0 -106 -88 94 -179 99 -34 -153
5734a53J28J25q6J1K4r5j05J82m0P8K7j58qn4J52n2J7P2m1n7J6l3O8n0j09J87
$$ -153 -25 100 14 25 49 -46 -151 31 -9 69 96 -62 -70 -124 28 -24 -7 65 24 -33 -17 -50 18 -32 -141 46
5760D6NJ00N7k02R0n9o8Lq9L0L3J45Q8k26Q8P3j20K9r5R4m1J4n2N3m9j09K42j17
$$ 46 51 151 208 6 96 37 -31 -28 -117 -87 -54 91 179 -47 41 114 -6 23 -72 22 -19 -5 -57 -4 -53 -162 80 -37
5788c7J28j4o3j03J71j48P2L4m1j32O2J99j97mO1J77J8j79K61k90O3j53O2K2K9
$$ -37 91 77 14 -89 82 -66 6 40 -1 -133 -71 128 -69 -73 -12 165 183 4 265 -25 38 -115 -53 -31 -2
5813bk0o2K80r9j2j97M2n3M6j7J60k46J45J56k04J09%J83j06j60P0J12k45J92
$$ -2 -22 -84 196 97 85 -112 -70 -123 -77 -94 66 -180 -35 121 -83 26 26 209 103 -57 13 125 -120 72
5837G2Pj01j9N3l4j48Q0K33j64R0nj3j37J2J5N4k9P8m3k8J08k2j24J29N8n2m2
$$ 72 79 -22 -41 12 -22 -170 -90 143 -21 69 64 51 -86 -74 -59 -5 -34 44 1 -27 81 59 -65 64 122 70 28
5864B8o8l3J05j40J18J8k83M12k33K48j12J4j68P2K1MJ04j09K05j95m3J31j10
$$ 28 -40 -73 32 -108 10 28 -255 157 -76 172 60 74 -94 -22 -1 3 107 -2 203 8 -35 96 -14
5887a4p1J33O4j28k4J7N7j18K09k15J79j27O3r3q8J5M04k47K0m8Q8j75m3J43j04
$$ -14 -85 48 112 -16 -40 -23 34 -84 125 -90 89 -38 25 -68 -156 -141 263 16 36 -12 76 -99 -142 1 -103
5912a03K67k49J08P7k51M3J89j25P2m9j48L06j1j86O5o2J16K4j0o4m9mK37l33
$$ -103 164 -85 23 100 -151 -108 81 -44 28 -21 -169 137 126 -60 5 -57 59 83 73 9 -40 -44 193 -140
5936a40J97r1J1j6o6J18J03j54R4j06J26k59K73j31L0m9J24j30N4J36k44K73l0
$$ -140 57 -34 -23 -39 -105 13 116 -38 56 -50 76 -183 90 -41 -11 -60 64 -66 -12 124 -120 153 123
5959A23j44J07j17j85K69l7N6M9j30J05K1k32J36l3J08k18J29m4n7Q1Pj04K08
$$ 123 -21 86 -31 -216 53 16 72 121 -9 96 117 -115 21 -12 96 -122 7 -37 -94 -13 -6 -110 98
5982I8k1l19K94p8Q5%k1k5J31p0N4j23j43K08n1j48O9J19N1p0q5K7n4L5K07l22
$$ 98 77 -242 52 -26 59 59 38 13 144 74 128 5 -138 70 19 -129 -60 59 110 40 -45 -18 -72 -37 170 -152
6008a52L89k54J42kn6j8q2j6q2j6O3K0J79j41J56rj36J3P8o5O5n1%oJ1j30R9J6
$$ -152 237 -17 125 123 67 49 -33 -49 -131 -147 -84 -64 115 -26 130 121 -15 -2 76 11 76 25 25 19 30 -100 -1 15
6036A5j6l6N1l9k6O0j65R6Om3K32j67j3J85k40J85N6k03N0NQN8j49J85k20K85
$$ 15 -1 -37 14 -25 -51 9 -156 -60 -54 -97 135 -32 -45 140 -100 85 141 -62 -12 -7 1 59 -90 95 -125 160
6062A60j35j68K9L4L0R3m5j63J45o9J55L8j23L9J36k64J02j23Q7L1r8J00K39k84
$$ 160 25 -143 -114 -80 -50 43 -2 -165 -20 -89 66 104 -19 20 156 -108 -6 -129 -42 -11 -109 -9 230 -54
6086e4P7L3k33K36j29Q9R0j86K07j54L5l4kpK8l3M8r6J16Q1k3r5k3K5M7j21O8
$$ -54 23 56 -177 59 -70 19 109 -77 130 -24 11 -23 -25 -32 -4 -37 11 -85 31 112 89 -6 -29 -4 43 -78 -10
6113a0M0n7qm5L2P7Oj10M4J79k26k9Q2LlJ01rN0j73m6J45n7l2M0m0J42l71J88
$$ -10 30 -27 -35 -80 -48 29 35 -75 -31 148 -78 -107 -25 -22 -25 76 67 117 -56 -102 43 -14 -46 -6 -46 96 -275 -87
6141h7J05j13J78j66J25L8j27n1j2J86M2j40k9J06K1j31J39oo9j28L7J05lJ96
$$ -87 18 -95 83 -83 42 80 -47 -98 -110 76 118 -22 -51 55 76 -55 84 78 9 -119 -82 23 20 216
$$ [...]
8191h2
##END NTUPLES=NMR FID
##END=
