##TITLE=1H_14-2021
 CDcl3,8 sc, 
 12.03.2021
##JCAMPDX= 6.0         $$ Bruker NMR JCAMP-DX V2.0
##DATA TYPE= NMR FID
##DATA CLASS= NTUPLES
##ORIGIN= UXNMR, Bruker Analytische Messtechnik GmbH
##OWNER= root
$$ XWIN-NMR		Version 3.5
$$ Fri Mar 12 10:35:00 2021 Russian Standard Time (UT+4h)  she@DPX200
##.OBSERVE FREQUENCY= 200.131506
##.OBSERVE NUCLEUS= ^1H
##.DELAY= (6, 6)
##.ACQUISITION MODE= SIMULTANEOUS
##.ACQUISITION SCHEME= undefined
##.AVERAGES= 8
##.DIGITISER RES= 18
##SPECTROMETER/DATA SYSTEM= spect
##.PULSE SEQUENCE= zg30
##.SOLVENT NAME= D2O
##.SHIFT REFERENCE= (INTERNAL, D2O, 0, 15.7039)
##AUDIT TRAIL= $$ (NUMBER, WHEN, WHO, WHERE, WHAT)
$$ ##TITLE= Audit trail, XWIN-NMR		Version 3.5
$$ ##JCAMPDX= 5.01
$$ ##ORIGIN= Bruker BioSpin GmbH
$$ ##OWNER= she
$$ F:/spectra/data/she/nmr/H-F/1/audita.txt
$$ ##AUDIT TRAIL=  $$ (NUMBER, WHEN, WHO, WHERE, WHAT)
(   1,<2021-03-12 10:33:53.45 +0400>,<she>,<DPX200>,
      <created by zg, POWCHK disabled, PULCHK disabled
       configuration hash MD5:
       00 E9 B6 7A A2 85 ED C7 34 08 36 98 17 FE 4E 26
       data hash MD5: 16K
       CC A3 5F 92 0A 6B C8 34 02 7C 65 98 31 18 60 C5>)
$$ ##END=
$$ 
$$ hash MD5
$$ 1E 98 DE 3C E8 64 2E 4C 8B B5 68 57 B5 6B A7 29
##$RELAX= 
##$RELAX= 
##$RELAX= 
##$RELAX= 
##$RELAX= 
##$RELAX= 
$$ Bruker specific parameters
$$ --------------------------
##$DU= <F:/spectra>
##$EXPNO= 1
##$NAME= <H-F>
##$PROCNO= 1
##$TYPE= <nmr>
##$USER= <she>
##$AMP= (0..31)
100 100 100 100 100 100 100 100 100 100 100 100 100 100 100 100 100 100 
100 100 100 100 100 100 100 100 100 100 100 100 100 100 
##$AQSEQ= 0
##$AQ_mod= 1
##$AUNM= <au_zg>
##$AUTOPOS= <>
##$BF1= 200.13
##$BF2= 200.13
##$BF3= 200.13
##$BF4= 200.13
##$BF5= 200.13
##$BF6= 200.13
##$BF7= 200.13
##$BF8= 200.13
##$BYTORDA= 1
##$CFDGTYP= 0
##$CFRGTYP= 5
##$CHEMSTR= <none>
##$CNST= (0..31)
1 1 145 1 1 1 1 1 1 1 1 1 1 1 1 1 1 1 1 1 1 1 1 1 1 1 1 1 1 1 1 1 
##$CPDPRG= <>
##$CPDPRG1= <>
##$CPDPRG2= <>
##$CPDPRG3= <>
##$CPDPRG4= <mlev>
##$CPDPRG5= <mlev>
##$CPDPRG6= <mlev>
##$CPDPRG7= <mlev>
##$CPDPRG8= <mlev>
##$CPDPRGB= <>
##$CPDPRGT= <>
##$D= (0..31)
0 1.2 0 0 0 0 0 0 0 0.06 0 0.03 0 0 0 0 0.0002 0 0 0 0 0 0 0 0 0 0 0 0 
0 0 0 
##$DATE= 1615530832
##$DBL= (0..7)
120 120 120 120 120 120 120 120 
##$DBP= (0..7)
150 150 150 150 150 150 150 150 
##$DBP07= 0
##$DBPNAM0= <>
##$DBPNAM1= <>
##$DBPNAM2= <>
##$DBPNAM3= <>
##$DBPNAM4= <>
##$DBPNAM5= <>
##$DBPNAM6= <>
##$DBPNAM7= <>
##$DBPOAL= (0..7)
0.5 0.5 0.5 0.5 0.5 0.5 0.5 0.5 
##$DBPOFFS= (0..7)
0 0 0 0 0 0 0 0 
##$DE= 6
##$DECBNUC= <off>
##$DECIM= 32
##$DECNUC= <off>
##$DECSTAT= 4
##$DIGMOD= 1
##$DIGTYP= 9
##$DL= (0..7)
0 120 120 120 120 120 120 120 
##$DP= (0..7)
150 150 150 150 150 150 150 150 
##$DP07= 0
##$DPNAME0= <>
##$DPNAME1= <>
##$DPNAME2= <>
##$DPNAME3= <>
##$DPNAME4= <>
##$DPNAME5= <>
##$DPNAME6= <>
##$DPNAME7= <>
##$DPOAL= (0..7)
0.5 0.5 0.5 0.5 0.5 0.5 0.5 0.5 
##$DPOFFS= (0..7)
0 0 0 0 0 0 0 0 
##$DQDMODE= 0
##$DR= 18
##$DS= 0
##$DSLIST= <SSSSSSSSSSSSSSS>
$$ [...]
##$SUBNAM2= <"">
##$SUBNAM3= <"">
##$SUBNAM4= <"">
##$SUBNAM5= <"">
##$SUBNAM6= <"">
##$SUBNAM7= <"">
##$SUBNAM8= <"">
##$SUBNAM9= <"">
##$SW= 16.9725357007746
##$SWIBOX= (0..15)
0 0 2 0 0 0 0 0 0 0 0 0 0 0 0 0 
##$SW_h= 3396.73913043478
##$TD= 16384
##$TD0= 1
##$TE= 0
##$TE2= 300
##$TE3= 300
##$TEG= 300
##$TL= (0..7)
0 120 120 120 120 120 120 120 
##$TP= (0..7)
150 150 150 150 150 150 150 150 
##$TP07= 0
##$TPNAME0= <>
##$TPNAME1= <>
##$TPNAME2= <>
##$TPNAME3= <>
##$TPNAME4= <>
##$TPNAME5= <>
##$TPNAME6= <>
##$TPNAME7= <>
##$TPOAL= (0..7)
0.5 0.5 0.5 0.5 0.5 0.5 0.5 0.5 
##$TPOFFS= (0..7)
0 0 0 0 0 0 0 0 
##$TUNHIN= 0
##$TUNHOUT= 0
##$TUNXOUT= 0
##$USERA1= <user>
##$USERA2= <user>
##$USERA3= <user>
##$USERA4= <user>
##$USERA5= <user>
##$V9= 5
##$VALIST= <valist>
##$VCLIST= <CCCCCCCCCCCCCCC>
##$VD= 0
##$VDLIST= <DDDDDDDDDDDDDDD>
##$VPLIST= <PPPPPPPPPPPPPPP>
##$VTLIST= <TTTTTTTTTTTTTTT>
##$WBST= 1024
##$WBSW= 4
##$XGAIN= (0..3)
0 0 0 0 
##$XL= 0
##$YL= 0
##$YMAX_a= 339569
##$YMIN_a= -247052
##$ZGOPTNS= <>
##$ZL1= 120
##$ZL2= 120
##$ZL3= 120
##$ZL4= 120
##$ABSF1= 10
##$ABSF2= 0
##$ABSG= 5
##$ABSL= 3
##$ALPHA= 0
##$AQORDER= 0
##$ASSFAC= 0
##$ASSFACI= 0
##$ASSFACX= 0
##$ASSWID= 0
##$AUNMP= <proc_1d>
##$AZFE= 0.1
##$AZFW= 0.1
##$BCFW= 1
##$BC_mod= 2
##$BYTORDP= 1
##$COROFFS= 0
##$CY= 11.3945322036743
##$DATMOD= 1
##$DC= 2
##$DFILT= <>
##$DTYPP= 0
##$F1P= 15.9154993809931
##$F2P= -4.1035820241983
##$FCOR= 0.5
##$FTSIZE= 0
##$FT_mod= 4
##$GAMMA= 1
##$GB= 0.15
##$INTBC= 1
##$INTSCL= 1
##$ISEN= 128
##$LB= 0.24
##$LEV0= 0
##$LPBIN= 0
##$MAXI= 10000
##$MC2= 0
##$MEAN= 0
##$ME_mod= 0
##$MI= 1.114404
##$NCOEF= 0
##$NC_proc= 0
##$NLEV= 6
##$NOISF1= 3.799351
##$NOISF2= 2.8
##$NSP= 1
##$NTH_PI= 0
##$NZP= 0
##$OFFSET= 15.70392
##$PC= 1
##$PHC0= -11118.33
##$PHC1= 10.80094
##$PH_mod= 1
##$PKNL= yes
##$PPARMOD= 0
##$PSCAL= 0
##$PSIGN= 0
##$REVERSE= no
##$SF= 200.130013532006
##$SI= 16384
##$SIGF1= 3
##$SIGF2= 2
##$SINO= 400
##$SIOLD= 16384
##$SREGLST= <1H.CDCl3>
##$SSB= 0
##$STSI= 0
##$STSR= 0
##$SW_p= 3612.71676300578
##$SYMM= 0
##$S_DEV= 0
##$TDeff= 0
##$TDoff= 0
##$TI= <>
##$TILT= no
##$TM1= 0
##$TM2= 0
##$TOPLEV= 0
##$USERP1= <user>
##$USERP2= <user>
##$USERP3= <user>
##$USERP4= <user>
##$USERP5= <user>
##$WDW= 1
##$XDIM= 8192
##$YMAX_p= 0
##$YMIN_p= 0
$$ End of Bruker specific parameters
$$ ---------------------------------
##NTUPLES= NMR FID
##VAR_NAME=  TIME,          FID/REAL,        FID/IMAG
##SYMBOL=    X,             R,               I
##VAR_TYPE=  INDEPENDENT,   DEPENDENT,       DEPENDENT
##VAR_FORM=  AFFN,          ASDF,            ASDF
##VAR_DIM=   8192,          8192,            8192
##UNITS=     SECONDS,       ARBITRARY UNITS, ARBITRARY UNITS
##FACTOR=    0.0002944,     1,               1
##FIRST=     0,             0,               0
##LAST=      2.4114304,     0,               0
##MIN=       0,             -247052,         0
##MAX=       2.4114304,     339569,          0
$$ Real data points
##PAGE= N=1
##DATA TABLE= (X++(R..R)), XYDATA
$$ [...]
$$ plain form
1916 -963 -237 -1241 974 595 -208 -222 -1454 1465 127 439 -591 -639 116 956 -102 -1253 -43 -1063
1934 -1063 1695 -568 -522 -62 -923 1591 -396 -77 -562 -25 167 180 -386 -431 596 -416 724 -844
1952 -844 405 42 -134 361 -1409 630 -537 582 -773 -1189 139 149 140 -661 -617 -953 1242 -644
1970 -644 -367 -935 -1252 1717 -542 232 -1373 -641 686 457 -300 -1061 -410 112 1706 -784 -258 -1050
1988 -1050 278 1597 -587 292 -1841 482 819 551 -258 -1904 -183 502 846 -1002 -812 -1230 805
2005 805 400 -1002 -205 -1965 823 -656 -298 -552 -1308 -185 -574 261 -849 -71 -1169 24 -405
2022 -405 -194 -20 -1182 186 -1582 412 -324 -872 -596 -1618 288 -560 -112 -1517 -1272 -927 348
2039 348 -249 -1545 -1106 -1627 1144 -366 -117 -1418 -1617 1383 305 463 -1231 -1111 543 1923 188
$$ packed form
1916i63P26j004K215l79q03j4j232K919j338L12j030m8P55Q40j058j151J210j020
1934a063K758k263M6M60q61K514j987L19m85N37J92J3n66m5J027j012J140j568
1952h44J249l63j76M95j770K039j167J119j355m16J328J0rq01M4l36K195j886
1970f44K77n68l17K969k259P74j605P32J327k29p57p61O51N22J594k490N26p92
1988a050J328J319k184Q79k133K323L37k68q09j646J721O85L44j848J90m18K035
2005H05m05j402P97j760K788j479L58k54p56J123l89Q35j110P78j098J193m29
2022d05K11J74j162J368j768J994p36n48K76j022J906q48M48j405K45L45J275
2039C48n97j296M39n21K771j510K49j301j99L000j078J58j694J20J654J380j735
$$ plain form
2056 188 -1066 -899 -439 2241 80 -52 -1618 -477 1610 395 439 -1956 -442 164 791 -215 -1404
2073 -1404 -1480 -356 964 -741 -449 -2363 -217 -125 -248 -71 -2248 -243 -716 40 -108 -1059 -984 -684
2091 -684 231 -46 525 -1165 299 -467 492 951 -609 234 -1262 619 574 303 -578 -1061 -43 597
2109 597 988 -1166 -706 -1341 1050 514 -482 -911 -1908 1278 256 591 -1273 -1603 461 1040 784 -790
2127 -790 -1151 -839 1679 365 -204 -1274 -1365 1552 296 613 -1495 -1164 359 424 732 -1189 -723 -567
2145 -567 1185 389 368 -889 78 1159 551 1328 -722 390 522 708 1156 -309 428 -113 708 502
2163 502 739 -463 92 -322 -451 844 -1325 -76 -1487 -605 272 -481 -430 -1756 -318 -391 314 -639
2181 -639 -1274 -1096 95 993 -232 -134 -1524 729 773 780 253 -1574 861 861 1648 322 -314 -168 1180
$$ packed form
2056A88j254J67M60K680k161j32j566J141K087j215M4k395J514O06O27j006j189
2073a404p6J124J320j705K92j914K146R2j23J77k177K005m73P56j48r51P5L00
2091f84R15k77N71j690J464p66R59M59j560Q43j496J881m5k71q81m83J018O40
2109E97L91k154M60o35K391n36r96m29r97L186j022L35j864l30K064N79k56j574
2127g90l61L12K518j314n69j070r1K917j256L17k108L31J523O5L08j921M66J56
2145e67J752p96k1j257R67J081o08P77k050J112J32J86M48j465P37n41Q21k06
2163E02K37j202N55m14j29J295k169J249j411Q82Q77p53N1j326J438p3P05r53
2181f39o35J78J191Q98j225R8j390K253M4Pn27j827K435%P87j326o36J46J348
$$ plain form
2200 1180 1142 350 -10 -1196 1484 877 713 -289 -1173 477 186 876 -904 -777 -456 172 629 -704
2218 -704 -720 -673 555 -134 533 -896 -305 579 -561 730 -570 179 86 -145 246 -122 53 -292 73
2237 73 -248 581 -107 268 -395 -612 781 -223 843 -823 -209 91 351 743 -602 -364 -52 1168
2255 1168 335 302 -931 176 749 74 433 -1366 -263 -21 281 -71 -1207 -682 -323 698 -419 -643
2273 -643 -1126 166 357 -87 -196 -1209 792 120 679 -301 -472 786 200 884 -43 40 96 710 467
2292 467 104 -15 -45 947 -286 563 -451 52 253 -325 228 -688 431 -215 214 -340 15 182 43
2311 43 421 -736 295 -328 697 -325 -733 -15 -429 871 -572 -461 -524 35 -83 -233 -666 -684 258
2330 258 -458 454 -691 -153 542 112 1025 -487 361 199 854 556 15 311 173 859 56 197 -602
$$ packed form
2200A180l8p92l60j186K680o07j64j002q84J650k91O90j780J27L21O28M57j333
2218g04j6M7J228o89O67j429N91Q84j140J291j300P49r3k31L91l68J75l45L65
2237G3l21Q29o88L75o63k17J393j004J066j666O14L00K60L92j345K38L12J220
2255A168q33l3j233J107N73o75L59j799J103K42L02l52j136N25L59J021j117k24
2273f43m83J292J91m44j09j013K001o72N59r80j71J258n86O84r27Q3N6O14k43
2292D67l63j19l0R92j233Q49j014N03K01n78N53r16J119o46M29n54L55J67j39
2311D3L78j157J031o23J025j022m08P18m14J300j443J11o3N59j18j50m33j8R42
2330B58p16R12j145N38O95m30R13j512Q48j62O55k98n41K96j38O86q03J41p99
$$ plain form
2349 -602 670 75 142 128 -809 365 -356 363 -236 -464 99 74 117 -383 -107 -220 699 -206 117 9 -4
2370 -4 1012 62 560 -182 636 611 347 166 -158 738 501 444 -291 66 -116 603 249 -622 637 -759
2390 -759 719 -89 -456 123 -463 692 156 -256 -597 404 -51 536 -115 -377 382 -236 889 -220
2408 -220 -105 70 324 763 -523 214 -161 668 360 -106 -314 40 257 59 268 -1168 474 -211 225
2427 225 27 -815 201 -187 233 -189 -191 -240 688 266 -124 500 -127 780 -140 248 102 51 647 128 127 -313
2449 -313 539 346 -137 -145 -338 -27 153 -143 -1020 -157 -284 357 -79 -998 51 -454 403 -158 -402 -431 -112
2470 -112 496 303 -155 -755 274 -267 490 -329 -907 18 -208 829 -687 -633 -708 -252 713 -370 -334 -750
2490 -750 90 -180 257 -614 -407 15 5 601 -645 56 -357 205 370 -370 275 -280 23 -176 347 -265
$$ packed form
2349f02J272n95O7j4r37J174p21P19n99k28N63k5M3n00K76j13R19r05L23j08j3
2370dJ016r50M98p42Q18k5k64j81l24Q96k37n7p35L57j82P19l54q71J259j396
2390g59J478q08l67N79n86J155n36m12l41J001m55N87o51k62P59o18J125j109
2408b20J15J75K54M39j286P37l75Q29l08m66k08L54K17j98K09j436J642o85M36
2427B25j98q42J016l88M20m22km9R28m22l90O24o27R07r20L88j46n1N96n19jm40
2449c13Q52j93m83qj93L11J80k96q77Q63j27O41m36r19J049n05Q57n61k44k9L19
2470a12O08j93m58o00J029n41P57q19n78R25k26J037j516N4p5M56R65j083L6m16
2490g50Q40k70M37q71K07M22j0N96j246P01m13N62J65p40O45n55L03j99N23o12
$$ plain form
2510 -265 341 -333 -259 234 -140 516 -474 95 -169 101 514 -291 -176 -525 281 91 129 -1009 -564 -80
2530 -80 239 439 -1461 -237 -434 326 110 -863 -452 -569 524 209 -229 -875 -9 496 823 609 -778
2549 -778 282 -115 973 360 -613 -278 15 823 -140 -171 -1099 -551 -49 1 -600 -868 -494 -600 349 -841
2569 -841 -500 -627 -609 211 -358 441 -372 -195 177 410 593 187 257 -23 670 153 840 -239 -146 293 -132
2590 -132 745 -453 -406 -548 152 515 -133 -475 -658 352 197 805 -479 -423 -110 456 1028 -550 -37
2609 -37 -517 697 775 -118 -77 -680 375 498 606 -881 -681 -675 484 341 -690 -504 -942 540 185 -291
2629 -291 -670 -509 132 171 496 -529 -359 -252 727 496 -265 100 -435 757 -62 323 39 149 393 71
2649 71 579 -133 110 -406 403 -42 400 -74 -496 84 -387 590 -323 -398 -424 -310 793 -99 -140 -751 293
$$ packed form
2510b65O06o74P4M93l74O56r90N69k64K70M13q05J15l49Q06j90L8j138M45M84
2530h0L19K00j900J224j97P60k16r73M11j17J093l15m38o46Q66N05L27k14j387
2549g78J060l97J088o13r73L35K93Q08r63l1r28N48N02N0o01k68L74j06R49j190
2569h41L41j27J8Q20n69P99q13J77L72K33J83m06P0k80O93n17O87j079R3M39m25
2590a32Q77j198M7j42P00L63o48l42j83J010j55O08j284N6L13N66N72j578N13
2609c7m80J214P8q93M1o03J055J23J08j487K00OJ159j43j031J86m38J482l55m76
2629b91l79J61O41L9L25j025J70J07R79k31p61L65n35J192q19L85k84J10K44l22
2649G1N08p12K43n16Q09m45M42m74m22N80m71R77r13p5k6J14J103q92m1o11J044
$$ plain form
2670 293 311 416 -234 -633 -31 28 944 -102 -66 -495 318 1059 -75 -88 -427 88 632 680 -118 -285 -120
2691 -120 152 709 -281 -179 -609 148 744 -313 -1 -562 240 64 149 -461 -355 -150 139 321 -516 -89
2711 -89 -537 139 77 -66 -201 -579 112 -526 111 84 -279 -346 -30 314 5 141 -607 40 -130 547 341
2732 341 -139 132 -266 860 296 266 -296 -50 493 376 227 -568 -50 -222 374 -197 -446 -219 -441 757
2752 757 -356 55 -548 189 696 60 22 -484 100 5 912 261 -89 118 89 420 -397 -3 -604 58 228
2773 228 -148 -113 -523 -105 -135 -90 -190 -285 -229 -73 -52 -314 239 -325 259 -248 91 167 125 306 -133 245 218
2796 218 338 -18 74 -68 -155 694 -67 92 -333 253 245 -176 120 -626 282 -267 386 -187 -341 -95 173
2817 173 471 -310 328 -280 539 73 124 145 -183 458 -13 421 109 71 71 216 225 -265 107 70 433 -204 -152
$$ packed form
2670B93J8J05o50l99O02N9R16j046L6m29Q13P41j134j3l39N15N44M8p98j67J65
2691a20K72N57r90J02m30P57N96j057L12n61Q02j76Q5o10J06K05K89J82q37M27
2711h9m48O76o2j43j35l78O91o38O37k7l63o7L16L44l09J36p48O47j70O77k06
2732C41m80K71l98J126n64l0n62K46N43j17j49p95N18j72N96n71k49K27k22J198
2752G57j113M11o03P37N07o36l8n06N84r5R07o51l50K07k9L31q17L94o01O62J70
2773B28l76L5m10M18l0M5j00r5N6J56K1k62N53n64N84n07L39P6m2J81m39L78k7
2796B18J20l56R2j42q7Q49p61J59m25N86qm21K96p46R08n49O53n73j54K46K68
2817A73K98p81O38o08Q19m66N1K1l28O41m71M34l12l8%J45Rm90L72l7L63o37N2
$$ plain form
2840 -152 -255 118 170 -365 224 -604 233 -208 -275 -19 -399 33 -232 128 -459 165 -51 178 -247 -302 534
2861 534 50 707 -215 77 228 179 231 -300 196 -514 369 -246 90 -289 -378 92 -202 241 -522 5 -135
2882 -135 196 293 -428 -149 -157 491 107 218 -85 192 269 -9 259 -532 867 -105 139 -65 -254 425 -38
2903 -38 122 -141 13 -81 359 -114 -278 -33 -264 107 -433 184 -254 -76 260 -129 200 -123 268 204 198 155
2925 155 67 -64 148 196 -397 354 -576 79 -135 -586 176 -243 349 -197 -256 -140 143 195 -231 235 -347
2946 -347 277 217 192 -539 -66 371 -61 330 -422 260 137 283 12 -476 -179 -293 251 -103 147 -310 345
2967 345 242 121 450 -325 368 272 397 140 -126 218 278 550 7 254 -200 266 17 85 -118 -427 -58
2988 -58 -566 122 -375 -246 63 -127 98 -30 17 34 396 -54 218 226 251 351 -75 557 -232 236 -52 -438
$$ packed form
2840a52j03L73N2n35N89q28Q37m41o7K56l80M32k65L60n87O24k16K29m25n5Q36
2861E34m84O57r22K92J51m9N2n31M96p10Q83o15L36l79q9M70k94M43p63N27j40
2882a35L31R7p21K79qO48l84J11l03K77P7k78K68p91J399r72K44k04j89O79m63
2903c8J60k63J54r4M40m73j64K45k31L71n40O17m38J78L36l89L29l23L91o4om3
2925A55q8j31K12M8n93P51r30O55k14m51P62m19N92n46n9J16K83N2m26M66n82
2946c47O24o0k5p31M73M37m32L91p52O82j23J46k71m88K97j14N44l54K50m57O55
2967C45j03j21L29p75O93r6J25k57k66L44O0K72n43K47m54M66k49O8k03l09L69
2988e8n08O88m97J29L09j90K25j28M7J7L62m50K72QK5J00m26O32p89M68k88l86
$$ plain form
3010 -438 -27 -87 144 -451 -226 -521 130 -268 -213 -457 -679 95 -195 281 -621 -223 182 327 513 -398 55
3031 55 145 509 448 46 3 -21 335 85 380 -688 86 -58 -12 171 -592 -113 -10 203 -184 66 -351 -80
3053 -80 282 -82 219 -224 261 -187 356 223 64 258 -369 410 -215 319 -203 -126 62 -372 13 -489 140
3074 140 -554 -66 -111 -47 -168 -557 297 -61 271 -145 -410 -125 338 441 -259 51 -263 582 270 438 -32
3095 -32 -652 221 -145 375 -603 -151 -174 341 407 -162 -309 -72 425 193 449 -128 -372 13 107 674 -335
3116 -335 124 -252 259 74 -239 -108 -242 124 -34 92 -333 -207 -65 231 469 -78 106 -422 449 168
3136 168 60 150 -494 159 -64 197 -73 64 -348 -97 73 -104 203 -405 192 52 124 154 -571 189 77
3157 77 436 121 -229 -383 -76 227 13 -89 -445 287 87 8 -206 -664 -165 60 252 -271 -182 -470 208
$$ packed form
3010d38M11o0K31n95K25k95O51l98N5k44k22P74k90M76r02L98M05J45J86r11M53
3031E5R0L64o1m02m3k4L56k50K95j068P74j44M6J83p63M79J03K13l87K50m17K71
3053h0L62l64L01m43M85m48N43j33j59J94o27P79o25N34n22P7J88m34L85n02O29
3074A40o94M88m5O4j21l89Q54l58L32m16k65K85M63J03p00L10l14Q45l12J68m70
3095c2o20Q73l66N20r78M52k3N15O6n69j47K37M97k32K56n77k44L85R4N67j009
3116c35M59l76N11j85l13J31j34L66j58J26m25J26J42K96K38n47J84n28Q71k81
3136A68j08R0o44O53k23K61k70J37m12K51J70j77L07o08N97j40P2L0p25P60j12
3157G7L59l15l50j54L07L03k14j02l56P32k00p9k14m58M99K25J92n23Q9k88O78
$$ plain form
3178 208 339 -77 24 -497 290 -184 579 11 160 391 110 285 -106 150 -156 -65 154 164 -55 -290 -157
3199 -157 -142 280 -213 56 44 -371 232 -52 117 -254 99 -434 372 206 -44 134 -248 52 319 168 12
3220 12 -185 275 -31 124 -426 -64 25 349 -43 -201 -59 -216 407 31 74 -578 54 -178 -187 79 -548 19
3242 19 -48 357 -133 -66 113 -152 220 106 18 -208 272 -83 -5 -115 -543 88 -64 502 -279 111 -247 -210
3264 -210 189 -141 131 -147 -12 -144 244 -129 -9 -217 -66 186 -192 107 -135 -223 -2 -114 287 -63
3284 -63 -63 -113 0 311 48 -5 -67 210 -6 223 -67 -91 116 -116 297 -98 7 -213 82 91 -396 -271 -294
3307 -294 65 42 181 -271 -1 33 77 234 -459 124 -141 355 54 -196 -68 -89 10 -106 165 -155 -37 -4
3329 -4 -120 77 -37 -166 -335 -63 -317 -86 40 -139 279 197 -115 -109 194 -18 236 126 158 60 -128 34
$$ packed form
3178B08J31m16J01n21P87m74P63n68J49K31k81J75l91K56l06R1K19J0k19k35J33
3199a57J5M22m93K69j2m15O03k84J69l71L53n33Q06j66k50J78l82L00K67j51j56
3220A2j97M60l06J55n50L62Q9L24l92j58J42j57O23l76M3o52O32k32rK66o27N67
3242A9o7M05m90O7J79k65L72j14q8k26M80l55P8j10m28O31j52N66p81L90l58L7
3264b10L99l30K72k78J35j32L88l73J20k08J51K52l78K99k42q8K21j12M01l50
3284f3%n0J13L11k63n3o2K77k16K29k90k4K07k32M13l95J05k20K95Rm87J25k3
3307b94L59k3J39m52K70L4M4J57o93N83k65M96l01k50J28k1R9j16K71l20J18L3
3329dj16J97j14j29j69K72k54K31J26j79M18q2l12OL03k12K54j10L2r8j88J62
$$ plain form
3351 34 -119 169 -184 -211 -109 129 58 -15 94 -304 -78 -220 59 -27 -207 89 -161 611 -44 99 -161 176
3373 176 179 -85 181 113 96 -266 -40 -109 -121 -23 -221 42 -313 157 -333 89 -159 -512 -67 -106 216 -82 262
3396 262 -450 174 -97 210 63 -244 133 -268 192 -91 -215 -20 -297 -6 -197 115 -345 128 -111 -122
3416 -122 10 -181 15 -214 179 -284 30 111 64 373 -97 140 -86 221 97 -45 -24 -134 190 -330 278
3437 278 -211 463 185 -79 -10 -293 78 -221 71 -120 40 100 -37 -134 -316 167 -93 313 50 332 246
3458 246 -125 206 -43 14 -349 5 32 -76 -18 -365 90 -322 -136 -241 -132 -15 -151 58 15 101 -75 282
3480 282 -64 26 252 194 171 48 99 30 265 -136 149 43 -42 225 -368 -156 -254 124 12 102 22 -255 82
3503 82 -163 121 -131 -62 -184 104 315 103 183 -106 422 78 -50 -119 61 260 -23 28 -264 -140 -51 163
$$ packed form
3351C4j53K88l53k7J02K38p1p3J09l98K26j42K79q6j80K96k50P72o55J43k60L37
3373A76Lk64K66o8j7l62K26o9j2R8j98K63l55M70m90M22k48l53M45l9L22k98L44
3396B62p12O24k71L07j47l07L77m01M60k83j24J95k77K91j91L12m60M73k39j1
3416a22J32j91J96k29L93m63L14Q1m7L09m70K37k26L07j24j42K1j10L24n20O08
3437B78m89O74k78k64O9k83L71k99K92j91J60O0j37r7j82M83k60M06k63K82q6
3458B46l71L31k49N7l63L54K7j08N8l47M55m12J86j05J09J17j36K09m3Q6j76L57
3480B82l46R0K26n8k3j23N1o9K35m01K85j06q5K67n93K12r8L78j12R0q0k77L37
3503H2k45K84k52O9j22K88K11k12Q0k89N28l44j28o9J80J99k83N1k92J24Q9K14
$$ plain form
3525 163 -202 -97 38 -289 239 -235 42 -182 132 142 75 307 -275 290 -55 179 87 -38 -169 -113 226
3546 226 -181 -8 -68 -43 -33 -203 -12 172 90 -212 -90 148 11 17 -83 113 -244 285 -140 112 77 75 209
3569 209 -102 9 -153 46 34 -10 -201 -136 43 43 14 -81 13 -68 48 207 -79 110 -230 252 -98 -43 -97 15
3593 15 -276 285 306 -128 -141 194 18 270 5 -160 -282 69 174 101 -166 -313 117 145 135 185 -76 -175 312
3616 312 -81 12 -25 -66 -50 283 -25 -92 67 -168 -111 -29 -57 2 -265 -96 -167 100 86 93 29 -106 -84 123 93
3641 93 14 -150 200 358 -27 -32 -91 -77 95 10 20 -29 39 297 -23 -97 -225 66 22 -331 -77 -173 39 -43 166
3666 166 -336 37 41 79 -121 90 -194 -215 -15 -73 6 175 -35 -47 132 40 -171 -46 -82 -201 2 -20 10 -57
3690 -57 86 -86 -170 -191 65 4 40 -61 70 -27 -221 -8 31 154 -89 -318 -92 -247 189 200 -88 143 132
$$ packed form
3525A63l65J05J35l27N28m74K77k24L14J0o7K32n82N65l45K34r2j25j31N6L39
3546B26m07J73o0K5J0j70J91J84q2l02J22K38j37Oj00J96l57N29m25K52l5kJ34
3569B09l11J11j62J99j2m4j91O5J79%k9r5R4q1J16J59k86J89l40M82l50N5n4J12
3593A5k91N61K1m34j3L35j76K52k65j65j22L51J05p3k67j47M30K8j0N0k61r9M87
3616C12l93R3l7m1J6L33l08o7J59k35N7Q2k8N9k67J69p1K67j4Po4j35K2K07l0
3641I3p9j64L50J58l85nn9J4J72q5J0m9O8K58l20p4j28K91m4l53K54r6K12q2K09
3666A66n02L73ML8k00K11k84k1K00n8P9J69k10j2J79r2k11J25l6j19K03k2L0o7
3690e7J43j72q4k1K56o1L6j01J31r7j94K13L9J23k43k29K26j55M36J1k88K31j1
$$ plain form
3713 132 532 48 -131 -170 132 -162 94 221 -210 -114 61 247 -110 69 -293 -154 248 13 -16 -133 8
3734 8 -104 108 -194 48 105 -130 138 210 87 100 20 -64 -170 135 -228 -19 -54 -125 54 87 -50 -129 26 116
3758 116 50 -234 86 -110 216 149 -169 384 -132 -93 -115 -244 228 -44 -78 165 -208 56 79 76 -54 -122 -145
3781 -145 -90 -66 -36 -26 26 5 -247 199 -152 132 -39 174 66 180 -207 -152 142 108 -109 -88 -96 -21 -120 399
3805 399 269 -53 -110 131 -43 30 -121 -73 131 -131 -56 -101 129 53 -17 -123 75 -72 -225 205 -105 -90 -182
3828 -182 -158 148 -65 241 -175 62 40 41 -61 -1 172 134 -15 -93 -90 -110 -160 -76 -84 -192 -17 166 -115 319 -122
3853 -122 14 16 -237 9 -234 78 -10 150 -108 -198 149 -421 50 -20 35 82 -188 -14 143 124 -176 255 75
3876 75 282 221 164 9 -104 -54 230 90 -68 183 -149 80 0 -120 74 -17 -92 -147 -59 -197 -134 -48 93 -114
$$ packed form
3713A32M00m84j79l9L02k94K56J27m31R6J75J86l57J79l62J39M02k35k9j17J41
3734Hj12K12l02K42N7k35K68P2j23J3q0q4j06L05l63K09l5p1J79L3j37p9J55R0
3758A16o6k84L20j96L26o7l18N53n16L9k2j29M72k72l4K43l73K64K3lj30o8k3
3781a45N5K4L0J0N2k1k52M46l51K84j71K13j08J14l87N5K94l4k17K1qP5r9N19
3805C99j30l22n7K41j74P3j51M8K04k62P5m5K30p6p0j06J98j47j53M30l10J5r2
3828a82K4L06k13L06m16K37k2Jj02O0J73l8j49p8Lk0n0Q4qj08J75J83k81M34m41
3853a22J36Kk53K46k43L12q8J60k58r0L47n70M71p0N5M7k70J74J57j9l00M31j80
3876G5K07o1n7j55j13N0K84j40j58K51l32K29q0j20J94r1p5n5Q8j38O3Q6J41k07
$$ plain form
3900 -114 -37 151 -15 372 -88 -149 -165 -17 65 -61 63 -174 -123 -144 -71 17 3 74 -33 213 -69 81 100 -49
3924 -49 10 -137 32 -59 219 -20 11 36 173 -106 -29 7 -39 -148 -300 31 -95 54 -14 -114 15 -274 -106
3947 -106 43 -73 251 -24 -94 -219 -30 -92 91 114 36 314 199 34 -260 -7 123 -158 -29 82 80 -108
3969 -108 -124 0 51 11 -172 96 56 57 85 -189 -1 55 -64 -194 24 -109 -103 -148 9 -1 -105 42 -13 -119
3993 -119 -90 177 8 -15 -31 173 102 -24 175 -85 31 104 22 70 -28 -112 -75 230 79 315 -185 68 -31 -157
4017 -157 36 107 176 -99 -54 -66 -43 43 235 -62 -82 94 -47 -181 -146 44 71 -41 89 -42 136 -99 129
4040 129 256 -79 39 131 43 92 -84 -125 -139 -175 4 -326 -98 190 20 -2 -98 176 141 -29 -32 115 22 0
4064 0 201 -123 -84 -313 36 131 27 191 -9 122 -298 -55 182 -35 143 156 321 -10 -9 -185 13 272
$$ packed form
3900a14P7J88j66L87m60o1j6J48Q2j26J24k37N1k1P3Q8j4P1j07K46k82J50J9j49
3924d9N9j47J69r1K78k39L1K5J37k79P7L6m6j09j52L31j26J49o8j00J29k89J68
3947a06J49j16L24k75p0j25J89o2J83K3p8K78j15j65k94K53J30k81J29J11kj88
3969a08j6J24N1m0j83K68m0JK8k74J88N6j19j30K18j33Om5J57j0j04J47n5j06
3993a19K9K67j69k3j6K04p1j26J99k60J16P3q2M8r8q4L7L05j51K36n00K53r9j26
4017a57J93P1O9k75M5j2K3Q6J92k97k0J76j41j34L5J90K7j12J30j31J78k35K28
4040A29J27l35J18R2q8M9j76m1j4l6J79l30K28K88j70k2r6K74l5j70lJ47r3k2
4064@K01l24L9k29L49R5j04J64k00J31m20K43K37k17J78J3J65l31Jj76J98K59
$$ plain form
4086 272 -116 -84 -233 -48 -188 -77 -196 -45 37 -291 144 -227 -66 -8 2 59 136 246 -189 301 -47 -122
4108 -122 -185 -34 140 271 29 -107 -50 184 48 160 257 14 -51 -140 -148 24 19 52 -58 -43 80 -38 208 -80
4132 -80 -295 -138 74 186 5 -35 -76 -12 -186 112 -100 -132 -121 -32 -11 -214 -112 36 -18 -51 -140 329 -166 209
4156 209 74 51 12 -38 64 60 148 195 127 116 142 -140 89 -15 17 -71 -16 117 62 -178 -49 78 147 -53 95
4181 95 -160 251 -12 -2 71 -60 155 -92 179 -76 -95 36 49 224 -114 352 59 166 -140 -106 171 -8
4203 -8 -153 -203 251 -209 30 -262 -78 -183 110 19 -95 289 -74 140 17 -302 -237 -205 175 -119 24 111
4225 111 -29 75 -2 -46 42 90 136 169 197 69 -196 -26 10 -10 -84 -67 97 19 132 38 91 64 -188 188 62
4250 62 -112 88 216 92 -312 39 37 179 3 192 17 -17 -188 -95 -41 -345 21 -108 75 -196 -226 190
$$ packed form
4086B72l88L2j49J85j40J11j19J51Q2l28M35l71J61N8J0N7P7J10m35M90l48p5
4108a22o3J51J74J31k42j36N7K34j36J12R7k43o5q9qJ72nL3j10J5J23j18K46k88
4132h0k15J57K12J12j81m0m1O4j74K98k12l2J1Q9K1k03J02J48n4l3q9M69m95L75
4156B09j35k3l9n0J02mQ8M7o8j1K6k82K29j04L2q8N5J33n5k40J29J27O9k00J48
4181I5k55M11k63J0P3j31K15k47K71k55j9J31J3J75l38M66k93J07l06L4K77j79
4203hj45n0M54m60K39k92J84j05K93r1j14L84l63K14j23l19O5L2L80k94J43Q7
4225A11j40J04p7m4Q8M8M6L3K8j28k65J70L6k0p4J7J64p8J13r4N3k7k52L76j26
4250F2j74K00J28j24m04L51kJ42j76J89j75l4j71R3N4l04L66j29J83k71l0M16
$$ plain form
4272 190 -46 78 -94 -68 -6 80 38 -174 228 104 194 -110 76 -59 -13 -279 -59 -287 -141 382 30 -13
4294 -13 78 121 116 -48 248 -99 6 -78 -92 -91 -130 40 13 18 50 -44 4 -187 -112 -5 66 -65 44 -167 -110 137
4320 137 -44 -91 -40 66 -105 141 10 96 21 49 74 52 87 22 129 164 183 -139 69 166 99 -59 -197 2
4344 2 28 -28 -76 -30 -118 -16 -138 -17 -60 -155 158 -120 24 99 -140 -126 -19 -47 -54 -204 287 117 49 -4 116
4369 116 -148 -15 12 16 72 70 -183 -31 51 -184 75 -28 -25 -96 -238 160 46 -21 -77 108 -24 -58 -160 -112 256
4394 256 11 74 -63 55 -6 117 -82 118 -69 -139 26 219 163 -215 18 172 -25 244 -118 -138 -33 41
4416 41 149 -174 142 -137 30 98 -91 48 -285 -48 -192 -41 -157 32 -74 -78 -149 -128 -47 -15 129 -116 -74
4439 -74 -197 -60 -137 -7 231 -133 74 -219 63 -74 -144 130 42 312 57 217 23 83 71 168 -39 -66 147
$$ packed form
4272A90k36J24j72K6O2Q6m2k12M02j24R0l04J86j35M6k66K20k28J46N23l52m3
4294a3R1M3nj64K96l47J05q4j4Jl9J70k7NL2r4M8j91P5J07P1j31J09k11N7K47
4320A37j81m7N1J06j71K46j31Q6p5K8K5k2L5o5J07L5J9l22K08R7o7j58j38J99
4344BK6n6m8M6q8J02j22J21m3r5L13k78J44P5k39J4J07k8pj50M91j70o8n3J20
4369A16k64J33K7MN6kk53J52Q2k35K59j03Lp1j42L98j14o7n6J85j32l4j02M8L68
4394B56k45O3j37J18o1J23j99K00j87p0J65J93n6l78K33J54j97K69l62k0J05P4
4416D1J08l23L16k79J67O8j89J39l33K37j44J51j16J89j06mp1K1Q1L2J44k45M2
4439g4j23J37p7J30K38l64K07k93K82j37p0K74q8K70k55J60j94O0j2R7k07k7K13
$$ plain form
4462 147 -39 4 78 -67 -194 -27 58 126 151 50 -77 -24 -165 -105 166 -97 -93 -248 -166 120 84 -17 -174 -196
4486 -196 60 -149 228 265 24 -33 -73 109 -88 66 -59 -82 8 -5 -47 -108 -71 45 -39 -197 -2 59 138 -63
4510 -63 -129 48 -175 192 -194 -197 -50 -225 -9 24 172 65 271 -79 -7 -135 -28 155 -20 46 191 43
4532 43 -39 62 177 122 -37 -50 -52 -67 -124 273 -102 145 118 99 53 -69 -65 154 83 -29 -142 -178 -42 121 -78
4557 -78 -92 -162 -28 -20 -81 -79 162 76 46 -2 -214 100 -78 -32 32 52 100 8 -135 -36 -86 24 88 -252 238 14
4583 14 -206 167 -18 -100 178 112 -245 128 8 246 16 -161 -6 -296 -6 125 88 -135 -109 3 -71 -34
4605 -34 48 -122 222 148 197 153 -67 87 104 -78 154 -20 -150 -6 -228 -3 -221 -37 -108 112 57 -18 -42
4628 -42 -27 -79 -194 100 -316 -194 -102 -167 -89 86 85 86 -67 -129 63 52 -161 61 -131 202 -69 86 37 30 50
$$ packed form
4462A47j86M3P4j45j27J67Q5O8K5j01j27N3j41O0K71k63Mj55Q2K86l6j01j57k2
4486a96K56k09L77L7k41n7m0J82j97J54j25k3R0j3m2o1L7J16q4j58J95O1P9k01
4510f3o6J77k23L67l86lJ47j75K16L3J48j07K06l50P2j28J07J83j75O6J45j48
4532D3q2J01J15n5j59j3kj5n7L97l75K47k7j9m6j22MK19p1j12j13l6J36J63j99
4557g8j4p0J34Qo1KK41q6l0m8k12L14j78M6O4K0M8r2j43R9n0J10O4l40M90k24
4583A4k20L73j85q2K78o6l57L73j20K38k30j77J55k90K90J31l7k23K6J12p4L7
4605c4Q2j70L44p4M9m4k20J54J7j82K32j74j30J44k22K25k18J84p1K20n5p5k4
4628d2J5n2j15K94m16J22R2o5P8J75jJj53o2J92j1k13K22j92L33k71J55m9pK0
$$ plain form
4653 50 -108 90 -246 74 55 57 175 -46 128 -62 222 321 206 -212 -26 150 55 35 48 89 -124 -103 -98 -24
4677 -24 104 -71 -43 -78 -77 -134 -159 101 138 -128 229 -192 -183 310 -226 148 317 -4 209 -16 -32 17 109 -304
4701 -304 95 101 76 -86 -61 129 -126 -210 -50 197 -77 -140 27 -69 -54 33 -26 58 13 37 275 197 21 254 -64
4726 -64 -2 97 85 136 -73 51 174 307 112 100 33 -142 -113 -186 94 -231 95 -113 -36 36 -79 173 -181 -9
4750 -9 -38 -78 187 -49 23 26 199 119 44 -71 21 182 -8 -143 -94 253 -33 153 -68 -152 305 109 70 -197
4774 -197 -149 -30 255 6 -216 -153 -77 -24 -29 272 -83 204 -1 -292 226 9 -215 -38 109 216 69 43
4796 43 -274 -115 -112 -97 -188 44 -50 -61 16 197 8 -56 133 -50 310 93 -67 -213 56 29 98 209 -127 185
4820 185 24 117 193 -185 -12 -35 -97 -5 -224 -52 -222 143 -127 387 -102 -22 -224 -26 126 -109 -17 60 186
$$ packed form
4653E0j58J98l36L20j9KJ18k21J74j90K84R9j15m18J86J76r5k0J3M1k13K1NP4
4677b4J28j75K8l5Jn7k5K60L7k66L57m21RM93n36L74J69l21K13k25j6M9R2m13
4701c04L99Ok5j62K5J90k55q4J60K47k74o3J67r6J5Q7n9Q4m5K4K38p8j76K33l18
4726f4O2R9j2N1k09J24J23J33j95j2o7j75K9p3K80l25L26k08P7P2j15K52l54J72
4750ik9m0K65k36P2LJ73q0p5j15R2J61j90j35M9L47k86J86k21q4M57j96l9k67
4774a97M8J19K85k49k22O3P6N3nL01l55K87k05k91N18k17k24J77J47J07j47k6
4796D3l17J59LJ5r1K32r4j1P7J81j89o4J89j83L60k17j60j46K69k7O9J11l36L12
4820A85j61R3P6l78J73k3o2R2k19J72j70L65k70N14m89Q0k02J98J52k35R2P7J26
$$ plain form
4843 186 -156 161 152 -27 -144 -284 73 134 -43 -129 -71 10 -85 -172 232 166 -148 413 176 -6 -16 69 52 -300
4867 -300 43 108 -163 165 120 203 -158 -44 -115 54 -293 19 -65 -49 204 -209 -145 108 182 -71 135 5 216
4890 216 100 -98 -34 -213 170 -213 -7 48 -162 1 -71 154 -13 67 -201 42 -54 -127 202 -69 -78 149 -166
4913 -166 -132 154 -77 -109 180 -36 -31 46 -19 -65 99 -129 51 40 -102 -53 175 -57 105 -16 97 -2 -135
4936 -135 3 81 -132 -64 149 -59 71 -185 52 -125 -85 -108 -100 216 35 -31 -72 122 -146 228 -109 144 24
4959 24 63 262 -254 308 -130 -8 -188 -140 447 -239 -150 -100 74 89 -85 100 -217 133 69 -85 -291 20
4981 20 -61 -100 128 -319 112 55 64 85 129 222 -92 -39 -7 125 123 184 -134 185 79 -165 241 -178 152 -17 -206
5006 -206 17 41 -47 -95 345 81 135 22 -66 -204 70 223 -131 66 90 121 217 25 166 -226 23 -70 191
$$ packed form
4843A86l42L17rj79j17j40L57O1j77q6N8Q1r5q7M04o6l14N61k37j82j0Q5j7l52
4867c00L43O5k71L28m5Q3l61J14p1J69l47L12q4J6K53m13O4K53P4k53K06j30K11
4890B16j16j98O4j79L83l83K06N5k10J63p2K25j67Q0k68K43r6p3L29k71rK27l15
4913a66L4K86k31l2K89k16NP7o5m6J64k28J80j1j42M9K28k32J62j21J13r9j33
4936a35J38P8k13O8K13k08J30k56K37j77M0k3QL16j81o6m1J94k68L74l37K53j20
4959B4L9J99n16N62m38J22j80M8N87o86Q9N0J74J5j74J85l17L50o4j54k06L11
4981B0q1l9K28m47M31n7RK1M4R3l14N3L2J32kO1l18L19j06k44M06m19L30j69j89
5006b06K23K4q8m8M40k64N4j13q8j38K74J53l54J97K4L1R6j92J41l92K49r3K61
$$ plain form
5029 191 13 -107 52 168 41 -68 76 -171 216 -245 -52 -44 12 109 -142 4 -38 100 -83 143 39 41
5051 41 -112 -247 57 -1 289 -74 -96 52 -137 143 -211 -5 -53 -159 -145 -25 -11 -235 -53 -103 -68 -96 4
5074 4 171 12 -60 -31 44 -42 -73 -220 -78 -97 -131 155 54 143 -21 -71 137 41 114 -60 -59 -15 100 122 149 31
5100 31 152 -50 -4 210 1 -70 72 -31 -159 262 -48 -50 -48 0 -73 -141 278 -100 -47 -124 -55 107 108 142 -102
5125 -102 -112 75 -42 48 150 -10 7 -36 43 -60 67 -44 63 -43 -68 -253 57 95 137 -52 51 79 -4
5148 -4 -5 32 128 83 -18 81 7 38 131 -10 -72 -353 -1 -114 24 34 -80 -47 53 -124 -49 -3 -34 138 4 446
5174 446 -70 227 325 32 -223 -180 -4 -3 553 49 -216 68 -90 -42 -364 171 -357 -120 -245 -95 -168 -368
5196 -368 63 -49 191 151 83 72 12 -169 -352 518 7 -52 140 -27 99 -3 145 -87 178 -148 -54 9
$$ packed form
5029A91j78j20J59J16j27j09J44k47L87m61J93QN6R7k51J46m2J38j83K26j04K
5051D1j53j35L04n8K90l63k2J48j89K80l54K06m8j06J4J20J4k24J82n0L5k8J00
5074DJ67j59p2K9P5q6l1j47J42j9l4K86j01Q9j64n0K08r6P3j74JM4J15K2K7j18
5100C1J21k02M6K14k09p1J42j03j28M21l10kKM8p3o8M19l78N3p7O9J62JL4k44
5125a02j0J87j17R0J02j60J7m3P9j03J27j11J07j06k5j85L10L8M2j89J03K8q3
5148djL7R6m5j01R9p4L1R3j41o2k81L52j13J38J0j14L3J00j77P5M6l1J72j34M42
5174D46n16K97R8k93k55M3J76JN56n04k65K84j58M8l22N35n28K37j25J50p3k00
5196c68M31j12K40m0o8j1o0j81j83Q70n11n9J92j67J26j02J48k32K65l26R4O3
$$ plain form
5218 9 -36 -89 -103 -48 -54 -187 -41 -77 -72 -45 12 105 -38 -334 41 118 16 144 142 393 74 103 -108 197 -171 194
5244 194 -70 89 102 -43 306 4 -65 -199 263 1 -132 -118 -280 50 -53 -129 -56 -112 -132 -126 286 26 -185
5267 -185 262 187 65 40 3 -144 154 -31 25 194 77 -16 44 30 -292 45 26 -135 -56 -103 -77 -208 90 -56
5291 -56 -136 26 2 43 -221 155 44 58 55 -85 -91 114 83 29 285 9 80 53 -69 105 -39 43 -48 162 220
5316 220 33 -151 -80 -19 131 -47 -89 291 54 34 5 92 50 -53 -249 -185 -6 -15 214 241 -20 -78 -120 -60 -211
5341 -211 -232 50 43 -106 43 -27 -104 183 -77 235 -85 -66 40 -142 27 -237 173 -127 -27 -18 -125 -50 -73
5364 -73 -19 9 76 37 232 -214 152 190 -104 39 82 254 -51 87 191 -21 -63 -49 52 -59 166 50 183
5387 183 93 8 62 -161 -64 -423 -123 -202 -118 89 17 93 -46 84 -248 173 -2 -239 187 -6 145 6 221
$$ packed form
5218Im5n3j4N5oj33J46l6NK7N7R3j43k96L75P7j02J28kK51l19K9k11L05l68L65
5244A94k64J59J3j45L49l02o9j34M62k62j33J4j62L30j03p6P3n6k0OM12k60k11
5267a85M47p5j22k5l7j47K98j85N6J69j17r3O0j4l22L37j9j61P9m7K6j31K98j46
5291e6q0J62k4M1k64L76j11J4lj40oK05l1n4K56k76P1k7j22J74j44Q2r1K10N8
5316B20j87j84P1O1J50j78m2L80k37k0k9Q7m2j03j96O4J79rK29K7k61n8m2O0j51
5341b11k1K82pj49J49p0p7K87k60L12l20J9J06j82J69k64M10l00J00Rj07P5k3
5364g3N4K8O7l9J95m46L66L8k94J43M3J72l05J38J04k12m2J4J01j11K25j16J33
5387A83r0q5N4k23R7l59L00p9Q4K07p2P6j39J30l32M21j75k37M26j93J51j39K15
$$ plain form
5410 221 -86 -94 -43 -132 93 -226 -23 -206 197 111 21 23 -55 -9 14 64 -118 48 29 113 50 9 -88 -286 11 -277
5436 -277 -51 -135 -132 293 -217 37 -167 192 -61 41 -216 156 -66 45 -33 -177 153 165 53 -16 -312 178
5458 178 149 -144 44 -118 -138 213 196 -154 -126 -245 57 49 12 87 -91 -176 25 39 -35 466 -223 -61 192 46
5482 46 94 -28 164 -241 -158 36 -246 -44 -14 154 -96 217 62 5 8 -25 151 -290 4 -228 -29 52 -21
5505 -21 111 101 303 -89 -110 -181 61 -52 -94 63 -329 27 15 192 52 -111 -81 83 -124 257 3 -97
5527 -97 218 -15 32 102 -214 203 -109 207 91 28 48 234 10 -58 -24 -63 -21 -26 89 144 191 -116 -66 91 -135
5552 -135 40 -42 152 36 -20 -8 -336 170 -213 150 171 -28 181 -94 -125 -55 116 -134 168 207 -224 -28
5574 -28 132 30 132 -205 40 28 -38 -171 13 90 -54 -132 -5 22 33 -68 -71 39 -313 31 -158 -147 75
$$ packed form
5410B21l07qN1q9K25l19K03j83M03q6r0Kp8M6K3N0j82J66j9Q4o3m1r7j98K97k88
5436b77K26q4LM25n10K54k04L59k53J02k57L72k22J11p8j44L30J2j12o9k96M90
5458A78k9k93J88j62k0L51j7l50K8j19L02ql7P5j78q5K01J4p4N01o89J62K53j46
5482D6M8j22J92m05Q3J94k82K02L0J68k50L13j55n7Ll3J76m41K94k32J99Q1p3
5505b1J32j0K02l92k1p1K42j13m2J57l92L56j2J77j40j63L0J64k07L81k54j00
5527i7L15k33M7P0l16M17l12L16j16o3K0J86k24o8L4l9M2nJ15N5M7l07N0J57k26
5552a35J75q2J94j16n6J2l28N06l83L63K1j99K09k75l1P0J71k50L02L9m31J96
5574b8J60j02J02l37K45j2o6j33J84P7j44p8J27K7J1j01lJ10l52L44j89J1K22
$$ plain form
5597 75 -150 70 -137 201 -241 -2 48 264 -73 -133 -70 79 224 -262 144 -43 -74 -179 65 85 -45 -72
5619 -72 -27 -81 -9 -16 150 13 178 63 117 66 197 1 7 -214 -209 -108 -345 178 14 164 -105 -122 -311 -114
5643 -114 -35 -32 -237 -135 -25 -108 -129 -263 -44 -341 -141 178 -38 -197 -4 106 248 -46 16 -32 320 65
5665 65 -82 68 -43 106 -125 -121 -172 -44 -62 -207 103 -145 110 -150 -28 118 -172 127 -145 1 7 218
5687 218 -268 214 -69 275 86 -234 -60 -113 201 -134 52 194 166 166 58 -45 -157 -262 -48 -237 -101
5708 -101 -143 -98 -119 -428 -138 185 135 -22 -69 -124 109 69 232 -103 20 127 56 67 -283 26 70 119 113 -179
5732 -179 -142 46 -10 -127 20 42 120 -39 171 20 -98 -46 -238 236 153 -37 1 -3 -99 -115 125 -135 204 -37
5756 -37 239 -101 -173 241 -5 28 -201 195 67 -62 94 85 22 -223 25 173 115 79 -6 132 -187 -16 57
$$ packed form
5597G5k25K20k07L38m42K39N0K16l37o0O3J49J45m86M06j87l1j05K44K0j30k7
5619g2M5n4P2pJ66j37J65j15N4n1J31j96Ok21NJ01k37N23j64J50k69j7j89J97
5643a14P9Lk05J02J10q3k1j34K19k97K00L19k16j59J93J10J42k94O2m8L52k55
5665F5j47J50j11J49k31Mn1J28j8j45L10k48K55k60J22J46k90K99k72J46OK11
5687B18m86M82k83L44j89l20J74n3L14l35J86J42k8%j08j03j12j05K14j89J36
5708a01m2M5k1l09K90L23n0j57m7n5K33m0J63l35J23J07p1J1l50L09M4M9ok92
5732a79L7J88n6j17J47K2P8j59K10j51j18N2j92M74q3j90L8mr6j6K40k60L39k41
5756c7K76l40p2M14k46L3k29L96j28j29J56ro3k45K48J48n8l6q5J38l19J71P3
$$ plain form
5779 57 125 -91 8 -105 -169 157 287 -28 -11 -64 102 -57 -33 13 5 12 70 147 -96 -7 43 9 -171 -184 -148 187
5805 187 -69 161 -46 -173 28 93 -176 30 409 111 -84 89 -75 -43 -6 -91 -71 212 -371 209 88 -32
5827 -32 141 -103 96 41 286 -101 247 1 -80 41 -42 41 -92 42 -107 -27 146 259 183 11 20 -187 -65
5850 -65 119 -178 -71 -167 -291 38 -6 18 -348 181 68 -12 68 156 -79 -107 -90 -48 131 -154 -182 68 -110 -153
5874 -153 178 15 52 24 -135 93 -335 245 -25 87 -120 9 137 -71 -60 3 230 39 -59 -24 -24 42 -345
5897 -345 -39 -113 -51 279 -194 -79 191 90 -336 -175 -77 49 -58 -77 213 81 -113 -36 197 -87 -89 -190
5919 -190 59 -23 14 166 -224 59 45 -218 24 -65 119 111 32 -59 198 -109 38 -86 20 5 158 384 -225
5942 -225 69 27 -50 51 -173 -118 112 -220 -68 4 -151 -130 135 109 -71 -5 39 -27 -239 23 230 -139 -146 31
$$ packed form
5779E7O8k16R9j13o4L26J30l15J7n3J66j59K4M6qPN8P7k43Q9N0l4j80j3L6L35
5805A87k56K30k07j27K01O5k69K06L79k98j95J73j64L2L7q5K0K83n83N80j21j20
5827c2J73k44J99n5K45l87L48k46q1J21q3Q3j33J34j49Q0J73J13p6j72Rk07J22
5850f5J84k97J07r6j24L29m4K4l66N29j13q0Q0Q8k35k8J7M2J79k85k8K50j78m3
5874a53L31j63L7k8j59K28m28N80k70J12k07J29J28k08J1O3K27j91r8L5%O6l87
5897c45L06p4O2L30m73J15K70j01m26J61R8J26j07j9K90j32j94P7K33k84kj01
5919a90K49q2L7J52l90K83j4k63K42q9J84qp9r1K57l07J47j24J06j5J53K26o09
5942b25K94m2p7J01k24N5K30l32J52P2j55K1K65k6j80O6M4o6k12K62K07l69pJ77
$$ plain form
5966 31 -90 68 23 -185 126 31 -23 -103 122 280 -156 -33 183 130 -32 -138 -112 173 -69 124 -21 -68 180
5989 180 -219 -52 -247 -115 24 -101 123 -30 -105 -96 -26 20 81 -27 -4 90 -128 -91 62 -32 -38 -137 -79 -14 248
6014 248 81 38 -125 -322 12 -11 -157 -118 132 -92 127 -164 45 264 -81 -128 -209 27 -144 -70 104 87
6036 87 -393 -80 28 -133 -196 -132 53 -13 71 -80 -118 -4 -289 -79 -229 267 -119 125 293 -44 14 16 -180
6059 -180 -187 197 118 145 51 5 -269 72 124 -77 8 -195 21 -132 -66 -275 -48 79 -130 194 112 -41 139
6082 139 212 -266 -55 -12 -105 -221 -16 -90 193 -37 -49 162 -201 -220 61 -203 2 -14 -67 -31 -43 -150 -145 -177
6106 -177 -141 -46 0 -91 139 78 50 -46 20 15 72 -49 -13 32 -103 -94 -63 -193 -27 239 -146 64 -159 19 -313
6131 -313 163 -232 -66 45 146 40 -153 -58 219 113 13 70 -132 -13 302 209 32 35 127 -151 230 -25
$$ packed form
5966C1j21J58m5k08L11r5n4q0K25J58m36J23K16n3j62j06K6K85k42J93j45m7K48
5989A80l99J67j95J32J39j25K24j53p5RP0M6O1j08K3R4k18L7J53r4or9N8O5K62
6014B48j67m3j63j97L34k3j46L9K50k24K19k91K09K19l45m7q1K36j71P4J74j7
6036H7m80L13J08j61o3O4J85o6Q4j51l8J14k85K10j50M96l86K44J68l37N8Kj96
6059a80pL84p9K7r4m6k74L41N2k01Q5k03K16j53O6k09K27J27k09L24q2j53J80
6082A39P3m78K11M3r3j16K05p4K83k30j2K11l63j9K81k64K05j6n3L6j2j07Nl2
6106a77L6R5M6r1K30o1k8r6O6nN7j21L6M5j35RL1j30J66K66l85K10k23J78l32
6131c13M76l95J66J11J01j06j93R5K77j06j00N7k02J19L15r3j77LR2k78L81k55
$$ plain form
6153 -25 -352 -101 -61 -89 -97 238 -169 -19 -68 12 51 -59 38 90 -12 -107 -105 93 145 57 22 -7 -330 57 59 25 -5
6180 -5 -106 195 -218 123 11 281 247 132 -53 37 101 -137 138 -91 -82 -138 -113 162 -9 29 -93 269 229 112
6204 112 -53 -57 -24 -89 -62 -219 91 -197 12 -50 116 -16 82 -82 -243 -1 111 151 43 -190 45 35 166
6227 166 -114 91 47 -22 160 127 154 -38 -204 2 62 -67 89 134 -125 16 -16 121 -41 57 151 -288 145
6250 145 97 -76 12 -210 -37 -6 54 -146 -93 -196 169 111 8 3 -54 175 142 -20 -82 -112 -123 -103 -27 -78 -108 179
6276 179 -178 -171 -83 -53 -59 173 93 -7 -88 -30 59 3 -95 -96 41 -237 242 -65 21 17 -225 3 213 305 -192 -77
6302 -77 -77 108 -66 133 258 -63 300 -131 176 24 182 -129 33 -37 28 56 -4 190 -95 305 -40 -20 -203
6325 -203 323 -75 -155 -146 179 -106 55 -185 19 168 -53 10 -67 -496 -196 -2 -38 -44 -152 65 -125 234 66
$$ packed form
6153b5l27K51M0k8qL35m07J50m9Q0L9j10R7N2j02r5KJ98N2q8l5k9l23L87Kl4l0
6180ej01L01m13L41j12K70l4j15j85R0O4k38K75k29Rn6K5K75j71L8j22L62m0j17
6204A12j65mL3o5K7j57L10k88K09o2J66j32R8j64j61K42J12M0j08k33K35j0J31
6227A66k80K05m4o9J82l3K7j92j66K06O0j29J56M5k59J41l2J37j62R8R4m39M33
6250A45m8j73Q8k22J73L1O0k00N3j03L65n8j03nn7K29l3j62o2l0j1K0P6n1l0K87
6276A79l57PQ8L0oK32q0j00q1N8Q9n6r8jJ37k78M79l07Q6mk42K28K10R2m97J15
6302g7%J85j74J99J25l21L63m31L07j52J58l11J62p0O5K8o0J94k85M00l45K0j83
6325b03N26l98q0RL25k85J61k40K04J49k21O3p7m29L00J94l6oj08K17j90L59j68
$$ plain form
6348 66 -135 330 43 50 166 11 13 -7 41 -84 -143 -299 -62 37 -69 -50 -118 -181 36 -4 16 247 -13 147 110
6373 110 -14 -17 -19 345 -83 -158 -262 88 55 53 -75 -181 139 -190 -133 -235 -31 -257 -35 84 74 230 -108
6396 -108 -180 87 -92 305 62 42 -46 178 -114 160 -115 -138 -28 -179 232 -54 75 -73 -88 68 291 145
6418 145 -340 -18 -51 143 -158 83 32 -37 -106 20 113 -85 149 -53 47 -143 -15 -53 -100 15 -245 -102
6440 -102 63 -68 77 26 41 -127 239 -68 52 27 -85 -79 -24 39 -205 204 130 -26 62 -163 -3 -74 -34 -109
6464 -109 -177 -93 75 48 -47 207 -59 169 -33 -18 -105 114 71 -115 218 -13 119 49 47 39 -380 103 -6 -53
6488 -53 -212 -147 -131 122 270 -202 81 -85 139 -37 237 -150 8 93 -95 195 -41 51 114 -38 -46 86 58
6511 58 65 77 -68 39 -69 292 -63 230 127 -185 167 62 -62 -107 -105 -113 -194 22 -171 124 -78 90 -149
$$ packed form
6348F6k01M65k87PJ16j55Kk0M8j25n9j56K37R9j06J9o8o3K17m0K0K31k60J60l7
6373A10j24lkL64m28p5j04L50l3kj28j06L20l29N7j02K04k26K22J19j0J56l38
6396a08p2K67j79L97k43k0q8K24k92K74k75k3J10j51M11k86J29j48j5J56K23j46
6418A45m85L22l3J94l01K41n1o9o9J26R3j98K34k02J00j90J28l8m7J15k60J43
6440a02J65j31J45n1J5j68L66l07J20k5j12ON5O3k44M09p4j56Q8k25J60p1M0p5
6464a09o8Q4J68k7r5K54k66K28k02J5q7K19m3j86L33k31J32p0kqm19M83j09m7
6488e3j59O5J6K53J48m72K83j66K24j76K74l87J58Q5j88K90k36R2O3j52qJ32k8
6511E8PJ2j45J07j08L61l55K93j03l12L52j05j24m5Kqq1K16j93K95k02J68k39
$$ plain form
6534 -149 -79 -3 -144 -146 380 72 271 84 -32 -173 86 -163 -173 -45 119 -120 -85 -151 -167 124 -55 130 -114
6557 -114 71 20 -12 -93 -152 -13 -110 -171 -107 65 -85 -66 11 -131 -5 130 219 -218 153 60 -69 -152 -338 2
6581 2 -107 -102 -83 25 -64 55 -38 -26 121 88 53 33 -192 -187 38 136 -162 217 -155 -8 150 190 6 169 -60
6606 -60 -151 131 -120 -142 80 240 65 62 -44 -73 237 168 -1 260 -154 -61 -156 -68 -10 97 -44 52 -33 -178
6630 -178 61 -135 160 53 -141 22 201 -36 4 64 176 97 81 103 57 186 55 -58 203 -182 -165 132
6652 132 50 -6 107 -164 -152 27 -36 48 -70 -35 -82 16 68 108 13 234 3 -204 167 -16 166 -91 -132 58
6676 58 44 2 -149 16 158 -207 -22 -83 -35 73 40 132 -194 27 65 73 -36 -158 -179 -69 10 -316 -90 2
6700 2 60 -10 -68 -167 -150 -42 -52 4 -41 93 42 47 -45 -6 -75 -90 289 62 46 109 -68 28 -74 -124 -165 208 -84
$$ packed form
6534a49P0P6j41kN26l08J99j87j16j41K59k49j0J28J64k39L5o6j6K91j79J85k44
6557a14J85n1l2q1n9J39r7o1O4J72j50J9P7j42J26J35Q9m37L71r3j29q3j86L40
6581Bj09NJ9J08q9J19r3J2J47l3l5k0k25NK25R8k98L79l72J47J58M0j84J63k29
6606f0r1K82k51k2K22J60j75lj06k9L10o9j69K61m14R3r5Q8N8J07j41R6q5j45
6630a78K39j96K95j07j94J63J79k37M0O0J12p9j6K2m6J29j31j13K61l85J7K97
6652A32q2n6J13k71J2J79o3Q4j18L5m7R8N2M0r5K21k31k07L71j83J82k57m1J90
6676E8j4m2j51J65J42l65J85o1M8J08l3R2l26K21L8Qj09j22k1J10P9l26K26R2
6700BN8p0n8r9J7J08j0N6m5J34n1Nr2L9o9j5L79k27j6O3j77R6j02n0m1L73k92
$$ plain form
6727 -84 58 162 -17 -29 -20 32 -44 -9 67 198 20 195 49 -40 -3 -46 -86 8 180 -82 -135 76 -1 -15 -25 254
6753 254 67 156 79 120 42 142 128 -66 -178 141 -57 -130 61 -187 -33 98 119 -22 -53 120 52 -52 186
6776 186 119 51 39 51 85 140 44 -454 199 -176 -123 -117 78 91 -57 -32 51 44 -30 31 149 121 -125 -56 -36 -48 111
6803 111 -196 -8 -25 -36 -189 -17 171 -133 -55 -75 71 -37 -69 -149 159 15 -304 301 -68 -156 74 -49
6825 -49 245 135 3 -91 -92 -36 18 171 -133 -127 -121 10 -15 40 -124 -121 76 -18 121 11 -302 -136 -81 -9 -86 -261
6851 -261 -242 2 -215 -104 -189 -125 15 -26 179 49 -152 -19 -1 -56 232 -59 -28 70 -241 -103 -125 -28 74
6874 74 77 125 123 145 138 -9 -87 1 -176 -186 -5 -17 144 -12 -9 160 -76 83 18 -173 109 235 -23 -127 55
6899 55 -203 -134 124 78 -103 196 -37 -152 -49 -19 -135 -40 17 18 150 -102 33 87 -75 -137 -234 -134 -73 145
$$ packed form
6727h4J42J04j79j2RN2p6L5P6J31j78J75j46q9L7m3m0R4J72k62n3K11p7j4j0K79
6753B54j87Q9p7M1p8J00j4j94j12L19j98p3J91k48J54J31K1j41l1J73o8j04K38
6776A86o7o8j2J2L4N5r6m98O53l75N3OJ95J3j48K5Q3pp4O1J18k8k46O9K0j2J59
6803A11l07J88j7j1j53J72J88l04P8k0J46j08l2q0L08j44l19O05l69q8K30j23
6825d9K94j10j32r4jN6N4J53l04OOJ31k5N5j64LJ97r4J39j10l13J66N5P2p7j75
6851b61J9K44k17J11q5O4J40m1K05j30k01J33J8n5K88k91L1R8l11J38k2R7J02
6874G4LM8kK2pj47p8Q8j77j0J81j2J61j56LJ69k36J59o5j91K82J26k58j04J82
6899E5k58O9K58m6j81K99k33j15J03L0j16R5N7JJ32k52J35N4j62o2r7J00O1K18
$$ plain form
6923 145 -151 13 -297 314 -19 -99 -7 -125 15 -54 93 -116 -9 306 -106 110 150 32 6 -49 160 -214
6945 -214 307 -149 -95 278 24 -9 -80 80 -277 139 85 364 -138 -181 -189 -9 69 -24 228 53 42 65 -99 -188
6969 -188 -139 -43 142 -85 -132 -176 27 -63 329 -115 52 144 -62 -74 20 -41 -65 17 202 202 -160 1 -301 -153
6993 -153 41 -256 -94 133 -2 6 -82 -109 -7 -142 -86 5 -42 -204 -85 148 147 34 41 -152 -168 160 67 -38
7017 -38 81 -198 -18 130 4 169 103 115 -99 6 12 201 76 -37 17 31 60 -209 165 -163 -128 -76 -69 0
7041 0 -74 -81 -7 22 106 -165 -177 -96 21 -109 -133 -67 31 -234 -61 115 -396 73 -5 41 -226 117 9 -109 53
7066 53 -138 -164 -26 76 -6 78 -212 230 81 -40 -78 72 -92 265 -261 96 -216 72 155 -105 146 -129
7088 -129 58 16 184 126 10 184 1 19 -81 55 -3 -42 11 322 218 -100 343 -71 87 -9 -130 -146 35
$$ packed form
6923A45k96J64l10O11l33q0R2j18J40o9J47k09J07L15m12K16M0j18k6n5K09l74
6945b14N21m56N4L73k54l3p1J60l57M16n4K79n02m3qJ80P8r3K52j75j1K3j64q9
6969a88M9R6J85k27m7m4K03r0L92m44J67R2k06j2R4o1k4Q2J85%l62J61l02J48
6993a53J94k97J62K27j35Qq8k7J02j35N6R1m7j62J19K33jj13Pj93j6L28r3j05
7017c8J19k79J80J48j26J65o6J2k14J05OJ89j25j13N4J4K9k69L74l28L5N2PO9
7041@p4pP4K9Q4k71j2Q1J17j30k4O6R8k65J73J76n11M69p8M6k67L43j08j18J62
7066E3j91k6J38J02q2Q4k90M42j49j21l8J50j64L57n26L57l12K88Q3k60K51k75
7088a29J87m2J68n8j16J74j83J8j00J36n8l9N3L11j04l18M43m14J58r6j21j6J81
$$ plain form
7111 35 -194 -119 242 -135 144 -104 231 32 15 48 -144 9 -91 46 8 56 -22 -279 66 -242 19 130
7133 130 104 212 -186 106 37 137 105 84 108 193 258 -105 -170 -38 96 208 143 31 98 -36 -25 78 29 -166
7157 -166 66 199 10 -18 11 15 103 -62 -55 -231 125 213 -31 21 -74 41 -143 11 -225 64 -248 -85 -37 24
7181 24 -59 31 229 46 21 -272 -184 33 -229 33 75 -84 164 -120 -139 103 2 12 89 179 -132 81 -91
7204 -91 205 -2 -99 114 197 -91 -108 -55 -63 -169 65 76 -256 141 -318 -121 -18 0 -81 -101 158 -71 -30 96
7228 96 271 -6 176 -54 -412 36 4 99 -124 53 162 138 200 -25 97 107 -71 369 184 223 46 206
7250 206 124 -140 -84 214 -114 80 -10 -52 250 -73 19 -123 75 261 24 9 -127 115 -81 -55 121 -222
7272 -222 60 -42 -210 78 -207 -50 19 75 215 15 -1 223 7 -31 -22 -241 90 -89 148 12 80 157 -177
$$ packed form
7111C5k29P5L61l77K79k48L35j99j7L3j92J53j00J37l8M8p8k57L45l08K61J11
7133A30k6J08l98K92o9J00l2k1K4Q5O5l63o5J32J34J12o5j12O7j34J1J03m9j95
7157a66K32J33j89k8K9MQ8j65Pj76L56Q8k44N2r5J15j84J54k36K89l12J63M8O1
7181B4q3R0J98j83k5k93Q8K17k62K62M2j59K48k84j9K42j01J0P7R0l11K13j72
7204i1K96k07r7K13Q3k88j7N3qj06K34J1l32L97m59J97J03J8q1k0K59k29M1J26
7228I6J75k77J82k30l58M48l2R5k23J77J09k4O2k25J22J0j78M40j85L9j77J60
7250B06q2k64N6K98l28J94r0m2L02l23R2j42J98J86k37j5j36K42j96K6J76l43
7272b22K82j02j68K88k85J57O9N6J40k00j6K24k16l8Rk19L31j79K37j36O8P7l34
$$ plain form
7295 -177 236 102 58 105 197 -14 -92 36 95 215 20 -43 -257 3 -176 39 -93 127 200 155 -47 27 -72
7318 -72 -69 45 51 60 62 -82 -99 174 -2 -265 41 279 -78 16 -164 91 26 183 -75 -142 -53 -71 105 16 202
7343 202 287 -124 -170 -118 -86 -72 37 -123 65 47 -11 66 255 42 6 165 39 -105 -188 34 -310 192 290 -22
7367 -22 -139 -205 5 -160 173 -26 0 -3 -32 85 -96 206 -127 -122 127 3 -16 -98 -48 -28 -68 214 39 43 -9
7392 -9 17 -74 67 184 183 178 50 -72 -100 -173 -29 66 -97 7 33 93 87 -158 20 202 -133 108 -214 28 -143
7417 -143 -29 75 -26 -19 185 139 -54 -97 -6 241 -86 -88 -195 -95 5 27 -5 -85 -16 -17 -209 67 40 -110 182
7442 182 27 46 -84 -24 107 -46 58 132 158 247 -146 90 183 -11 -102 46 -73 -76 35 58 -60 208 -293
7465 -293 285 -71 249 59 -2 267 -221 1 50 -27 -94 143 -148 -42 -2 -64 20 0 -59 -55 67 -222 120 4
$$ packed form
7295a77M13j34m4M7R2k11p8J28N9J20j95o3k14K60j79K15j32K20P3m5k02P4r9
7318g2LJ14ORKj44j7K73j76k63L06K38l57R4j80K55o5J57k58o7Q9j8J76q9J86
7343B02Q5m11m6N2L2J4J09j60J88j8n8P7J89k13l6J59j26j44q3K22l44N02R8l12
7367b2j17o6K10j65L33j99K6lk9J17j81L02l33NK49j24j9q2N0K0m0K82j75Mn2
7392iK6r1J41J17jnj28j22k8p3J44R5j63J04K6O0ok45J78J82l35K41l22K42j71
7417a43J14J04j01PK04m6j93m3R1K47l27kj07J00J00K2l2q0O9jj92K76k7j50K92
7442A82j55J9j30O0J31j53J04P4K6Q9l93K36R3j94r1J48j19lJ11K3j18K68n01
7465b93N78l56L20j90o1K69m88K22M9p7o7K37k91J06M0o2Q4k0n9MJ22k89L42j16
$$ plain form
7489 4 -302 -83 6 -36 -49 -122 43 323 -67 -79 180 -142 -186 -120 53 -149 -190 226 21 91 114 -51 81 189
7513 189 37 99 80 188 82 -125 143 203 226 76 -21 89 35 -21 31 17 -11 56 153 232 44 -136 10 38 60
7538 60 35 121 61 30 51 16 -283 -43 -5 -316 60 123 35 263 -236 112 108 168 22 -2 109 -298 236 126 50
7563 50 7 -49 -78 127 54 28 -61 105 174 227 157 60 -2 273 153 200 -220 -113 -165 230 -87 3 3 132 194 -162
7589 -162 29 17 85 -239 364 279 -69 -27 304 21 39 130 -300 -65 -8 -78 -187 -57 45 8 58 -72 -4 82
7613 82 0 316 123 32 90 -59 374 -111 -3 -203 -21 108 -72 193 -86 217 -145 -53 -32 147 -9 168
7635 168 -9 88 209 42 206 -34 71 -176 -307 115 50 55 -65 -182 -35 36 -200 -252 60 41 -70 -208
7657 -208 283 -255 99 84 155 106 -199 -21 -111 6 209 64 -84 -23 -24 268 -30 3 -10 86 46 44 -196 25
$$ packed form
7489Dl06K19Q9m2j3p3J65K80l90j2K59l22m4O6J73k02m1M16k05P0K3j65J32J08
7513A89j52O2j9J08j06k07K68O0K3j50r7J10n4n6N2j4k8O7R7P9j88j80J46K8K2
7538F0k5Q6o0l1K1l5k99K40L8l11L76O3q8K28m99L48mO0j46k4J11m07N34j10p6
7563E0m3n6k9K05p3k6q9J66O9N3p0r7o2K75j20M7m20J07n2L95l17R0%J29O2l56
7589a62J91j2O8l24O03q5l48M2L31k83J8R1m30K35N7p0j09J30J02l7N0j30O8Q6
7613H2q2L16j93r1N8j49M33m85J08k00J82J29j80K65k79L03l62R2K1J79j56J77
7635A68j77R7J21j67J64k40J05k47j31M22o5Nj20j17J47P1k36n2L12j9j11j38
7657b08M91n38L54j5P1m9l05J78r0J17K03j45j48O1jK92k98L3j3R6m0kk40K21
$$ plain form
7681 25 71 -3 -30 324 49 196 -41 -108 14 12 126 50 32 -91 64 198 19 -122 -70 -78 -13 54 -208 -60 42
7706 42 -188 31 -61 -62 78 -21 18 122 26 49 136 -209 30 -118 -227 96 -157 -71 -139 -43 -6 1 -133 -52 97
7731 97 -203 -52 -33 -7 -62 -29 32 -133 65 -32 -11 10 -80 24 5 52 -97 77 -72 83 120 70 23 -137 -125
7756 -125 -97 -25 -99 -30 63 49 -119 -103 92 100 85 40 23 38 -91 -24 -35 7 166 157 9 35 43 -206 95 -34 -5
7783 -5 13 25 266 -339 -21 -30 99 225 -126 134 -15 -95 -115 -50 163 -62 -75 172 83 133 -289 -162 9 -30
7807 -30 -108 86 -59 26 122 111 -155 11 -10 -125 146 68 -31 -21 115 -193 -132 95 19 -96 112 -186 -117 -155
7831 -155 13 -202 -80 2 -7 -50 -24 -284 -147 31 28 -59 138 0 8 -50 168 21 -237 -9 -300 50 -125 -132
7855 -132 -182 -102 -92 82 -100 -9 -107 -33 16 -187 -42 45 -127 94 -91 -37 13 -5 -87 5 134 92 -175 28 13
$$ packed form
7681B5M6p4k7L54k75J47k37o7J22kJ14p6j8j23J55J34j79j41N2qO5O7k62J48J02
7706D2k30K19r2jJ40r9L9J04r6K3Q7l45K39j48j09L23k53Q6o8R6L7Pj34Q1J49
7731I7l00J51J9K6n5L3O1j65J98r7K1K1r0J04j9M7j49J74j49J55L7n0m7j60J2
7756a25K8P2p4O9R3j4j68J6J95Qj5m5j7J5j29O7j1M2J59rj48K6Qk49L01j29K9
7783eJ8J2K41o05L18rJ29J26l51K60j49q0k0O5K13k25j3K47q9N0m22J27J71l9
7807c0p8J94j45Q5R6j1k66J66k1j15K71p8r9J0J36l08O1K27p6j15K08k98O9l8
7831a55J68k15J22Q2rm3K6k60J37J78lq7J97j38Qn8K18j47k58K28k91L50j75p
7855a32n0Q0J0J74j82R1r8P4M9k03J45Q7j72K21j85N4N0j8q2R2J29m2k67K03j5
$$ plain form
7880 13 25 -58 54 -160 141 209 -39 50 39 -61 -99 156 -71 146 -12 0 -61 35 -208 180 180 35 298 -29
7904 -29 38 -20 -60 6 -137 -151 -137 99 221 44 0 95 89 -81 162 -54 90 -143 -17 -10 121 216 -67 114 -97
7929 -97 -124 180 -116 31 92 -214 -60 163 67 -18 297 86 0 -66 118 -94 95 -196 192 83 -218 79
7951 79 -92 132 -79 -3 -138 -27 112 154 -191 130 179 -98 42 -48 -42 -61 -40 -41 -142 93 208 -112 241 138
7975 138 -48 -38 -37 -313 118 -84 -99 -44 117 -47 -49 89 -20 -111 -43 -25 -26 199 -155 -104 59 -75 222 -74
7999 -74 4 -59 -96 -16 11 -39 -60 246 -37 -140 252 -102 17 187 -42 -272 -139 -150 -150 -24 86 62 -12 -13 -44
8024 -44 162 -39 -231 -22 -16 -5 -138 -19 -12 51 67 -216 102 -127 -163 -61 259 -7 334 67 -55 66 -88
8047 -88 158 -170 -122 272 53 -24 43 21 179 -106 89 -63 -217 -4 -68 61 33 -102 45 15 -52 -3 -242
$$ packed form
7880A3J2q3J12k14L01O8k48Q9j1j00l8K55k27K17j58J2o1R6k43L88%j45K63l27
7904b9O7n8m0O6j43j4J4K36J22j77m4R5oj70K43k16J44k33J26PJ31R5k83J81k11
7929i7k7L04k96J47O1l06J54K23r6q5L15k11q6o6J84k12J89k91L88j09l01K97
7951G9j71K24k11P6j35J11J39M2l45L21M9k77J40r0Oj9K1jj01K35J15l20L53j03
7975A38j86J0Jk76M31k02j5N5J61j64kJ38j09r1O8J8jK25l54N1J63j34K97k96
7999g4P8o3l7Q0K7n0k1L06k83j03L92l54J19J70k29k30J33j1%J26J10k4p4jl1
8024d4K06k01j92K09OJ1j33J19PO3J6k83L18k29l6J02L20k66L41k67j22J21j54
8047h8K46l28M8L94k19p7O7k2J58k85J95j52j54K13o4J29k8j35J47l0o7M9k39
$$ plain form
8070 -242 81 -149 99 -165 47 -7 -26 158 -295 82 63 -203 96 -7 125 -155 60 65 -18 -83 68 193
8092 193 -165 -172 -38 -6 -67 67 111 -76 -8 -70 -40 -74 -10 -11 -147 140 129 53 -91 37 -211 186 -66 123 142
8117 142 96 265 -19 88 -66 198 196 -76 -309 11 221 4 -79 -285 -61 -100 -35 25 175 305 99 212
8139 212 -150 200 176 42 -168 -142 53 -30 -111 -183 96 39 -28 192 -100 -29 156 125 -83 -137 -86 46 96 -150
8163 -150 -79 -59 -49 83 -106 114 95 -15 89 27 135 175 -51 -180 -50 97 71 -52 161 -99 -240 -197 -72
8186 -72 13 73 -110 90 -79
$$ packed form
8070b42L23k30K48k64K12n4j9J84m53L77j9k66K99j03J32k80K15Nq3o5J51J25
8092A93l58pJ34L2o1J34M4j87O8o2L0l4O4jj36K87j1p6j44J28k48L97k52J89J9
8117A42m6J69k84J07j54K64kk72k33L20K10k17q3k06K24l9O5O0J50J30k06J13
8139B12l62L50k4j34k10K6J95q3q1p2K79n7o7K20k92P1J85l1k08n4N1J32N0k46
8163a50P1K0J0J32j89K20j9j10J04o2J08M0k26j29J30J47k6j23K13k60j41M3J25
8186g2Q5O0j83K00j69
8191g9
$$ Imaginary data points
##PAGE= N=2
##DATA TABLE= (X++(I..I)), XYDATA
$$ plain form
0 0 0 0 0 0 0 0 0 0 0 8 -8 8 -8 16 -16 24 -24 32 -40 48 -57 72 -83 99 -117 137 -161 187 -216 248 -285 325
32 325 -371 420 -476 539 -608 681 -763 853 -950 1058 -1174 1304 -1443 1597 -1761 1942
48 1942 -2143 2359 -2598 2864 -3153 3476 -3834 4236 -4692 5207 -5799 6489 -7304 8282
62 8282 -9482 10998 -12987 15717 -19753 26445 -40543 141585 -140232 113987 135365 -178788
74 -178788 339569 35946 -152179 81299 -67240 8648 166228 -138167 -84848 -39823 24673
85 24673 55017 -11471 -62035 -118170 106101 59130 15772 23426 -114385 94798 81693 35438
97 35438 64234 -106420 24845 134101 -72326 113160 -61495 -162636 216128 -119420
107 -119420 -11743 98609 -247052 83117 58847 -139677 97781 -40528 -112583 132515
$$ packed form
0@%%%%%%%%%Qj6J6j6K4l2M0m8N6p2Q8j05J29j55J82k16K54k98L48m03M64n33O10
32C25o96P91q96J015j147J289j444J616j803K008k232K478k747L040l358L703
48A942m085M502m957N462o017O629p310Q070q928R899j1006J2288j3793J5586
62H282j7764K0480k3985K8704l5470M6198o6988J82128k81817K54219K1378l14153
74a78788N18357l03623j88125K33478j48539P5888J57580l04395N3319M5025O4496
85B4673L0344o6488n0564n6135K24271m6971m3358P654j37811K09183j3105m6255
97C5438K8796j70654J31265J09256k06427J85486j74655j01141L78764l35548
107a19420J07677J10352l45661L30169k4270j98524K37458j38309p2055K45098
$$ plain form
117 132515 -21058 -3166 85172 -40751 22436 67642 75421 71 72380 10100 -26160 155633
129 155633 -7142 13903 48191 -80137 66930 69039 -59809 24391 -78457 -32937 108681
140 108681 -91011 12396 -70123 -98595 126236 -60761 -30908 -10568 -117085 61381 60967
151 60967 -81615 1958 -46006 -27586 107362 -22583 -39987 -23271 9863 34239 38554 3012
163 3012 -87460 61304 27421 1695 63091 -67108 -7231 84699 -18996 27269 21424 -77846
175 -77846 78425 1378 -20469 42081 -77494 28260 -1607 -35294 13533 -48375 -26400
186 -26400 -2318 -48081 -13839 -7451 -60494 -639 -41773 -18076 8523 -27278 -11923 -32795
198 -32795 21244 -6080 22081 4370 -44017 42583 19341 12477 32104 -30614 -8071 70954
$$ packed form
117A32515j53573J7892Q8338j25923O3187M5206P779p5350P2309o2280l6260J81793
129A55633j62775K1045L4288j28328J47067K109j28848Q4200j02848M5520J41618
140A08681j99692J03407q2519k8472K24831j86997K9853K0340j06517J78466m14
151F0967j42582Q3573m7964J8420J34948j29945j7404J6716L3134K4376M315l5542
163C012r0472J48764l3883k5726O1396j30199N9877R1930j03695M6265n845r9270
175g7846J56271p7047k1847O2550j19575J05754k9867l3687M8827o1908K1975
186b6400K4082m5763L4242O388n3043N9855m1134K3697K6599l5801J5355k0872
198c2795N4039k7324K8161j7711m8387Q6600k3242o864J9627o2718K2543P9025
$$ plain form
210 70954 -9719 18871 1093 -56899 67745 2698 -6252 -2407 -47919 19445 24295 -8440
222 -8440 -21840 -23219 -13026 35529 -4761 -17021 -21090 -11506 33149 -2878 2557 -33863 4801
235 4801 19027 -703 10915 -37134 4230 12804 -2269 -1419 -14351 -21598 19948 -1963 -23744
248 -23744 11744 -36574 20462 1785 -27723 9423 -17678 9257 3743 -12307 -11939 11484 -255
261 -255 5553 -4982 -17496 18570 1050 11010 -15593 -2900 5458 9891 14619 -25511 6370
274 6370 -2203 16235 11552 -15688 -6724 8535 14745 5450 2604 -25437 21528 9996 5423 5224
288 5224 -25632 17070 8604 10296 -8879 -11016 -122 12711 8609 -16439 -4197 -11353 17691
301 17691 -1292 -8525 -13517 -6688 16476 -5798 1556 -22081 5018 10274 3087 -424 -15561
$$ packed form
210G0954q0673K8590j7778n7992J24644o5047q950L845m5512O7364M850l2735
222h440j3400j379J0193M8555m0290j2260m069R584M4655l6027N435l6420L8664
235D801J4226j9730J1618m8049M1364Q574j5073Q50j2932p247M1546k1911k1781
248b3744L5488m8318N7036j8677k9508L7146k7101K6935n514j6050L68K3423j1739
261b55N808j0535j2514L6066j7520R960k6603J2693Q358M433M728m0130L1881
274F370q573J8438m683k7240Q964J5259O210r295k846k8041M6965j1532m573j99
288E224l0856M2702q466J692j9175k137J0894J2833m102k5048J2242p156K9044
301A7691j8983p233m992O829K3164k2274P354k3637K7099N256p187l511j5137
$$ plain form
314 -15561 8265 8927 14263 -9415 -1221 -717 15529 13698 -12765 3525 -9074 19777 3323
327 3323 -8197 -8528 -6675 12505 -3226 -4956 -22190 156 438 1811 -11087 -20362 1199 -2527
341 -2527 11445 -18375 -7462 -3727 6366 12749 -14218 -2285 -5345 15706 4912 -2815 -11820
354 -11820 -718 12685 -188 301 -23569 2877 392 3578 -8201 -23395 -210 -4216 9183
367 9183 -13944 -12795 -6587 7013 9363 -4569 -3406 -5718 21637 6221 11511 -3814 2346 22991
381 22991 6415 15026 -7402 5900 10131 8856 -518 -8044 -3230 -2740 4970 -19148 -7907 -17932
395 -17932 -4865 -6621 -23817 -11987 -22550 805 -14297 -16763 -16614 -11694 2797 -5918 -10991
408 -10991 -15861 4357 1676 12447 -11714 -8296 10754 5386 24619 -10996 -2040 8246 15093
$$ packed form
314a5561K3826O62N336k3678Q194N04J6246j831k6463J6290j2599K8851j6454
327C323j1520l31J853J9180j5731j730j7234K2346K82J373j2898r275K1561l726
341b527J3972k9820J0913L735J0093O383k6967J1933l060K1051j0794p727r005
354a1820J1102J3403j2873M89k3870K6446k485L186j1779j5194K3185m006J3399
367I183k3127J149O208J3600K350j3932J163k312K7355j5416N290j5325O160K0645
381B2991j6576Q611k2428J3302M231j275r374p526M814M90P710k4118J1241j0025
395a7932J3067j756j7196J1830j0563K3355j5102k466J49M920J4491q715n073
408a0991m870K0218k681J0771k4161L418J9050n368J9233l5615Q956J0286O847
$$ plain form
421 15093 22261 -735 -6837 4581 22399 12644 11364 -17911 1697 17364 9053 8846 -23296
434 -23296 -4215 -438 11985 -3399 -24015 -11651 -12062 6312 -4289 -20431 -22036 -1835 -6130
447 -6130 5669 -7663 -22269 13411 -5546 15998 5709 -5404 15509 7130 17972 13107 10317
460 10317 10910 15164 4770 18024 7429 5120 12446 -14210 11362 -1061 2801 -1184 -18073
473 -18073 -4620 -4381 10654 -7965 -14033 -9770 2157 14153 12685 -13090 -7477 18788 8056
486 8056 35805 -6557 -12952 21091 9488 30366 1155 -19958 -2953 13697 11908 1442 -27246
499 -27246 -20997 4167 2318 7420 -34002 -16927 -2451 4547 20223 -18412 -7643 3953 20716
512 20716 27559 12126 3309 12905 28849 35001 26272 6337 23161 9658 33834 24556 -6002
$$ packed form
421A5093P168k2996o102J1418J7818r755j280k9275J9608J5667q311k07l2142
434b3296J9081L777J2423j5384k0616J2364m11J8374j0601j6142j605K0201m295
447f130J1799j3332j4606L5680j8957K1544j0289j1113K0913q379J0842m865k790
460A0317N93M254j0394J3254j0595k309P326k6656K5572j2423L862l985j6889
473a8073J3453K39J5035j8619o068M263J1927J1996j468k5775N613K6265j0732
486H056K7749m2362o395L4043j1603K0878k9211k1113J7005J6650j789j0466k8688
499b7246O249K5164j849N102m1422J7075J4476O998J5676l8635J0769J1596J6763
512B0716O843j5433q817R596J5944O152q729j9935J6824j3503K4176r278l0558
$$ plain form
525 -6002 20430 -9306 7694 15653 -10619 -4957 -8920 -18573 -336 -397 -16798 -5924 -23879 -2414
539 -2414 1608 2019 2245 -21933 8886 4200 19269 17802 -11963 2600 16016 22267 22886 1815
553 1815 -14165 16842 17634 24896 1092 -19668 7074 4155 31680 -954 -22838 -247 40
566 40 23965 13963 -21511 -12998 11591 9692 24878 -10075 -19513 9159 8788 25009 -6690 -10077
580 -10077 -6450 6026 23648 -5159 -7585 -8639 -2888 14133 10175 -14936 -990 -4168 2587
593 2587 20785 -9952 5320 -4918 2937 16489 2362 11697 -4297 758 11519 9491 8423
606 8423 6669 -12128 5227 13137 1382 14919 -17321 -4325 7254 7189 12124 -13656 -8923 -3782
620 -3782 14326 12838 -7298 -14502 -3013 8360 17939 3503 -24427 995 -1242 17847 10192
$$ packed form
525f002K6432k9736J7000P959k6272N662l963r653J8237o1j6401J0874j7955K1465
539b414M022M11K26k4178L0819m686J5069j467k9765J4563J3416O251O19k1071
553A815j5980L1007P92P262k3804k0760K6742k919K7525l2634k1884K2591K87
566D0K3925j0002l5474Q513K4589j899J5186l4953r438K8672l71J6221l1699l387
580a0077L627J2476J7622k8807k426j054N751J7021l958k5111J3946l178O755
593B587J8198l0737J5272j0238P855J3552j4127R335j5994N055J0761k028j068
606H423j754j8797J7355P910j1755J3537l2240J2996J1579o5M935k5780M733N141
620c782J8108j488k0136p204J1489J1373R579j4436k7930K5422k237J9089p655
$$ plain form
633 10192 -23770 -7230 -4600 14324 8490 -13435 -18499 -4638 7896 10452 -6856 -20805 -1919
646 -1919 -604 17873 -2841 -13881 -1235 -2457 19168 2653 -3809 -4136 2012 12201 8832 466
660 466 -3961 2276 2498 12740 -4192 2164 -2327 -4462 11101 -6289 5680 -3471 -6615 1010
674 1010 259 2915 684 -5512 -7813 5360 -19 7635 -6389 -8625 2110 1219 12936 -7252
688 -7252 -6055 -5479 4525 12610 -2018 -7648 -8643 5166 8509 7081 -12505 -6386 1150 7951 12231
703 12231 -12534 -4799 -4671 9604 9914 -6656 -8000 -6184 7865 6089 378 -13393 -3077 1150
717 1150 5768 1954 -13260 -1158 -3708 7686 -919 -5855 -3111 -2191 7218 -1084 189 -3601 3330
732 3330 2354 3879 -679 -939 7242 -2092 7021 -3508 2831 5321 -605 1834 -3675 3500 1328
$$ packed form
633A0192l3962J6540K630J8924n834k1925n064J3861J2534K556j7308j3949J8886
646a919J315J8477k0714j1040J2646j222K1625j6515o462l27O148J0189l369q366
660D66m427O237K22J0242j6932O356m491k135J5563j7390J1969r151l144P625
674A010p51K656k231o196k301J3173n379P654j4024k236J0735q91J1717k0188
688g252J197N76J0004Q085j4628n630r95J3809L343j428j9586O119P536O801M280
703A2231k4765P735J28J4275L10j6570j344J816J4049j776n711j3771J0316M227
717A150M618l814j5214J2102k550J1394q605m936K744R20R409q302J273l790O931
732C330r76J525m558k60Q181r334R113j0529O339K490n926K439n509P175k172
$$ plain form
747 1328 3374 -6288 -1710 -83 2369 2965 -8678 -1296 -4307 7366 -53 -4588 -4028 -2721 9498
762 9498 656 635 -6368 2291 7238 6748 329 -4633 4115 3785 12685 -3351 -1673 876 2937 9816
778 9816 -3829 -3271 -4522 4143 1538 -1286 -8570 -6865 2396 -3509 -272 -11597 -4568 -1543 424
793 424 -2730 -8930 -1109 -3147 6248 -3638 -2956 -609 2301 6945 -117 174 -1596 9113 2301 4509
809 4509 -2067 -1848 9251 201 3722 -5207 -780 2934 3723 -2186 -5398 -691 -1874 7112 -5717
824 -5717 -3411 -2978 1193 4919 -2546 -2049 -4875 7030 617 2359 -2883 -4066 7284 1690 1906
839 1906 -4191 -759 829 6593 -2547 -4682 433 -4129 8179 -5235 -4709 -2624 -1162 3376 -2293
854 -2293 -4799 -6257 3789 -2025 1305 -6040 -5431 3399 223 1225 -6358 -635 -2005 6141 -1196
$$ packed form
747A328K046r662M578J627K452N96j1643P382l011J1673p419m535N60J307J2219
762I498q842k1p003Q659M947m90o419m962Q748l30Q900j6036J678K549K061O879
778I816j3645N58j251Q665k605k824p284J705R261n905L237j1325P029L025J967
793D24l154o200P821k038R395r886O82K347K910M644p062K91j770J0709o812K208
809D509o576K19J1099r050L521q929M427L714P89n909l212M707j183Q986j2829
824e717K306M33M171L726p465M97k826J1905o413J742n242j183J1350n594K16
839A906o097L432J588N764r140k135N115m562J2308j3414N26K085J462M538n669
854b293k506j458J0046n814L330p345O09Q830l176J002p583N723j370Q146p337
$$ plain form
869 -1196 -5060 2482 -3383 7654 -601 -3440 70 2837 1806 2696 -2598 -5069 8555 -3471 3017
884 3017 -3774 -6081 5016 -1743 -1275 -6584 -3598 -2965 2830 -5393 -7575 -2285 -3489 4636 -3588
899 -3588 -4425 -4589 5256 2659 1880 997 -6321 12419 5023 4798 3033 -2973 7480 10447 2038 -862
915 -862 1295 -3710 11553 -1427 -6103 -1134 -8384 5059 -2749 -7220 -8595 -4510 -2161 -906 -4376
930 -4376 -10153 77 -2035 2294 -1667 -2145 -1032 4689 4276 -1802 7488 -4408 7290 4671 -3771
945 -3771 6868 -1225 -181 2939 -3653 -3648 5774 -7199 -1685 -2702 -10114 6468 -5030 -4013 -4501
960 -4501 -3725 2967 3072 -1320 -6321 2605 3193 8404 1727 -3189 -80 7116 8731 1981 558 -8365
976 -8365 9299 5731 393 1044 -12997 3791 5957 -1125 -2440 -7929 -7233 9844 645 -6425 -118
$$ packed form
869a196l864P542n865J1037q255k839L510K767j031Q90n294k471J3624j2026O488
884C017o791k307J1097o759M68n309K986O33N795q223k182N290j204Q125q224
899c588q37j64R845k597p79q83p318J8740p396k25j765o006J0453K967q409k900
915h62K157n005J5263j2980m676M969p250J3443p808m471j375M085K349J255l470
930d376n777J0230k112M329l961m78J113N721m13o078R290j1896J1698k619q442
945c771J0639q093J044L120o592NR422j2973N514j017p412J6582j1498J017m88
960d501P76O692J05m392n001Q926N88N211o677m916L109P196J615o750j423q923
976h365J7664l568n338O51j4041J6788K166p082j315n489O96J7077r199p070O307
$$ plain form
991 -118 -11313 8475 5565 -3081 -845 -4723 3592 5918 4418 -5201 -115 1124 2889 5036 -2019
1006 -2019 -3318 -694 3008 -2880 4796 -6171 -2492 2758 -6787 6351 -3483 -3138 204 -4305 1785
1021 1785 4071 -3468 -1205 -619 -4446 11054 -2555 -2210 -709 -6179 9234 2755 -2587 -6206 -1948
1036 -1948 2258 6609 717 -9685 -2457 2086 6803 2117 -3213 -10483 4411 8672 357 4373
1050 4373 -13254 1493 10436 2841 2325 -7069 -4674 7708 7300 -1846 -1426 -9260 4689 6570 -1142
1065 -1142 820 -10590 2213 4256 2121 -862 -5860 -1764 2360 4996 -1988 -1007 -3548 1182 2626
1080 2626 3076 -1590 -3139 2161 -4579 7770 -788 -3878 2249 -6331 3398 4055 -2402 -2785 -1809 -4650
1096 -4650 7138 1381 -5148 -1297 -7177 6474 3163 -727 -5231 -5874 4561 4447 3255 -6496 -5258
$$ packed form
991a18j1195J9788k910q646K236l878Q315K326j500r619N086J239J765K147p055
1006b019j299K624L702n888P676j0967L679N250r545J3138r834L45L342m509O090
1021A785K286p539K263N86l827J5500j3609L45J501n470J5413o479n342l619M258
1036a948M206M351n892j0402P228M543M717m686n330p270J4894M261q315M016
1050D373j7627J4747Q943p595n16r394K395J2382m08r146M20p834J3949J881p712
1065a142J962j1410J2803K043k135k983m998M096M124K636o984R81k541M730J444
1080B626M50m666j549N300o740J2349q558l090O127q580R729O57o457l83R76k841
1096d650J1788n757o529L851n880J3651l311l890m504o43J0435j14j192r751J238
$$ plain form
1111 -5258 678 7914 3228 -3206 -5874 -2317 9031 3032 2155 -8846 -2316 7171 3579 5196 -7945
1126 -7945 -3765 4937 5584 2309 -1809 -6864 1802 7960 -716 2740 -7533 -967 5360 1150 1887
1141 1887 -5355 -1124 175 4137 265 -1957 -1988 -358 2178 503 2220 -3809 1774 -1808 2018
1156 2018 3403 -2513 1648 -4199 1687 1982 842 -901 -3611 -1539 2142 2785 -2502 -1379 -6672
1171 -6672 3452 2923 -1577 -1057 -8279 2225 3544 2254 -2870 -5107 -923 4338 5076 -2627 -2839
1186 -2839 -3697 5690 4267 1425 -3029 -4302 5593 2950 4204 -3725 -3658 2461 3577 3174 -2670 -2853
1202 -2853 -1226 4468 122 184 -4279 -1759 3847 -1284 2680 -4503 -929 1816 -75 1028 -1781
1217 -1781 -615 -114 2539 -1425 1959 -664 611 1151 -1576 3178 -722 2860 -1544 -312 1511
$$ packed form
1111e258N936P236m686o434k668L557J1348n999q77j1001O530R487l592J617j3141
1126g945M180Q702O47l275m118n055Q666O158q676L456j0273O566O327m210P37
1141A887p242M231J299L962l872k222l1J630K536j675J717o029N583l582L826
1156B018J385n916M161n847N886K95j140j743k710K072L681O43n287J123n293
1171f672J0124n29m500N20p222J0504J319j290n124k237M184N261P38p703k12
1186b839q58R387j423k842m454j273R895k643J254p929O7O119J116m03n844j83
1202b853J627N694m346O2m463K520N606n131L964p183L574K745j891J103k809
1217a781J166N01K653l964L384k623J275N40k727M754l900L582m404J232J823
$$ plain form
1232 1511 711 2992 -2759 -1021 -745 2348 284 -875 -4209 -1285 2785 -1162 1078 -6471 -798
1247 -798 1619 207 610 -5212 -1475 795 2933 -987 -1965 -3416 1208 3576 -695 -639 -4347 2501
1263 2501 1328 1934 -1728 -3638 2503 375 3185 -1992 -2236 465 2323 1089 -251 -894 -1070 4735
1279 4735 -1019 1655 -1177 48 4189 -352 1880 -1827 1898 1879 1481 -415 -704 1387 1006 1895
1295 1895 -2448 491 -814 2399 -272 -2692 -13 -2503 3246 -1977 -2137 -1304 -1130 1626 -419 -1868
1311 -1868 -2833 1585 -526 1924 -2396 -1776 1793 -46 2816 -2607 418 429 2641 2336 -1514 429
1327 429 319 3889 1658 394 -1376 2304 1717 1525 718 -3233 3462 -174 1945 -487 -3069 1502
1343 1502 137 836 -1722 -1598 -1368 2066 -505 -1173 -1237 -1327 3175 -821 868 -1969 1155 2598 175
$$ packed form
1232A511q00K281n751J738K76L093k064j159l334K924M070l947K240p549N673
1247g98K417j412M03n822L737K270K138l920r78j451M624K368m271N6l708O848
1263B501j173O06l662j910O141k128K810n177k44K701J858j234j340o43j76N805
1279D735n754K674k832J225M141m541K232l707L725j9l98j896k89K091l81Q89
1295A895m343K939j305L213k671k420K679k490N749n223j60Q33J74K756k045j449
1311a868r65M418k111K450m320O20L569j839K862n423L025J1K212l05l850J943
1327D29j10L570k231j264j770L680n87j92q07l951O695l636K119k432k582M571
1343A502j365O99k558J24K30L434k571o68o4r0M502l996J689k837L124J443k423
$$ plain form
1360 175 2148 -2128 2522 2467 1873 945 257 1028 3868 2410 -1096 2533 -1431 4418 1402 -1650 1613
1377 1613 -962 3454 890 -686 -1364 715 1529 1502 -659 -2210 1312 387 2451 -2326 -1012 -150
1393 -150 642 2872 -3743 128 -1578 853 2211 -2590 -1719 -217 108 1212 497 -4371 2123 -152
1409 -152 947 2149 -3870 2253 573 1983 1224 -692 1037 1842 2651 565 1160 15 2804 991
1425 991 1971 -429 366 2901 -999 2789 -1993 1070 2080 -1375 958 -1833 -205 1679 -246 -2148
1441 -2148 401 -2264 2233 702 -4076 1632 -2264 2466 1156 -2952 -324 -255 2419 901 -750
1456 -750 -2755 811 1992 2168 -869 -1728 1 1042 4744 -2883 -428 -674 -174 5013 -2181 -1646
1472 -1646 -869 -109 2618 973 -3644 -481 -512 777 2765 -4500 246 -1479 -62 2571 -3077 -648
$$ packed form
1360A75J973m276M650n5n94r28o88P71K840j458l506L629l964N849l016l052L263
1377A613k575M416k564j576o78K079Q14k7k161j551L522r25K064m777J314Q62
1393a50P92K230o615L871j706K431J358m801Q71J502L25J104p15m868O494k275
1409a52J099J202o019O123j680J410p59j916J729Q05Q09k086N95j145K789j813
1425I91R80k400P95K535l900L788m782L063J010l455K333k791J628J884j925j902
1441b148K549k665M497j531m778N708l896M730j310m108K628O9K674j518j651
1456g50k005L566J181J76l037q59J729J041L702p627K455k46N00N187p194N35
1472a646P77P60K727j645m617L163l1J289J988p265M746j725J417K633n648K429
$$ plain form
1488 -648 -1181 210 459 -263 -1775 -553 -10 -105 416 -718 603 -1860 1710 -1082 675 2491 -3256
1505 -3256 2257 -761 526 3259 -975 -1359 1151 288 2325 2187 -3610 1594 -92 2529 2372 -3677
1521 -3677 -51 -1024 3091 2004 -1884 -2312 -727 2130 2525 -569 -3897 -336 751 3688 -889 -2775
1537 -2775 -1767 -734 5234 -1365 -1628 -2101 -1635 4531 997 -2357 -1584 -1121 970 4457 -2873 -1097
1553 -1097 -676 -1018 4229 -1528 -362 -1426 43 1926 362 317 -1343 116 679 1752 -97 862
1569 862 -1667 805 1837 -88 2487 -2410 480 362 1149 3225 -1257 -347 -714 1094 3194 1085
1585 1085 -2555 378 368 2710 3411 -3661 23 -558 2487 3599 -1529 -1510 -1300 2698 3027 797 -3034
1602 -3034 -1658 1042 3644 1446 -3050 -1047 -1480 4621 1288 -1813 -1522 -1971 3573 1604 -264 -2129
$$ packed form
1488f48n33J391K49p22j512J222N43r5N21j134J321k463L570k792J757J816n747
1505c256N513l018J287K733m234l84K510q63K037j38n797N204j686K621j57o049
1521c677L626r73M115j087l888m28J585K857L95l094l328L561J087K937m577j886
1537b775J008J033N968o599k63m73M66O166l534l354P73M63K091L487p330J776
1553a097M21l42N247n757J166j064J469J883j564m5j660J459N63J073j849R59
1569H62k529K472J032j925K575m897K890j18P87K076m482R10l67J808K100k109
1585A085l640K933j0K342P01p072L684n81L045J112n128J9K10L998L29k230l831
1602c034J376K700K602k198m496K003m33O101l333l101K91m49N544j969j868j865
$$ plain form
1618 -2129 -1447 1654 2957 301 -1291 -367 -173 4108 -206 256 -581 -689 3654 419 1011 -414 -242
1635 -242 1011 1742 596 442 -278 -803 1683 -251 1820 -1099 -814 183 -538 2714 -1398 -614 -1303
1652 -1303 -207 1881 542 -1025 -1810 14 1325 3104 -1859 -809 -935 1394 4200 -880 -219 -1613
1668 -1613 2013 3728 1272 -812 -1379 1135 2894 2890 -1832 -725 -248 2682 3039 -1408 -718 -2062 2418
1685 2418 1574 -297 -1638 -2234 973 880 155 -2044 -1497 -1210 1652 -491 -1383 -592 -2219 1541 -1037
1702 -1037 -258 -1029 -1513 470 -572 428 -602 148 -863 512 -371 917 291 -1102 944 -653
1718 -653 2187 565 423 504 -218 2353 1038 952 -1067 387 1012 2694 473 -850 -312 -179 3197
1735 3197 -545 -311 -1953 -701 2223 -526 -528 -2803 -577 678 631 -1405 -1912 -1276 88 1606 -1992
$$ packed form
1618b129O82L101J303k656j592R24J94M281m314M62q37j08M343l235N92j425J72
1635b42J253P31j146j54p20n25K486j934K071k919K85R97p21L252m112P84o89
1652a303J096K088j339j567p85J824J311J779m963J050j26K329K806n080O61j394
1668a613L626J715k456k084n67K514J759mm722J107M77K930L57m447O90j344M480
1685B418q44j871j341n96L207r3p25k199N47K87K862k143q92P91j627L760k578
1702a037P79p71m84J983j042J000j030P50j011J375q83J288o26j393K046j597
1718f53K840j622j42Q1p22K571j315q6k019J454O25J682k221j323N38J33L376
1735C197l742K34j642J252K924k749kk275K226J255m7k036n07O36J364J518l598
$$ plain form
1752 -1992 -845 -2093 566 1062 -1097 -316 -1405 1361 858 814 -375 -221 1069 1242 1306 -844 829
1769 829 57 2166 188 73 664 -74 1398 -1056 214 -662 64 158 -669 -1019 -634 200 -1183 23
1787 23 -2225 -194 -238 -1142 -49 -2346 176 -288 215 -679 -1138 -57 648 1153 -817 2 -739 1884
1805 1884 873 101 -75 -657 2170 621 1314 -674 160 1890 983 1005 -721 875 886 1874 224 273
1823 273 -298 737 2202 -696 708 -1105 977 1206 -355 -609 -799 416 -143 -1 -1752 -483 -666
1840 -666 50 -192 -1851 -239 -805 1086 -1048 -702 -357 -466 1289 -720 77 -114 837 851 651 -550
1858 -550 733 1530 397 1766 -1184 887 727 569 1301 -1114 394 202 971 -122 -430 -599 126
1875 126 1074 -594 114 -1148 1002 215 279 -629 -1319 1057 -70 778 -1170 -881 355 438 269 -942
$$ packed form
1752a992J147j248K659M96k159P81j089K766n03m4j189J54J290J73O4k150J673
1769H29p72K109j978j15N91p38J472k454J270q76P26R4q27l50L85Q34j383J206
1787B3k248K031m4r04J093k297K522m64N03q94m59J081P05N05j970Q19p41K623
1805A884j011p72j76n82K827j549O93j988Q34J730r07K2j726J596J1R88j650M9
1823B73n71J035J465k898J404j813K082K29j561k54j90J215n59J42j751J269j83
1840f66P16k42j659J612n66J891k134L46L45j09J755k009P97j91R51J4k00j201
1858e50J283P97j133J369k950K071j60j58P32k415J508j92P69j093l08j69P25
1875A26R48j668P08j262K150p87O4r08o90K376j127Q48j948K89J236Q3j69j211
$$ plain form
1893 -942 -417 -196 1344 -817 277 -1105 -245 1524 -966 680 -718 621 909 434 -41 -27 663
1910 663 701 855 -963 704 33 862 244 -920 170 -861 1069 -942 -550 -554 -888 349 -1286 -1074
1928 -1074 -1063 -202 -524 2 -2065 -719 373 -1128 1048 -2247 -353 318 98 348 -1536 -633 -66
1945 -66 1222 -393 -138 -1384 459 906 -236 -197 -1444 1029 259 910 -646 -1405 434 79 1128
1962 1128 -724 -1130 -331 585 33 157 -874 -1215 1399 -962 513 -986 -821 645 -460 460 -865
1979 -865 -104 -532 379 -308 163 -4 -433 400 -913 527 -803 187 -619 -756 237 -601 437 -1360
1997 -1360 -1038 -634 -42 115 -593 -1470 -660 881 -540 286 -1752 -601 1218 75 882 -1776 -565
2014 -565 359 1402 551 -958 -800 313 1675 374 146 -1864 238 1168 758 377 -2158 -3 396
$$ packed form
1893i42N25K21J540k161J094j382Q60J769k490J646j398J339K88m75m75J4O90
1910F63L8J54j818J667o71Q29o18j164J090j031J930k011L92ml34J237j635K12
1928a074J1Q61l22N26k067J346J092j501K176l295J894O71k20K50j884R03N67
1945f6J288j615K55j246J843M47j142L9j247K473p70O51j556p59J839l55J049
1962A128j852m06P99R16n52J24j031l41K614k361J475j499J65J466j105R20j325
1979h65P61m28R11o87M71j67m29Q33j313J440j330R90q06j37R93q38J038j797
1997a360L22M04N92J57p08q77Q10J541j421Q26k038J151J819j143Q07k658J211
2014e65R24J043q51j509J58J113J362j301k28k010K102R30m10l81k535K155L99
$$ plain form
2031 396 1116 201 -1370 -742 240 1019 270 -413 -1312 846 183 1001 -134 -1160 1073 -439 1323 -303
2049 -303 -583 89 -41 791 106 -166 -850 398 -266 890 170 -492 235 -911 1340 161 783 -193
2067 -193 -961 678 817 1209 -377 -161 -425 1755 876 309 -1017 -749 1537 419 1443 -1369 -902
2084 -902 934 824 1510 -1161 -1118 -320 1339 470 -44 -2005 -459 1146 450 786 -2237 -597 535
2101 535 797 611 -1407 -913 -285 1565 799 20 -814 226 1332 1031 1274 -995 1023 785 1823 1222
2119 1222 88 1143 -122 1686 1043 599 30 172 89 564 683 -664 239 -1270 641 -169 -479 -351
2137 -351 -1462 230 -197 662 -763 -1240 -971 250 1162 -206 -506 -1263 1028 735 1374 -577 -1302 1067
2155 1067 499 2060 -526 -943 -178 621 1103 173 -863 -1069 1266 269 1289 -1389 -916 553 240
$$ packed form
2031C96P20r15j571O28R82P79p49o83q99K158o63Q18j135j026K233j512J762j626
2049c03k80O72j30Q32o85k72o84J248o64J156p20o62P27j146K251j179O22r76
2067a93p68J639J39L92j586K16k64K180q79n67j326K68K286j118J024k812M67
2084i02J836j10O86k671M3P98J659q69n14j961J546J605o96L36l023J640J132
2101E35K62j86k018M94O28J850p66p79q34J040J106l01K43k269K018k38J038o01
2119A222j134J055j265J808o43m44n69J42q3M75J19j347R03j509J911q10l10J28
2137c51j111J692m27Q59j425m77K69J221R12j368l00p57K291k93O39j951p25K369
2155A067n68J561k586m17P65P99M82r30j036k06K335r97J020k678M73J469l13
$$ plain form
2172 240 1297 -1034 -699 -420 1094 887 -456 -356 -840 699 233 287 -1024 -264 -75 102 579 -1078
2190 -1078 282 -952 513 253 -349 -81 -644 -265 -73 608 -311 338 -371 82 579 -43 906 -903
2208 -903 261 403 1136 680 -620 210 210 1592 263 -261 -642 392 836 891 181 -1493 406 -314 1226
2227 1226 -252 -1401 -316 -554 485 -810 -1015 -1403 -171 25 -96 -978 -1647 138 -332 807 -993
2244 -993 -631 84 207 1247 -338 84 -128 1071 866 564 192 -68 417 240 902 -761 824 -263
2262 -263 -269 508 -603 526 -121 293 -112 -33 201 -58 -70 -304 281 -156 601 -605 7 -145 44 1002
2282 1002 -1054 166 -687 330 535 -293 -572 -475 272 -12 466 -1159 -33 -256 455 399 -820 356
2300 356 -340 1104 355 -171 -218 88 1076 302 267 -232 595 363 459 -441 -749 393 -915 528 -1128
$$ packed form
2172B40J057k331L35K79J514k07j343J00m84J539m66N4j311P60J89J77M77j657
2190a078J360j234J465k60o02K68n63L79J92O81r19O49p09M53M97o22R49j809
2208i03J164J42P33m56j300Q30%J382j329n24l81J034M44N5p10j674J899p20J540
2227A226j478j149J085k38J039j295k05l88J232J96j21q82o69J785m70J139j800
2244i93L62P15J23J040j585M22k12J199k05l02l72k60M85j77O62j663J585j087
2262b63oP77j111J129o47M14m05P9K34k59j2k34N85m37P57j206O12j52J89R58
2282A002k056J220q53J017K05q28k79R7P47k84M78j625J126k23P11n6j219J176
2300C56o96J444p49n26m7L06R88p74l5m99Q27k32R6r00l08J142j308J443j656
$$ plain form
2319 -1128 -288 -181 -371 177 -818 -449 -567 335 -385 297 -532 93 800 -236 714 -702 809 485 250
2338 250 275 -377 395 165 594 -343 12 -234 553 34 -279 128 -400 919 -515 244 -558 -486 1068 -431
2358 -431 281 -147 170 389 588 -419 -110 168 164 831 -747 51 -43 321 220 -545 22 -746 446 -250
2378 -250 -531 -723 -461 -101 -68 -308 -1013 -13 -735 408 -535 -454 140 -722 501 -667 -219 -101 264
2397 264 319 204 -229 -322 410 -240 549 -635 -10 271 -281 173 -897 338 -171 225 -372 -404 -67 -181
2417 -181 63 -437 -188 -918 428 -582 -473 15 -620 997 -451 -280 -421 -226 731 125 -137 -462 172
2436 172 -46 798 -453 -295 -319 -329 636 -855 -240 -940 283 138 -646 -458 -1203 1 -242 -102 -943
2455 -943 -371 -610 142 40 -868 301 -865 874 -427 -339 272 -320 390 -13 -5 -329 28 -186 -58 -318
$$ packed form
2319a128Q40J07j90N48r95L69j18R02p20O82q29O25P07j036R50j416J511l24k35
2338B50K5o52P72k30M29r37L55k46P87n19l13M07n28J319j434P59q02P2J554j499
2358d31P12m28L17K19J99j007L09K78mO67j578P98r4L64j01p65N67p68J192o96
2378b50k81j92K62L60L3k40p05J000p22J143r43Q1N94q62J223j168M48J18L65
2397B64N5j15m33r3P32o50P89j184O25K81n52M54j070J235n09L96n97l2L37j14
2417a81K44n00K49p30J346j010J09M88o35J617j448J71j41J95R57o06k62l25O34
2436A72k18Q44j251J58k4j0R65j491O15p00J223j45p84J88p45J204k43J40q41
2455i43N72k39P52j02r08J169j166J739j301Q8O11n92P10m03Ql24L57k14J28k60
$$ plain form
2475 -318 -591 466 -878 92 -697 -111 -135 -380 -124 -886 262 -222 -35 -396 -561 -117 355 -30 -598
2494 -598 113 -533 702 -135 -492 -178 -876 936 82 -71 -520 -119 165 1039 114 -555 40 -230 1124
2513 1124 -223 -37 -226 -62 933 63 201 -915 -35 495 17 -168 -786 -246 49 276 -696 -281 -931
2532 -931 129 504 -608 43 -791 425 -215 282 241 39 -74 -3 481 8 522 -582 212 -22 152
2551 152 675 -701 -292 -428 264 81 -275 -435 -723 289 289 260 -625 -58 -5 1121 692 -193 293 -611
2571 -611 1177 488 114 -187 -635 882 699 407 -744 -494 -122 894 112 -578 -725 -846 896 -424
2589 -424 -208 -1053 -691 420 252 132 -696 -153 141 800 444 158 -250 -42 870 -25 587 -405 286 602
2609 602 -12 592 -339 77 -269 282 39 -131 -352 -422 -303 -155 630 -907 -163 -493 -181 796 -381 -98
$$ packed form
2475c18k73J057j344R70p89N86k4k45K56p62J148m84J87l61j65M44M72l85n68
2494e98P11o46J235q37l57L14o98J812q54j53m49M01K84Q74r25o69N95k70J354
2513A124j347J86j89J64R95q70J38j116Q80N30m78j85o18N40K95K27r72M15o50
2532i31J060L75j112O51q34J216o40M97m1k02j13P1M84m73N14j104P94k34J74
2551A52N23j376M09j36O92j83l56j60k88J012%k9q85N67N3J126m29q85M86r04
2571f11J788o89l74l01m48J517j83k92j151K50L72J016p82o90j47j21J742j320
2589d24K16q45L62J111j68j20q28N43K94O59l56k86m08K08R12q95O12r92O91L16
2609F02o14O04r31M16l46N51k43j70k21p0J19J48P85j537P44l30L12R77j177K83
$$ plain form
2629 -98 -639 124 106 487 -294 -686 -186 230 691 -170 54 -666 747 885 -78 -51 -606 466 359 479
2649 479 -367 -286 244 343 949 -282 -245 -425 931 458 57 -188 -898 512 196 313 -272 -453 217 278
2669 278 258 -283 -438 -715 415 -178 329 -441 -301 453 -235 581 -713 -299 -288 -290 240 -407 231 -652 -173
2690 -173 -76 565 -94 -313 -119 -355 748 84 335 -462 -108 332 286 253 -668 -19 117 488 -194 -290 -427
2711 -427 -199 579 6 189 -861 132 156 256 177 -969 271 266 700 23 99 -256 293 852 -177 283
2731 283 -560 747 134 293 -33 -401 219 28 351 -176 -101 -203 -67 103 34 -243 -345 612 -400 500
2751 500 168 23 264 -499 316 116 235 -160 -16 -42 262 229 -246 36 -465 438 -85 -145 -267 -842 298
2772 298 -262 234 -609 -76 -56 95 238 -420 57 -229 611 -85 593 -168 94 588 159 497 -257 204
$$ packed form
2629i8n41P63j8L81p81l92N00M16M61q61K24p20J413J38r63K7n55J072j07J20
2649D79q46Q1N30R9O06j231L7j80J356m73m01k45p10J410l16J17n85j81O70O1
2669B78k0n41j55k77J130n93N07p70J40P54o88Q16j294M14J1kN30o47O38q83M79
2690a73R7O41o59k19J94k36J103o64K51p97L54M40m6l3r21O49J36L71o82r6j37
2711d27K28P78n73J83j050R93K4J00p9j146J240nM34o77P6l55N49N59j029M60
2731B83q43J307o13J59l26l68O20j91L23n27P5j02J36J70o9k77j02R57j012R00
2751E00l32j45K41p63Q15k00J19l95J44k6L04l3m75K82n01R03n23o0j22n75J140
2772B98n60M96q43N33K0J51J43o58M77k86Q40o96O78p61K62M94m29L38p54M61
$$ plain form
2792 204 380 435 33 -147 -152 -185 417 -268 2 -367 21 169 27 -32 -893 307 -259 209 -30 -437 199
2813 199 16 242 -216 125 -65 712 248 111 156 -174 694 -344 158 -66 117 195 -415 44 -399 374
2833 374 -378 67 -248 -230 -63 -223 90 -671 -96 -190 235 -393 -286 137 -253 404 -26 19 132 151 186 105
2855 105 -32 -375 478 -92 575 -283 -52 289 -141 125 -349 124 -264 118 -68 -245 -229 -383 394 -202
2875 -202 193 -417 402 113 16 298 9 496 -19 267 123 -84 131 115 278 -185 319 -261 449 2 22
2896 22 -167 -364 240 -444 243 -378 19 -48 -179 -149 -453 271 -222 167 -449 8 304 64 284 -355 278
2917 278 -39 481 -40 -413 -196 -76 98 -251 -40 -317 307 -266 20 -127 -614 302 -252 373 75 -146
2937 -146 312 414 368 -112 48 -276 330 -87 -110 -166 -14 367 -89 167 -594 215 -204 185 4 -83 168
$$ packed form
2792B04J76N5m02j80nl3O02o85K70l69L88J48j42n9q61J200n66M68k39m07O36
2813A99j83K26m58L41j90P77m64j37M5l30Q68j038N02k24J83P8o10M59m43P73
2833C74p52M45l15J8J67j60L13p61N75r4M25o28J07M23l90O57m30M5J13J9L5q1
2855A05j37l43Q53n70O67q58K31L41m30K66m74M73l88L82j86j77J6j54P77n96
2875b02L95o10Q19k89r7K82k89M87n15K86j44k07K15j6J63m63N04n80P10m47K0
2896B2j89j97O04o84O87o21L97o7j31L0l04P24m93L89o16M57K96k40K20o39O33
2917B78l17N20n21l73K17J20J74l49K11k77O24n73K86j47m87R16n54O25k98k21
2937a46M58J02m6m80J60l24O06m17k3n6J52L81m56K56p61Q09m19L89j81q7K51
$$ plain form
2958 168 -47 -164 -7 152 -94 142 244 -5 467 -106 678 50 55 274 28 318 -548 55 -243 -192 -20
2979 -20 -80 -318 -340 158 -184 -83 -620 28 175 46 284 -244 -19 -92 523 50 84 -72 -4 473 404 60
3001 60 -444 154 -69 394 -80 -243 -111 -321 274 -203 -169 -556 37 6 -179 -30 -361 209 -64 450 96
3022 96 226 236 -146 583 -190 518 -194 39 337 35 100 -88 -42 -459 400 -299 96 -266 -336 287 -512 501
3044 501 -473 -340 -139 123 474 -29 -223 -430 342 51 367 -88 -248 353 147 561 -372 -94 -328 378
3064 378 306 -378 -189 -311 308 38 219 -699 -266 -135 62 199 -377 8 -302 531 184 90 60 -171 396
3085 396 50 134 -631 -56 -171 312 168 -184 -80 -402 333 74 -27 -31 -69 218 -29 338 49 70 -319 145
3107 145 311 123 197 -296 230 292 392 -66 -235 47 72 614 -26 -206 -437 232 187 260 -253 -542 116 369
$$ packed form
2958A68k15j17J57J59k46K36J02k49M72n73P84o28NK19k46K90q66O03k98N1J72
2979b0o0k38k2M98l42J01n37O48J47j29K38n28K25p3O15m73L4j56O8M77o9l44
3001F0n04N98k23M63m74j63J32k10N95m77L4l87N93l1j85J49l31N70k73N14l54
3022I6J30J0l82P29p73P08p12K33K98l02O5j88M6m17Q59o99L95l62p0O23p99J013
3044E01r74J33K01K62L51n03j94k07P72k91L16m55j60O01k06M14r33K78k34P06
3064C78p2o84J89j22O19k70J81r18M33J31J97J37n76L85l10Q33l47r4l0k31N67
3085C96l46Q4p65N75j15M83j44l52J04l22P35k59j01ml8K87k47L67k89K1l89M64
3107A45J66j88P4m93N26O2J00m58j69K82K5N42o40j80k31O69m5P3n13k89O58K53
$$ plain form
3129 369 487 -327 -188 -22 41 357 -268 -234 -495 21 277 -150 -185 -167 153 90 430 -533 -200 176 118 420
3151 420 -185 104 -464 -39 101 188 -184 -167 130 78 283 -173 50 -394 132 -26 -100 363 -520 -48 -29 322
3173 322 -152 -240 -83 165 575 126 145 -344 155 325 399 284 -277 208 -268 533 34 54 -191 -205 113 80
3195 80 -38 -446 -39 -35 457 79 -470 164 -167 627 24 -288 -46 21 544 182 200 -235 -4 -129 280 29
3217 29 -139 -141 -80 265 -144 91 -405 -72 262 -161 235 -409 -29 -70 110 -348 -169 18 36 329 -118 34
3239 34 -484 96 -47 -170 247 -337 -2 -177 127 -112 72 48 -206 47 114 238 -299 -41 -104 75 163 -146
3261 -146 -148 -365 279 131 28 -126 -279 23 -71 187 -164 -34 -45 379 2 -199 65 -392 342 -64 -32 -32
3283 -32 21 87 -48 231 -201 93 -81 153 85 -324 52 -214 212 -432 209 -88 -196 119 -198 11 -208
$$ packed form
3129C69J18q14J39J66O3L16o25L4k61N16K56m27l5J8L20o3L40r63L33L76n8L02
3151D20o05K89n68M25J40Q7l72J7K97n2K05m56K23m44N26j58p4M63q83M72J9L51
3173C22m74q8J57K48M10m49J9m89M99J70P4j15n61M85m76Q01m99K0k45j4L18l3
3195H0j18m08M07MM92l78n49O34l31P94o03l12K42O7N23l62J8m35K31j25M09k51
3217B9j68kO1L45m09K35m96L33L34m23L96o44L80m1J80m58J79J87J8K93m47J52
3239C4n18N80j43j23M17n84L35j75L04k39J84k4k54K53O7J24n37K58o3J79Q8l09
3261a46kk17O44j48j03j54j53L02r4K58l51J30j1M24l77k01K64m57P34m06L2%
3283c2N3O6j35K79m32K94j74K34o8m09L76k66M26o44O41k97j08L15l17K09k19
$$ plain form
3304 -208 79 -67 174 11 -210 72 218 308 -242 312 33 -62 -124 139 177 -134 30 -65 -260 -95 186 -462
3326 -462 -240 56 -201 269 10 43 -302 116 260 113 45 -213 286 201 231 -171 202 -75 -27 337 -308 102
3348 102 -400 57 235 -260 13 144 218 -179 114 -229 160 -125 175 239 -90 250 -142 -17 -14 -53 21 -11
3370 -11 13 -260 -96 -124 88 30 13 156 -94 -86 -172 -238 -480 1 -113 -47 -117 -142 179 -180 38 188 418 491
3394 491 -140 5 -145 320 110 184 -342 -1 79 -70 23 -207 165 -168 37 204 63 74 89 35 -158 180
3416 180 -77 291 231 133 204 -60 280 -150 93 -6 26 -9 -32 -70 93 -150 -319 -55 -47 -62 2 -82 2 -148 133
3441 133 -210 69 -14 -110 307 104 290 -251 148 154 136 5 149 256 -67 149 -313 209 53 128 -40 -359
3463 -359 6 -152 275 -314 -348 -278 35 248 56 168 131 675 184 119 -50 -138 273 -51 274 122 223 -120
$$ packed form
3304b08K87j46K41j63k21K82J46R0n50N54k79r5o2K63L8l11J64r5j95J65K81o48
3326d62K22K96k57M70k59L3l45M18J44j47o8k58M99q5L0m02L73k77M8L64o45M10
3348A02n02M57J78m95K73J31P4l97K93l43L89k85L00O4l29L40l92J25Ll9P4l2
3370a1K4k73J64k8K12n8j7J43k50Qq6o6k42M81j14O6p0k5L21l59K18J50K30P3
3394D91o31J45j50M65k10P4n26L41Q0j49R3k30L72l33K05J67j41J1J5n4j93L38
3416A80k57L68o0r8P1k64L40m30K43r9L2l5k3l8J63k43j69K64Qj5O4q4Q4j50K81
3441A33l43K79q3r6M17k03J86n41L99Oj8j31J44J07l23K16m62N22j56P5j68l19
3463c59L65j58M27n89l4P0L13K13j92J12l7N44m91o5j69q8M11l24L25j52J01l43
$$ plain form
3485 -120 87 122 -14 -70 -98 432 -41 -27 -56 -14 143 -283 236 -270 272 159 165 -33 -36 68 144 159 40 301
3509 301 -110 -92 74 -46 42 -235 29 202 93 80 -115 -210 -164 -46 34 282 -152 91 -64 52 128 -150
3531 -150 89 -205 -159 274 -130 -34 -27 58 52 205 -42 -3 -238 30 197 111 -41 -103 101 -183 138 -212 -209 164
3555 164 123 113 166 -95 -36 20 22 -192 81 -108 61 38 92 -187 -10 8 95 212 17 2 -109 -33 -63 144 -131
3580 -131 -34 85 -128 12 -93 132 -182 -112 33 -60 208 -242 -60 137 296 84 119 -74 36 50 -185 194
3602 194 -30 117 19 -121 49 -290 5 -93 119 -181 3 -391 -225 87 62 45 -329 51 -81 96 -7
3623 -7 -243 -169 302 105 -7 95 -53 169 5 -75 129 -159 147 125 108 90 167 29 214 103 -86 -54 -275
3646 -275 180 35 -56 -198 41 267 30 68 -209 -107 -38 78 2 -41 -116 -262 -90 162 109 130 -134 -166 -63
$$ packed form
3485a20K07L5j36n6k8N30m73J4k9M2J57m26N19n06N42j13Oj98lJ04P6J5j19K61
3509C01m11J8J66j20Q8k77K64J73j09j3j95r5M6J18Q0K48m34K43j55J16P6k78
3531a50K39k94M6M33m04R6PQ5oJ53k47L9k35K68J67q6j52o2K04k84L21l50LL73
3555A64m1j0N3k61N9N6Kk14K73j89J69k3N4k79J77J8Q7J17j95j5j11P6l0K07k75
3580a31R7J19k13J40j05K25l14P0J45r3K68m50J82J97J59k12L5j93J10J4k35L79
3602A94k24J47r8j40J70l39K95r8K12l00J84l94J66L12k5j7l74L80j32J77j03
3623gk36P4M71j97j12J02j48K22j64q0K04k88L06k2j7j8P7j38J85j11j89L2k21
3646b75M55j45r1j42K39K26k37L8k77J02O9J16p6m3p5j46J72K52n3K1k64l2J03
$$ plain form
3669 -63 226 -99 -14 -72 77 266 -136 182 -54 113 -74 46 52 -209 -198 43 227 -126 34 -237 21 -18
3691 -18 123 80 -2 -291 -110 6 3 -52 165 -94 -16 83 -62 1 -71 -70 42 -19 -152 24 -32 69 94 75 -111
3716 -111 -36 13 68 202 -105 -214 -143 -79 -314 -93 -37 -128 -40 -81 -83 89 -7 129 -203 -26 0 -261 90 95 13
3741 13 -231 315 -270 -25 -258 176 -36 -243 122 140 42 -32 -90 -51 29 -73 29 -92 -6 37 74 -143 -213 -238
3765 -238 -130 164 77 -116 -47 -316 57 79 20 90 -102 220 61 213 -372 69 -164 168 185 62 34 95 211
3788 211 112 -56 7 164 7 -95 59 72 94 -203 141 -20 29 -50 -167 219 -13 172 55 144 -25 9 79
3811 79 -120 -207 126 -21 17 249 73 -154 100 54 8 -148 58 4 285 -85 -123 -15 40 -23 164 -116 -40
3834 -40 -289 3 34 -53 96 36 65 3 -25 -112 119 -24 322 0 -165 -119 -94 70 48 208 -188 285 12 137
$$ packed form
3669f3K89l25Q5n8J49J89m02L18k36J67j87J20Ok61J1K41J84l53J60k71K58l9
3691a8J41m3q2k89J81J16ln5K17k59P8R9j45O3p2JJ12o1j33J76n6J01K5j9j86
3716a11P5M9N5J34l07j09P1O4k35K21N6r1Q8m1kJ72r6J36l32J77K6k61L51Nq2
3741A3k44N46n85K45k33M34k12k07L65J8r8p4n8L9Q0j02J02j21Q6M3L7k17p0k5
3765b38J08K94q7j93O9k69L73K2n9P0j92L22j59J52n85M41k33L32J7j23k8O1J16
3788B11r9j68O3J57j57j02J54J3K2k97L44j61M9p9j17L86k32J85j17Q9j69L4P0
3811G9j99q7L33j47L8K32j76k27K54m6m6j56K06n4K81l70l8J08N5o3J87k80P6
3834d0k49K92L1q7J49o0K9o2k8q7K31j43L46l22j65M6K5J64k2J60l96M73k73J25
$$ plain form
3858 137 15 -188 -157 -82 48 87 34 -132 5 107 -163 81 102 223 -63 196 164 -86 114 169 49 122 36
3881 36 -6 -100 46 30 -113 -98 -7 -68 -99 -119 -154 2 -34 -39 -227 -9 364 147 91 -1 89 23 -61 58 113 -200
3907 -200 -66 -250 -74 114 31 23 -170 2 -211 24 -112 -67 -52 214 86 -42 200 -172 159 -216 23 169
3929 169 134 30 -259 56 -3 79 -198 -39 -287 -85 26 -105 20 85 43 -51 5 139 183 83 -175 41 41
3952 41 205 12 -22 -286 -66 -59 -77 89 4 111 -100 -172 185 32 -81 -184 -31 86 -110 43 18 71 -101
3975 -101 -112 -154 40 -3 -129 -59 89 -142 16 204 131 -75 -24 -19 -95 -66 32 53 20 -10 56 198 -56 51 -4
4000 -4 17 -221 -119 -75 141 110 -115 37 157 233 -137 16 -116 -59 232 4 130 -109 32 77 -165 -8 115
4023 115 84 -242 -38 77 -58 -75 147 68 -159 130 24 19 -104 -242 166 27 5 -288 201 153 -51 -180
$$ packed form
3858A37j22k03L1P5J30L9n3j66J37J02k70K44K1J21k86K59l2k50K00N5j20P3q6
3881C6m2r4J46j6j43J5R1o1l1k0l5J56l6nj88K18L73k17n6r2R0o6q4J19N5l13
3907b00J34j84J76J88q3qj93J72k13K35j36M5J5K66j28j28K42l72L31l75K39J46
3929A69l5j04k89L15n9Q2k77J59k48K02J11j31J25O5m2r4N6J34M4j00k58K16%
3952D1J64j93l4k64K20Pj8J66q5J07k11p2L57j53j13j03J53J17j96J53k5N3j72
3975a01j1m2J94m3j26P0J48k31J58J88p3k06N1Np6K9R8K1l3l0O6J42k54J07n5
4000dK1k38J02M4K16l1k25J52J20P6l70J53j32N7K91k28J26k39J41M5k42J57J23
4023A15l1l26K04J15j35j7K22p9k27K89j06nj23j38M08j39k2k93M89m8k04j29
$$ plain form
4045 -180 -153 -141 44 -122 -301 -40 10 201 -183 -2 72 3 32 37 -43 50 156 -45 232 -89 -65 -124 -15 46
4069 46 17 233 28 47 141 126 46 111 -61 -68 62 -79 160 155 34 182 -140 -55 2 152 25 -59 213 139 -3
4094 -3 113 -17 -76 134 -17 20 28 -223 104 -49 46 62 -111 -97 -317 144 -48 -61 -116 -80 -181 -95 -65 -14 275
4119 275 5 -21 125 9 0 -89 52 -141 -6 -43 79 181 -97 119 -15 13 -74 -134 49 15 -21 -47 230 -21
4143 -21 -64 181 8 -230 -15 -46 40 163 71 -86 -406 -44 -66 17 -102 38 -178 -117 247 -108 25 363 88
4166 88 93 -91 -51 49 284 162 184 203 -17 -16 145 193 -2 82 211 179 46 168 -272 -92 29 283 -155 -100
4190 -100 -286 -131 -182 2 84 249 -32 157 139 11 -94 -147 129 -24 -38 184 -45 -22 103 241 -151 122
4212 122 0 132 118 -208 307 93 -19 91 60 -160 148 -77 -30 -103 -228 -220 -109 80 448 -16 45 179
$$ packed form
4045a80K7J2J85j66j79K61N0J91l84J81P4o9K9Nq0R3J06k01K77l21K4n9J09O1
4069D6k9K16k05J9R4j5q0O5j72pJ30j41K39nj21J48l22Q5N7J50j27q4K72p4j42
4094cJ16j30n9K10j51L7Qk51L27j53R5J6j73J4k20M61j92j3n5L6j01Q6L0N1K89
4119B75k70k6J46j16rq9J41j93J35l7J22J02k78K16j34K8q7o0J83l4l6k6K77k51
4143b1m3K45j73k38K15l1Q6J23r2j57l20L62k2Q3j19J40k16O1L64l55J33L38k75
4166H8Nj84M0J00K35j22K2J9k20JJ61M8j95Q4J29l2j33J22m40J80J21K54m38N5
4190a00j86J55n1J84Q2J65k81J89j8j28j05n3K76j53j4K22k29K3J25J38l92K73
4212A22j22J32j4l26N15k14j12J10l1k20L08k25M7p3j25QJ11J89L68m64O1J34
$$ plain form
4234 179 120 -4 116 -55 -48 43 178 101 11 100 33 52 5 180 133 -69 -20 -58 -138 9 -134 -316 -34 187 1
4259 1 -15 -84 53 -104 45 -130 -62 -160 -117 95 175 257 -251 163 -98 184 -45 211 -90 -67 51 -156 -127 108
4283 108 -45 -217 -1 36 -244 -153 -184 262 151 -108 203 23 63 115 205 -40 69 -27 17 -17 -94 192 -134
4306 -134 353 -141 37 18 226 187 -143 25 -88 238 -45 0 24 -99 43 -21 -157 194 106 -149 -95 63
4328 63 -168 -48 -136 51 -255 -168 83 -316 154 -290 73 133 168 -168 191 -133 102 80 -187 18 -257 -182
4350 -182 175 45 54 -22 -64 -18 -27 86 69 6 27 40 -91 -60 -109 177 -201 66 142 19 -143 150 20 37 -36
4375 -36 25 104 -100 -44 161 83 -50 -256 155 22 109 -62 14 -21 -314 185 -193 14 -6 -42 -77 -269 37 -84
4399 -84 11 -167 -223 242 -31 29 13 253 -163 -180 -51 122 -82 -86 -99 -118 79 -195 -116 -39 71 -118 60 167
$$ packed form
4234A79n9j24J20j71PR1J35p7r0Q9o7J9m7J75m7k02M9l8q0J47j43j82K82K21j86
4259Aj6o9J37j57J49j75O8r8M3K12Q0Q2n08M14k61K82k29K56l01K3J18k07K9K35
4283A08j53j72K16L7k80R1l1M46j11k59L11j80M0N2R0k45J09r6M4l4p7K86l26
4306a34M87m94J78j9K08l9l30J68j13L26k83M5K4j23J42o4j36L51q8k55N4J58
4328F3k31J20q8J87l06Q7K51l99M70m44L63O0L5l36L59l24K35k2k67K05k75P5
4350a82L57j30Rp6m2M6rJ13j7o3K1J3j31L1m9K86l78K67P6j23j62K93j30J7p3
4375c6O1P9k04N6K05p8j33k06M11j33Q7j71P6l5k93M99l78K07k0l6l5j92L06j21
4399h4R5j78n6M65k73O0j6K40m16j7J29J73k04mj3j9J97k74P9P7J10j89J78J07
$$ plain form
4423 167 129 -50 20 119 -254 -13 245 -101 268 -100 164 5 85 80 -41 -46 -51 151 -73 154 -256 -203 -317 69
4447 69 -5 -193 97 -239 11 -108 -82 220 -32 163 -84 -31 -46 -4 111 134 -67 54 64 -20 -76 -133 11 -92
4471 -92 -68 -68 28 11 -109 25 56 -112 207 98 104 216 256 -185 35 138 -162 -8 35 -98 -100 -45 -42 156 -44
4496 -44 -77 -77 -104 73 -245 162 -46 -17 144 -163 161 15 285 -100 -199 58 7 -93 14 204 -237 -74 -219
4519 -219 83 198 -13 -94 -65 -139 -267 46 11 103 -161 -74 -20 -213 70 -190 241 -84 138 78 18 41 131 263
4543 263 67 214 -224 -74 156 -29 166 4 -11 -156 27 -124 98 117 -85 110 -7 425 57 -17 140
4564 140 -21 -5 -198 31 -18 11 -137 10 109 33 37 -89 198 -160 -42 -49 25 -88 165 -71 -243 168 -127
4587 -127 10 -104 42 85 -93 190 2 109 -207 -3 -27 11 -171 -193 29 176 160 77 159 131 195 142 81 264
$$ packed form
4423A67l8j79P0R9l73K41K58l46L69l68K64j59Q0nj21nnK02k24K27m10N3j14L86
4447F9p4j88K90l36K50j19K6L02k52J95k47N3j5M2J15K3k01J21J0q4n6n7J44j03
4471i2K4%R6j7j20J34L1j68L19j09OJ12M0m41K20J03l00J54M3j33kN5LJ98k00
4496d4l3%k7J77l18M07k08K9J61l07L24j46K70l85r9K57n1j00J07J90m41J63j45
4519b19L02J15k11q1K9p4j28L13l5R2k64Q7N4j93K83k60M31l25K22o0o0K3R0J32
4543B63j96J47m38J50K30j85J95j62j5j45J83j51K22J9k02J95j17M32l68p4J57
4564A40j61J6j93K29m9K9j48J47R9p6Mj26K87l58J18pP4j13K53k36j72M11k95
4587a27J37j14J46M3j78K83j88J07l16K04k4L8j82k2K22J47j6q3Q2k8O4n3o1J83
$$ plain form
4611 264 -231 8 -13 -36 100 -125 3 -262 157 209 192 148 -153 54 -151 97 -18 38 -67 93 265 -2
4633 -2 41 -76 -225 100 9 -13 96 128 -233 -237 -106 71 -293 63 -6 -53 -131 34 86 -263 -107 -154 -102 250 -10
4658 -10 -115 -74 -117 -102 265 153 -170 -14 -107 6 -19 35 -198 41 154 121 67 -50 162 114 -84 -99 -132 -23
4682 -23 -73 169 -14 127 -78 -181 94 102 -47 130 71 54 159 -34 -124 120 -1 -2 -269 70 -189 195 -127
4705 -127 -40 -17 -88 24 -282 -58 -171 235 -42 19 -107 206 200 -135 -31 -68 111 -46 20 -121 -334 162 -60
4728 -60 90 76 -66 -42 -171 151 -121 -128 -392 16 -5 -37 20 44 -10 97 30 -194 10 10 107 190 4 82 -135
4753 -135 80 -34 2 26 -22 8 93 -54 -180 95 -113 39 -15 72 -75 -12 -118 -81 148 -98 177 -4 -18
4776 -18 212 -137 148 -168 232 -101 -1 -31 -129 -66 -65 237 -96 178 -51 24 75 -65 50 -153 65 -198 19
$$ packed form
4611B64m95K39k1k3J36k25J28k65M19N2j7m4l01K07k05K48j15N6j05J60J72k67
4633bM3j17j49L25r1k2J09L2l61mJ31J77l64L56o9m7p8J65N2l49J56m7N2L52k60
4658a0j05M1m3J5L67j12l23J56r3J13k5N4k33K39J13l3n4j17K12m8j98j5l3J09
4682b3n0K42j83J41k05j03K75Qj49J77n9j7J05j93r0K44j21jk67L39k59L84l22
4705a27Q7K3p1J12l06K24j13M06k77O1j26L13ol35J04l7J79j57O6j41k13M96k22
4728f0J50j4j42K4j29L22k72pk64M08k1l2N7K4n4J07o7k24K04%R7Q3j86P8k17
4753a35K15j14L6K4m8L0Q5j47j26K75k08J52n4Q7j47O3j06L7K29k46K75j81j4
4776a8K30l49K85l16M00l33J00l0r8O3JL02l33K74k29P5N1j40J15k03K18k63K17
$$ plain form
4799 19 8 -90 -173 -60 33 65 -22 231 233 76 80 -29 -235 294 -68 185 94 -14 25 -329 190 -190 -108 -91 -74
4824 -74 29 66 -56 -78 192 -10 -33 48 207 -79 -132 15 -49 53 -197 101 -60 -13 60 -41 73 -231 -173
4847 -173 -29 117 -251 -187 -56 74 64 -116 -32 -175 106 -67 -54 -1 197 172 -49 -189 92 26 -37 -62 189
4870 189 -211 -40 -228 -142 88 -75 -187 162 186 66 11 163 204 -349 43 -157 -81 161 148 45 2 -154
4892 -154 62 4 -52 14 -1 3 172 -147 -75 177 -2 -91 -103 -62 -212 1 206 -113 -79 66 304 128 -54 -84
4916 -84 -62 26 208 -121 89 83 34 288 -245 -104 -4 66 5 43 -19 -169 182 89 -64 -98 -234 125 -307 114
4940 114 -18 209 54 -75 237 -94 141 -227 256 -233 -40 -208 -95 256 -153 -215 -103 -52 -45 -29 -53 -187
4962 -187 -214 -109 -20 -30 98 245 -120 -42 17 -175 241 88 -250 -6 -207 160 27 73 156 -228 37 -9 268
$$ packed form
4799A9j1r8q3J13R3L2q7K53Kj57Mj09k06N29l62K53r1j08L9l54N19l80Q2J7J7
4824g4J03L7j22k2K70k02k3Q1J59k86n3J47o4J02k50K98j61M7P3j01J14l04N8
4847a73J44J46l68O4J31J30j0j80Q4j43K81j73J3N3J98k5k21j40K81o6o3k5K51
4870A89m00J71j88Q6K30j63j12L49K4j20n5J52M1n53L92k00P6K42j3j03m3j56
4892a54K16n8n6O6j5MJ69l19P2K52j79q9j2M1j50K13K05l19L4J45K38j76j82l0
4916h4K2Q8J82l29K10om9K54n33J41J00P0o1L8o2j50L51r3j53l4j36L59m32M21
4940A14j32K27j55j29L12l31K35l68M83m89J93j68J13L51m09o2J12N1PJ6k4j34
4962a87k7J05Q9j0J28J47l65P8N9j92M16j53l38K44k01L67j33M6Q3l84K65m6K77
$$ plain form
4985 268 215 65 60 41 88 -198 -65 -89 -20 -38 -12 224 70 302 -151 186 191 21 -92 6 239 -388 89 204
5009 204 120 128 43 96 18 244 308 -24 70 168 -218 -17 -94 -33 -213 -169 80 -276 -182 -221 -114 -257 -239 -26 -90
5034 -90 -120 24 -92 35 -1 134 -220 -148 180 57 8 168 -135 -93 264 -414 -256 -239 -10 63 171 -42 -221
5057 -221 -76 -121 133 -177 -8 58 -223 159 -24 31 33 187 -43 -82 -96 -197 9 -114 -92 -94 94 -150 -133 -153
5081 -153 -345 103 -125 277 -117 -52 -28 93 31 -148 79 -132 176 -100 155 -103 -334 -6 -362 -47 215
5102 215 -107 -182 -171 -93 -35 304 -99 -19 -180 124 -44 213 -24 -123 -105 -213 -67 -179 266 207 -64 17 -213
5125 -213 126 29 191 21 -184 152 -222 164 3 76 -262 -111 -135 166 -26 25 62 105 152 127 -125 -90 50
5148 50 212 -83 -102 86 -118 259 64 -54 -174 35 177 142 -83 -98 -197 -113 -33 176 119 -109 -67 -28 99
$$ packed form
4985B68n3j50nj9M7k86J33k4O9j8K6K36j54K32m53L37Nj70j13R8K33o27M77J15
5009B04q4Qq5N3p8K26O4l32R4R8l86K01p7O1j80M4K49l56R4l9J07j43J8K13o4
5034i0l0J44j16J27l6J35l54P2L28j23m9J60l03M2L57o78J58J7K29P3J08k13j79
5057b21J45m5K54l10J69O6k81L82j83N5KJ54k30l9j4j01K06j23K2kJ88k44J7k0
5081a53j92M48k28M02l94O5K4J21o2j79K27k11L08k76K55k58k31L28l56L15K62
5102B15l22p5J1P8N8L39m03Q0j61L04j68K57k37r9J8j08J46j12M45n9k71Q1k30
5125b13L39r7J62j70k05L36l74L86j61P3l38J51k4L01j92N1L7M3M7k5k52L5J40
5148E0J62k95j9J88k04L77j95j18j20K09J42l5k25j5r9Q4Q0K09n7k28M2L9J27
$$ plain form
5171 99 -56 -121 22 207 -63 2 81 -96 -155 -264 -270 282 -218 -5 -238 275 -63 -73 -85 15 183 -216 214
5194 214 14 202 280 149 -34 -58 162 35 116 -44 59 47 47 247 -226 216 35 -37 -126 81 -58 -239 -139
5217 -139 -171 24 114 -7 -20 -136 -11 -92 185 -310 -18 -103 -10 105 -88 93 -229 203 21 -3 53 -53 44
5240 44 113 105 -88 19 -186 -67 -234 8 -101 199 -22 -196 166 -34 9 46 44 60 61 161 -125 -85 146 -7
5264 -7 -88 -107 -129 -203 0 12 62 219 26 -38 32 106 68 20 157 177 -186 88 -39 104 297 211 206 -70 -40 164
5290 164 230 -61 -59 190 -215 111 134 -146 -180 -59 209 22 -32 -120 60 -133 -73 244 -309 46 -116 123 -312
5313 -312 -51 108 -58 -27 -50 71 -185 -10 -364 32 -25 -48 152 -131 211 -1 113 -142 -121 -129 -55 162 -17
5336 -17 249 -165 181 32 -52 102 -249 195 -186 27 -291 84 40 44 114 -73 219 45 285 -16 305 -250
$$ packed form
5171I9j55o5J43J85k70O5P9j77n9j09oN52n00K13k33N13l38j0j2J00J68l99M30
5194B14k00J88P8j31j83k4K20j27Q1j60J03j2%K00m73M42j81p2q9K07j39j81J00
5217a39l2J95R0j21j3j16J25q1K77m95K92q5R3J15j93J81l22M32j82k4N6j06R7
5240D4O9qj93J07k05J19j67K42j09L00k21j74L62k00M3L7kJ6JJ00k86M0K31j53
5264gq1j9k2p4K03J2N0J57j93o4P0P4l8m8J37K0l63K74j27J43J93q6nk76L0K04
5290A64O6k91KK49m05L26K3k80l4J21K68j87n4q8J80j93O0L17n53L55j62K39m35
5313c12K61J59j66L1k3J21k56J75l54L96n7k3K00k83L42k12J14k55K1qP4K17j79
5336a7K66m14L46j49q4J54l51M44l81K13l18L75m4MP0j87K92j74K40l01L21n55
$$ plain form
5358 -250 -314 -72 -295 90 -162 50 -222 136 -80 -56 230 120 166 -90 265 -86 178 -130 -330 -22 28
5379 28 -117 -239 140 -122 -168 35 -77 131 -50 -106 -67 -153 25 -61 -35 -160 81 34 123 -23 55 85 -191 -55
5403 -55 -104 152 -42 -169 -43 -177 -90 -11 4 -220 170 53 -108 -34 -246 259 119 33 -144 74 70 25 -37 -34
$$ packed form
5358b50o4K42k23L85k52K12k72L58k16K4K86j10M6k56L55l51K64l08k00L08N0
5379B8j45j22L79k62m6K03j12K08j81n6L9q6J78q6K6j25K41m7Q9j46P8L0k76J36
5403e5m9K56j94j27J26j34Q7P9J5k24L90j17j61P4k12N05j40q6j77K18mm5o2L
$$ [...]
8191F9
##END NTUPLES=NMR FID
##END=
