##TITLE=1H_13-2026-Bay
 200.13MHz,DMSO-d6.
 8 sc
 
 10.2.2026
##JCAMPDX= 6.0         $$ Bruker NMR JCAMP-DX V2.0
##DATA TYPE= NMR FID
##DATA CLASS= NTUPLES
##ORIGIN= UXNMR, Bruker Analytische Messtechnik GmbH
##OWNER= pz
$$ XWIN-NMR		Version 3.5
$$ Tue Feb 10 14:22:42 2026 Russian Standard Time (UT+4h)  she@DPX200
##.OBSERVE FREQUENCY= 200.1313
##.OBSERVE NUCLEUS= ^1H
##.DELAY= (6, 6)
##.ACQUISITION MODE= SIMULTANEOUS
##.ACQUISITION SCHEME= undefined
##.AVERAGES= 8
##.DIGITISER RES= 18
##SPECTROMETER/DATA SYSTEM= spect
##.PULSE SEQUENCE= zg30
##.SOLVENT NAME= CDCl3
##.SHIFT REFERENCE= (INTERNAL, CDCl3, 0, 14.3821)
##AUDIT TRAIL= $$ (NUMBER, WHEN, WHO, WHERE, WHAT)
$$ ##TITLE= Audit trail, XWIN-NMR		Version 3.5
$$ ##JCAMPDX= 5.01
$$ ##ORIGIN= Bruker BioSpin GmbH
$$ ##OWNER= she
$$ F:/spectra/data/she/nmr/H-C/1/audita.txt
$$ ##AUDIT TRAIL=  $$ (NUMBER, WHEN, WHO, WHERE, WHAT)
(   1,<2026-02-10 14:20:56.59 +0400>,<she>,<DPX200>,
      <created by zg, POWCHK disabled, PULCHK disabled
       configuration hash MD5:
       00 E9 B6 7A A2 85 ED C7 34 08 36 98 17 FE 4E 26
       data hash MD5: 16K
       69 47 CD 6C D9 CC DB 94 5F BB A2 5B 17 C6 E8 0D>)
$$ ##END=
$$ 
$$ hash MD5
$$ BB 08 7B 08 87 3F 8D B3 89 03 38 99 4A D4 10 C6
##$RELAX= 
##$RELAX= 
##$RELAX= 
##$RELAX= 
##$RELAX= 
##$RELAX= 
$$ Bruker specific parameters
$$ --------------------------
##$DU= <F:/spectra>
##$EXPNO= 1
##$NAME= <H-C>
##$PROCNO= 1
##$TYPE= <nmr>
##$USER= <she>
##$AMP= (0..31)
100 100 100 100 100 100 100 100 100 100 100 100 100 100 100 100 100 100 
100 100 100 100 100 100 100 100 100 100 100 100 100 100 
##$AQSEQ= 0
##$AQ_mod= 1
##$AUNM= <au_zg>
##$AUTOPOS= <>
##$BF1= 200.13
##$BF2= 200.13
##$BF3= 200.13
##$BF4= 200.13
##$BF5= 200.13
##$BF6= 200.13
##$BF7= 200.13
##$BF8= 200.13
##$BYTORDA= 1
##$CFDGTYP= 0
##$CFRGTYP= 5
##$CHEMSTR= <none>
##$CNST= (0..31)
1 1 145 1 1 1 1 1 1 1 1 1 1 1 1 1 1 1 1 1 1 1 1 1 1 1 1 1 1 1 1 1 
##$CPDPRG= <>
##$CPDPRG1= <>
##$CPDPRG2= <>
##$CPDPRG3= <>
##$CPDPRG4= <mlev>
##$CPDPRG5= <mlev>
##$CPDPRG6= <mlev>
##$CPDPRG7= <mlev>
##$CPDPRG8= <mlev>
##$CPDPRGB= <>
##$CPDPRGT= <>
##$D= (0..31)
0 0.7 0 0 0 0 0 0 0 0 0 0.03 0 0 0 0 0 0 0 0 0 0 0 0 0 0 0 0 0 0 0 0 
##$DATE= 1770718855
##$DBL= (0..7)
120 120 120 120 120 120 120 120 
##$DBP= (0..7)
150 150 150 150 150 150 150 150 
##$DBP07= 0
##$DBPNAM0= <>
##$DBPNAM1= <>
##$DBPNAM2= <>
##$DBPNAM3= <>
##$DBPNAM4= <>
##$DBPNAM5= <>
##$DBPNAM6= <>
##$DBPNAM7= <>
##$DBPOAL= (0..7)
0.5 0.5 0.5 0.5 0.5 0.5 0.5 0.5 
##$DBPOFFS= (0..7)
0 0 0 0 0 0 0 0 
##$DE= 6
##$DECBNUC= <off>
##$DECIM= 32
##$DECNUC= <off>
##$DECSTAT= 4
##$DIGMOD= 1
##$DIGTYP= 9
##$DL= (0..7)
0 120 120 120 120 120 120 120 
##$DP= (0..7)
150 150 150 150 150 150 150 150 
##$DP07= 0
##$DPNAME0= <>
##$DPNAME1= <>
##$DPNAME2= <>
##$DPNAME3= <>
##$DPNAME4= <>
##$DPNAME5= <>
##$DPNAME6= <>
##$DPNAME7= <>
##$DPOAL= (0..7)
0.5 0.5 0.5 0.5 0.5 0.5 0.5 0.5 
##$DPOFFS= (0..7)
0 0 0 0 0 0 0 0 
##$DQDMODE= 0
##$DR= 18
##$DS= 0
##$DSLIST= <SSSSSSSSSSSSSSS>
$$ [...]
##$SUBNAM0= <"">
##$SUBNAM1= <"">
##$SUBNAM2= <"">
##$SUBNAM3= <"">
##$SUBNAM4= <"">
##$SUBNAM5= <"">
##$SUBNAM6= <"">
##$SUBNAM7= <"">
##$SUBNAM8= <"">
##$SUBNAM9= <"">
##$SW= 18.0517328524113
##$SWIBOX= (0..15)
0 0 2 0 0 0 0 0 0 0 0 0 0 0 0 0 
##$SW_h= 3612.71676300578
##$TD= 16384
##$TD0= 1
##$TE= 0
##$TE2= 300
##$TE3= 300
##$TEG= 300
##$TL= (0..7)
0 120 120 120 120 120 120 120 
##$TP= (0..7)
150 150 150 150 150 150 150 150 
##$TP07= 0
##$TPNAME0= <>
##$TPNAME1= <>
##$TPNAME2= <>
##$TPNAME3= <>
##$TPNAME4= <>
##$TPNAME5= <>
##$TPNAME6= <>
##$TPNAME7= <>
##$TPOAL= (0..7)
0.5 0.5 0.5 0.5 0.5 0.5 0.5 0.5 
##$TPOFFS= (0..7)
0 0 0 0 0 0 0 0 
##$TUNHIN= 0
##$TUNHOUT= 0
##$TUNXOUT= 0
##$USERA1= <user>
##$USERA2= <user>
##$USERA3= <user>
##$USERA4= <user>
##$USERA5= <user>
##$V9= 5
##$VALIST= <valist>
##$VCLIST= <CCCCCCCCCCCCCCC>
##$VD= 0
##$VDLIST= <DDDDDDDDDDDDDDD>
##$VPLIST= <PPPPPPPPPPPPPPP>
##$VTLIST= <TTTTTTTTTTTTTTT>
##$WBST= 1024
##$WBSW= 4
##$XGAIN= (0..3)
0 0 0 0 
##$XL= 0
##$YL= 0
##$YMAX_a= 120717
##$YMIN_a= -118023
##$ZGOPTNS= <>
##$ZL1= 120
##$ZL2= 120
##$ZL3= 120
##$ZL4= 120
##$ABSF1= 10
##$ABSF2= 0
##$ABSG= 5
##$ABSL= 3
##$ALPHA= 0
##$AQORDER= 0
##$ASSFAC= 0
##$ASSFACI= 0
##$ASSFACX= 0
##$ASSWID= 0
##$AUNMP= <proc_1d>
##$AZFE= 0.1
##$AZFW= 0.1
##$BCFW= 1
##$BC_mod= 2
##$BYTORDP= 1
##$COROFFS= 0
##$CY= -3
##$DATMOD= 1
##$DC= 2
##$DFILT= <>
##$DTYPP= 0
##$F1P= 0
##$F2P= 0
##$FCOR= 0.5
##$FTSIZE= 0
##$FT_mod= 4
##$GAMMA= 1
##$GB= 0.15
##$INTBC= 1
##$INTSCL= 1
##$ISEN= 128
##$LB= 0.25
##$LEV0= 0
##$LPBIN= 0
##$MAXI= 10000
##$MC2= 0
##$MEAN= 0
##$ME_mod= 0
##$MI= 1.114404
##$NCOEF= 0
##$NC_proc= 0
##$NLEV= 6
##$NOISF1= 3.799351
##$NOISF2= 2.8
##$NSP= 1
##$NTH_PI= 0
##$NZP= 0
##$OFFSET= 14.38212
##$PC= 1
##$PHC0= -3702.001
##$PHC1= 8.792324
##$PH_mod= 1
##$PKNL= yes
##$PPARMOD= 0
##$PSCAL= 0
##$PSIGN= 0
##$REVERSE= no
##$SF= 200.129724274929
##$SI= 16384
##$SIGF1= 3
##$SIGF2= 2
##$SINO= 400
##$SIOLD= 16384
##$SREGLST= <1H.CDCl3>
##$SSB= 0
##$STSI= 0
##$STSR= 0
##$SW_p= 3205.1282051282
##$SYMM= 0
##$S_DEV= 0
##$TDeff= 0
##$TDoff= 0
##$TI= <>
##$TILT= no
##$TM1= 0
##$TM2= 0
##$TOPLEV= 0
##$USERP1= <user>
##$USERP2= <user>
##$USERP3= <user>
##$USERP4= <user>
##$USERP5= <user>
##$WDW= 1
##$XDIM= 8192
##$YMAX_p= 0
##$YMIN_p= 0
$$ End of Bruker specific parameters
$$ ---------------------------------
##NTUPLES= NMR FID
##VAR_NAME=  TIME,          FID/REAL,        FID/IMAG
##SYMBOL=    X,             R,               I
##VAR_TYPE=  INDEPENDENT,   DEPENDENT,       DEPENDENT
##VAR_FORM=  AFFN,          ASDF,            ASDF
##VAR_DIM=   8192,          8192,            8192
##UNITS=     SECONDS,       ARBITRARY UNITS, ARBITRARY UNITS
##FACTOR=    0.0002768,     1,               1
##FIRST=     0,             0,               0
##LAST=      2.2672688,     0,               0
##MIN=       0,             -118023,         0
##MAX=       2.2672688,     120717,          0
$$ Real data points
##PAGE= N=1
##DATA TABLE= (X++(R..R)), XYDATA
$$ [...]
1621H12j018J47O52l99j147JP82M46l31p99M88J603l60j219L04P65m37q46l87
1640i43P80N33n53p92N51J479l16j258j20J383k5j176j36N63O15n69m91M13Q21
1659G59l28j186l8J390l15o71k86N16M23l18m4K71L87j66o06j38P48r1j101J16
1679f78N51N42o73OL91N11l59m30K47L15l89o49pR54P8j158O23O45J96o92l43
1700c19N44L0j16r72N15O68j39r25J83J319L9p29n00O18K85k10j061K2J194j69
1720B77j003K21R20M78p16m01M14N05p26m91o0P50L38o43m07P49L93p17k38L43
1740a4L92j36n11j19M04N69n08p69P14O11m62m38L25K05l37l89N0K83L01j37o0
1761b6M97J1l60j27K31q0o19Q4J80J01j37N9J11N56o2l89J62L0L42r11j68K85
$$ plain form
1621 812 -206 -59 593 194 -953 -952 -170 276 -55 -854 -366 1237 877 -342 -38 727 290 -556 -943
1640 -943 -163 370 -183 -975 -424 1055 739 -519 -639 744 719 -457 -593 -30 585 16 -475 -62 759
1659 759 431 -755 -793 597 282 -389 -675 -159 264 -54 -98 173 560 394 -212 -350 398 307 -794 -678
1679 -678 -127 415 -258 -252 139 650 291 -139 108 423 34 -615 -622 332 410 -748 -125 520 716 24 -319
1700 -319 225 255 139 -833 -318 350 211 -714 -531 788 827 98 -402 216 501 291 -770 -748 446 277
1720 277 -726 -505 415 893 177 -224 190 695 -31 -522 -582 168 506 -137 -544 205 598 -119 -357 -14
1740 -14 378 242 -269 -388 16 585 77 -692 22 633 171 -267 58 263 -74 -463 -413 -130 171 34 -26
1761 -26 471 482 122 -5 226 146 -473 -389 -209 -108 -245 -186 -75 481 419 30 192 222 564 -347 -515 -230
1783b30M03o00k25K24R04q8p74K16Q42J37r87l79O69M12p52n87P91K74j71m21
1803c42j91P98K29o72m58O62O42l27q54L79N59J54p31m83O22M71p35n25N60L70
1823A28M3l69m2P01P5m38q1P3N6l13k16M0J74J58j35K06M8J60N5n4j53j4j1j37
1847d6J77r6j15j44L32n7j79l7K3L41j69l34L27N46k85o27J94M31J12m68l30N22
1869A18J98l25o60L71M18M7n28M8N82J69q1n60J41M58P5j021K44N72j34k18o05
1890f91O51O63k85n57J23O87k77p11j39N09J55r4l06rN18r6k95J10J99J96m18
1911f7j81J14L95j41k55m3L82P7l04j51K19nk22k5J5K89j68L39j95o5N8J02R9
1934B67j56j97R8j19J61j82j70K68K98j17k66J22K30L7m22j5R6K83j23m62J31
$$ plain form
1783 -230 173 -427 -652 -428 476 388 -386 -170 672 809 -178 -557 112 524 -228 -815 -24 250 79 -342
1803 -342 -533 265 494 -178 -636 26 668 341 -513 -134 425 579 -152 -635 -13 458 -277 -802 -242 128
1823 128 171 -198 -240 461 536 98 17 90 146 -167 -383 -343 -169 -11 -146 60 108 268 323 269 116 102 91 -46
1847 -46 131 35 -80 -224 108 51 -128 -165 -142 199 30 -304 23 569 284 -343 -149 282 394 -74 -404 118
1869 118 316 -9 -669 -298 120 167 -361 -313 269 438 357 -203 -62 396 471 -550 -306 266 132 -86 -691
1890 -691 -40 623 338 -219 -96 591 314 -397 -536 -27 128 34 -272 -281 237 141 -154 -44 155 351 -67
1911 -67 -248 -134 261 120 -135 -178 204 281 -23 -174 45 40 -182 -207 -192 97 -71 268 73 8 66 168 267
1934 267 111 -86 12 -107 54 -128 -298 -30 268 151 -115 7 237 274 -148 -163 -67 216 93 -369 -238
1955b38M58O5l79k05N55L8k36n25L83M58m76k74J24M90J15l96l82O41J0j78m89
1976d41L91K47j28k88j5L21K48k76j37J1M67j29l32j95J87K57l35p9J87K61j62
1997F0j48K9L53j56j7J7r5j82L03j13k30J02K06o5l34K82r0O0J41o8k88L25N1
2020A43k6l8p3J21j00o3p3j14M90n9n31K67L69j8k18j12J97K43l04m00J97K53
2042A51J13k76l48M64J66k07j49j67L96P1j05k79K26K42l82l47M32J63j87l08
2062c31j2L64L34n43k9j47M59o7m46N09J3q8k17j5R6K78n1l08k68N82K12j84l63
2085b22K58Q7J70K2l21k1m0n9j67L27QNq5Q9k04j10N41r6l83K01K90m6l46p0K53
2110H1j8q5j80M8J66Q7j31j01K11J29j88j24p6K39N9j91j65O0M42k55o6K16J92
$$ plain form
1955 -238 220 285 -94 -299 256 294 58 -467 -84 374 -102 -376 -252 238 353 -43 -425 216 226 48 -441
1976 -441 -50 197 69 -219 -234 87 335 59 -78 -67 400 271 -61 -256 -69 188 -147 -226 -39 222 60
1997 60 -88 -59 294 138 121 138 43 -139 164 51 -179 -77 129 64 -270 12 -78 -18 123 55 -233 92 143
2020 143 117 79 6 127 27 -36 -109 -223 267 208 -323 -56 313 295 77 -35 162 405 101 -299 -102 151
2042 151 264 -12 -360 104 270 63 -86 -253 143 214 109 -170 56 298 -84 -431 1 164 -23 -331
2062 -331 -343 21 355 -188 -217 -364 95 28 -418 91 104 16 -201 -216 -120 158 107 -201 -469 113 325 141 -222
2085 -222 36 123 293 315 -6 -27 -67 -126 -293 34 42 47 -38 51 -153 -263 278 182 -201 0 290 244 -102 -172 81
2110 81 63 -22 -202 -154 12 99 -32 -133 78 207 19 -105 -181 58 117 -74 -239 -179 263 8 -58 158 350
2133C50l83j50J49J49J27j40k26N4K44N7m35j03M05j49L3M7l3O7M7j59k6K46M5
2156B16l15j95K26L07l62l3j0K10j93K36r0o2J88P4k68K5L3K6L7n7j59J03K24
2179A61j05k04J50J82j24n6q3R8K5K5k3q7J71K2l05j7J38n3Q5j02qK93o3l9k14
2204a33J17M61l73j14Q8n5m9q7J72n1MJ60m55K10M2J17k6k40K55K0k1r8N9K39
2228B42J5m68K06K9J4j26n6K51P7j5l9j94J30l0J9j69J65j49j62L8J67P0o6J08
2252E7j28j07K32J09m42K30J35o4L9M7r3j37J80o3l82J46Q5N1K6P5j45N4J51l4
2276B2j80K56J74l01N3j44L39l61Q8M8j35J39j59K20n9J18j31j49L2J2J53j14
2298g9Ml21M61J13j37m0J14J27j48K6j68J63k85J69N5k0p3k7N8j30J41Q5j98J57
$$ plain form
2133 350 -33 -183 -34 115 242 102 -124 -70 174 231 -204 -307 98 -51 -18 29 -4 63 110 -49 -75 171 216
2156 216 -99 -294 -68 239 -123 -156 -166 44 -149 87 -3 -65 123 197 -71 -46 -13 13 50 -7 -166 -63 161
2179 161 56 -148 2 184 60 4 -79 19 44 69 46 -41 130 152 -153 -170 -32 -85 0 -102 -110 183 120 81 -133
2204 -133 -16 445 72 -42 46 -9 -58 -145 27 -24 -20 140 -315 -105 -63 54 28 -212 43 63 42 -56 3 242
2228 242 257 -211 -5 24 38 -88 -144 107 184 169 130 -64 66 36 55 -114 51 -98 -260 -222 -55 15 -51 57
2252 57 -71 -178 54 163 -279 -49 86 22 61 108 15 -122 58 -5 -387 -241 -156 -105 -79 -4 -149 -95 56 22
2276 22 -158 98 272 -29 24 -120 219 -142 -54 -6 -141 -2 -161 59 0 118 -13 -162 -130 -118 35 -79
2298 -79 -75 -396 65 178 41 1 115 242 94 120 -48 115 -170 -1 54 34 -39 -66 -8 -138 3 88 -110 47
2322D7p4q3N3J69k57L46l42R6P1r5J49ll9l6k14K39M9o6n3K57j30q0m2K0l1L0
2348a9J46l54K72N7Kj24L6J25k1j75l6J61r0J12J6%J2O2m41K40J88p2j83l8L2
2373i2J83j85r5J98q9N6j23J49K1j29J11k49L31j36K9J06j9l61K79P5Q0k33j2
2396a05O5L7K23k93m5J67o2rj2K9j59K12l7j16J6J17j54R2J00J5j43j64J34O3
2420b9Q8o0O5k6P7K4K4k47J35k43N7pK04j65J69k27j41L12O6j66n5K67j75J58
2444A05k07j01J52J9k3K3m3J86k70L17j51q7J1j20L50j81oM2O2J15j49pNk84M00
2469A58j00k10mJ98j42L27m59J03J30qp6J12Jj84K04o6J51l2n2j3m0j1r1RK11
2494A16k29n6N4J09j60K38j29J30k33L33o5N2q6k5J08q3j6J18k85J68j21K7N1
$$ plain form
2322 47 -27 -110 -57 112 -145 201 -141 -45 26 -69 80 77 38 2 -212 27 76 10 -43 214 84 4 -38 -18 -49 -19
2348 -19 127 -227 45 102 104 -20 16 141 120 -55 -91 70 -20 92 108 108 120 182 -259 -19 169 97 -86 -124 -92
2373 -92 91 -94 -189 9 -80 -24 -147 2 23 -106 5 -244 87 -49 -20 86 67 -294 -15 60 140 -93 -105
2396 -105 -40 -3 220 -73 -118 49 -13 -22 -34 -5 -164 48 11 -105 -89 28 -126 -34 66 81 -62 -226 -92 -29
2420 -29 59 -1 64 38 115 139 163 -84 51 -192 -135 -142 62 -103 66 -161 -302 10 76 -90 -145 122 -53 105
2444 105 -102 -203 -51 -32 -55 -32 -75 111 -159 158 7 -80 -69 -189 161 -20 -26 16 78 193 44 37 42 -242 158
2469 158 58 -152 -156 42 -100 227 -232 -129 1 -7 -83 29 30 -154 50 -16 135 103 51 38 -2 -13 -104 -95 116
2494 116 -113 -169 -115 -6 -166 72 -57 73 -160 173 108 160 74 49 157 74 58 176 -109 59 -62 -35 16
2517A6LJ44j61m4J08k69L16j77l3J22P6Om2rn5j67J49J84N7k74L3j04L45j33J7
2542A08k45RQ0L4O9O3M3j06m9j25NQ8j3J14nk06K15l0j8j51K00m7L0l20L15j15
2568e7L22j20j46K18l39J81P1j18L4q5Jn3j6J51k88K43R9o1L9j75Q9p5n5K15m2
2593C3Op6K4m6j27K50k95J53J23o7L1j92L50k18j82K41J25k19N1L7r6J97M1j00
2617D4j46K52k4k77l4o7J20J46j06R3j33l53L98JK21p7r6J19j38J20QJ58k34j39
2641a44J31m9k5K55r6k61J77J55k50O9R1K4K6j86J56L10l82P4j36K26J44k20k46
2664a57P4J80o3o8Q5Q6j93q3K86m6j2m5l39L45M5o7l7P1j13J1r3J55J05j9k26
2689a18J38j08J34lq8j27L61k59K7N2L0J54k58J55n8k5Q1j43J17j0l6j09K75k13
$$ plain form
2517 16 19 163 2 -42 66 -203 113 -64 -97 25 101 107 65 56 1 -166 -17 167 224 -50 -17 -121 224 91 108
2542 108 -137 -128 -48 -14 55 118 161 55 6 -119 -114 -26 -39 75 70 -136 79 49 31 -120 80 33 63 -257 58 -57
2568 -57 265 145 -1 217 -122 59 130 12 46 -39 -38 -91 -107 44 -244 -1 98 37 76 -99 -10 -85 -140 75 33
2593 33 39 -37 -13 -59 -186 64 -231 -78 45 -22 9 -183 167 -51 -233 8 133 -86 -35 2 -94 103 144 44
2617 44 -102 150 126 -151 -185 -252 -132 14 -92 1 -132 -485 -87 -86 135 58 -38 81 -57 63 71 229 -5 -144
2641 -144 -13 -62 -87 168 72 -189 -12 143 -107 -38 53 77 103 -83 73 383 1 75 -61 165 309 89 -157
2664 -157 -83 97 34 -34 51 137 -56 -139 147 101 89 44 -295 50 95 28 -9 62 -51 -40 -133 22 127 108 -118
2689 -118 20 -88 46 43 -45 -172 189 -70 -43 9 39 193 -65 90 32 7 88 -55 62 52 16 -93 182 -31
2713c1j19K30L0N7J47m75J37rJ80L0k16j62L65k42J19k4n0k02J94J29j32K58k94
2736h0J69j27J58j14N2J0k17J39q9N4RM5Mm2Lk0l8J72j73l6K04q8r4K27rk62K85
2763A42k22P0n7k8J82K7j81K13k3l9k17J28m3J44r3J14q7%j25m3K43R8k17kl7
2788e3J76j40O4k0R9p1J21n0j52L1j00J40j4l7r8J29j02J83k64J28j02M05j67
2811A06JJ4k8j95q0J44k0kl4Q2n8J80j15j8r4O5l0k2rP0J45j4j0pK74m36R6j28
2839a23J37P1m2j05j78L57O9j30j22J03j04p9K04mn4k21K07K11k37q6J02J15q5
2862Fj7K0Q8Qq0n4O2J76l2Mj67J60k71J9J6J84j84Q2r4O6p8qJ2n6N1P8Q9j24N1
2891Gj2o7J68o0K1Rn2r8J2M4J91k14J37r3j7O7JJ02l8j58R7J74l54L5J67j58J11
$$ plain form
2713 -31 -150 80 110 167 314 -161 -24 -33 147 177 -39 -201 164 -78 41 17 -33 -235 -41 88 -44 214 -80
2736 -80 89 -38 120 6 58 68 -149 -10 -99 -45 -36 9 13 -29 -26 -46 -84 88 -85 -121 83 -5 -99 128 119 -143 142
2763 142 -80 -10 -67 -95 87 114 -67 146 123 84 -133 -5 -48 96 3 117 30 30 -95 -138 105 203 -14 -16 -53
2788 -53 123 -17 47 27 126 55 176 126 -26 5 -95 45 31 -6 -104 25 -77 106 -158 -30 -132 273 106
2811 106 107 121 93 -102 -182 -38 -58 -60 -94 -12 -70 110 -5 -23 -117 -52 -82 -104 -113 -43 102 88 78 71 345 -91 5 -123
2839 -123 14 85 43 -62 -240 117 186 56 -66 37 -67 -146 58 54 0 -221 -14 197 -40 -126 -24 91 6
2862 6 -11 9 97 105 25 -29 33 209 177 181 14 174 -97 -78 -62 122 -62 20 -74 -8 -86 -94 -82 -138 -87 -9 80 -44 7
2891 7 -5 -72 96 36 57 66 14 -84 -72 -28 163 -51 86 -7 -24 43 44 146 108 -50 47 221 -133 -98 69 -89 22
2918B2j72J25o7k2j5J5K5J67j02N2n9J5j5j48J38j84K44j86J70J12k29J58q5J84
2942A43k32p7L44p8j93k1K51j65J73J45o25K43J88j4k35jp0K18j18J58m4j77L6
2965a51J99Q3P6l40j6K75l89K91J2P6j07M9j39J72j66j69J23K72p7k47K25j36
2987h4J05q8q7O5J72j85K27K5j19J4l6O3k59L25j8k16j11M00q7j26L26l91J13
3010B8j18p8K26r3K42k84K09m4j73P5q6J14o0K49l91R5k8jJ2Q3J05r9P8j20R0
3035C1o0P2p3J95l31J64MM0l02K27Kl6J70j39j05L92l97J96j08K14l21K41j15
3058c9j16J27R8l3r4J23j95J12J3P4n9o6P1p9J75Jl06K52j44J78Pj46Q4J18k13
3083e7J50m0K5j27m0K1L6o5J86P5k74K4L05j11j49K41l63K58M3k03o5M4P5q1r2
$$ plain form
2918 22 -150 -25 -92 -114 -129 -114 -89 78 -24 28 -31 -16 -31 -179 -41 -225 19 -167 3 115 -114 44 -41 143
2942 143 -89 -166 178 100 -93 -114 137 -28 145 290 -335 -92 96 82 -153 -154 -224 -6 -124 34 -10 -187 -151
2965 -151 48 131 207 -133 -149 126 -263 28 40 116 9 58 -81 91 -75 -244 -121 151 74 -173 52 -84
2987 -84 21 -67 -154 -89 83 -102 125 150 31 45 9 72 -187 138 120 -96 -207 193 106 -20 306 -85 28
3010 28 -90 -168 58 -35 207 -77 132 88 -85 -10 -96 18 -42 207 -184 -89 -117 -118 -106 -23 82 -17 61 -59 31
3035 31 -29 43 -30 165 -166 -2 2 42 -260 -33 -31 -67 103 -36 -141 251 -146 50 -58 156 -165 76 -39
3058 -39 -155 -28 70 37 -57 66 -129 -17 -4 70 11 -55 16 -63 112 113 -193 59 -85 93 100 -46 38 156 -57
3083 -57 93 53 78 -49 -89 -68 -32 -97 89 164 -110 -86 219 108 -41 200 -163 95 138 -65 -130 -86 -11 -92 -184
3108a84o7M03r7j04l6J94J04k17R3J3l5r6J15p3J36q6j05k12L74k39L59j75o8
3131cJ79l90N9l4k4J50J7K70k04k62J82J34M1Q2j71K0j65O6J99r8j63K59lK6j50
3156A7J7k3j94L53l26J80l3m6k8R5j29P6J37k28L5J45j38N3J25r2q4P3R2j32Q2
3181B7nl8L2M2rk1j07O0m5K1K22k92J98j04k3R6k86L03J63q0j81rL2j34K23L0
3207A15k51Q6j59K76R2j14J15j28R1k22K95k96J9k1J84K02m19K02k0k16L19l31
3229a81J34j71J37J70n3Q8o8K07k99J3n7k8J58j16K24j93q9J4O6q7J61o6L4K89
3253B87k41k20L8K4lo8J45J15r4N8n9J23j85R0RP5J22m66j7K71RJ60q0O0l16J2
3279a51O7jm3J95N1q0O7l5m9p3J45j52K21k86K53o4N9m2Jj43R4J15j76R5P4k38
$$ plain form
3108 -184 -251 152 55 -49 -85 109 213 -4 89 102 67 -29 86 13 149 63 -42 -254 120 -119 240 65 -3
3131 -3 176 -214 -155 -189 -213 -63 -46 224 20 -242 -60 74 115 197 26 46 -119 -53 146 48 -115 144 141 167 17
3156 17 34 11 -183 170 -156 24 -9 -55 -83 12 -117 -41 96 -132 -97 48 -90 -37 88 -4 -88 -15 77 -55 27
3181 27 22 -16 16 58 49 28 -79 -19 -64 -43 179 -113 85 -19 -42 54 -232 71 234 154 -27 -36 -4 -138 85 115
3207 115 -136 -50 -209 67 159 45 160 32 123 -99 196 -100 -81 -102 82 284 -135 67 47 -169 150 -181
3229 -181 -47 -218 -81 89 36 124 56 263 -36 -23 -80 -108 50 -66 158 -35 -124 -110 -44 -131 30 -36 -2 287
3253 287 46 -174 -136 -112 -115 -183 -38 77 -17 41 -18 105 -80 10 19 94 216 -250 -267 4 13 173 93 153 -163 -151
3279 -151 -84 -85 -128 67 118 38 105 70 21 -52 93 -59 162 -124 129 65 124 82 83 -60 34 149 -27 68 142 -96
3305i6K45n8rJ15l33L55K4j76Q9j13p3R5O4L6j49M0r2m0J54p7L5j95K08p5j67
3330a93J85J37j42N0j55L40k22k39J71n4K6k7J48r5J16o2q5K8o9K9L08k88L7O5
3354IJ94k60o5J62j08J10j89J57mj26K31K7j78J20k81J14M2l2P9o4N7R6j50Q4
3378B5j06m6J98Qo6P4j51J64l2j38J52p0J33j23r5L2m0j8J80j92K28q5j26k6J6
3403a04P0J2M2J50j50j5P6M6k51Q0Qm6J22J66j24K2J58k11J73k58m0k4K13j70
3427e5oO5p7j00K00k2n8Q4J8M4oJl8r7J1m8O9Q9l12J37K6j06L05q4j22N9nJ15
3455H7j71L09j62j03K91k46j27J18P5j79m3J11j28P7R8J79k76l6J40j58K42j60
3477f2L1j04J78P6qr6l7o5J12k79J85J64K46l21rj10k2O2J9J83j95K12k10L4j09
$$ plain form
3305 -96 149 91 82 197 -136 219 243 67 156 43 -30 65 129 165 16 56 -36 -76 78 1 36 -159 49 -26 -193
3330 -193 -8 129 -13 37 -118 222 0 -239 -68 -122 -96 -123 25 -70 46 -16 -101 -73 -142 -113 195 -93 -56 9
3354 9 203 -57 -122 40 -68 42 -147 10 6 -120 111 138 -40 80 -201 -87 -45 -77 2 -62 -5 91 -59 25
3378 25 -81 -127 71 79 13 87 -64 100 68 -70 82 12 145 22 -73 -41 -81 -99 81 -111 117 32 -94 -120 -104
3403 -104 -34 -22 20 170 20 5 81 127 -124 -44 -36 -82 40 206 82 104 262 51 224 -34 -74 -98 115 -55
3427 -55 -61 4 -73 -173 27 5 -53 31 49 93 87 88 50 -47 -36 -84 -15 74 -238 -101 -75 -181 124 40 -82 -23 -28 87
3455 87 -84 225 63 -40 251 5 -122 -4 71 -108 -151 -40 -168 -91 7 186 -90 -126 14 -144 98 -62
3477 -62 -31 -135 43 119 111 15 -22 -87 25 -254 -69 95 341 20 11 -99 -121 -59 -40 143 -52 160 -50 -16 -125
3502a25Q1j31J57k3P7n0P3P5k8K3l1j98J24p9l0J45l34J76j8J95j37l7R7P0m8
3527B4j26O5l5M4M6Q4K5q5L2J04l63M7J88j79o0M71k89kO2q6RJ40J53q8j74P6
3553H3p9o1O9K8oN9l4l8r2n5J47j80J98M2k09n4l9J66J00j90J16l9K7J85j07m5
3579hK8M3j91L60k49K4l7O6J63k39k11J58l1J64m7jL0j61J34N4j39k20J35j1J00
3604h6K1j68K98k08k0J49p3K15k59K65q5%j08O2J46k06Q6q1J34j90K00m1n4J21
3628A18p0J15j49j18J44k48M14k04m7K00m03J52n8J43q6k7K73j41jo2J54j27%
3651b8J86j56m1j6J18jL4j7k94J98K02j21R8j35k7M8r7J35j73J85L5j22q4nJ60
3676H2J56k01J08r7P6q6Qk22K20j76o0K62r5P7j07j87J28K63K9j92J18j31L3P
$$ plain form
3502 -125 -44 -175 -18 -41 36 -14 59 134 106 129 98 -100 24 -55 -85 60 -274 -98 -116 79 -58 -95 2 72 24
3527 24 -102 -37 -72 -28 18 102 127 42 74 178 -185 -138 50 -129 -189 282 -7 -9 53 -33 -24 116 269 181 7 83
3553 83 4 -57 12 40 34 93 59 21 -71 -126 21 -159 39 81 -128 -182 -221 -55 45 -145 -29 -68 -41 144 37 -8
3579 -8 20 63 -128 232 -17 7 -30 36 199 -40 -251 -93 -124 40 -7 -8 22 -139 -5 49 -90 -310 -175 -186 -86
3604 -86 -65 -233 65 -143 -163 -14 -87 128 -131 134 49 49 -59 3 149 -57 29 -52 82 -108 92 51 -3 118
3628 118 48 163 14 -104 40 -208 206 2 -45 155 -248 -96 -154 -11 -97 -124 149 8 7 -55 99 -28 -28
3651 -28 158 2 -39 -55 63 62 96 79 -215 -17 185 64 162 27 0 48 -49 86 -87 98 133 11 -73 -78 82
3676 82 238 37 145 48 124 38 46 -176 44 -132 -192 70 -25 52 -55 -242 -114 149 178 -14 104 -27 6 13
3700A3j7n8K8k55K34J94k22k0p9M29k01j13k0K6j08K0J27J2J59m2r5j15O3N7J
3725A8L4J01k59R9l3R5n9O7j27l7j65N39o42L22K60R5m1j78p9j22J53j8lj13m1
3750a34L75m88K85n2q1J25m1r2j9K82j40N2j49J8L5Kk22L91k23qJ56M4l25K8J54
3775b7K0k4K20j46k53N5N4J27k4l1K18j40J62j35M3k96J61J80q7P6k40%J29nO0
3800I7J07k36j12K7K38l40J39J43P2k31R8J57k30J46kN9k93J37K8j2k0K16k20
3823c2O6K74m46M26l89L2MN9r1PL38j76q0L01k77l22K21l4P0K37j34p9qn4J53
3848F6j12O4o4o5j44J66L11l57J04j08l0J80o3M1Q7J63k17j12M7Q0K17l14L0L21
3872B91k31K6o3L1lJ10j43O0j59j3J1O8P5JJ13j54q1k9n2J10j49K09q7J1p3N6
$$ plain form
3700 13 -4 -62 -34 -289 -55 139 -83 -103 -182 247 46 -67 -87 -61 -169 -149 -22 -10 149 107 12 -103 -40 17 18
3725 18 52 153 -106 -7 -40 55 -4 63 -64 -101 -266 273 -369 -47 213 308 267 89 10 -112 41 23 20 -93 -134
3750 -134 241 -247 38 -14 -95 30 -11 -103 -122 160 20 72 -77 -59 -24 -22 -244 147 -76 -84 72 116 -209 -181 -27
3775 -27 -7 -31 189 43 -210 -155 -101 26 2 -29 189 49 211 76 119 -177 -16 164 77 153 -87 -87 42 37 97
3800 97 204 -32 -144 -117 121 -219 -80 63 135 -96 2 159 -71 75 73 132 -161 -24 4 -8 -28 188 -32
3823 -32 34 308 -138 288 -101 -69 -65 -6 -97 -90 248 72 -8 293 16 -306 -85 -119 -49 188 54 -25 -33 -87 66
3848 66 -46 18 -46 -111 -255 -89 222 -135 -31 -139 -169 11 -52 -11 76 239 22 -90 -43 37 254 -60 -30 291
3872 291 60 86 23 54 51 161 18 78 -81 -94 -83 -15 60 61 174 20 -61 -90 -142 -32 -181 28 -59 -48 -121 -65
3898f5k6J43P2J44p5j12r0p9J25o8k9N4jj21J31j27j13J12P6k1M0q2J08j9oJ68
3924A39k44o2J23J83l89L24n2R2k49j06K16j8J64j3j3l00K61j24J34q8j7K1J76
3947A58m98K07J29P0L9j0j33J32n8J7qr7J36j6j9M6L5j40r7N9P2p0J4L6Rj00l
3974i0J19o9P8q0R4k56J10J64L2J43l55K08j2n9Op6k36L90r9Q6J07k00O0j76J83
3999G2Q3k15o4J98j92K91j85J83j28L1Kj25Q6j34L4J03R3J0j87j11K55j09oO0
4023D5r1j07J98j31J61K9j52R8R6k46J98k0l1j38K9K4K38j82r1O8k16M53m00J04
4047f4l0L12j51k46K4K38m9o9j64J14K37l61K73k72K32rj79J82p3k38J99M0N0
4070dM2j42J21p0O7jO5k55K28j21J06m6j7M3J6P3j41J71J18l44Q6m8j0O7J11k53
$$ plain form
3898 -65 -91 52 124 268 193 81 -9 -88 37 -31 -60 -6 -7 -128 3 -124 -237 -125 -49 -70 -30 -112 -4 -23 -29 139
3924 139 -105 -167 -44 139 -250 74 22 114 -135 -241 -25 -43 121 108 95 -205 56 -68 66 -22 -39 -18 158
3947 158 -340 -133 -4 66 105 95 -38 94 36 53 45 -52 84 68 49 95 130 -10 -107 -48 24 -46 -32 4 13 -87 -90
3974 -90 29 -40 38 -42 52 -204 -94 70 102 245 -110 98 86 27 33 -43 -279 111 12 98 205 5 65 -111 72
3999 72 155 -60 -124 74 -118 173 -12 171 43 74 76 -49 37 -97 -63 40 133 143 -44 -155 100 -9 -15 45
4023 45 -46 -153 45 -86 75 104 -48 50 146 -100 98 78 47 -91 -62 -38 200 18 -73 -5 -221 232 -168 -64
4047 -64 -94 218 67 -179 -155 83 34 -35 -199 -85 152 -209 64 -208 24 15 -164 18 -55 -293 -94 -54 -4
4070 -4 38 -104 17 -53 14 13 78 -177 51 -70 36 -10 -27 16 32 105 -36 135 253 -91 -5 -53 -63 4 115 -138
4096a38J53L9j6p3l8J50n3k3K9j59M4l8N2O9O0j02r8K12R0j67J12J00k09O3q7
4121b8p4N8k2Q9L6j72J92j00P5q3K9J25j68J46M2l8n1J82l67P8M8j54J87p8r7
4146a45J08M0j38N8J38j14q7J38j5N6L1k9j85qL18m3j92rN9qQ5rp3J6n3m3J02
4173bl3R7j9l04L77j01J36J8O9k53Nkl3r9J79p8J55k8l6j37J00j6M4j7p8J73j65
4200d8po2M8l9K40q4k1M3N9j98K46k32K40k71K05k79K02JP8l9k57L10j58K4n1
4225e0L7r4J7J07J51j89k12q7L16r2J09J36k82j24L83k37o8J37J15Nl48J99K77
4248B06m8p6m7M6q0K3R2k43K52j76J86q5J01j02j19K02k57K15j94J43j31J4N8
4271b0P6j41j7R9j71J90o6j87J31J09m6K3mJ41k82J61r8J59J1Nk06K98o1j3qN
$$ plain form
4096 -138 15 54 38 -35 -73 77 24 1 30 -129 -85 -123 -71 -2 58 -44 -142 70 160 -7 105 205 -4 59 -28
4121 -28 -102 -44 -66 23 59 -113 79 -21 54 -29 0 125 -43 103 145 107 56 238 -129 -51 -3 -157 30 -48 -145
4146 -145 -37 3 -135 -77 61 -53 -140 -2 -17 39 70 41 -144 -152 166 123 -69 -78 -19 -27 58 49 -24 -8 -61 -104 -2
4173 -2 -35 62 43 -261 116 15 151 169 238 -15 -10 -12 -45 -144 35 -43 112 84 48 -89 11 -5 39 22 -56 117 -48
4200 -48 -55 -117 -69 -108 132 48 27 70 129 -69 177 -55 185 -86 119 -160 42 43 121 82 -175 135 -23 1 -50
4225 -50 -13 -107 -90 17 168 -21 -233 -320 -4 -96 13 149 -133 -257 126 -111 -179 -42 73 78 -270 -71 206
4248 206 158 82 35 81 1 24 116 -127 125 -51 135 50 151 49 -70 132 -125 90 -104 39 -92 -78 -20
4271 -20 56 -85 -102 -3 -174 16 -50 -237 -106 3 -43 -20 -24 117 -165 -4 -102 57 68 73 -133 165 104 91 83 88
4297H8o3r9J79j52K2n0J06j00J18j77K69j10mJ01j71N6NL4p2J16q3r2O9p9p4P8
4323h5J93k12K3K46j77q8N3J01o9R8l33L33J61j57r4l1lo0K0K6J44l21J09j24
4347b47L21r2q2M8k6r4L9K09O7j9L1k44K01j8J2k69J60N6l8J82j99J21r3kk5J6
4373A5m7J15r0P8j82L8j6n5K60OK0j27R7j14J15P9n8j21K2j23J73j33OJ2J40%
4399A10j68K66n6j43L9Po6J49k67K43r8p7k1L67k80j5j00L70l8k55k4J64q2l4
4423iQl7J4rJN1N4p0L0j38o5L67m21M91l20Q9rnq5rK39q8npm3j88O4K73k50oJ35
4454E2k70J1O1l1K24k9J48j76k31L32k9j10k6P6O0j90K5L0J17O0k99J38r6K57
4478A04J6j91J01J50Oj01r2p3J28r1j36L09j14q3j06J74K2Nl1j56M39l19m4j92
$$ plain form
4297 88 25 -74 105 -47 -25 -75 31 -69 49 -128 141 31 27 128 -43 13 18 52 -20 96 13 -79 -10 -89 -163 -85
4323 -85 108 -104 -81 165 -12 -100 -47 54 -15 83 -250 83 244 87 -7 -38 -41 -101 -81 -55 89 -232 -123 -247
4347 -247 74 -18 -100 -52 -78 -172 -133 76 143 124 155 -89 112 94 106 -163 -3 53 15 197 -2 119 26 24 -1 15
4373 15 -32 83 -7 71 -111 -73 -89 -144 116 122 142 15 112 -2 113 192 134 13 35 -88 85 -48 -42 -30 110 110
4399 110 -58 208 152 9 48 55 -11 138 -129 114 16 -61 -82 285 5 -10 -110 260 222 -33 -57 107 25 -9
4423 -9 -1 -38 -24 -33 -32 19 73 3 33 -105 -170 197 -224 267 -53 36 27 22 -63 -72 167 79 74 67 24 -164 -100 173 -77 -83 52
4454 52 -218 -207 -146 -177 47 18 166 -10 -241 91 62 -48 -74 2 62 -128 -103 -73 44 104 -195 -57 -153 104
4478 104 120 -71 30 180 186 85 -7 -80 48 -43 -179 130 16 -67 -173 1 23 28 -3 -159 280 -39 -83 -275
4502b75K78J09j00m9N2O4l0N3j69m6K25J02j24k9kN0j95K15l8%Ql5m2jm0j49K00
4529C2P4j84P5j41K05j27J83k9n2j97J11R3J31k69K19l6j8Nl9R3k94J96L8j13
4553d4M8O3k55K94j34K13k19n4J61j42j2K25j66l5n4K94k48Q5M5j33L8K0j17K64
4577A37l44L72k33K7M6j41M04l06J58j21q4K05J34j92q7J19n3J83l11j5J25j19
4599i6L05j03k94Q3J95r5o9K02j49K46k07J3Pk01Q2O8K0m9j44J71P6j45j6K0J10
4624C0r7J09k98K07J29p6J0L2Ok38K85j73K1J61r2n9Q2k11N3J80j4k3l1M8j66
4649a25L84j26Nk68LJ80j59J5J61J9k56Q3K8j8K43m5l1k00K99j81J58k97K7Q4
4673a7O9j84J18p3K73k39K10j36L89m85J44k9j7K8k6J30l06K93l6o3n7J53L0L0
$$ plain form
4502 -275 3 112 12 -37 15 79 49 102 -67 -113 112 214 90 61 59 109 -86 129 91 91 99 64 22 21 -19 -168 32
4529 32 106 -78 -3 -144 61 -66 117 88 36 -161 -50 43 174 -95 124 88 70 75 36 129 -165 31 69 -44
4553 -44 4 67 -188 106 -28 185 -34 -88 73 -69 -81 144 -22 -57 -111 183 -65 20 65 -68 -30 -10 -127 137
4577 137 -207 165 -68 -41 5 -136 268 -38 120 -1 -85 120 254 62 -25 94 41 224 -87 -102 23 -96
4599 -96 209 106 -188 -105 90 -5 -74 128 -21 225 18 31 38 -163 -81 -13 7 -42 -186 -15 61 -84 -100 -80 30
4624 30 -67 42 -256 -49 80 4 14 46 52 -186 99 -74 -53 108 16 -43 39 -172 -119 61 47 24 -7 41 -125
4649 -125 259 133 138 -130 -127 53 -106 -91 70 89 -167 -84 -56 -74 169 124 93 -107 192 11 169 -128 -101 -17
4673 -17 52 -132 -14 -87 186 -53 157 21 410 -75 69 40 23 51 25 155 -151 142 106 43 -14 139 169 199
4697A99L2k30J02k10M1J88j45q2K2Pq6N6J98l46K25r0K71l3l14J18j52K87R9q9
4721F8l3n8J80j06n7%J30M9Jl1nl39L25r5j28J55k6q5Rj06J9Q0jPJ82m4m0q4k
4750c5M1j24q0J15l4J47j06J53n2J12j40P1L9j09j62L07j48P3j99J88J72k25Q4
4773H8k0j43RJ97m5j28L52m42j21K34j58K30kn4J38n6j29J94k43oJ43k9j0j2K
4798a1j98J76J44m8k18J07J52k0j88l0k7K92l68J36K32j14P4O9j24j25M4N0q9
4821h4j6PJ42j59K32o0j18k1k6J21K9j30P5J3%j25K80k2j67l6J21l4J85k19J39
4846A27j89K22o7j1J51l04j1P1J1k8K0J67k70N7Q8m2J38j7o0l55K69K2j38J33
4870a6p1J0j6J49q6K9j01j62K75j61J97r9J71j58j88K43M1mL3j59P8J29k3k86
$$ plain form
4697 199 231 1 103 -107 -66 122 -23 -105 -83 -76 -162 -106 92 -254 -29 -119 152 119 -195 -77 -229 58 157 68
4721 68 35 -23 157 51 -6 -6 124 173 174 143 138 -201 124 29 -99 56 30 -55 -46 -152 -133 -53 -54 -47 135 91 51 -33 -35
4750 -35 6 -118 -198 -83 -117 30 -76 77 25 137 -3 68 107 -2 -164 143 -5 68 -131 57 229 4 88
4773 88 68 -75 -66 131 86 -42 310 -132 -253 -19 -177 53 51 -3 135 79 -50 144 -99 -105 38 9 -1 -13 -11
4798 -11 -209 -33 111 63 -155 -48 104 84 -104 -134 -161 131 -237 -101 131 17 91 160 36 -89 -45 5 -84
4821 -84 -100 -93 49 -110 122 62 -56 -77 -103 18 47 -83 -8 5 5 -120 160 138 -29 -65 56 22 207 -12 127
4846 127 -62 160 93 82 233 -71 -82 -11 0 -28 -8 159 -111 -54 34 -8 130 113 53 -302 -33 -11 -149 -16
4870 -16 -87 -77 -93 56 -30 -1 -102 -264 11 -150 47 -52 119 -39 -227 16 57 53 86 -73 5 134 111 -175
4894a75K07M4k7j58J10R5j97k7j5K04k8Lj2q0L17m35o5K68J24R9l58pJ62k21K07
4919C5J77k50M9J30p3m0m8j9jo1n1n1J48O2p6L0Q6oj95L19j14j56J34n6J13M7
4945A33M2n7j64o1L08j85kN6j58l8J20J8r3J6n6J59j47K0J92k15K44j98N6K11
4969B01r5j58J10j8m9J07j09P8l48K02J89k8j27Q0K3M0rN8k06J74j09P7j32J37
4993H8j52K5m4r1J32J29j68J62jk79L07k13O9R2r7O0R9j51j1Q5J68k49k4J41m9
5018B8l1L7P7j37J68k4j76M0J48l29J2L83k70Q0K9J9J16k09O9k05L29j64J56o8
5042G8j37R9J6No3J17n1r9P6m1P6j53J46J57k56m2J9J25K2j70P4j63K07l9N0J7
5068G0m1Pp0Pr0J52M3o2k07Pk1K15k38K11M2l9J9K0o1J08N6j29J0l0N7pl5o2J5
$$ plain form
4894 -175 32 76 49 -109 1 96 -101 -128 -143 61 33 36 24 -56 261 -174 -239 29 153 252 -106 -113 49 -172 35
4919 35 212 -38 11 141 68 28 -20 -39 -40 -101 -152 -203 -55 7 -69 -39 47 41 -154 165 51 -105 29 -27 86 133
4945 133 175 118 -46 -107 201 16 14 70 -88 -126 -6 12 -81 -65 -121 38 -109 -89 103 -112 132 -66 -10 201
4969 201 106 -52 58 40 -9 98 -11 67 -281 -79 110 82 -45 35 58 98 89 147 -59 115 6 83 -49 88
4993 88 -64 -39 -83 -174 -42 87 -81 81 80 -199 108 -105 -36 56 -41 19 118 -33 -44 41 209 -40 -64 77 28
5018 28 -3 34 111 -26 142 118 -58 -18 130 -199 -187 196 -74 6 35 54 170 -39 30 -175 154 -10 146 78
5042 78 -59 40 56 61 -2 115 64 -35 41 0 76 -77 69 226 -30 -72 -53 72 94 -76 -2 -165 42 3 53 70
5068 70 29 36 -34 -27 -117 35 78 16 -191 -184 -205 10 -228 -17 25 -14 5 25 -36 72 128 -1 9 -21 36 29 -6 -68 -53
5097e3N9jr1J02O3J64ml65K62L8l16l4J16J34j0k50K88n8L8j00o5L3Q3j21K17
5122A29n9n9K6j47K95j41j46N5K93j31k72n9L35J01j28j26J26L3L3K4o2j61m1
5145h2L0L1Q6j4Lm3L1J20j60l7o2M9J8J81r8j05Q1R6M0j21J6j13R3J8M4Nn4%j16
5174f3M3J41J26k41Q4k08L09j85J09O8l17P0K38Kj57j10L57k30Pj38o7K56j25
5197c1J15k11J58M1q1J98m15K09K01k05M6q4p6J98j18J18r4k6J62j00k21K44J86
5220B14j99o6j0Q4K9q5O7j08L37j20k10j6%J9o8R9j64K32j36J88k33J18J0N8r9
5245e9J33j82P7j27K89j74j43K8J46P4j41L5L6k53K55m7J86l43Q5J53R0m2j11
5268c5j95J50O4r1J21R5j87P9j09J22o5J44r7JJ18J14l12L8M8pn6J78j76kK4l1
$$ plain form
5097 -53 6 5 -86 16 79 243 239 -126 136 174 -142 -176 -60 74 64 -186 102 44 82 -18 -83 -50 33 -88 129
5122 129 70 11 37 -110 185 44 -102 -47 246 115 -157 -216 119 220 92 -34 92 125 158 182 120 -41 -82
5145 -82 -52 -21 65 51 54 11 42 162 2 -35 -97 -48 -30 151 53 -52 29 125 165 44 60 -53 40 58 102 107 53 53 -63
5174 -63 -20 121 247 6 90 -118 191 6 115 183 -134 -64 174 176 19 -91 266 36 43 -95 -162 94 -31
5197 -31 84 -127 31 72 -9 189 -226 -17 184 -21 25 -59 -135 63 -55 63 -31 -57 105 5 -216 28 214
5220 214 15 -51 -61 23 52 -33 34 -74 263 143 -67 -83 -83 -64 -132 -33 -197 35 -101 87 -146 -28 -18 40 -59
5245 -59 74 -108 -31 -158 131 -43 -186 -158 -12 62 -79 -44 -8 -261 -6 -53 133 -210 -125 28 118 76 -35
5268 -35 -230 -80 -16 -107 14 109 -78 1 -108 14 -51 93 -4 -3 115 229 -83 -45 3 -4 -60 118 -58 -60 -36 -67
5294f7J14k48J34J27j87K79n8j81j64J12J64J09J4j72q8J00k3J60r3l8O3J6k27
5317a54Q4J06q3J86k41j34P1J32l8J94k20q3K54K9j27k5O2K9K0l7k43J66n7N6
5341e3m1J80m4j26J58K5l12J16J44j04OJ85j29k16m1J21k3J53K12k19K31k92m9
5364a18L21j63K4l9K0j07o7J49j53J72J63k09NJ53j60k9j75K56j88J51J30j05
5386C1j69L22l16R3J72o4K04j84q3l9J03j11L3K03j19P9k03K60k99K06j94L4o
5409d7P8O4q9k62K46J40k7k9j02J20j99L4J91j53N9J68j59r0K92m32J86K2J47
5432A58nj50j66K98J11l31O9J3p2N6O8J1j5J41j84m8L6k23J76R7n9m3P4J8j24
5457i4k6L81l38j15L85l36jJ37j20RLK53k74K15j83J92r0O1j51N1Q4j33J39j17
$$ plain form
5294 -67 47 -201 -67 60 -127 152 94 -87 -251 -139 25 134 148 -24 -112 -12 -35 125 32 -6 57 73 -154
5317 -154 -70 36 -47 139 -102 -236 -165 -33 -71 123 -97 -180 74 103 -24 -49 13 42 62 25 -218 -52 -109 -53
5341 -53 -94 86 42 -84 74 99 -213 -97 47 -57 -51 134 5 -211 -252 -131 -154 -1 211 -8 223 -69 -118
5364 -118 203 40 64 25 45 -62 -129 20 -133 39 202 -7 -2 151 -9 -38 -213 43 -145 6 136 31
5386 31 -138 184 -132 -39 133 69 273 89 6 -33 70 -41 -8 195 76 155 -48 212 -87 119 -75 -41 -47
5409 -47 31 95 6 -256 -10 130 103 74 -28 92 -107 -73 118 -35 24 192 33 -57 235 -197 -11 11 158
5432 158 153 3 -163 135 246 -85 -16 -3 -75 -19 49 60 45 186 2 -46 -10 -233 -57 40 -19 -62 12 30 -94
5457 -94 -120 261 -77 -192 193 -143 -144 -7 -127 -118 -115 138 -136 79 -104 88 -2 59 -92 -41 43 -90 49 -68
5481f8J99Kj37P2P7j64k7ro1Q7J20o3j26JJ24J43l13K31q4m9j60J30m1K45k81
5506a52J89pM7p0j6j51P1J09n4J10r4m1p2N7L08j28o5j30J14j02m3J11l2n4J03
5531HP9n0n8p0J14N5o0K2k69J36j27J15M8R3K4r8rL7r7K7L45l90R5j14M0J45O1
5558A02R4j81j40K07O5k53J93m14K52J40p5l5k44M32m8p2j38K54k69P8Lj58R4
5581a13J82n1N9j01p7K38Pj00j53P6J94r4k40J9J53j15lK85k34J3O2L2k28L71
5605A82l72L02k33L6N6q7L00k26J96j96Q7L18l11p7N9j24Q7j41P3K5Q9Nm0j14
5629a06K44r4P9k4J9J5j65J75jj35J08K9j9k86J52n1K6P0l43L50j81R3j86K67
5653C6l3pK24r8m05M64k47k7K28k01O5R4k32n4K29ml2p9K20j95j15p0K60J26n
$$ plain form
5481 -68 131 133 -4 68 145 -19 -46 -55 -116 -29 91 28 -98 -97 27 170 -143 88 4 -45 -205 -75 -116 129 -152
5506 -152 37 30 77 7 -9 -160 -89 20 -34 76 -18 -59 -131 -74 234 106 41 -89 25 -77 -120 -9 -41 -95 8
5531 8 87 37 -21 -91 23 78 18 40 -229 -93 -220 -105 -57 36 60 -38 -47 -10 -107 -80 265 -125 -30 -144 -104 41 102
5558 102 196 15 -125 82 147 -106 87 -327 -75 65 -10 -45 -289 143 95 23 -115 139 -130 -52 -49 -207 -113
5581 -113 69 18 77 -24 -101 137 144 44 -109 -33 161 67 -173 -154 -1 -116 -119 166 -68 -55 7 39 -189 182
5605 182 -190 112 -121 -85 -29 -116 184 -42 154 -42 45 363 52 -25 34 -90 -3 -144 -71 -46 43 48 8 -106
5629 -106 138 44 123 99 118 133 -32 143 142 7 115 144 125 -161 -9 -60 -34 36 -307 43 -138 -45 -231 36
5653 36 3 -4 220 122 -283 181 -66 -93 135 -66 -1 93 -139 -193 36 32 0 -79 141 -54 -169 -239 21 147 142
5678A42j71p5L4J03j99J19j0j23J90k6Q7j62p2O6L5O0L2q0J23m1o5j31R5m1J66
5703E6j28j97L48K7j81K51j47N1m3j06J23J25j94K68l89R5J3J99q0j46L3m4Q8
5726B2L5M7j08Q0K5m5j09j21R7K1K49k43q3Q5J02Po4P1j73Q2k4R1j3j9j68J32
5752b4R7j49NJ9O4j8j14J25j8MJ46k50J21j10r8L17q7j32J38j34J9J47k31J97
5776C4K8r0o8J51r8Q8P4R7n2k60j8M24k24q7r3L3p5m7Q4R3m1J5J58jl2l24K34
5803CM5p5k18J39N1Q3qk0j20J22j19R1J77P4qk84O0Qj31K98j50P5Jk21K16j38
5829d9k68K68J63j3q2R0Jk72J04J98q7p2OQ1r8K3Q0j62n0K48j00n0K03j13r5J4
5855c2k9J12N6j3p0k9J9m4Q1l1J34l30Q9J31j62J43L7K3j11q6K03k31K24j73K6
$$ plain form
5678 142 -29 -104 -70 33 -166 -47 -57 -180 10 -16 71 -91 -163 -97 -62 -2 30 -50 73 32 -33 -164 -69 -110 56
5703 56 -72 -269 79 106 -75 176 29 80 37 -69 54 179 -15 253 -136 -41 -28 171 91 -55 -22 -66 22
5726 22 57 104 -4 76 101 56 -53 -174 -77 -56 193 -50 -133 -48 54 61 -3 68 -105 -23 -47 44 31 12 -156 -24
5752 -24 73 -76 -71 -52 12 -6 -120 5 -13 -9 137 -113 8 -102 -200 117 30 -102 36 -98 -79 68 -163 34
5776 34 62 -28 -96 55 -43 45 119 216 164 -96 -114 310 86 -1 -94 -61 -136 -183 -99 -6 -47 -32 126 125 93 -231 3
5803 3 48 -27 -245 -106 -55 28 20 0 -120 2 -117 -26 151 225 217 -67 -7 1 -130 168 18 93 94 -127 89 -49
5829 -49 -317 -49 114 101 19 109 110 -162 -58 140 53 -19 -13 68 -30 -7 73 -89 -139 109 9 -41 162 49 -46 -32
5855 -32 -61 51 107 94 24 -5 14 -30 51 20 154 -176 -87 44 -118 25 62 85 -26 -112 91 -140 84 -89 -63
5880f3J18j83M7J40J01r0n0J13m9j70J64ok02k9J70J17p8N0K6M1l74K19q7J75
5904A00k39K11k4o5J82j00m4r5Q3q0J55o6j3j21K19j3M0J07k56J61j26J31j59
5927a2N4Q4j22Oj98m9o7K47Pr5J72j53J43l1p6L80j61%k44l4J43L9l4j41j29K59
5953a2J05o5J17j61l5J64l1k14P2O7p3m7K9K27k40O5J54p5Pl02K73N6o1K69l40
5978e1LJ42m8k9J62j79l3O0L2j89o3K92Jo7j34K48p7k8J33q0j66J71k11J65P0
6003A24k34J71j6m0q0Q3J28m9q8O4j51P0J10Op0l5O2M5j83K23j48O6%k9p9qN7
6030am6NK30n2p6m8m2q1R8J91k02j8Q6j60l1m5K6o1K78o0j31R1K05q5l05O8J59
6057gp2J07Oo4j30J03k9P2k29L2K99j08N7m6J90n7j08O9j55R6k09J59o7N8j01
$$ plain form
5880 -63 55 -128 -81 59 160 70 20 133 84 -86 78 72 -130 -159 11 128 50 100 126 167 -207 12 -75 100
5904 100 -139 72 48 -17 165 65 21 -74 9 -71 84 18 5 -116 103 90 130 237 -19 142 16 147 -12
5927 -12 42 126 4 10 -188 -237 -304 -57 -50 -145 27 -126 17 -14 -90 290 129 129 -115 -149 -6 33 -1 -142 -271 -12
5953 -12 93 28 145 -16 -51 113 82 -132 -60 7 -66 -113 -84 143 -97 -32 122 47 54 -248 25 81 20 289 -51
5978 -51 -48 94 46 17 179 0 -33 27 59 -130 -193 99 100 33 -101 147 70 42 175 95 -71 100 -111 54 124
6003 124 -110 61 45 5 -75 8 136 87 -1 63 -88 -18 92 98 28 -7 55 100 -83 140 -8 58 58 29 -50 -58 -1
6030 -1 -47 -42 188 136 60 12 -30 -111 -13 178 -24 -42 44 -116 -147 -192 -166 -227 51 -9 -140 -49 156 71 -234 -166 -7
6057 -7 -79 28 34 -30 -160 -57 -86 -14 -243 -211 88 -20 37 -9 181 124 16 85 -70 26 -183 -24 -91 -33 -134
6082a34K86j73q1J02l3k5J80j73J38j5l30J06N8K02j80P9J6M3k8O1j30N0j8k2
6106b1j5O7l3j39J58M0J89l68J89J0K38l53q3j2J42j46j26N18k48k1J49l31M73
6129B77p2l38K34n2O2j05Oo9l4P1j17M8j1m5J04K61m5j19k74PK20j55K73r4o8
6154c5J01n1J66l28N9P6RR6j06k43K77l2J23j88J85n1k65J40R9o3O8n2Mk9Q4r7
6180e3p2K32m9j8j38k7P0K9jP8j26K44l25K27Q2o8o2l45L85J11j65q9L31l56J62
6205E7P4m6j14J24%j30J94k86m0L8K25J01j92j59K17n4n4J99j31k9J07l1r2p8
6229a00L4L36l09J9k85K10J06L1Oo6J40k25K53j53r3J45J8Mj53j03P6p5l4O5Q8
6254f5K05j00j79J16K41l62L7J10j80N3J07Q3j45J94j07j86L14j49j09L15kj26
$$ plain form
6082 -134 152 -21 -102 0 -33 -58 122 -51 87 72 -258 -152 -94 108 -72 7 23 66 38 99 -31 19 1 -21
6106 -21 -36 31 -2 -141 17 57 246 -122 67 77 315 -38 -121 -133 9 -137 -263 255 7 -14 135 -196 277
6129 277 205 -133 101 49 111 6 12 -57 -91 -20 -137 -89 -100 -145 -41 220 175 56 -218 -211 9 -146 127 33 -35
6154 -35 66 15 181 -147 -88 -12 -3 93 -13 -256 21 -11 112 -76 109 58 -207 -67 32 -31 37 -15 -11 -40 44 -53
6180 -53 -125 107 58 40 -98 -125 -55 -26 -27 51 -75 169 -156 71 153 85 23 -322 63 174 9 -80 251 -105 57
6205 57 131 85 -29 95 95 -35 159 -127 -167 -129 96 197 5 -154 63 9 -45 154 23 -6 101 70 -22 -100
6229 -100 -66 270 -39 -20 -305 -95 11 42 48 -18 122 -103 150 -3 -96 49 67 71 -82 -185 -109 -184 -218 -153 -65
6254 -65 140 40 -139 -23 218 -144 -107 3 -177 -124 -17 66 -79 115 8 -178 136 -13 -122 193 191 65
6276F5Q7j9M6k49oJ84r5j44J32j20O9n4j19L58r4p3J60Q5n9m02K45Q0j3k03J21
6301a8l7o7N5Oo4J35j79L57j88Q4N9k65J04k31L79j05K6k6pj1J53j8j65J87j39
6326B5j10j11L78j08pj03K16r5j84J09P2j73J42j25J24L53m26qQj96n5L26j45
6349i3K93j94J3q3o8k1K46r9k32J26k9K93k16lP1o1R5j52N4J25j20M5o6Q8J6j19
6375i1NJ38J7j08n2L5K06k72P8k7o1J03J10k59L35K3j60R5Qk1j31QM3%l1O8o1
6402brn4K07j20qr3J68M6j86R4J53p2j43K6K88l30O6J1k19K81r0j64j7J69O9j47
6428g6J56k16j2Q5L3k5j84K33p1J0K77k47K1J9L05k69n0N8J6J29k87K78q4j27
6452b8j85j21O9R3L38j25j01R8L4R4p2O3k97K61k13K75K2k58J32r1Rm8K13l9j91
$$ plain form
6276 65 152 133 179 -70 -76 108 13 -131 1 -119 -50 -104 -223 135 41 -32 128 213 154 -248 -3 77 64 -139 -18
6301 -18 -55 -122 -67 -61 -125 10 -169 188 0 84 143 -122 -18 -249 130 25 51 25 18 7 160 142 -23 164 25
6326 25 -85 -196 182 74 67 -36 180 85 -99 10 82 -91 51 -74 50 403 -23 -31 -23 -219 -274 52 -93
6349 -93 200 6 19 -64 -132 -153 93 -6 -238 -112 -141 152 -64 -67 4 -57 38 -114 -60 65 -55 -10 -76 12 28 -91
6375 -91 -86 52 69 -39 -91 -56 150 -122 -44 -71 -132 -29 81 -178 157 180 20 115 123 102 -29 -21 22 22 -9 59 -2
6402 -2 -11 -65 142 22 14 -79 89 135 -51 43 196 124 -19 7 295 -35 31 42 -177 104 14 -150 -167 2 71 -76
6428 -76 80 -136 -148 -63 -30 -55 -239 -6 -77 -67 210 -37 -16 3 308 39 -11 47 63 192 -95 183 99 -28
6452 -28 -213 -334 -265 -172 166 41 -60 38 72 166 94 157 -140 121 -92 183 205 -53 79 -12 -3 -51 162 123 -68
6477f8K66j70K4l5m4J53l77K76J00l9j1r3O4j37K93j52mQ7q1r1K44r0qr1n1P7
6503D2l9K5r9l4J79j54K62l04J13J0J41k59l5K63r1K7L9k54J22R5jq6P7j25J54
6528F8q7J1l4k07K09RJ40j44MJ1J01p5j12LJ22j3l5kLN1O0k42J74j4o3J19j30
6555g3R6j05K33k47k3J38o1L5L9k14J63J69n3k02lJ16j75P2P6l4j18J96j3o4j14
6580a66M0J03J27j24j71K92j6j09J19n2l19L36k85J77J59k92J34n8J41Jj71R5
6602c9j09R4RJ72q3r0J07J21j94j19J91j91K80k82J13j30K29Oj28K2j38J15l63
6625d07L13j4J94q6p0M3J68p9m6j16K89k71n2N4P6k37K59J02o6M3k76P8l3K69
6649A35k04l0m9J12P1j40N5o5K11j46l7J67K3k56K89p4k42K33j21K32k16J46k19
$$ plain form
6477 -68 198 28 52 17 -27 126 -251 25 125 86 75 -18 46 -91 202 50 46 133 52 -39 205 115 107 16 -35 42
6503 42 3 28 -71 -105 74 -80 182 -122 -9 1 142 -117 -152 111 20 47 86 -168 -46 49 48 -38 39 -86 68
6528 68 -19 -8 -42 -249 -40 -31 109 -35 -31 -20 81 6 -106 -103 19 6 -29 -31 -28 23 83 -159 15 1 -62 57 -73
6555 -73 23 -82 151 -96 -119 19 -42 -7 32 -182 -19 150 97 -105 -108 8 -167 -95 -19 -53 -171 25 12 -52 -166
6580 -166 -126 -23 104 -20 -191 101 85 -24 95 43 -276 60 -225 -48 111 -181 -47 -105 36 37 -134 -39
6602 -39 -148 -54 -45 127 44 -46 61 182 -12 -131 60 -131 149 -133 -20 -150 79 85 -43 -21 -159 -44 -407
6625 -407 -94 -108 86 0 -70 -27 141 62 16 -100 189 -82 -134 -80 -4 -241 18 120 54 97 -179 -101 -134 135
6649 135 -69 -99 -148 -36 35 -105 -50 -115 96 -50 -87 80 103 -153 136 62 -180 53 -68 164 -52 94 -125
6672a25J45K93l47P1j0j21J71qk00K80k85L9K69j71J1q8o3J92J85k27K2O0k20
6695a27J97q9Pj0K9j70J81j31m3J61l06P5M19o6j22J82k92J7j39J15L18j39J42
6718B09k23O8j65M6L59k18o7K46o0q4j78J80K1j17J39k53j34K97l1m5k1p9K19
6741A09n2j28j66L25j06j66J96r8J11j0N0j93R0K51k28P5Q0j61k46J26K59k31
6763a13J13m0M8k17j9K43r2j4L1J5j2l3j4J39jn6o0J37p4j08M2J10j47r9J45K10
6789A34k95Q1J3r9r7K99j10P9R7j79J46j03K55k14o9n8P5q4J26j6J28j22Kp6j32
6814b19J54J64r2j71J34J6J07j48k6J30q6J99o9l6j07k9j3M4K1k13K37q7J03j1
6838Bj44K18j27N2K8J41j94j6R6r9r4J06J39j58mJ18l1j14R6j7j12J62N7k09n4
$$ plain form
6672 -125 20 313 -34 37 27 -94 77 69 -131 149 -136 -97 172 1 12 -76 -139 53 238 11 33 93 -127
6695 -127 70 -19 -12 -22 7 -163 18 -113 -156 5 -301 -226 193 127 5 187 -105 -88 -227 -112 206 67 209
6718 209 -14 54 -111 -65 294 76 9 255 195 111 -67 113 134 17 156 -97 -231 66 35 -10 -31 -110 109
6741 109 57 -71 -237 88 -18 -184 12 -86 25 15 65 -128 -38 213 -15 60 140 -21 -267 -141 118 -113
6763 -113 0 -40 8 -209 -228 15 -77 -91 -60 -45 -57 -90 -104 35 34 -22 -82 55 -19 -127 -85 25 -122 -221 -76 134
6789 134 -161 -80 -67 -166 -263 36 -74 5 102 -77 69 -34 221 7 -62 -120 -45 -129 -3 -19 109 -13 -11 -87 -219
6814 -219 -65 99 7 -164 -30 -14 93 -55 -81 49 -37 162 93 57 -50 -79 -92 -48 -27 -240 -3 -90 13 2
6838 2 -142 76 -51 1 29 170 -24 -40 56 -43 -137 -31 108 -50 -54 64 33 -81 15 -2 -114 48 105 -104 -158
6863a58J37j23L36m52L02mj04R4J20j97N9k54K19M22l11j82P5O6r6M2o7K16Kj1
6887A31N6r8j69J47O9l47K49j07M9j41K04J0k06K66m9l9L9j43L25k70M3j95L88
6910B12j64j46K00o8j13L62k52j02j13O5M3K69k41L9K21l33K89q5n4K0q6p5J87
6933G5O4l09O0N7N9Mn2L1N3K13k07j94Q2J59o3Q3k39k6J20Q0O5Ll39Q5J33q7k
6960i2j4J62k04K92j34m7J81j3J26n53K64J07kj1P5j94J72k7o9M7o9k7q8M04m26
6985a40J95k98J96R7kR8j63j0j2j81K91r8J34m9j08R4k2j15J30J9k4r0m2K91p3
7010A18k00K6J92j64P9kL7k15J05k28M3R3j08L17j16J98l50K35k9j76J18R5K3
7033I1R4k59K03M7j41j39P5n8r9K60j51k05K06Q4R2j73P4q9j6j3L31J3j26Pm1
$$ plain form
6863 -158 -21 -144 192 -260 42 38 -66 28 148 -49 10 -244 -25 397 86 -96 -21 45 -51 -9 -76 140 142 131
6887 131 187 89 -80 67 136 -211 38 -69 -20 -161 43 53 -153 113 64 25 64 -79 246 -24 19 -176 212
6910 212 48 -98 102 34 -79 283 31 -71 -184 -119 -76 193 -48 -9 212 -121 168 83 29 49 -37 -112 75
6933 75 139 -170 -110 -53 6 10 -42 -11 42 255 48 -146 -64 95 32 115 -124 -150 -30 50 115 118 -221 -136 -3 -90 -92
6960 -92 -106 56 -148 144 10 -37 144 131 257 -296 -32 75 73 62 137 -57 115 88 19 66 -3 -30 -118 286 -140
6985 -140 55 -243 -47 50 48 146 -17 -27 -39 -220 71 -27 107 58 -50 44 22 -93 37 56 32 -58 -100 191 118
7010 118 -82 -56 136 -28 51 49 86 -129 -24 -252 -209 -116 -224 93 -23 175 -175 60 31 -145 -27 68 91
7033 91 185 -74 129 176 35 -104 -29 -87 -186 74 -77 -282 -76 8 100 -73 1 -88 -104 -117 214 227 101 108 67
7058F7k47P8n8K61l26L85j98J11j01k07K67m0o5q0j8j63N20k59NP6k3Q0j78J96
7082H3J43m40J5M02l39J2J20q8J67Oj07K7r6K7J08K5L6n0m5j10k1p7K76L8j42
7107c0n0J38j53q6K78O4j46R5J13k29j53J08p1J10j67J85j9J55k30M32l78J48
7129A14l87Q6K7p0K52J25j0K6l25j7L10p7J07m2j4j46J21L0k26K50j00k09j6K30
7153C9J01j40j60K30r9R8k5l0P1o5j00Q1l2j47K03o7m7J70j9K4o2N0j67k4R9J23
7179A05l50K90j2n2L9J09j31R6q5J7l4m8L4J12p4k15k3K36q0L1j06J52j25L1J24
7204D1j84K24j32O8J17j18j22K8M6q2K08k96K40R5j49M0k17K20Q6r1R8n7j09N4
7228HJ50j51q6K62j61j24J00J39k54J80m1J7r1J2J85N2l51J93jo3J37k23O9j77
$$ plain form
7058 67 -180 -102 -160 101 -225 160 -38 73 -28 -235 32 -8 -73 -153 -171 -334 186 -73 -68 8 -15 65 -113 83
7082 83 226 -214 -199 203 -136 -124 -4 -92 75 81 -26 1 -95 -68 40 65 101 51 6 -104 -125 -202 74 112 -30
7107 -30 -80 58 -95 -181 97 161 15 110 223 -6 -159 -51 -122 -12 -179 6 -13 142 -88 344 -34 114
7129 114 -273 -187 -160 -230 22 147 137 163 -162 -179 131 54 161 119 105 -41 80 110 -116 134 34 -175 -191 39
7153 39 140 0 -160 70 -29 69 44 14 85 20 -80 1 -31 -178 25 -42 -89 81 62 86 24 74 -93 -117 -18 105
7179 105 -245 45 33 -19 20 129 -2 94 9 26 -8 -56 -22 90 16 -199 -222 14 -66 -35 -141 11 -114 -83 41
7204 41 -143 81 -51 17 134 16 -106 -78 -32 -114 94 -202 38 133 -16 24 -193 27 113 22 120 63 -46 8
7228 8 158 7 -79 183 22 -102 -2 137 -117 63 22 39 -52 -40 145 197 -154 39 38 -25 112 -111 -42 -219
7252b19K59j71J42k49L96k15J42j15J58k72M89m34n4J88j47J15Om7O0%j39K61
7274A54j69K9k3k7%K04l16L6J48k55K16k81Q9K34K18k91q9K46o9J8k25P4K21r6
7298D6j64J63L0m1l9l4Np1K11l02J01N3J90j41l3J7N1j46N8m7J22k31L16j04o1
7323e1j9j19J66J11k0nmq8R6r9J71p1j05k46L71J06l92K39p3J30J0L4j06r2K99
7348B43k25Q4j57j23M76l04J16r9L1R6J45k11Q0k70K93j77l1J95j12K7j28L6Q4
7371F9q3J04l1J01j63o0l8R2K23k50p7J72J20j21M1l7m5r9J41O5j69O4O6l8j33
7396h6R5J14k69J22n5k23K75Q3k06J88j47M5J09nj53j74J28J66J6kN6j51R3O3
7420H2K7L0j30l1Rj00J57q4J49o1qj35J42k80J57L04j35r0O3l1Jk86J23J55L4
$$ plain form
7252 -219 40 -131 11 -238 158 -57 85 -30 128 -144 345 -89 -143 45 -102 13 19 -28 32 32 -107 154
7274 154 -15 14 -9 -36 -36 168 -148 -112 36 -219 -3 -284 -195 39 257 -34 -123 123 54 72 -153 -79 142 46
7298 46 -118 45 75 34 -5 -39 -34 -105 106 -196 -95 -42 148 7 -26 -9 42 -104 -46 -93 29 -202 114 10 -51
7323 -51 -70 -189 -23 88 68 63 59 -29 67 -32 139 68 -37 -283 88 194 -198 41 -32 98 108 142 36 -56 243
7348 243 18 102 -55 -178 298 -6 110 11 42 138 283 72 152 -118 175 -2 -33 162 50 77 -51 -15 69
7371 69 -14 90 59 160 -3 -63 -101 -9 214 -36 -113 59 179 58 99 62 17 -82 59 124 -45 19 85 47 -86
7396 -86 9 123 -146 -24 -79 -302 -27 56 -150 38 -109 -64 45 40 -113 -287 -159 7 23 21 77 -74 19 82
7420 82 109 139 9 -22 -13 -113 44 -40 109 48 40 -95 47 -233 -76 228 93 3 66 35 36 -250 -127 28 62
7445F2O5N8j43jL6n2j31kKK54l41J85r5J78r0J62l17J21Q0j13M14l71m1J86k3
7470H3j0j22lJ03n6n5j03J14N9j14QO8N1k36L63j73l5R0R9j00j44m4OK20Q8j70
7496a3J72k35M7OL8o9l2J17K3J50k25K24j66o8j66L06pj29p7K59j05j73K14j45
7520e4K7j83K04J11j06l4J35k12K19NN1j96J18l18J36K83J05j43j4N2k97K71r6
7543F4q7L4j78J55p1K03k3m3m4n5L08k03j01J33r1M6K48k06j86N1J9M2k77K01
7567f1R0m1nJ14k33J44M6j95L9j9J1K8O7J42j76J94l37J32K6j9K72k79O4n9J43
7592H8j1j61pm1lK51o0J7Q3j01j66K66j42o5j11J67J66k58K49p2m3N2k06m5L60
7617B07l44m4K56k94J46J19j66O2J0k02M81k31L9k57J47lL24k09l14N53j97l5
$$ plain form
7445 62 127 185 42 41 77 25 -106 -108 -106 148 -193 -8 -103 75 -15 147 -170 -49 31 -82 332 -39 -80 106 83
7470 83 73 -49 -52 51 -5 -60 -163 -49 10 -104 -96 -28 23 -213 150 -23 -58 32 131 31 -113 -157 -151 69 157 -13
7496 -13 159 -76 -29 -23 15 -54 -86 31 54 204 -21 203 37 -31 -197 109 102 -27 -104 155 50 -123 91 -54
7520 -54 -27 -210 -6 105 -1 -35 100 -112 107 112 163 -33 85 -233 -97 186 291 148 134 186 -111 160 64
7543 64 -23 11 -167 -12 -83 120 97 54 10 -45 263 60 -41 92 1 47 295 89 -97 -46 -27 15 -262 -61
7567 -61 29 -12 -17 97 -136 8 54 -141 -102 -121 -110 -82 -15 127 -49 145 -192 -60 -34 -53 219 -60 4 -55 88
7592 88 77 -84 -91 -132 -135 116 56 73 156 55 -111 155 13 -52 -163 4 170 -88 161 89 46 98 -108 -153 207
7617 207 -137 -181 75 -219 -73 46 -120 -58 -48 -250 231 0 39 -218 -71 -74 250 41 -273 280 83 48
7639D8q5j7J56L4k36J7N4O3l4K8J27k83J46RJ0N0p4m0j19K46j20J58j07M2l55
7664b82L47m5j15J87r5j79J59m4Q7q4q1K21J2j91K8N6L3Jj97j5P1L11q4j20O5
7689D6pr8J90k36L25k18j55J18J15k30L10r9k47K70j20Q0K1L6k26K04o5lQ1l22
7713b30L18L1j38L5p2L5k9K17r8k02L97l85K79k14p0P4K9J99j75q8J11K3j27J29
7737D9j56J36k2j44J48J70j27J2q1N6j65L54k73R2j66P5K81m21J19k8k5j51L15
7760D8j20J40Q9k30k2P6K04k55N1K34j20n2k32K20K8n5M2o9J29j50M23m51J73
7783A01p1j97K05o0N7j49N6J76mj8j99K9O1k2k8Q7k48J80J24k83J66K53K7j78
7807F5Jj31J72j29J16R8j51k01K87j28J47j10J6m8Q9q3j67J67j4p0M1KJ04j13
$$ plain form
7639 48 -37 -54 102 136 -100 -83 -29 34 0 28 155 -128 18 27 37 87 13 -27 -146 100 -20 138 31 73 -282
7664 -282 65 20 -95 92 -3 -182 -23 -67 20 -64 -145 76 88 -103 -75 -19 14 15 -182 -197 -126 185 101 -19 46
7689 46 39 -59 131 -105 220 2 -153 -35 80 -150 160 61 -186 84 -36 44 65 101 -125 79 14 11 92 -230
7713 -230 88 119 -19 16 -56 -21 -50 167 69 -133 264 -121 158 -56 -126 -52 -23 176 1 -87 24 47 -80 49
7737 49 -107 29 7 -137 11 181 54 66 -15 41 -124 230 -43 49 -117 -42 239 -182 -63 -91 -116 -267 48
7760 48 -72 68 157 -73 -95 -19 185 -70 -19 215 95 43 -189 31 59 4 46 -23 106 -44 379 -72 101
7783 101 30 -167 38 -22 35 -114 -58 118 114 96 -103 -74 -13 -35 -63 24 -224 -44 80 -203 -37 216 243 65
7807 65 66 -65 107 -22 94 192 41 -160 127 -1 146 36 52 4 93 10 -157 10 -4 -74 -33 -31 73 -40
7831d0j78J56m9J37J11j69j56K29l0r2%J63j12L6o7rj92L18j32q4r4K84j81j11
7855b62L09M4o5Q7k23O8L8J08m7k9L0k66P8L12R3j94m9r4J77j22P0k43Q9Rj6N7
7881d1K36j85r4J46j72J26J20k13R2P6L7Lj59M0q4n7J77r6J33q6l32M27K1j22
7905gR8oK3j21j37k1J56k5J77k27J0J03p3j9M5J42k52J73j7k3N7j47J53Nk01J0
7931a24J54r1Oj41J63rOq7J08j4qkO0J27j73k2Q8rJ00j5j71n0P2J09l83K63m3
7958h6N5m2J33j51j94R1J38o7R6J05J00p5J7k31J23j18K39l3l86M82k54J87j07
7981B2n1j7N6M6j41M3r6L54J5l3j17k84J94O0nl5K6k33K27Nn7k0K3o3r5K16O9
8008A09j5j48P8o1k0j05J31J25m52M40J2j59N7Jj22P3J89j00n1j52K12k9K1J17
$$ plain form
7831 -40 -218 -62 -111 26 137 -32 -188 41 11 -81 -81 82 -30 6 -61 -70 -262 56 -76 -160 -254 30 -151 -262
7855 -262 47 91 26 113 -110 -42 -4 104 57 28 58 -208 -130 182 275 81 32 -62 115 -7 63 -180 -91 -82 -98 -41
7881 -41 195 10 -84 62 -110 16 136 -77 15 91 128 131 -28 12 -72 -129 48 -48 85 -1 -333 94 115 -7
7905 -7 91 85 108 -13 -150 -171 -15 -40 137 -90 -80 23 -50 -69 -24 118 -134 39 22 -1 56 -91 62 67 -134 -124
7931 -124 30 -61 -55 -196 -33 -42 -36 -123 -15 -29 -37 -39 21 148 -25 -47 41 32 132 117 -54 -104 -32 77 -306 -43 -86
7958 -86 -31 -73 60 -91 -285 -194 -56 -123 -27 78 178 103 120 -111 12 -106 133 100 -286 196 -58 129 22
7981 22 -29 -46 10 56 -85 -42 -138 216 231 198 81 -203 -9 51 46 11 37 -196 31 36 -21 -41 -18 -81 -176 40 109
8008 109 94 -54 24 -37 -57 -162 -31 94 -358 82 94 -65 -8 -7 -129 -56 133 33 -18 -170 42 13 34 151
8032A51j02j61K58l06K17j5k32J70j80M2Q7J42j25J02M0j11N4j62J03m9P7N1P3
8055A24k06o4j0K71j67K5J02r4r7K03q5R0n0LN3J7o4j03o5J10N7Q1j36l3n4L3
8081e9K11l50K84m0j71P0j01J01PN8Q8J00l85N8K30k60j1J74M3R5M3j62r0K15
8105A48k16J92k19N0J51j60k84L16k07NK79k30R9J05l8jL1R0j71J96k4k27K2l0
8129a23KK22j08K32l67P8l7N9N7p8J77J30l95J44j07k1J60N3k11J33O3K29j49
8152A43j63K25n3j91P4J13mo4n9J9j12K18j24j98J73N3m4l4j7n6J58p2j25J09
8176c1q2J5J74k0k2l1k6k2RJ16J58k70J02m4k11
$$ plain form
8032 151 49 -112 146 -160 57 42 -190 -20 -200 -158 -71 71 -54 48 88 -23 31 -131 -28 -77 0 51 124
8055 124 -82 -146 -156 115 -52 -27 75 -19 -116 87 2 92 42 45 98 115 51 -52 -117 -7 50 131 -5 -38 -92 -59
8081 -59 152 -198 86 46 -125 -55 -156 -55 -48 10 98 198 -187 -129 101 -159 -170 4 47 142 185 23 -67 148
8105 148 -68 124 -95 -45 106 -54 -338 -22 -229 -224 55 -175 -76 29 -9 -10 21 111 -60 136 112 -115 -93 -123
8129 -123 -121 101 -7 225 -142 -64 -101 -42 15 -63 114 244 -151 -7 -114 -135 25 78 -133 0 63 292 143
8152 143 -20 205 152 -39 35 148 144 80 21 40 -72 146 22 -176 -3 50 6 -28 -45 -101 57 -15 -140 -31
8176 -31 -113 -98 76 56 34 3 -23 -45 -36 80 238 -32 70 26 -185
8191a85
$$ Imaginary data points
##PAGE= N=2
##DATA TABLE= (X++(I..I)), XYDATA
0@%%%%%%%%%%%%%qJ6j6J6k4L2l2M0m8N6p1P9q8J04j24J48j68J91k22K54k86L21
35A70l61M06m56N12n72O36p06P82q68R62j065J177j297J428j573J733j910K107
53A105k323K564k836L144l497L904m382M952n644O507p615R103j1218J4481k0238
68a1993L3407j20737j8700J90292l5640p0482Q537R7017j138o9733l0244P0238
80D0824K5209p7188p6269N2169P1165l1578p3870L0952Q3484Q277o8449j6347
92c1621N7343L0809n6862m8089L8390N4523l0551n6252K1473O1504j0509o0603
104c0445p575M9697J0808m8565k0746M9501L7595l2297l1410L9107M5161l0664
116C0167n6923P576M0948j4654n7669q213N4644K6595l8982j8381N8240M8564
$$ plain form
0 0 0 0 0 0 0 0 0 0 0 0 0 0 0 -8 8 -8 8 -16 16 -16 24 -24 32 -39 40 -48 56 -68 80 -88 103 -119 135 -151 170
35 170 -191 215 -241 271 -301 335 -371 411 -457 505 -560 617 -680 748 -825 908 -1002 1105
53 1105 -1218 1346 -1490 1654 -1843 2061 -2321 2631 -3013 3494 -4121 4982 -6236 8245 -11993
68 -11993 21414 -99323 -118023 72269 36629 -33853 -25316 71701 70563 830 -29414 40824
80 40824 66033 -11155 -87424 -35255 35910 4332 -69538 -38586 44898 53175 -15274 -31621
92 -31621 25722 56531 -331 -48420 -10030 44493 13942 -42310 -20837 40667 30158 -30445
104 -30445 -38020 11677 22485 -26080 -46826 2675 40270 7973 -23437 15670 60831 30167
116 30167 -26756 -19180 21768 7114 -50555 -58768 -4124 22471 -16511 -34892 23348 71912
128G1912m0676n5231K5082M9441k9956p4164m577O2385J8296n4376k3309O4922
140I749N5237m2017n7091L4362O1236k9355p7809j491O6062J4543o0823k8275
152e5672N9170N3012l8380n9373K5714O2091j7613p1857m232O5137K0826n3863
164a5040k8127N2088M7953l4392n5968J7321N2039j5325o2702m544N5999J7277
176B6579m3911j7663M7985L7602l0719m0982J8370L6732k0549n0194J870M2896
188H016M144l6045l010M4458K1589l1935k5252K5933K5930k9349m1930J3653M0157
201A6359q131l8699R048M9805R429m1558j5926L6840J8827m2520m0363K5895M2456
214B1462j8391m3663J7590N9041O553m9560j2976M5694J9462m9581m3829K8463
$$ plain form
128 71912 31236 -23995 1087 50528 20572 -53592 -58169 4216 22512 -31864 -55173 9749
140 9749 64986 22969 -34122 240 61476 32121 -45688 -47179 18883 33426 -27397 -55672
152 -55672 3498 56510 18130 -41243 -15529 46562 28949 -42908 -47140 17997 38823 -15040
164 -15040 -43167 8921 56874 22482 -33486 -16165 35874 20549 -42153 -46697 9302 26579
176 26579 -17332 -34995 12990 50592 19873 -21109 -2739 33993 13444 -36750 -34880 8016
188 8016 12160 -23885 -26895 17563 39152 7217 -18035 7898 33828 4479 -37451 -23798 16359
201 16359 8228 -30471 -21423 28382 37811 -3747 -19673 17167 35994 -6526 -46889 -20994 21462
214 21462 3071 -40592 -23002 36039 42592 -6968 -19944 25750 45212 -4369 -48198 -19735
226a9735M4312k1818m9995J4804O3103J0178n1152j5816N0474K6663m7924m5833
238d2739K8150M5696k1202n2241J0012N8157R333m9762j6779M5275K5380m0603
250a323l8002K6960M1412j5648m1161J0019M6932N095m2612j4978L3431J5584
262B5709l6621l0096K3548L2378j3586k7948J6948M2129J393l4364n288L0456
274B4658K764m1178k3107K5057J8937k4620k1717K8351L8799p824k8665J0971
286B426L6265m465m3903j4374L0392J0101l7048k3678L2254L5214j7564l2313
298b6693J8292M3370n006m5049q105M0089J4102m1069k5903L4843L4942k5268
310H545m0380J6044M3390p904m7912o337M4426J7074l6592k1833L7246L7013k2716
$$ plain form
226 -19735 24577 2759 -47236 -32432 30671 40849 -10303 -26119 24355 51018 3094 -42739
238 -42739 -14589 31107 9905 -42336 -32324 25833 35166 -14596 -31375 13900 39280 -1323
250 -1323 -39325 -12365 29047 13399 -27762 -17743 29189 34284 -8328 -23306 10125 25709
262 25709 -10912 -41008 -17460 14918 1332 -26616 -9668 32461 33854 -510 -5798 24658
274 24658 27422 -13756 -36863 -11806 7131 -17489 -39206 -10855 27944 20120 -8545 2426
286 2426 38691 34226 -9677 -24051 6341 16442 -20606 -44284 -12030 23184 5620 -26693
298 -26693 -8401 34969 29963 -15086 -23191 16898 31000 -10069 -35972 -1129 33813 8545
310 8545 -31835 -15791 27599 19695 -28217 -34554 9872 26946 -9646 -31479 5767 42780 20064
323B0064l8932J2370L7290r895m8380j0971L6650J5441l2856j8404L5738L7593
335C5708j5531l0901J3871L4939r601m4081j0331K9363O936l4071j5913L2181
347g431K8361j7052k1352K0762L1105j1559l4074m1K6921j494l3466r295K9528
360I13J6636k3025j7081K3783K4849j7135k8903R242K9310n143l1712j499L3783
373A4018J1444k9184j6377K7055K1196k5893l1538J4232L0876r934l3313M728
385b2690L9998J0991l0954j3080L1004K0575k9628l3665J4223K9603j2730l6015
397c2368L992M0033J1838k9999j2146L2902K2811k7292l2591J4410K9391j3758
409G223l6711K582L7332Q929k9311j0416L1195K0687k5792k7084J5962K6007j4618
$$ plain form
323 20064 -18868 -6498 30792 20897 -27483 -38454 -1804 13637 -19219 -37623 -1885 35708
335 35708 20177 -10724 3147 38086 28485 -15596 -25927 3436 10372 -23699 -39612 -7431
347 -7431 20930 3878 -17474 3288 34393 22834 -11240 -11281 15640 14146 -19320 -28615 913
360 913 17549 -5476 -22557 1226 26075 8940 -19963 -10721 18589 13446 -18266 -19765 14018
373 14018 25462 -3722 -20099 6956 28152 2259 -29279 -15047 15829 5895 -27418 -22690
385 -22690 17308 28299 -2655 -15735 15269 35844 6216 -27449 -13226 16377 3647 -32368
397 -32368 -28376 11657 23495 -6504 -18650 14252 37063 9771 -22820 -8410 20981 7223
409 7223 -29488 -26906 10426 19355 -9956 -20372 10823 31510 5718 -21366 -5404 20603 5985
422E985l1004O049L1862L882k5621o107K6588J3734k3552k1007J5178K0478j5472
435I93k6004R593K8960j59k4428m08K7196Q625k5365j6479J8537J5689j9628k3474
449b6352J4719K7636o953k5082N486K9840K815k8407j1313K2509J3371k2716k1466
462b5913J8124K6690j0272k5730Q132L0192r8l0493j0347K4382J2565k4161k1236
475b8165K0030K8436j0630k5895R606L1492j786l1922q577K4219R669k5898j9720
488b9141J9216K5527j0313k3195J1105L0108j818k8374m513K3069N812k5588j6867
501b4972J7444K0372j0910k1561R702K8169j234k5856k063K4138M203k4929j1331
514a8828J9850J5262j5356j9125J1973K3526o056k5516J081K3699J528k4138n822
$$ plain form
422 5985 -25019 -18970 12892 16774 -8847 -14954 11634 25368 1816 -19191 -4013 16465 993
435 993 -25011 -15418 13542 13383 -11045 -11453 15743 24368 -997 -17476 1061 16750 -2878 -26352
449 -26352 -11633 16003 9050 -16032 -10546 19294 22109 -6298 -17611 4898 18269 -4447 -25913
462 -25913 -7789 18901 8629 -17101 -8969 21223 21125 -9368 -19715 4667 17232 -6929 -28165
475 -28165 -8135 20301 9671 -16224 -6618 24874 23088 -8834 -17411 6808 16477 -9421 -29141
488 -29141 -9925 15602 5289 -17906 -6801 23307 21489 -6885 -11398 11671 17483 -8105 -24972
501 -24972 -7528 12844 1934 -19627 -9925 18244 17010 -8846 -10909 13229 17432 -7497 -18828
514 -18828 1022 16284 928 -18197 -6224 17302 11246 -14270 -13189 10510 12038 -12100 -17922
527a7922K2743J2319j6563j3336J4952J9570j0187k4918J776K1415j780k5391
539a7322m604K3744J1251j7010r992J9254J9503j1907k3143M420K2103n188k8281
552a7172m862K3562P942j9930q114K1286J7556j2360j8497Q853K1440n551k7332
565a3179l705K3495O060k2219r454J9829J4812j3669j6197R930J9773n170k3332
578a3026r60K4575N983k3403r132K1253J2894j7311j5837J1013J5817q553j9869
591a6556K888K2328L677j9816m860K2237J0830j7961j4033J1720J2570j1559j8309
604a6844L746J8695R68j7958k208K2561J0276j7738j1755J4389J3035j3723j8077
617a4633N532J6933l049j8708K42K2015O950j8901r104J8038J2427j5602j6570
$$ plain form
527 -17922 4821 17140 577 -12759 2193 21763 11576 -13342 -11566 9849 8069 -17322
539 -17322 -21926 1818 13069 -3941 -13933 5321 24824 12917 -10226 -5806 16297 11109 -17172
552 -17172 -22034 1528 9470 -10460 -18574 2712 20268 7908 -10589 -1736 19704 14153 -13179
565 -13179 -16884 6611 12671 -9548 -19002 827 15639 1970 -14227 -4297 15476 10306 -13026
578 -13026 -13986 10589 16572 -6831 -15963 5290 18184 873 -14964 -3951 11866 3313 -16556
591 -16556 -13668 8660 12337 -7479 -12339 9898 20728 2767 -11266 454 13024 1465 -16844
604 -16844 -13098 5597 6565 -11393 -13601 8960 19236 1498 -10257 4132 17167 3444 -14633
617 -14633 -9101 7832 4783 -13925 -13683 8332 15282 -3619 -12723 5315 17742 2140 -14430
630a4430R186J6079n033j7473Q69J9299M587j8572p872J8010J0728j6861j4657
643a6140J1337J6730o258j7222K987J8960L476j8046p447J6880R296j7693j4117
656a7257J3720J4903r110j5613O049J8351Q48j6428m205J5665O908j6368j2404
669a4941J2918J2965j0440j4940P890J7667j282j5894k250J5729N736j6388j0808
682a4038J3445J2071j1822j4086R778J7145m392j6223K19J6887K987j6870q351
695a3250J3831J0412j2859j2146J1171J5290o169j4850L054J5585O14j6044o420
708a1781J3475Q764j2605j1470J0648J4509o443j4815M546J5689j086j5859l975
721a0403J4083P066j3412j0337J1539J3295q378j4141O166J5050l056j5805r63
$$ plain form
630 -14430 -5244 10835 5802 -11671 -10802 8497 13084 -5488 -13360 4650 15378 -1483 -16140
643 -16140 -4803 11927 5669 -11553 -8566 10394 13870 -4176 -11623 5257 14553 -3140 -17257
656 -17257 -3537 11366 2256 -13357 -7308 11043 11891 -4537 -8742 6923 13831 -2537 -14941
669 -14941 -2023 10942 502 -14438 -6548 11119 9837 -6057 -8307 7422 13158 -3230 -14038
682 -14038 -593 11478 -344 -14430 -4652 12493 8101 -8122 -7903 8984 11971 -4899 -13250
695 -13250 581 10993 -1866 -14012 -2841 12449 6280 -8570 -5516 10069 10683 -5361 -11781
708 -11781 1694 10458 -2147 -13617 -2969 11540 5097 -9718 -5172 10517 9431 -6428 -10403
721 -10403 3680 10746 -2666 -13003 -1464 11831 3453 -10688 -4522 10528 7472 -8333 -9296
734i296J4321M390j2968p794J1930J1689r193j2799O458J3954m098j5549k43J4284
748E086K815j3594o005J3140J0611r830j1721Q046J3735n812j5478J312J4056
761F361N48j4278l939J3526P897j0352r335R126J2205o333j3512K563J2968n31
775F914j3601l327J2803O152j0597q507R297J1401o688j2937M035J3628j608j3815
789f850j729J3399M821j2102p330J0600R353q667j1685N664J2631k959j3340N19
803g675J3718L060j2134n306J0596P900r022j0604O180J1387m265j2283J090J3091
817E733K301j1919m323J1332P203r705r598P312J0351n493j2139K544J2552K69
831F420j1894k727J1882N439r980p628Q186Q940o098j0659L413J1354r78j1245
$$ plain form
734 -9296 5025 9415 -3553 -11347 583 12272 3079 -9720 -3262 10692 6594 -8955 -9198 5086
748 5086 7901 -5693 -11698 1442 12053 2223 -9498 -1452 12283 6471 -9007 -7695 6361
761 6361 6909 -7369 -11308 2218 10115 -237 -9572 -446 11759 5426 -8086 -5523 7445 6914
775 6914 -6687 -10014 2789 8941 -1656 -10163 -866 10535 3847 -9090 -5055 8573 6965 -6850
789 -6850 -8579 4820 9641 -2461 -9791 809 10162 1495 -10190 -4526 8105 5146 -8194 -7675
803 -7675 6043 9103 -3031 -8337 2259 10159 1137 -9467 -3287 8100 3835 -8448 -7358 5733
817 5733 8034 -3885 -8208 3124 10327 622 -8976 -1664 8687 3194 -8945 -6401 6151 6420
831 6420 -5474 -8201 3681 9120 -860 -8488 -302 8638 2540 -8119 -4706 6648 5670 -5575
845e575j659J1160M647j0150o734Q372Q629o822j0250M390J1318j628j1739o44
859f685J1554L152j0963n404R442P164p773r076N802J0323l323j0845Q15J1148
873E331J679j0422m036R544N745p823p957N837R541l972j0287J565J0770J209
887F724j0355l687R730N189q239p352O852Q742m786r864K731J0315m49j0282j731
902f462J0125L641r090n782P585P180n700q722L871R604j226r763r16R608L082
917G035r000n308P633O883o503q057M396Q876j796r640K39R660K310r453m103
932f828Q535N776p530p134N184Q014l143q641J318R029R57q349l017P912M824
947F907p379o396N697P228l802p935J966Q290P09q626k102Q274L729p775n925
$$ plain form
845 -5575 -7234 3926 8573 -1577 -8311 61 8690 1868 -8382 -3992 7326 5698 -6041 -6685
859 -6685 4869 8021 -2942 -8346 1096 8260 487 -8589 -2787 7536 4213 -6632 -5817 5331
873 5331 7010 -3412 -7448 2096 7841 18 -7939 -2102 7439 3467 -6820 -5255 5515 6724
887 6724 -3631 -7318 2412 7601 -638 -7990 -1138 7604 2818 -7046 -4315 6000 5551 -4731 -6462
902 -6462 3663 7304 -1786 -7568 17 7197 1497 -7225 -3354 6250 5024 -4739 -5655 3953 7035
917 7035 -1965 -7273 360 7243 740 -7317 -2921 5955 4159 -5481 -5242 4418 6728 -2725 -6828
932 -6828 1707 7483 -47 -7181 -1997 6017 2874 -5767 -4449 4580 5537 -2812 -5829 2083 6907
947 6907 -472 -6868 -1171 6057 2255 -5680 -3714 4576 5285 -3341 -5443 2831 6560 -1215 -7140
962g140O945O699n186p703L290Q529r97q437q64Q417K639q044m770P074N690n908
978B34o848M137P865j660p807k84P765K339p581m302O683N727o129o737M889P562
994E853k632p766M07P798J279p286l701O940M904o129n551N252O718l756p213
1009d883K409O810j36p192k400O029L879n168n229N148O308l545o291K803O796
1024E338j275p239j307N946K873o215m683N607O297m156o446M077P146k615p123
1039c775N00O593Q22o347l422N388N427m531n702L242O702k594o452J184O702
1054C737K88o177k624N777M626m739o101L431O882k741p127J131O925l99o324
1069c435q42O240L466m811m732L886O121l103p511J361O315j120o054k61N717
$$ plain form
962 -7140 -195 6504 1318 -6385 -3095 5434 4437 -4000 -4864 3553 6192 -1852 -6622 452 6142 234
978 234 -6614 -2477 5388 3728 -4079 -4363 3402 5741 -1840 -6142 541 6268 139 -6598 -1709 5853
994 5853 3221 -4545 -4138 3660 4939 -2347 -6048 892 5796 -333 -5884 -632 6086 2330 -4883
1009 -4883 -2474 4336 4200 -2992 -5392 637 4516 -652 -5881 -733 5575 2030 -4261 -1458 5338
1024 5338 4063 -3176 -4483 1463 4336 -1879 -6562 -955 5342 1186 -5260 -1183 5963 3348 -3775
1039 -3775 -3275 3318 4140 -2207 -5629 -241 5186 655 -5047 -1805 4897 2303 -4149 -2965 3737
1054 3737 4025 -2152 -4776 1001 5627 888 -5213 -1782 5100 2359 -4768 -3637 3288 2889 -3435
1069 -3435 -4277 1963 5429 618 -4114 -228 5893 2790 -4721 -3360 2955 1835 -4219 -4480 1237
1084A237K429m235k941M165N307l051o813J402O289j439o516l43N802J330m466
1099a843j890M770L817l133n527K153O197j819o668L68O168J00n013r50M052K778
1115C560l664l797K560N153j969o062R39O673O71n757j339M734K187l934l602
1130c647K377M467k401n569J333O803J20n995m48N817K004m970l070L052K982
1145B855k754m677J437N708Rn548k59O110J888n074k509L266K791k798m051J128
1161b478M727M7n256l11O068J519n476k176L759L190l537l601J935M153p98m242
1177b477K64N146M99n047j248M213K113m462k946K880L749j287l534K59M707O63
1193C492n193j379M801J580m465k726L011L696j915l660J389M383J02m569j128
$$ plain form
1084 1237 3666 -569 -3510 655 5962 2911 -3902 -2500 3789 2350 -4166 -4509 1293 2623 -1843
1099 -1843 -3733 1037 4854 1721 -3806 -1653 4544 2725 -3943 -3575 2593 2693 -2320 -3270 782 3560
1115 3560 -104 -3901 -1341 3812 1843 -4219 -3280 3393 4064 -1693 -3032 1702 3889 -45 -3647
1130 -3647 -1270 3197 796 -4773 -3440 3363 3483 -2512 -2960 2857 4861 -109 -3179 -127 2855
1145 2855 101 -4576 -3139 2569 2578 -2970 -3229 2881 4769 -305 -2814 452 3243 445 -3606 -2478
1161 -2478 2249 2296 -2960 -3271 2797 4316 -1160 -3336 423 3613 76 -3525 -1590 2563 1765 -2477
1177 -2477 -2213 2933 3432 -1615 -2863 1350 3463 -999 -3945 -1065 2684 1397 -2137 -1878 2829 3492
1193 3492 -1701 -3080 1721 3301 -1164 -3890 -879 2817 902 -2758 -1369 3014 3116 -1453 -2581
1208b581M302J315m847k144M387K275k501k480J159M301m09m753k30L647J032
1223B473m368j839L376K942k539k963K484L677l24m419m20L822N63m225k239L607
1239c92K446k775k516K866L879j621l268M79L383K21m113j576L180J917k920k428
1255c238K892L020j496l155Q96L281j1l585j121L212J846l119k282K991K824k159
1271G96l424J317L309q54l858O1L460J578k874j579L288K297k161l063J282K308
1287A883j192l421m68L376J104k506j110L166K704k161k529J531K658j513l538
1302b016m17L083L71l167r78L381K356k329k025K315K442j424l151M21K748m36
1318A174k644q80K779J453k231j805J892K486j652k840J128K781kk545o37L049
$$ plain form
1208 -2581 1721 3036 -1811 -3955 432 2707 206 -2274 -1115 3186 2777 -1976 -2206 1441 2473
1223 2473 -1895 -3734 -358 2584 45 -2918 -434 3243 2919 -1500 -1920 1902 2465 -1760 -3999 -392
1239 -392 2054 -721 -3237 -371 3508 1887 -1381 -902 2481 2702 -1411 -2987 193 2110 -810 -3238
1255 -3238 -346 2674 1178 -1977 -1081 2200 2189 -1396 -2517 695 2541 -578 -2860 131 2955 796
1271 796 -2628 -1311 1998 1144 -2714 -2653 807 2385 -489 -2068 1220 3517 1356 -1707 -425 1883
1287 1883 691 -2730 -3198 178 1282 -1224 -2334 832 3536 1375 -1154 377 3035 1522 -2016
1302 -2016 -2433 650 1021 -2146 -3124 257 2613 284 -1741 574 3016 1592 -1559 -1138 1610 1174
1318 1174 -1470 -2350 429 1882 -349 -2154 -262 2224 572 -2268 -1140 1641 1639 -906 -1543 1506
1334A506R66k665j764J851J760j854k801J041K945l8k650L03L351Q64k604j085
1350h74J822J419k435k630R76K288n23k347K69L295Q31j912j101K400J091j902
1366F67k445J206J889j057k685M83K809O80k493m91K598J158k280j736J654J827
1382A784j324k324R72K489k20k421N5J719Q45k259j257J257K079j233j756R09
1398f85K462R9k319n26K087N71k307j768J679J845j332k099J640K158j03k261
1414h59M06K225p0k208j216J694Q56j448j276J260K017m21j860K46K230o4k160
1431f48q15J396J144j481j557J168K163m19j886L25K132J50k652o32J828P55j769
1448g98r43J380J947r72j249L48J810l66k028m01J815J85j427r32J595J264j047
$$ plain form
1334 1506 2472 -193 -1957 -106 1654 -200 -3001 -1960 985 947 -1703 -1400 1951 2815 211 -874
1350 -874 948 2367 -68 -2698 -1722 566 43 -2304 -2035 1260 2091 179 -922 1478 2569 667
1366 667 -1778 -572 1317 260 -2425 -1942 867 1547 -946 -1437 1161 2319 39 -1697 -43 1784
1382 1784 460 -1864 -892 1597 1377 -1044 -989 730 1575 -684 -1941 -684 1395 162 -1594 -685
1398 -685 1777 1876 -443 -969 1118 1689 -618 -2386 -707 1138 -194 -2293 -653 1505 1402 -859
1414 -859 -453 1772 1702 -506 -1722 -28 828 -620 -1896 -636 1381 960 -900 -654 1576 1512 -648
1431 -648 -1463 -67 1077 -404 -1961 -793 1370 951 -935 -610 1522 1672 -980 -1612 216 971 -798
1448 -798 -1741 -361 1586 614 -635 -287 1523 1157 -871 -1272 543 728 -699 -1631 -36 1228 181
1465A81r51O95J602k62j984l57J907J99j864j051K011J210r97j318P68J586o83
1482F92j858k2J731K75j703m63J804R70j147q83R07R46m33j716k64J353J05j271
1500i77o91J595J349j155p71J157J126o47j432j73R25J75j690m86J807R33j689
1517f44n24J596J130j032j136O07R13l35j420k44J208N58j102q83J640R60j299
1534gj164Q35J109l10j019j17J219Q23j292r25R75J152j611j352J035J105p41
1551b85q22K13J593M20r48o08J258Q39j283j246M71J150j348j168N18J314M09
1568D77n69n14J133J039p58j338M73R40j068j079M57R54Kq47j9R95Q71j054r55
1587h60Q58J036o49j262Q06P10n00o20J64O60K33j110m68O11J064n45j041O10
$$ plain form
1465 181 -770 -75 1527 1265 -719 -1076 831 1030 -834 -1885 126 1336 339 -979 -211 1375 692
1482 692 -1166 -1188 543 818 -885 -1348 456 1426 279 -604 303 1249 816 -900 -1164 189 294 -977
1500 -977 -1668 -73 1276 121 -650 507 1633 986 -446 -619 306 481 -1209 -1695 112 1045 -644
1517 -644 -1168 428 1558 526 -610 -3 910 575 -845 -1089 119 677 -425 -1308 332 1292 -7
1534 -7 -1171 -336 773 463 -556 -673 546 1369 77 -848 127 1279 -332 -1684 -649 456 -285
1551 -285 -1107 -894 699 1119 171 -437 821 1660 377 -869 -398 752 -596 -1764 -1246 68 477
1568 477 -92 -606 527 1566 808 -530 -57 883 -185 -1264 -807 147 149 -698 -717 278 1149 95 -860
1587 -860 -2 1034 385 -877 -71 639 139 -481 -317 343 576 -534 -1002 -391 673 128 -913 -303
1605c03J090j64j014N91N92o3r78n88N94N95q01j104O27J631m19q88Q09R08l53
1624G62p24k61N48K35r91r42O99J221m88p79J48J419R1j046QN88J89p79o19K67
1644d54J122l78j273R4J515J17j155Q8P14J4o27m41N22N74k57r16K75J322j46
1663G10r30l68Q09rl22m24J6N25K00l78J04P59j02r48nO01N9o41k90O84j65o5
1685a80J51J33N49l17n08l6R47l55j087R3Q40O7m61q4J73N36l38j97k97R12m00
1706A41q20k48J161L58q50m12R67L87k56o21j11Q09o6j030k92J268J47j217J4
1725f71R79L51m97m83M3O35L01j002j71N60M48p46k12L74N80k81m72L4M70J94
1745D34n13m94N97L38n59LK19M33m78k99J51K25j20j1l05M18K61l14j07O27M6
$$ plain form
1605 -303 787 623 -391 200 792 729 -249 -837 -243 352 -449 -1553 -926 705 286 -602 207 1115 762
1624 762 38 -223 325 560 -431 -1373 -674 547 59 -720 -572 847 938 -108 -100 488 677 -102 -721 -454
1644 -454 668 290 -983 -889 626 743 -412 -324 390 404 -223 -664 -142 432 175 -741 -466 856 710
1663 710 -220 -588 221 212 -110 -534 -518 7 207 -171 -67 692 590 -358 -363 238 297 -344 -634 50 -115 -180
1685 -180 -29 104 653 336 -172 -208 739 384 -703 -610 230 297 -164 -248 -75 461 123 -74 -371 541 141
1706 141 -679 -927 234 592 -258 -670 297 684 428 -193 -304 505 439 -591 -883 385 532 -685 -671
1725 -671 308 659 162 -321 -278 357 658 -344 -515 45 493 -253 -465 -91 489 208 -264 -230 240 434
1745 434 -79 -573 24 362 -197 -194 25 458 -20 -319 -168 57 -63 -74 -379 39 300 -14 -121 506 552
1766E52m70n3K06J79o31m02K44L48l23P9j34P62J2k61j62N53J63o37o04N55L22
1787B98n02l92K90O52K02q19l30R43J65n51m14L48O15l05n94J53N46J52q00k09
1807e52N50N64m57p40J45R70j00m17l28P25K05m22m90J49M45l17n44L5P44M7k49
1828c7j49M05N8J94n31K57O7n1o05J96J86j32k19J56J15Q4L00j79O3k02l5N2J19
1851A12K1l50N6K38o1J45l53K66K79m36l92M22J57L67o35n3M17J48l10m55L41
1872g6L29j6q16Q8O63N48n46o93M49M68r7o72L50M83q2n41j77K16L47m01l0oL84
1895A72K02o56O0N10K18n01l96M05K52l35j13pK35K26l25l02L02K18j60k53Q1
1916a67K51J05k67O7J35R2l15n0P2K43j84Q9j43J91k41J87J39l13J20j1L96n7
$$ plain form
1766 552 82 29 235 414 -217 -619 -375 -27 -350 -271 -405 357 369 108 -54 499 662 25 -579 -24 298
1787 298 -204 -596 -306 346 548 -271 -601 342 507 -44 -458 -110 505 200 -394 -241 305 457 -343 -552
1807 -552 -2 562 105 -635 -490 480 380 -37 -365 360 565 143 -347 -198 247 -70 -614 -579 165 212 -37
1828 -37 -186 219 277 471 -60 197 264 213 -392 -196 -10 -142 -361 -205 -90 -6 294 115 178 -24 -59 -7 112
1851 112 133 -217 -161 77 16 161 -192 74 353 -83 -475 -53 104 471 -164 -217 200 348 38 -417 -76
1872 -76 253 237 -579 -491 172 720 174 -519 -70 398 301 -371 -21 462 380 -161 -338 -122 225 -176 -206 -212 172
1895 172 374 -282 -222 288 506 5 -391 14 266 -69 -182 -189 46 272 -53 -355 -53 165 5 -248 -167
1916 -167 84 189 -78 -11 124 216 -99 -149 -77 166 -18 71 -72 119 -122 65 204 -109 11 0 396 339
1938C39m00p0J90J77m77k14K22M70j59k18J93J61J30m17k96K97M45j43n36k0N14
1959A88J30m50k06M97K98n73k44L45K10O5o05M1N03K14l50l41L02L22J7m29k51
1980c17K26L66l68k48J90L45p8k99R7J40J70l13N1j77N46m70m1K76l04J45J60
2001I7r7J41J6j80O8k34J52K65k55qn6K4n1J16l5jqk03M5m0M62n0j49L3j02L03
2027B53m0m1m48J13M04no82K23N2M12p5m74L20K35L9m01j82M60j63k48l2o3M85
2050A42J1l78J99L93M7m64k04L94K92m15l20L6K13J33j79N7J0L22l4l97J35O5
2072E8l2j40P8P0r7K59k43k48L95J74k88r1J76J86l04p8K50m9ml6o6J91j61n4
2096e4R9n2Q4N4r5j73nJ93J46p8j25j15L81q6m8k28J09r0K39k79r2L54l62L3O1
$$ plain form
1938 339 -61 -131 59 236 -241 -455 -233 237 78 -140 53 214 344 -73 -369 -72 373 230 -306 -326 188
1959 188 318 -132 -338 159 457 -116 -360 -15 195 260 -345 -304 199 413 63 -278 24 346 363 -66 -317
1980 -317 -91 275 -93 -341 -151 194 116 -183 -86 54 224 -89 -38 -215 331 -139 -180 96 -208 -63 97
2001 97 0 141 157 -23 45 -189 -37 228 -27 -35 -91 -67 -118 -2 -37 -38 -46 -249 -204 -244 218 168 19 52 -50 253
2027 253 213 172 -276 -163 241 236 -446 -223 -171 241 166 -308 12 247 286 -115 -297 163 0 -248 -280 -343 142
2050 142 153 -225 -26 367 414 -50 -254 140 432 17 -303 -267 -54 79 -100 -43 -33 289 255 -142 -7 58
2072 58 26 -114 -36 34 -63 196 -47 -295 100 274 -14 -105 71 257 -47 -125 125 76 72 36 -30 161 0 -54
2096 -54 45 -7 77 131 36 -137 -142 51 197 119 -6 -121 260 174 126 -102 7 -83 156 -123 -215 139 -223 -190 -129
2121a29L13oJ5l93L6J04K08j4m45L56K7P1l32K48J93j60k59K85j6J85j42l69Q9
2144a35K81m0r7j60N9J27n0n6Q9R9N6l36Q0K76P9m1l47k8l3l4K93q0N4P8j47O
2170gJ7P7k42K45n9L2n9J39j82j52K87J39r4J4K6j37M3J9k15k70M22O1j64M7n3
2195f6K51k63j02K93j97K22l34J70Q3J39k45j21J87J24nK6k30J93J60n7m40J50
2217f2K06K5k11k81N02o2K1k87K49N6Jq8j53K20J52k92lj68J97Q1j14j57P3K47
2241A52O7m31R5K80m0l7k20K64N9k49m4k2K61j54j8r9nL54k24K2J48k27J25pN7
2266A07l52J01K37R2l95J74r5J34k03J25K2K16j35o2J10J13l1j84q4N9K03k18
2288f6O3P6oJ71k46QR0k7l7O6j33J62r9J15r2k2j1J22j12k07K21j7%j65J03J20
$$ plain form
2121 -129 184 178 193 -200 -164 -60 148 134 -311 45 72 143 -189 59 252 92 -167 118 102 287 145 -224 -135
2144 -135 146 106 9 -151 -92 35 -15 -71 18 117 173 -163 -83 193 272 231 -116 -144 -177 -211 82 2 56 134 -13 -7
2170 -7 10 87 -155 90 31 63 4 143 -39 -191 96 235 141 155 181 44 87 106 -109 -379 43 104 -60 -13 -66
2195 -66 185 -78 -180 113 -84 138 -196 -26 57 196 -49 -170 17 141 136 162 -68 125 285 228 -212 -62
2217 -62 144 169 -42 -323 179 117 138 -149 100 156 157 69 -84 136 288 -4 -7 -175 22 103 -11 -168 -95 152
2241 152 219 -212 -117 163 123 86 -134 130 189 -60 -104 -126 135 -19 -37 -136 -141 213 -11 11 159 -68 57 50 107
2266 107 -245 -144 93 185 -210 -36 -131 3 -200 -75 -53 163 28 -34 76 189 158 -26 -110 -51 152 -66
2288 -66 -3 73 67 238 -8 0 90 63 26 92 -41 121 22 137 45 23 12 134 22 -185 36 19 19 -146 -43 77
2314G7j29%l7J63j6k20L14l19K59M6p1j04J32j0J03k18JJ40pl1mk3j41K95k12
2339a2k12J29jJ63q2K5n8r7J36q2J23K77k99m3R1k9q8q8n0J79J10J68m08R1J46
2364H9j2J6j35j03L08r9l14L90q9j52L02k5j92K28l08j15Q9N6n2p8M4Q9J11m5
2388Cj24J4L16j68j63L72n16K13p7J52k0J50j13r8j20K23o5J42k87J78Q0N4j24
2411B2r0L15k08M4R0l33J1l9J96J39J1Kk33J00j80k9J98K8j76K56j25n5P7q0j55
2436b14J00r2K17o6j30K84r0j46J83j00o1Q0L09O1j56k17L6j38jN3J4J57p7jj10
2461a05J52J67j44k25K66j85J81j93J92p2J52o6j42J29r1j01R6K7j28K26l3j20
2483a7k34K70n7J28j84K9J80j90J93j17J0J9r9m7J59m2n8J80j67o0K21j57r4J65
$$ plain form
2314 77 -52 -52 -89 74 58 -162 152 -167 92 138 67 -37 95 85 188 -30 -29 111 104 73 69 46 -95 200 -12
2339 -12 -224 -95 -96 67 -15 10 -48 -145 -9 -91 32 309 10 -33 58 29 -59 -147 -197 -18 92 260 -148 -57 89
2364 89 77 93 -42 -145 163 64 -250 140 51 -101 201 176 -16 212 -96 -211 -122 -66 -118 -196 -152 -63 48 3
2388 3 -121 -107 209 41 -122 250 -266 -53 -130 22 2 152 39 -59 -179 44 -21 121 -166 12 92 146 22
2411 22 -68 247 39 83 173 -160 -149 -188 8 147 158 160 -73 27 -153 -182 16 44 -132 124 -1 -56 21 -59 -214
2436 -214 -114 -206 11 -55 -185 99 9 -137 46 -54 -115 -35 274 335 179 -38 -2 -140 -141 -88 -74 83 6 5 -105
2461 -105 47 214 70 -155 111 -74 107 -86 106 34 186 120 -22 107 16 -85 11 38 -90 136 103 -17
2483 -17 -251 19 -38 90 -94 -65 115 -75 118 1 11 30 -69 -116 43 1 -57 123 -44 -104 117 -40 -134 31
2507C1J46q1j11M7j8P8j72J72n5K01l61J03p2K49l2l17L27J3l05L61k79j14L2
2530a57L01k02N3L53l12J02m21L18P5o7j58K4K53j04O6j62K3J53o6M3J51m57J78
2553a3p6K15o3n6j57K2N8J64j55k1K24L0k84J25J24r8n1j32L14k29J91K3k34J58
2577G9J19k62k07L60j64k2K13J5k11q9J84J08Mj07L4j46L30k26j70J48n5j63J88
2600d0J70l29j27L53k71K17K19k48j22K53n2m4m9J05l6r0P5o2R0mJ31k45M1l7
2624a02J15j04J27J57m34J13N3M4R6p7ok03Q9J23M3M4q1p2R0L3p9K1n6k7J64k37
2650a66R9J45J8k71J73j4P4J45j03N6j07J22l54J87O8o0O2J51k57j10J9l1K07
2673E3R4l0r7j09K7J13L1j63J56l95K56J23L8J3Pj72J42N3k32K06k26K6J20j67
$$ plain form
2507 31 177 96 -15 32 14 92 -80 92 37 238 -123 -20 -92 157 125 -192 135 148 -157 204 -75 -189 -157
2530 -157 144 -58 -5 348 36 138 -283 35 110 43 -115 -91 162 58 124 -38 -15 138 72 115 266 -191 -13
2553 -13 -89 126 63 7 -150 -128 -70 94 -61 -82 142 172 -112 13 137 39 -12 -144 170 -59 132 155 -79 79
2577 79 198 -64 -271 89 -75 -97 116 131 -80 -169 15 123 127 20 54 -92 238 12 -158 -10 -65 -228 -40
2600 -40 130 -199 -326 27 -244 -27 192 -56 -178 75 23 -21 -70 35 -1 -91 -16 -78 12 8 139 -106 -65 -102
2624 -102 13 -91 36 193 -241 -128 -75 -31 65 -12 -18 -221 -132 -9 34 78 -3 -75 15 48 -31 -10 -66 -93 71 -166
2650 -166 -67 78 96 -175 -2 -16 58 203 100 156 49 171 -183 4 72 12 74 225 -32 -142 -123 -154 53
2673 53 147 117 20 -89 -62 51 82 -81 75 -320 -64 59 97 110 117 -55 87 140 -92 114 -112 -86 34 -133
2697a33M77l43J06j77J12Q1j72M6l4L3J03j96K16j49M2M1j09J15j98J04l5m0K56
2720A46o8j83K70l03O3J49k39R1J1P4j08K2K9J94j50j25K31j43J70p6o9j65L67
2743A88j89j98K73j16O1J59k05Q4N4k25J41k45J03J21R4q9k9J18j14l19K77j36
2765a92J26r8J94j20R4jJ3J10LR9k54q5K39n0j60J20P1j45o3J03j06n6K03l0R
2790B4j00m1M8J49j70K9J18k7j10r7K43j94kNJ04J25k08R0J41j74J21r5J14l6
2814E7R2j50K8J36j99J40l19JJ26j21J74j62K96m02L59J3k30q4L33k03J01K8J78
2837A92j73R4k47M09k09j90L3J18k11J03K57O2l63J27J29k55n0N8K11j25J28j36
2859c8M3j47K46M4j41R7j21j63J28p2k9K74k16J00J00r2q8J59k03O4K19k16j5
$$ plain form
2697 -133 344 1 107 -70 42 123 -49 -3 -37 -4 99 -97 119 -30 12 53 -56 59 -139 -35 -70 -110 146
2720 146 78 -105 165 -138 -75 74 -165 -74 -63 11 -97 -75 -46 148 -2 -127 104 -39 131 55 -14 -179 188
2743 188 -1 -199 74 -42 19 178 -27 57 111 -114 27 -218 -115 6 100 11 -18 100 -14 -333 -56 -192
2765 -192 -66 -164 30 -90 4 3 16 126 129 228 -26 -111 128 78 -82 38 109 -36 -99 4 -102 -158 45 15 24
2790 24 -76 -117 -69 80 -90 -61 57 30 -80 -177 66 -128 -130 -125 -21 104 -104 -14 127 -47 74 -21 93 57
2814 57 149 -1 27 163 -36 104 -215 -214 -88 -209 -35 -197 99 -303 56 69 -161 -245 88 -115 -14 14 192
2837 192 19 113 -134 275 66 -124 -91 27 -184 -81 176 238 -125 2 131 -124 -174 -116 95 -30 98 -38
2859 -38 5 -142 104 148 7 104 -17 -180 -52 -124 -153 121 -95 5 105 13 -75 84 -119 -55 164 -52 -67
2882f7J35k46J15j72K14j31J57J18j46J53j91J64j50P5j36K1L30m10J46j83P5
2903a29j3K35o2QO0M0k51J92l02J87J02o9p3j33L26J19j26j85P5K01k60J23J25
2926A90l76J21J15R0j75j77NL23j55j34J67K1M3N4k71J50Nnj5J52l07L15l8K2
2950A20jj13n2J8J5M0K4N4Nl4mj74K24q6j27K68j10R7q5k1j63q2K79J0p7O6M3
2977A34k18K50k27j0J20p8No4L4J61j41J10K4k36K46L7l10K46k03j41L23K4n1
3000C5j96Q8J53j18j64R5J28nJ95j57J4o5j43P3J17o2L6p3K51j26j90l0P4L6K9
3025eJ48j10j75R2q0K34j00R0J16k11R1j19R0l7j48K71j82P0J20m1r6R7K9j02
3049D2L2n8r0q0J23J36q7l6n1J76j23j37J0k8J65k9K63k49J23j7P1j36k9M7N8
$$ plain form
2882 -67 68 -178 -63 -235 -21 -152 5 123 -23 130 -61 103 -47 28 -108 -87 243 -167 -21 -204 -129
2903 -129 -142 93 31 39 99 139 -112 80 -222 -35 67 -2 -75 -208 118 237 111 -74 1 202 -58 65 190
2926 190 -186 -65 50 140 -35 -212 -207 116 -39 -173 -6 15 58 112 -159 -9 -4 -9 -24 128 -179 136 98 120
2950 120 119 6 -46 -28 -13 27 51 105 110 76 72 -102 122 36 -91 177 67 164 79 58 -105 -187 92 102 25 91 134
2977 134 -84 166 -61 -71 49 -29 -24 -88 -54 107 -34 76 100 -136 110 147 -163 83 -120 -261 62 86 35
3000 35 -161 -73 80 -38 -202 -107 21 16 211 54 68 3 -140 -67 50 -12 24 -49 202 76 -114 -144 -70 -34 -5
3025 -5 143 33 -142 -50 -130 104 4 94 210 -1 90 -29 61 24 -124 147 -35 35 155 114 18 115 144 42
3049 42 74 16 -74 -154 -31 105 18 -18 -69 107 -16 -153 -143 -171 -6 -35 228 -21 102 85 156 20 -9 38 96
3074I6o6k18K22j25O4L5l6l7Q0n1J06n8R5q8j2J69l63K4K34k20J82N9N4l59K00
3099a3J11o8q9N5J48Oj3j79k6k0j3J34j55J34lLj79J99Nj09K67o0j03R9j34J00
3125I7Q3NR6k84J73k88k1J5J91L7r6N4k99J77M5m0j02J14J43k14J63l98L61R6
3149A08j15J52J0mk12K8P6p1L4Q6q8J66o6Pl3P6k10m1K28j11j33K81r4j60J83
3174I7o9KP8j42L6k03J61k0J78q9K00k14J33Q0j41J43k68L09k85j80L18j69J06
3197F1J42l31K68n9m4j62M1J17o0r2R6j16O0P5J06Nk44J48p3J01Jr3J26m4J68
3222A97p9m5R0l09j34K95o4K15q0j20Q5r9N1Q3j43n9kQ1K47k10j1N5N9j09J04
3247I8k38O4p0J0J01K9O5N3k58J68j19o6J92q4P5j75K36o9Mj88K61j19J26k66
$$ plain form
3074 96 30 -188 34 -91 -27 8 -28 -65 15 -36 70 12 107 19 7 176 -187 -163 71 -149 33 92 146 -213 -13
3099 -13 98 30 -59 -4 144 150 137 -42 -68 -88 -101 33 -122 12 9 12 -167 32 37 -72 195 135 32 131 -3 97
3125 97 180 185 281 -3 170 -118 -139 -124 67 104 8 62 -237 -60 -15 -55 -157 -43 100 -114 49 -349 12 108
3149 108 -7 145 155 151 -61 -33 43 -28 6 92 4 170 104 111 78 154 -56 -97 131 20 -113 168 74 -86 97
3174 97 28 30 108 -34 2 -201 -40 -60 118 29 229 15 148 228 87 230 -38 271 -14 -194 124 -45 61
3197 61 203 -128 140 81 37 -125 -84 33 -27 -119 -23 -139 -79 -4 102 107 -137 11 -62 39 40 -53 73 29 197
3222 197 118 73 163 -146 -280 15 -49 166 86 -34 51 -48 3 86 -57 -116 -118 -37 210 0 -11 44 103 -6 98
3247 98 -140 -76 -146 -136 -35 -6 59 112 -146 22 -97 -163 29 -55 20 -155 81 12 16 -172 89 -30 96 -170
3271a70K47J3k26J53J9L6J55n7l23K04j83K94m86L84k01QJ3J80N4jj36k21K83
3294C9O6k84J63J23j51O5r0K74l48J40n7R8j77J67r4N5l0k7M5J21l64J99L6K90
3318B59l18k2r5O0r3J71J61j33J05N4j45N3j61m1K08l79N12q8m8m3J11j14j26
3341a12J79j17J51k29J70o5J19n2M1o6k5J92m54L15j24J01j5O1j22m0K54j78J89
3364A73k77K08oj54k1J53k32R0P8J3j14MrL1Q5j39J05N9P6j34Lk27J24K35j90
3389f6R7l0Nj79J05J17k30J67R8j23Qk50J27L21j93j38K12k22J29R0j23j4R4l3
3413c1kJ3oj5k10L90k73K73j00K0L4R7k40J38k40J52R5Nj5l55K77M8n6j05j7K46
3439A23k63J97j89J45m5k28J32J00K63k55NP6k06J56n1q8L92l47M9j14P3l3J16
$$ plain form
3271 -170 77 90 -136 17 36 72 227 170 -153 51 -132 162 -324 60 -141 -133 -120 60 114 113 -23 -244 39
3294 39 105 -179 -16 107 -44 21 -69 205 -143 -3 -60 38 -139 28 -66 -11 -41 -68 -23 98 -266 -67 -31 259
3318 259 -59 -81 -176 -116 -209 -38 123 -10 95 149 4 57 -104 -145 63 -316 196 108 60 17 128 14 -112
3341 -112 67 -50 101 -128 42 -23 96 44 85 19 -6 186 -268 47 -77 24 9 70 -52 -92 162 -16 173
3364 173 -104 104 98 -56 -77 76 -156 -66 12 25 -89 -85 -94 -63 22 -117 -12 47 123 -11 -8 -235 -111 124 -66
3389 -66 31 1 6 -173 -68 49 -181 -14 84 -39 -31 -281 -154 167 -26 -164 48 -174 -45 45 -78 -92 2 -31
3413 -31 -33 -20 -26 -41 -251 139 -134 139 39 59 93 190 -50 88 -152 0 95 100 85 -270 7 55 -1 -106 -123 123
3439 123 -140 57 -132 13 -32 -260 -128 -28 235 -20 -15 61 -145 11 -40 -128 264 -83 -34 -148 -75 -108 8
3462HJ41k4j49K5j16K29k43R9p2j27L83k26Q4j26o0J06J37j73m6K06%m6J28j01
3486C7Q8n8j9p7O7j53J04M4kj02j27K58R9k17M6j6L02k49j23P5K3k7j39J13L47
3511B94m07M0O2j84J51P5R4k18P6M1J8n1P1j64P3Rn9J83j35jJ47j3P3k05J02k08
3537a36J22r8L0J75L0J66m35J41j7J22o3r2J02j88K16n2L1j37o7L46j10k57K92
3560A21j94K04j52J41oj27PL14k84q2P9l0M5j61L0J20q3k44L84p8j05J22o2J65
3584A24j18n8P8K6l8M1n5Qk47L88j84Q8k04J47j91J48k9m9J66k08Q5J4J03j3J22
3609A44k71L82q8k3l48J6K53R7O9j61k67K09j77J88l9J55j14J6j36J49n7r0K14
3632A21j17O2l7Mm7K6k55L04n6J44j53NL1k78J17J39J29j07j1Q6j37l2p7K55j05
$$ plain form
3462 8 149 125 -24 1 -115 114 -129 -30 -102 -229 154 -72 12 -114 -174 -68 69 -104 -150 56 56 10 138 37
3486 37 125 67 48 -29 38 -115 -11 33 31 -71 -198 60 159 -58 -12 -28 274 25 -98 -23 0 -27 -166 -53 294
3511 294 -113 -73 -11 -195 -44 31 125 -93 -17 24 42 -9 62 -102 -29 -20 -79 104 -31 -32 115 102 175 -30 72 -136
3537 -136 -14 -112 -82 93 123 289 -146 -5 -22 100 37 -55 47 -141 75 23 54 -83 -150 196 86 -171 121
3560 121 -73 131 -21 120 114 -13 -6 308 24 -58 21 -9 36 -125 -95 25 -58 -302 82 4 -101 21 -41 124
3584 124 6 -52 26 52 14 55 0 8 -239 149 -35 53 -151 -4 -195 -47 -76 -125 41 -167 -82 -68 35 22 144
3609 144 -127 255 167 144 -204 -188 65 162 231 70 -197 12 -165 23 -16 139 25 41 -95 54 -3 -93 121
3632 121 4 66 29 33 -14 12 -243 61 5 149 -4 1 32 -246 -129 10 139 32 21 107 -30 -62 -139 116 11
3657A1j5J19j10l0k5L2l1M2J36P9m8k47L77l21M9j57K07o4J6j46J37m2J36j40
3681c5n4J03k08L62j78k0j4r4N3Q5j62P8j4l1K30r7J31j55m9k2J24l6l6K10k74
3706a03R6q0J68k8j02M3p5n7P5oL0J78n4j54P7o7o9J89q9J01r7J5J11j7n3J21
3732A53j14l1j45K58m5j19J54p5N9Q2j05m2k4j23J78k8O2M0q7Q9Q7j70M5J42q5
3757A56q5k89K44o6j09J85J57k72L6R7L3P3L8l29j26J36K6N5l2J40j39K37k75
3780a09J58j2n5Q1LP2j91J64j50J38k77J53oJ16l5m5j44L40j02J18l44Q1J8J00
3804G2j94J90J20j93k6J97k15N8O1k6N7l36J08Q2J54qj37L1j0m8M7P0K3l62J47
3829a38J97O2m7j72p3P7J92k69L43j35m1j41P9M1L4mO8j33j7J14k1R0p4L7p8J46
$$ plain form
3657 11 -4 115 5 -25 -50 -18 -49 -7 129 208 160 -87 290 -31 18 -139 68 4 20 -126 11 -31 105 -35
3681 -35 -89 14 -194 168 -10 -30 -44 -138 -85 0 -162 -84 -98 -129 101 4 135 -20 -69 -91 33 -3 -39 171 -103
3706 -103 -7 -87 81 53 -49 -6 -81 -138 -63 -69 -39 139 85 -69 8 -59 -128 61 -28 73 -24 -9 102 85 32 153
3732 153 39 8 -137 121 76 -43 111 36 95 177 72 30 6 -117 61 33 95 135 48 137 224 54 99 241 156
3757 156 71 -218 26 -40 -149 36 193 -79 -43 54 87 160 198 -131 -257 -121 -95 -40 -72 68 -71 166 -109
3780 -109 49 37 -18 63 66 138 -53 111 -39 99 -178 -25 -31 85 50 5 -139 201 99 217 -127 -46 -28 72
3804 72 -122 68 188 -5 -31 166 -49 9 70 44 101 -235 -127 -45 109 101 -36 -5 -15 -63 -16 54 77 -285 -138
3829 -138 59 121 74 -98 -171 -94 98 -171 172 37 -4 -145 -66 -25 9 5 73 -60 -77 37 16 106 32 69 -9 137
3855A37J75k61l1R0j2j34m6K48j6j69Q2n9k3N6j6k2m4L93l64k1J18o7n5j94J53
3880h2j8J8J41J0j4L7n7j03m4p6J39K3K75j68j98L12k32O9j87J40K2j64O2L3J07
3905D5J16J6k13l8L02p0j20j98J19K2k35L47j20r6L46k48K26j70J28j60k39L70
3927A30p9j21J07K3j04j22K95j67P5k4N8J82k31J70k03j47J00j04J81J66k22Q0
3949D3K2j63J80M4j17J2m2J28k36M10k69J14l16J98Pj85J65M3K0j31J7P5k12K41
3973D8J05j47m3j07J92k01j1o4K68j71K31j54J72O4j79j79J45P0j69J66j59J19
3995dQ9k07J09K0Kp8J78M6o9j08l2Q2n1R1m0j01Mj93L91k96J96j16O2r6M4j95
4021b72L49j27O4r7J00j72j16Q5M3m8J50J06p7k52J96P7P2nr9O9j11O5J4J03k27
$$ plain form
3855 137 312 51 20 110 98 -36 -82 166 150 -19 63 4 -19 37 21 -1 -45 348 -16 -37 81 14 -41 -235 -82
3880 -82 -100 -82 59 69 55 92 35 -68 -112 -188 -49 -26 249 81 -117 195 -37 32 -155 -15 7 -157 -95 -62 45
3905 45 161 177 -36 -74 228 158 38 -160 -41 -19 -254 93 -27 -123 223 -25 201 31 159 -1 -240 130
3927 130 51 -70 37 60 -44 -166 129 -38 37 13 71 253 22 192 -11 -158 -58 -162 19 185 -37 43
3949 43 65 -98 82 126 9 21 -21 107 -129 281 12 126 -190 8 15 -170 -5 38 58 -73 -56 19 -193 48
3973 48 153 6 -37 -144 48 -153 -164 -228 40 -131 100 -54 118 182 3 -176 -31 39 -130 36 -123 -4
3995 -4 85 -122 -13 7 9 -69 109 155 86 -22 -54 28 -23 68 28 -73 -69 -262 129 -167 29 -87 -25 -121 -77 -272
4021 -272 77 -50 14 -83 17 -155 -271 -186 -143 -191 -41 65 -12 -264 -68 9 81 76 -23 46 -65 0 14 117 -110
4046a10J07M6k19J51L5j0l0m3M3K5M4J1j66K03k24R0rML7j22j26J60R0j6j7OJ0
4073c0j2j15J40K01j69p1K7J54n4J74l05K61m62K60R9j51QJ92j42k55L02p5J19
4096I6M4j89N8o2K20l02Q2jq4K25q8O6k82J52l8J00k22L68j34o3J59J48k54r1
4120i2K4M9M7J3j0Q5K1k65J46P9Jj52m4J58J7q2j23K48r9q0L28k76K47j20j34
4145a4J03j01k33O3Q2J8NK70k57L6J71j01k90K91j41j2O8J69k35K12r5n2P3P4
4169A04k6K4o8p7J75J22l98K16K2j61J8J20j63P3N2j25J26l71L87j78N6O3j03
4192a12O8j39J81r3J61k21J00J33p6l8K0j8P7N3j1p2J82j75r1p6J21P3j14k05
4216b72L31J4j91o4K87k1N9j82K68k03J34m9k68K43J01k32N5p2K5J68r0k1j53
$$ plain form
4046 -110 -3 43 -176 -25 10 0 -30 -73 -30 -5 39 50 -116 87 -137 -47 -56 -52 -15 -137 -263 -103 -13 -29 -46 -40 -30
4073 -30 -42 -157 -17 184 15 -56 -29 125 71 245 -60 201 -261 -1 98 -53 -45 147 5 -250 52 -23 96
4096 96 140 -49 9 -53 167 -135 -53 -54 -138 87 -1 65 -217 -65 -103 -3 -225 143 9 -54 105 253 -1 -92
4120 -92 -68 -19 28 41 31 116 137 -128 18 97 98 -54 -98 60 77 -5 -128 120 21 -59 269 -7 240 120 -14
4145 -14 89 -12 -245 -182 -100 -82 -77 193 -64 -28 143 42 -248 43 -98 -110 -42 127 -108 104 9 -43 30 104
4169 104 78 102 34 -43 132 254 -144 72 94 -67 -49 71 -92 -19 33 -92 34 -337 50 -128 -72 -9 -112
4192 -112 -44 -183 -2 -95 66 -155 -55 78 2 -36 -16 -34 43 96 85 13 195 20 -71 -147 -26 47 -67 -272
4216 -272 59 73 -118 -182 105 84 143 -39 229 26 160 111 -157 86 187 -45 10 -62 -37 131 41 20 -133
4239a33K11q5qrN0L2o3n4J27j73M5J43j11n6Q6j09Q6j45K42j06n8K03p5J59l51
4264a52N4N2J4K36l6k45P7k75M11k8L2j36n0J46k19L69k38J72k45n1P2q0J03K0
4288CJ81Lo1j99rK04k3M6k16L31k26M7j42O0o5Q7j5k39Q7J22P5j92m7K68n6n0
4314b6K7Q0k59K17pj62J89j42J6p2P9rJ80q1K56l71J29q0k71K96k5M9l05L27j6
4339A9j74R6O0r7O7K31K7j47k37m3R5Q5J53j04J61k40N7j79J40J75k84K56j97
4362h0J58l6q2P0J8lj08J80j27R5K8k81K10k4j86J66J4J09l23K78k14l7mJ06k7
4387a00J83m9o3K06j40k38K16j23J64k64J37K52j72M4q8J53j61k7K18r9p2O4k43
4410b02KJ69J67l76K74j13J60L3j05J43P4j31j03j72J39J23k1k8l5n8RL1J6j85
$$ plain form
4239 -133 78 -7 -15 -24 26 58 -5 -59 68 -105 -60 83 -28 -84 2 -107 -21 -166 76 -30 -88 115 40 199 -152
4264 -152 -98 -46 -32 204 168 -77 0 -275 136 108 140 4 -46 100 -119 250 12 184 -61 -112 -40 -120 -17 3
4288 3 184 187 126 -73 -82 122 99 145 -71 260 34 81 -61 -1 -66 21 6 -233 -146 -24 51 -141 -188 80 24 -26
4314 -26 1 81 -178 39 32 -130 59 -83 -67 -139 -60 -69 111 30 286 -85 44 -36 -307 -11 -36 13 -292 35 19
4339 19 -155 -59 1 -96 -29 202 229 82 -155 -198 -103 -18 135 31 192 -48 9 -170 -30 145 -139 117 -80
4362 -80 78 42 -40 30 48 45 -63 117 -10 85 113 -168 42 18 -168 -2 12 121 -202 76 -138 -175 -179 -73 -100
4387 -100 83 34 -29 177 37 -201 15 -108 56 -208 -71 181 9 53 -35 118 -43 -70 148 49 -23 41 -202
4410 -202 -200 -31 136 -240 34 -79 81 114 9 152 226 95 -8 -180 -41 82 61 33 -2 -60 -51 -20 -4 -189
4434a89K11lj49J54k10j17K25%J80K02k91j96J70K27j79J5k56O2R9M6k10J68Q4
4457D3j81j1j4K03J01l38L01p2j17OrQ6Q8j02P2k21O6P4J06J31m65J85P7j0r1
4482i2R2K4J30j47o2K5J13j28J00M0k13K42j44m6N2j19K87l35J08PMj28J75j34
4506a49r0J93j1N6K11r9k49K43J1q1r5Q4Oo0R3j12pK9ln8l5L20k72R9O1N3k61
4533a23J50o2P3j37j78L70k02p0M20l04j97K47K03j29k11J42m9J08j6M1n6n7p
4556d4J10r0J1j00L6J22q7J42k02Q6po2R7l8KK32J8j36j38j27J74j84O5P8j88
4581b30R1K31l23J17Q9K5K6J61j15p1Q7p4j74K39O2j39Q0m4j25R2K20l25K86m90
4605c04L57K45j56j23k3J04l4N3j1l23K31P5j31o8K60q8k54K85k11J52q0J78l20
$$ plain form
4434 -189 22 19 -130 24 -186 -303 -78 -78 102 304 13 -183 -13 214 35 50 -206 -144 -45 1 -209 -41 43
4457 43 -138 -149 -163 40 141 -197 104 32 -85 -79 -88 -2 86 -16 56 -165 -99 -25 81 212 -253 -68 9 -1 -92
4482 -92 0 24 154 7 -55 -30 83 -45 55 95 -118 124 -20 -66 -14 -133 154 -181 -73 -66 -62 -190 -15 -149
4506 -149 -239 -46 -57 -1 210 111 -138 105 116 35 -60 24 30 -30 63 -49 -56 -27 -30 -88 -123 197 -75 24 85 138 -123
4533 -123 27 -35 38 -99 -277 93 -109 -179 241 -63 -260 -13 190 61 -150 -8 -57 51 35 76 20 -37 -44
4556 -44 66 -24 -13 -113 -77 45 -42 100 -102 -16 -23 -85 12 -26 -24 208 226 90 -48 -175 -1 -185 -120 -42 -230
4581 -230 -139 92 -231 -114 -25 0 26 187 72 1 88 14 -160 79 141 2 82 38 -87 5 225 -100 186 -304
4605 -304 53 298 142 19 -4 100 66 119 108 -215 16 91 -40 -108 152 64 -190 95 -116 36 -44 134 -186
4628a86J41MQ5k4j3k7P8k63K18j05J13n8J96q1k87L70k0q3j34L1j17J49K6k00
4652a87Oj02M16k47J93j22j10J19j96m5N8K90L4j8j77J23m60N48p2j14J8J87l7
4675A05j63K42k39m2n2L19j3k52K64j14R8k20L8l09L02oJ5r3l6J70J48j57j58
4698a53J72K1p8M6j26Q3k7k6K46k04k68L29J42q2k9J82n35K41J5j90K08J46k8
4721H5P1l31K30k13J80j09J91j60N8J71j69o3K45q6Pr4P9J60L2k40o8N8k16R2
4745i0K04k08N3j26L66k34l4J07j18J07J5J12k07j8j3r4K46q3J08k25P2J14j45
4768i1j08L21j32m9J71j31o9P4O4r4L58l11q3l6M9J89j69P3j25J96j03J66k89
4791a29J12K11n4j48k58L27q2n8K45k66M0l3K0P6m1k8J09j9Q1r9r2J6J85n9r1
$$ plain form
4628 -186 -45 -41 44 20 7 -20 58 -205 13 -92 21 -37 159 78 -209 161 141 58 -76 -45 -162 -13 13 -187
4652 -187 -181 -283 133 -114 79 -43 -153 -34 -230 -275 -217 73 107 89 -88 35 -425 123 51 -63 -45 142 105
4675 105 -58 184 -55 -97 -149 170 157 -95 169 55 153 -67 -29 -338 -36 -42 -27 -120 -156 14 162 5 -153
4698 -153 19 40 -38 8 -118 -35 -62 -88 158 -46 -314 15 157 75 46 228 -307 -66 -51 -241 -33 113 85
4721 85 156 -175 55 -158 22 -87 104 -56 2 173 4 -59 186 100 107 13 92 252 284 44 -24 34 -182 -90
4745 -90 114 -94 -41 -167 199 -35 -69 38 -80 27 42 154 -53 -71 -84 -178 68 -15 93 -132 -60 54 -91
4768 -91 -199 122 -10 -59 112 -19 -88 -14 50 -44 314 3 -80 -116 -67 122 -47 26 -99 97 -6 160 -129
4791 -129 -17 194 140 -8 -266 61 -21 -79 166 -100 -60 -93 -73 3 -38 -66 43 24 105 6 -86 -70 115 56 -35
4816c5j51K23n1p9p6J89q4J03R4k12j9M0J08p8j01J61J31j47R9p5o4l24J37J32
4840g9J41P2L3l53L24j83j54J25J54k47M35r7j45k76L14l50J86J8J42j85K64j32
4862GJ5R1k49P8J12j4m08M53R5k36NJ26l2p5K7N5L6k23K13j09J15J0q7J18j51
4887b8L7j71p7L14j65Q2J64l52J05N0p9L47k88nJ48q1J23k18Q2J78k51J01J28
4910A44o3j23K5J40j56J52q7L40l97K02k4k23k4K69j46J01j23J9Q5p4Rj22j48
4933b24O6J78j34J33J0k06J21K7K6j11P4K73m60K75j12J59j2j04J1m3K44k86k3
4956a18J76j96k1J66P2n4r8O6K7j03P4j23K01m1k27J90K4l0Rj0J64j09j8K5r8
4981e2q6J68o8m2J59P1j50ql3R4l8L8L0o0J3J15j10j16J50o8k4J97k27J06l6J42
$$ plain form
4816 -35 -186 37 -14 -93 -169 20 -64 39 133 -79 -98 -58 50 -28 -129 32 163 16 115 40 -24 -348 -211 -79
4840 -79 62 134 167 -186 138 -45 -199 -74 80 -167 268 171 26 -250 64 -286 -100 -82 60 -125 139 7
4862 7 22 113 -136 -58 54 40 -368 85 180 -56 -51 75 43 -32 -5 50 86 -137 76 -33 82 92 5 123 -28
4887 -28 9 -162 -239 75 -90 -8 156 -196 -91 -41 -120 227 -61 -66 82 1 124 -94 -12 166 -85 16 144
4910 144 81 -42 -17 123 -33 119 32 372 -25 177 153 -70 -94 175 29 130 7 26 111 37 46 -76 -224
4933 -224 -158 20 -114 19 29 -177 -56 -29 -3 -114 -40 233 -227 48 -64 95 83 -21 -10 -53 191 -95 -118
4956 -118 58 -138 -159 7 79 25 -73 -7 20 -83 -9 -132 69 28 -199 -9 15 -15 -6 -16 148 39 21 46 -52
4981 -52 -138 30 -38 -80 79 150 0 -8 -41 53 15 53 83 23 36 151 41 -75 75 7 -17 180 -47 59 23 165
5007A65j32r9J42q1J7m5J40j83N9L7K1KK4j23k11L24N5k85K63K2j31j07Ln5K09
5032C1k28J19J94k18K67Km23K93R2j82O0j66K07j69J48M3j20j4K6r0J79j71K10
5055I0J20k95J86m06L78P4j34J2j96J97j3J2Q8j72J64J10j84q3R4k13J66J69k25
5078f1K60k99J49k09J99M6q0n6Q1J59j33j08J88k80qP8j45Q0O4J08K2j71J45o7
5102c8J22k59M7J66o5O9r6m8N4K5J78k29K25l3j9L1o0m6r9Q0J27j16j37J60p3
5127c4j1l0K8L88n32Q4Q9p7R4rJ18k93J77O1o9K79l75p9L56k82J6L97k38j03K6
5152a9n8j11J79O2j26J74k86L0K5J40K8q7Q6J86k37K40l20J12J0r0Q5LPJ77k52
5177d2J19k18N2J39r9j32R7ml5J43K1J03r8q5N0j23K12j33l4r5K11L1j42J19j38
$$ plain form
5007 165 33 -66 76 -5 12 -33 107 -76 -17 20 41 43 67 -56 -267 57 112 -173 90 112 -19 -126 -123 -178 31
5032 31 -197 -78 116 -102 165 167 -256 37 129 -53 7 -159 48 -121 27 70 -50 -64 -38 -128 51 -120 90
5055 90 210 -85 101 -305 73 147 13 25 -171 26 13 25 113 -59 105 215 31 -52 42 -171 -5 164 -61
5078 -61 199 -100 49 -160 39 85 5 -51 30 189 56 -52 136 -144 -152 -74 -219 -139 -75 33 55 -116 29 -38
5102 -38 84 -175 -128 38 -27 42 -54 -102 -48 -23 155 -74 151 118 99 130 70 24 -75 5 132 16 -121 39 -34
5127 -34 -45 -75 -47 341 -191 -107 -18 -95 -1 -10 108 -185 -8 53 -16 263 -112 -191 165 -117 -101 296 58 -45 -19
5152 -19 -77 -188 -9 53 -73 101 -185 -155 -130 10 38 -49 37 223 -14 226 -94 18 28 -62 23 26 33 210 -42
5177 -42 77 -141 -89 50 -49 -181 -84 -88 -123 20 41 144 46 -39 11 -112 100 -33 -67 -162 49 80 -62 57 -81
5202h1nL8j27K13J1m9j08K93l52pK39k14J95P1n7nj75R0P4p0q0j4J83n8j39K84
5228A50l6j49RK9jk5K03k85L2J73j61L1k7l1J99j98K62k50r7L02Mj29m0J6Qq6
5254i7J67j22j11K07l25K19J60o2K7Nq4L4P6K66l06j07K50m05K5K25j16o9O0M6
5278c7M9P6k3nj10K1p1J80o6j93J20j02R2P0r2L16p1r0rj28o4K81j65k8J76l0
5304I7j44O2n0J66l90K93%o0K4k74K17K53l02K18j15%r4K16ok74n2L15j64J59
5328I5j28n4J23m6J21J57k62r3J05J71m6j3j33q0K05j3j23j03K16q5N3o1q5J61
5352H2oj65O4J63k39K15p9Kj21J74j35J1J52j94K43k74K82l09K12K8j57j03J62
5375HKK9J92j69J65j24j16j01L6j87K53J43j06J78j82p4J12O1k37J94o4j07p0
$$ plain form
5202 -81 -86 -48 -175 38 49 0 -108 185 -167 -174 65 -149 46 117 60 55 -120 -30 44 -26 -106 -120 63 5 -134 150
5228 150 114 -35 -26 3 2 -23 180 -105 -73 100 -61 -30 -57 -88 111 -87 175 -75 -172 130 134 5 -35 -19 -11 -97
5254 -97 70 -52 -163 44 -281 -62 98 36 63 68 -16 18 94 360 54 -53 197 -208 -183 42 -74 -143 -83 -37
5278 -37 12 88 65 60 -50 -29 -100 80 14 -179 -59 -161 -69 1 -91 225 154 64 55 -73 -137 144 -21 -49 127 97
5304 97 -47 15 -35 131 -259 34 34 -26 -2 -276 -59 194 -108 110 -5 -5 -99 117 111 -163 -215 100 -64 95
5328 95 -33 -87 36 -10 111 268 6 -87 18 189 143 130 -3 -83 122 109 -14 -117 99 14 67 6 -79 82
5352 82 76 -89 -25 138 -101 114 35 37 -84 90 -45 -34 118 -76 167 -107 175 -134 78 106 -51 -154 8
5375 8 10 39 231 62 227 103 -13 -114 -78 -265 -12 131 25 203 21 -53 59 120 -117 77 13 -94 -164
5398a64J57M2J33m9J8O4q7n3o5k04K52o8p8J1o0K95j06j3j73J99j01J70r2k82
5422b54K64k16J93K2k6j18K16q8o1J11J44j59k26L48jj62J4j23J34J77j51j12
5444g4J90p5P7o4k51K15J69j26m4k61K47J15kj9k26K11k2j16k4K11j17L4p4k6
5468e2J18J22k19l27M23l2j95O9mM0J98j08p6j59K08jQ6k64N9K53j87m9J07k7
5492a7q4L27k21J9j26k0K59J04m46J23PJ01r7J10J21r5P3j53Q4N4m49K72qq4K72
5517A26k83J70q8J25j3J09k01O7J52k43j9J77k4Nj32j1J43L4q8NPR5j01k79K01
5542f6K1J18k78J88o4N1q0O4J30k2n4m3o3J77o9r9k8J98j4o1k3k0k9J54j53J48
5568H3k05lL39k46N7%om4R2j09j19M02k22M3j14pL2R1K9l7K39l37K57l36J50j19
$$ plain form
5398 -164 -7 35 168 119 137 201 114 61 -4 -208 44 -24 -102 -91 -151 144 38 25 -148 51 -50 120 28 -254
5422 -254 10 -206 -13 9 -17 -135 81 -7 -68 43 187 28 -198 150 149 -13 1 -122 12 189 38 -74
5444 -74 116 41 118 54 -197 18 187 61 17 -244 3 118 116 97 -129 82 60 -56 -80 131 14 48 -26 -52
5468 -52 66 188 -31 -358 65 33 -162 -93 -97 -57 141 33 -43 -202 6 5 91 -173 -114 139 -48 -97 10 -17
5492 -17 -101 226 5 24 -102 -122 137 241 -205 -82 -75 26 -71 39 160 65 138 -15 69 123 -326 -54 -62 -146 126
5517 126 -157 13 -75 50 37 146 -55 12 164 -79 -98 79 55 60 -72 -83 60 94 6 11 18 113 12 -267 -66
5542 -66 -45 73 -205 -17 -81 -30 -110 -46 84 62 8 -35 -98 79 10 -89 -117 81 67 6 -17 -37 -66 88 -65 83
5568 83 -122 -125 214 -32 25 25 19 -25 67 -42 -161 241 19 62 -52 -59 -27 64 93 56 295 -42 215 -121 29 -90
5594i0J29r6P1k33R7K6O3J33j98R3j16K22L4k46J10J51l43K64k92K42M2O4j94
5617f7M5m2j06L76q5QJ5j26j92K55L1k08JJ89j9r2J87k85l8J95P3m1R4k20N1R
5643Hj17j3%J79n0j19P1Q9L9k92L51r4M5j51J23J62m02J34P4L5j05m1O0J87k26
5668e3J84k2j81k8K64o00K84J71p3j75L08j17Lq6L60j37q7K7r0K52l21P4l7J10
5692C0L6j15J00n2j8lj03L38j53J27K1m53K06p1K19l58K66P2j43M1q5N9J5J06
5716H2r8J29j53j0J30P5l90K86n18L44K94JK3k00j89p6N14r3j26J1p6Q3r8K82
5740B27L3l67R0j48M0P1J4J01j59m5R1J76l5j86P8J12n1k7J99j19Oj91K21j62
5764c1Q8M3O1k06R8j53L0P6p4P1j6J13k90J11Q0n9J9J44j29mj59LQ8M4m3P8K2
$$ plain form
5594 -90 39 -57 14 -219 -122 -96 -33 100 -98 -5 -121 101 135 -111 -1 150 -193 71 -221 21 63 127 -67
5617 -67 -22 -64 -170 206 121 129 144 18 -174 81 112 -96 -95 94 75 -17 170 -115 -153 42 115 74 168 -52 -1 8
5643 8 -109 -122 -122 57 7 -112 -41 48 87 -205 146 52 97 -54 69 231 -171 -37 37 72 -33 -74 -14 173 -53
5668 -53 131 109 -72 -100 164 -436 -152 19 -54 -229 79 -38 -35 -121 239 102 15 42 -48 204 -117 -43 -80 30
5692 30 66 -49 51 -1 -19 -22 -125 213 60 187 208 -245 -39 -110 109 -249 17 89 -54 -13 -98 -39 -24 82
5716 82 -16 113 -40 -50 80 155 -235 51 -467 -123 171 172 195 -5 -194 -270 244 151 25 36 -40 43 -55 227
5740 227 260 -107 -17 -165 -125 -54 -40 61 -98 -143 -52 124 89 -97 -19 93 42 15 214 95 101 -90 131 -31
5764 -31 57 100 161 -45 53 -100 -70 6 -68 3 -13 100 -190 -79 1 -58 -39 105 -24 -28 -187 -184 -96 -52 -95 -17 5
5791EJ14L9p7j29O5q7q4K22Q6p8N9k10Q0k59Q2O2r1K47rO6n7j53m9K42k35j22
5817b71M79j38j0j54J27k00M1L6J96j5j60J08p3K8rJ16q8M4k56J72R7l0j29J07
5841A8J33j88n6Q3J00j42q1K95j73j66J21N7K0j39J72K1K9j88l4j0K26j60j9J31
5865E0p3N8q3LP9K4m4j83J48K07k58K31lk55K6p0J23m2M1q8J69M8m8l12M67k98
$$ plain form
5791 5 119 158 81 -48 17 -70 -154 68 154 76 135 -75 5 -254 -172 -110 -201 46 37 103 46 -107 -156 86 -149 -271
5817 -271 208 70 60 -94 33 -167 -126 -90 106 91 -69 39 -34 -6 -15 101 13 57 -199 -27 70 40 -89 18
5841 18 151 -37 -93 -10 90 -52 -133 162 -11 -177 -56 1 21 -118 54 75 104 -84 -118 -128 98 -62 -81 50
5865 50 -23 35 -48 -45 34 58 14 -169 -21 186 -72 159 156 -99 -73 -143 -20 -62 -21 -109 60 108 60 -252 215 -83
$$ [...]
8191B7
##END NTUPLES=NMR FID
##END=
