##TITLE=1H_13-2025
 200.13MHz, CDCl3,
 8 sc
 
 20.1.2025
##JCAMPDX= 6.0         $$ Bruker NMR JCAMP-DX V2.0
##DATA TYPE= NMR FID
##DATA CLASS= NTUPLES
##ORIGIN= UXNMR, Bruker Analytische Messtechnik GmbH
##OWNER= pz
$$ XWIN-NMR		Version 3.5
$$ Mon Jan 20 14:12:55 2025 Russian Standard Time (UT+4h)  she@DPX200
##.OBSERVE FREQUENCY= 200.1313
##.OBSERVE NUCLEUS= ^1H
##.DELAY= (6, 6)
##.ACQUISITION MODE= SIMULTANEOUS
##.ACQUISITION SCHEME= undefined
##.AVERAGES= 8
##.DIGITISER RES= 18
##SPECTROMETER/DATA SYSTEM= spect
##.PULSE SEQUENCE= zg30
##.SOLVENT NAME= D2O
##.SHIFT REFERENCE= (INTERNAL, D2O, 0, 14.3821)
##AUDIT TRAIL= $$ (NUMBER, WHEN, WHO, WHERE, WHAT)
$$ ##TITLE= Audit trail, XWIN-NMR		Version 3.5
$$ ##JCAMPDX= 5.01
$$ ##ORIGIN= Bruker BioSpin GmbH
$$ ##OWNER= she
$$ F:/spectra/data/she/nmr/H-C/1/audita.txt
$$ ##AUDIT TRAIL=  $$ (NUMBER, WHEN, WHO, WHERE, WHAT)
(   1,<2025-01-20 14:11:42.25 +0400>,<she>,<DPX200>,
      <created by zg, POWCHK disabled, PULCHK disabled
       configuration hash MD5:
       00 E9 B6 7A A2 85 ED C7 34 08 36 98 17 FE 4E 26
       data hash MD5: 16K
       A1 1A 15 17 55 1B 74 5A B7 D2 B1 3C D5 8F 8D 4D>)
$$ ##END=
$$ 
$$ hash MD5
$$ 03 9D CD BA A2 F4 69 CD 71 D8 81 7E CB 92 9F 75
##$RELAX= 
##$RELAX= 
##$RELAX= 
##$RELAX= 
##$RELAX= 
##$RELAX= 
$$ Bruker specific parameters
$$ --------------------------
##$DU= <F:/spectra>
##$EXPNO= 1
##$NAME= <H-C>
##$PROCNO= 1
##$TYPE= <nmr>
##$USER= <she>
##$AMP= (0..31)
100 100 100 100 100 100 100 100 100 100 100 100 100 100 100 100 100 100 
100 100 100 100 100 100 100 100 100 100 100 100 100 100 
##$AQSEQ= 0
##$AQ_mod= 1
##$AUNM= <au_zg>
##$AUTOPOS= <>
##$BF1= 200.13
##$BF2= 200.13
##$BF3= 200.13
##$BF4= 200.13
##$BF5= 200.13
##$BF6= 200.13
##$BF7= 200.13
##$BF8= 200.13
##$BYTORDA= 1
##$CFDGTYP= 0
##$CFRGTYP= 5
##$CHEMSTR= <none>
##$CNST= (0..31)
1 1 145 1 1 1 1 1 1 1 1 1 1 1 1 1 1 1 1 1 1 1 1 1 1 1 1 1 1 1 1 1 
##$CPDPRG= <>
##$CPDPRG1= <>
##$CPDPRG2= <>
##$CPDPRG3= <>
##$CPDPRG4= <mlev>
##$CPDPRG5= <mlev>
##$CPDPRG6= <mlev>
##$CPDPRG7= <mlev>
##$CPDPRG8= <mlev>
##$CPDPRGB= <>
##$CPDPRGT= <>
##$D= (0..31)
0 0.7 0 0 0 0 0 0 0 0 0 0.03 0 0 0 0 0 0 0 0 0 0 0 0 0 0 0 0 0 0 0 0 
##$DATE= 1737367901
##$DBL= (0..7)
120 120 120 120 120 120 120 120 
##$DBP= (0..7)
150 150 150 150 150 150 150 150 
##$DBP07= 0
##$DBPNAM0= <>
##$DBPNAM1= <>
##$DBPNAM2= <>
##$DBPNAM3= <>
##$DBPNAM4= <>
##$DBPNAM5= <>
##$DBPNAM6= <>
##$DBPNAM7= <>
##$DBPOAL= (0..7)
0.5 0.5 0.5 0.5 0.5 0.5 0.5 0.5 
##$DBPOFFS= (0..7)
0 0 0 0 0 0 0 0 
##$DE= 6
##$DECBNUC= <off>
##$DECIM= 32
##$DECNUC= <off>
##$DECSTAT= 4
##$DIGMOD= 1
##$DIGTYP= 9
##$DL= (0..7)
0 120 120 120 120 120 120 120 
##$DP= (0..7)
150 150 150 150 150 150 150 150 
##$DP07= 0
##$DPNAME0= <>
##$DPNAME1= <>
##$DPNAME2= <>
##$DPNAME3= <>
##$DPNAME4= <>
##$DPNAME5= <>
##$DPNAME6= <>
##$DPNAME7= <>
##$DPOAL= (0..7)
0.5 0.5 0.5 0.5 0.5 0.5 0.5 0.5 
##$DPOFFS= (0..7)
0 0 0 0 0 0 0 0 
##$DQDMODE= 0
##$DR= 18
##$DS= 0
##$DSLIST= <SSSSSSSSSSSSSSS>
##$DSPFIRM= 0
$$ [...]
##$SUBNAM0= <"">
##$SUBNAM1= <"">
##$SUBNAM2= <"">
##$SUBNAM3= <"">
##$SUBNAM4= <"">
##$SUBNAM5= <"">
##$SUBNAM6= <"">
##$SUBNAM7= <"">
##$SUBNAM8= <"">
##$SUBNAM9= <"">
##$SW= 18.0517328524113
##$SWIBOX= (0..15)
0 0 2 0 0 0 0 0 0 0 0 0 0 0 0 0 
##$SW_h= 3612.71676300578
##$TD= 16384
##$TD0= 1
##$TE= 0
##$TE2= 300
##$TE3= 300
##$TEG= 300
##$TL= (0..7)
0 120 120 120 120 120 120 120 
##$TP= (0..7)
150 150 150 150 150 150 150 150 
##$TP07= 0
##$TPNAME0= <>
##$TPNAME1= <>
##$TPNAME2= <>
##$TPNAME3= <>
##$TPNAME4= <>
##$TPNAME5= <>
##$TPNAME6= <>
##$TPNAME7= <>
##$TPOAL= (0..7)
0.5 0.5 0.5 0.5 0.5 0.5 0.5 0.5 
##$TPOFFS= (0..7)
0 0 0 0 0 0 0 0 
##$TUNHIN= 0
##$TUNHOUT= 0
##$TUNXOUT= 0
##$USERA1= <user>
##$USERA2= <user>
##$USERA3= <user>
##$USERA4= <user>
##$USERA5= <user>
##$V9= 5
##$VALIST= <valist>
##$VCLIST= <CCCCCCCCCCCCCCC>
##$VD= 0
##$VDLIST= <DDDDDDDDDDDDDDD>
##$VPLIST= <PPPPPPPPPPPPPPP>
##$VTLIST= <TTTTTTTTTTTTTTT>
##$WBST= 1024
##$WBSW= 4
##$XGAIN= (0..3)
0 0 0 0 
##$XL= 0
##$YL= 0
##$YMAX_a= 718557
##$YMIN_a= -623214
##$ZGOPTNS= <>
##$ZL1= 120
##$ZL2= 120
##$ZL3= 120
##$ZL4= 120
##$ABSF1= 10
##$ABSF2= 0
##$ABSG= 5
##$ABSL= 3
##$ALPHA= 0
##$AQORDER= 0
##$ASSFAC= 0
##$ASSFACI= 0
##$ASSFACX= 0
##$ASSWID= 0
##$AUNMP= <proc_1d>
##$AZFE= 0.1
##$AZFW= 0.1
##$BCFW= 1
##$BC_mod= 2
##$BYTORDP= 1
##$COROFFS= 0
##$CY= -3
##$DATMOD= 1
##$DC= 2
##$DFILT= <>
##$DTYPP= 0
##$F1P= 0
##$F2P= 0
##$FCOR= 0.5
##$FTSIZE= 0
##$FT_mod= 4
##$GAMMA= 1
##$GB= 0.15
##$INTBC= 1
##$INTSCL= 1
##$ISEN= 128
##$LB= 0.25
##$LEV0= 0
##$LPBIN= 0
##$MAXI= 10000
##$MC2= 0
##$MEAN= 0
##$ME_mod= 0
##$MI= 1.114404
##$NCOEF= 0
##$NC_proc= 0
##$NLEV= 6
##$NOISF1= 3.799351
##$NOISF2= 2.8
##$NSP= 1
##$NTH_PI= 0
##$NZP= 0
##$OFFSET= 14.38212
##$PC= 1
##$PHC0= 253.1955
##$PHC1= 12.9922
##$PH_mod= 1
##$PKNL= yes
##$PPARMOD= 0
##$PSCAL= 0
##$PSIGN= 0
##$REVERSE= no
##$SF= 200.129724274929
##$SI= 16384
##$SIGF1= 3
##$SIGF2= 2
##$SINO= 400
##$SIOLD= 16384
##$SREGLST= <1H.CDCl3>
##$SSB= 0
##$STSI= 0
##$STSR= 0
##$SW_p= 3205.1282051282
##$SYMM= 0
##$S_DEV= 0
##$TDeff= 0
##$TDoff= 0
##$TI= <>
##$TILT= no
##$TM1= 0
##$TM2= 0
##$TOPLEV= 0
##$USERP1= <user>
##$USERP2= <user>
##$USERP3= <user>
##$USERP4= <user>
##$USERP5= <user>
##$WDW= 1
##$XDIM= 8192
##$YMAX_p= 0
##$YMIN_p= 0
$$ End of Bruker specific parameters
$$ ---------------------------------
##NTUPLES= NMR FID
##VAR_NAME=  TIME,          FID/REAL,        FID/IMAG
##SYMBOL=    X,             R,               I
##VAR_TYPE=  INDEPENDENT,   DEPENDENT,       DEPENDENT
##VAR_FORM=  AFFN,          ASDF,            ASDF
##VAR_DIM=   8192,          8192,            8192
##UNITS=     SECONDS,       ARBITRARY UNITS, ARBITRARY UNITS
##FACTOR=    0.0002768,     1,               1
##FIRST=     0,             0,               0
##LAST=      2.2672688,     0,               0
##MIN=       0,             -623214,         0
##MAX=       2.2672688,     718557,          0
$$ Real data points
##PAGE= N=1
##DATA TABLE= (X++(R..R)), XYDATA
$$ [...]
2061b501M760j221m476M725J478m865J066L109j741k322J612K921l743k113N877
$$ -2501 2259 1038 -3438 1287 2765 -2100 -1034 2075 334 -1988 -376 2545 -1198 -3311 2566
2076B566j321m546M132J665m262J46K971n22k918J598L325l289k446N567j328
$$ 2566 1245 -3301 831 2496 -1766 -1620 1351 829 -2089 -491 2834 -455 -2901 2666 1338
2091A338m137M128J894l817r41K714R2l842J140M680l626k347M969j482m302K905
$$ 1338 -2799 1329 3223 -594 -1535 1179 1271 -2571 -1431 3249 -377 -2724 2245 763 -3539 -634
2107f34K022k356q29K638R43m239J152M873l767k029N227j472l950J654K449j366
$$ -634 1388 -968 -1797 841 1784 -2455 -1303 3570 -197 -2226 3001 1529 -2421 -767 1682 316
2123C16j990L150J643n258o3M393l560j221M844n43l500R59J870j384k368L499
$$ 316 -1674 1476 3119 -2139 -2202 2191 -1369 -2590 2254 1711 -1789 -830 1040 -344 -2712 787
2139G87K491m854J48M029l927j733M305O15k324j05K002j040l541L091K940m311
$$ 787 3278 -1576 -1428 2601 -1326 -3059 1246 1861 -463 -568 1434 394 -3147 -56 2884 -1427
2155a427J092L475l603k098L123M00j394r0K784r13m522K740K370l745P78L786
$$ -1427 -335 3140 -463 -2561 562 962 -432 -522 2262 1349 -3173 -433 1937 -1808 -1030 2756
2171B756k571j803J243P89j162p03L565o75l466K287J569m035J331L185j642r90
$$ 2756 185 -1618 -375 414 -748 -1451 2114 1439 -2027 260 1829 -2206 -875 2310 668 -322
2187c22M76J211j778j768L282M86l494K212J438l167M83J782o13p48L05J523j774
$$ -322 154 1365 -413 -2181 1101 1587 -1907 305 1743 -1424 -941 841 228 -520 -215 1308 -466
2204d66j625L500j03l087K599P44k722J58J394j62o71m74K272j145j984K607j36
$$ -466 -2091 1409 1306 -1781 818 1562 -1160 -1002 392 230 -441 -915 1357 212 -1772 835 699
2221F99k101J849N13j508M20M39P45r81l68J848j391j999K558q4j729J761K35
$$ 699 -1402 447 960 -548 -128 311 1056 75 -293 1555 164 -1835 723 639 -1090 671 906
2238I06p15r73k15J047p36o63K717j103j342J899n96j324J295J35J32p24j26J463
$$ 906 191 -782 -997 50 -686 -1349 1368 265 -1077 822 226 -1098 197 332 464 -260 -386 1077
2256A077j444o66K666j273j113J162o70m76M87L94R67q26m45J214k099m89K278
$$ 1077 -367 -1033 1633 360 -753 409 -261 -737 -250 144 1111 285 -160 1054 -1045 -1534 744
2273G44j053k9J693q59m93l69j41R40j248R3J912j620p4J486j479j6Q91n96K79
$$ 744 -309 -338 1355 496 3 -366 -507 433 -815 -722 1190 -430 -504 982 -497 -513 378 -218 61
2292F1j79k15J061j106P28J048j716M8P33j193J17M75k40J240r76k11Q78j542
$$ 61 -118 -333 728 -378 350 1398 -318 -270 463 -730 -613 -138 -378 862 -114 -325 553 -989
2310i89M48J054j261J182K20j431R58k00l44Q05j009Q39N50j284O47N22j164R06
$$ -989 -541 513 -748 434 654 -777 181 -19 -363 442 -567 272 822 -462 185 707 -457 449
2328D49n17n85J050o17j43J207j163O90r9j071Q44j38q24J382l51m00R75j070
$$ 449 -68 -653 397 -220 -363 844 -319 371 272 -799 45 -93 -917 465 114 -286 689 -381
2346c81K09N40j460J031k4n06J168n36o4R06j317J0R37j047N61N75o66J028l05
$$ -381 -172 368 -1092 -61 -85 -591 577 41 -23 883 -434 -424 513 -534 27 602 -64 964 659
2365F59j115J071r72R6O63j198J052N44j419N82R5r96R33n31m9J044q78M97P47
$$ 659 -456 615 -357 -261 402 -796 256 800 -619 -37 58 -938 -5 -536 -585 459 -419 78 825
2384H25j331O04J76j030J032j44m17J109n39l37L19r32M86L87j097J114mo14J249
$$ 825 -506 98 274 -756 276 132 -285 824 285 -52 267 -665 -179 208 -889 225 221 -393 856
2403H56j011j10Q12j130K31N44o72Q27j44o61J305r38o27J011p12J98N65n26P46
$$ 856 -155 -265 547 -583 -352 192 -480 347 203 -458 847 -91 -718 293 -419 -221 344 -182 564
2422E64k64o70J067r14j74J099j146M30J095j350M12L77p74M51r36J42J024j096
$$ 564 300 -370 697 -217 -391 708 -438 -8 1087 -263 149 526 -248 203 -733 -591 433 -663
2440f63K53J428j480L49N72j320J021k34k29R17p73N69P17j544O28O33j247M02
$$ -663 -410 1018 -462 -113 459 -861 160 -74 -303 614 -159 410 1127 -417 211 844 -403 -1
2458aK64l24M35n36r2P80j080M94M18j208O63L36j261J026K89l53M48l56L90K92
$$ -1 263 -61 374 -162 -254 526 -554 -60 358 -850 -187 149 -1112 -86 203 -150 298 -58 332 624
2478F24j493J115M49j631J287o2o75O24j04j43L60q01O23R2j154J126nj209J350
$$ 624 -869 246 695 -936 351 289 -386 238 134 -9 351 -450 173 265 -889 237 232 -977 373
2497C73J72q36N00q31N86n1j128J799Q6j506J425m08r05O90P7j41N53m34N50k75
$$ 373 545 -291 209 -622 -36 -87 -1215 584 670 -836 589 181 -724 -34 43 -98 455 21 571 296
2517B96j082J645p57j097J754m23o30O69k47J40l20q24R62n08q15J699l68o15
$$ 296 -786 859 102 -995 759 336 -294 375 128 268 -52 -876 86 -422 -1237 462 94 -521
2535e21J449j017l43L66n95N83j99Q4J775r71q05J493j291q52Q39j92L63j00m11
$$ -521 928 -89 -432 -66 -661 -78 -277 -193 1582 611 -194 1299 8 -844 -5 -197 166 66 -345
2554c45J383j195m14J368j090m18R42r61r3J249k05M87m79k94M71j754L1J960
$$ -345 1038 -157 -571 797 -293 -711 231 -730 -823 426 221 708 229 -65 406 -1348 -1317 643
2572F43q54J38J608j379n81j56l92R52j89J021O91j441m83Q03j631N52J500m86
$$ 643 -211 -73 1535 156 -425 -581 -973 -21 -210 811 1502 61 -422 381 -1250 -698 802 316
2590C16J83p96j77P33j191R10J471j787j95M04j276L70Q51M27J217n01l98p79
$$ 316 499 -297 -474 259 -932 -22 1449 -338 -533 -129 -1405 -1035 -184 243 1460 959 561 -218
2608b18j578O20J368l41J630P29j925n87p09k20Q76K15J113N56k017J27r2j005
$$ -218 -1796 -1176 192 -149 1481 2210 285 -302 -1011 -1231 -355 -140 973 1529 -488 -361 -453 -1458
2626a458J581N86l73L70j010n28L41k25J697M65j004K22r91j360P69N20J064J002
$$ -1458 123 709 336 706 -304 -832 -491 -716 981 1446 442 664 -327 -1687 -918 -398 666 1668
2644A668j061j08o31j801Q77R60L01J470m81j183r9r49J73R30m13J655l50j673
$$ 1668 607 499 -132 -1933 -1056 -96 205 1675 1194 11 -88 -1037 -864 66 -347 1308 958 -715
2662g15O25k34p16J060J61P0k5j207M04N21m32J430p3n67L72j074q03J031J59
$$ -715 -90 -324 -1040 20 181 251 226 -981 -577 -56 -488 942 869 302 674 -400 -1203 -172 -13
2681a3N90M03p37K59p63j289J358J89k95J109n56k55K23q09N22M35q26J097p19
$$ -13 577 980 243 502 -261 -1550 -192 -3 -298 811 255 0 223 -586 -64 371 -455 642 -77
2700g7n90J124n83k72J101n01k71m0p31R03l91n7J360o65m12N26j024L42L34l01
$$ -77 -667 457 -126 -398 703 202 -69 -109 -840 63 -328 -385 975 310 -102 424 -600 -258 76 -225
2720b25Q28j18m55M31p08j58J157r45N5O32p70L20K4p45J132p45l77R50p14j2
$$ -225 603 485 30 461 -247 -405 752 -193 -138 494 -276 44 68 -677 455 -290 -667 283 -431 -443
2740d43P11p50Q30J70j056P61j9n03M83l09M3P38q32J40L25q84Q36j89o00Q44
$$ -443 268 -482 348 518 -538 223 204 -299 184 -125 -82 656 -176 -36 289 -595 241 52 -548 296
2760B96k87o48R37m00J73K52n58Q17k61j185J075m32j44Q78p36L52M40j055K10
$$ 296 9 -639 298 -102 71 323 -235 582 321 -864 211 -221 -365 513 -223 129 569 -486 -276
2779b76L69n37M45k9r9J006n41n22R31j058L81J3m84O94L13p20O20n14j74L98
$$ -276 93 -444 1 -28 -127 879 338 -184 747 -311 70 83 -401 293 606 -114 506 -8 -182 216
2799B16r74N26P04j099O94J96m78L62l97j36N29n59P2R88o06N30j80q77R30k60
$$ 216 -758 -232 472 -627 67 263 -215 147 -250 -386 143 -416 -344 644 38 568 388 -489 441 181
2819A81q44Q39k29J23L29o87L07L25j113N79J66o30J118m25NO07o47k82M18o44
$$ 181 -663 176 -53 70 399 -288 19 344 -769 -190 -24 -654 464 39 44 651 4 -278 140 -504
2839e04L39l5k49J030k99k60M72q21LM02j043J051L25n29P80k48m81O72j059P
$$ -504 -165 -200 -449 581 282 22 494 -327 -324 78 -965 86 411 -118 662 414 -67 605 -454 -447
2859d47P23o90L73M85n06N39m68p18R86q13j99O42j61L75L95o19M58k32o51N21
$$ -447 276 -414 -41 444 -62 477 9 -709 277 -536 -735 -93 -254 121 516 -103 355 123 -528 -7
2879gk1q4N86l50Q5K23p15L11k5o49P41l72P6Q25o20k30O02p74K45K09p45Q82
$$ -7 -28 -112 474 124 209 432 -283 28 3 -646 95 -277 -201 624 4 -226 376 -398 -153 56 -689 193
2901A93R1n31Q36m59k70K48q75N47L17o07N91K85m62N94o01k66M98n78l6Q24n36
$$ 193 284 -247 589 130 -140 108 -767 -220 97 -510 81 366 -96 498 -103 -369 129 -449 -485 339 -197
2922a97O84j29o46P94p06j41M70o82K31R28p80K22K65q11M41j80l12R73n56J19
$$ -197 487 358 -288 506 -200 -341 129 -553 -322 606 -174 48 313 -498 -57 -237 -549 424 -132 -13
2942a3P41q61K20K65o27K22J04l79Q50m77J6K72p36M02K88j239P41N45p83O37
$$ -13 728 -133 87 352 -275 -53 51 -328 522 45 61 333 -403 -1 287 -952 -211 334 -449 188
2962A88O3k69L44o56K84L04p72N55L61p18M63r0l81N99k09k28L62n65P96j4j177
$$ 188 251 -18 326 -330 -46 258 -514 41 402 -316 147 57 -324 275 66 -162 200 -365 431 417 -760
2983g60J129p0q53Q44om42M36o14K41L23n04L73K77q43Q00k20n52Q00n08j6M74
$$ -760 369 299 -554 290 284 -158 278 -336 -95 228 -276 97 374 -469 331 111 -441 359 -149 -165 309
3004C09o51P41j28j150J406k62n87P68l98k27M44n92K88K68n65O90l64n03Q84
$$ 309 -342 399 271 -879 527 265 -322 446 48 -179 265 -327 -39 229 -336 354 -10 -513 371
3023C71n32m88J013l47k29K83o35P60n12k24J283m91n60Q69m07n62L65k88M94
$$ 371 -161 -649 364 17 -212 71 -564 196 -316 -540 743 252 -308 561 154 -408 -43 -331 163
3042A63k27k50Q62n22m77J217j323j98J217o58l32M70p4O32o38q0P79q02l98J234
$$ 163 -64 -314 548 26 -451 766 -557 -755 462 -196 -528 -58 -132 500 -138 -218 561 -241 -639 595
3062E95p65k01R03m36O3m2J01J56r89J50J203j316K92J136p84m77O01k95m3j61
$$ 595 -170 -371 532 96 159 117 218 374 -615 -465 738 -578 -286 850 66 -411 190 -105 -148 -309
3082c09N8Q00q80K13Q85j418L20R54j075J47M87l1J54o62N95L11j257N63Q64j125
$$ -309 -251 549 -331 -118 767 -651 -331 623 -452 -305 182 151 305 -357 238 549 -708 -145 719 -406
3102d06L51N60n00p3k68N46m5q97Q85K32j227P74R00j292L40M64m56l18r7Q42
$$ -406 -55 505 5 -68 -336 210 165 -732 153 385 -842 -68 832 -460 -120 344 -112 -430 -527 315
3122C15N0q30J022J73j352O91J91p80L27N55k32j26j53N21n24o98J105M27j550
$$ 315 365 -465 557 730 -622 69 260 -520 -193 362 130 4 -149 372 -152 -850 255 682 -868
3141h68R68K84q50J68L06M11l31o16R71k63r94J222J63j005Q64J3o71l2k19R17
$$ -868 100 384 -466 -298 8 419 88 -528 443 180 -814 408 571 -434 430 443 -228 -260 -479 438
3161D38o59j51J360n57j515J250Q0j051O29N19j00j96n28P92p08k89J385n54p18
$$ 438 -221 -372 988 431 -1084 166 246 -805 -176 343 243 47 -481 311 -397 -686 699 145 -573
3180e73J035l92o99N65J98J59l70R0R53j288o07J554o15l24P67M9m87l08k95P31
$$ -573 462 70 -629 -64 134 293 -77 13 966 -322 -929 625 10 -314 453 502 15 -293 -588 143
3200A43o62N83J050j191l31Q71r41m20J120K10p4m11L3M01j208J05J593o49j03
$$ 143 -519 64 1114 -77 -408 463 -478 -898 222 432 358 -53 -20 381 -827 -722 871 222 119
3219A19P51r88l99K35L50J26k23L34L17j443O5J251j019J4J154m02m51p3k2M88
$$ 119 870 -118 -517 -282 68 194 -29 305 622 -821 -756 495 -524 -510 644 242 -209 -282 -304 184
3239A84l64M48Q13j152j44P83j291L05Q22k63Q1l36P3Or26J075L74p53K21J021
$$ 184 -180 268 1081 -71 -215 568 -723 -418 404 141 222 -114 -41 -35 -961 114 488 -265 -44 977
3259I77j155k28L57m1L78l71L09J66j043O77K73j044J051J86p70J14j5L87j40
$$ 977 -178 -406 -49 -90 288 -83 226 392 -651 26 299 -745 306 492 -278 -164 -179 208 68
3278F8l76O41K99j164O82L92j157P72Q5l69M39m80J26J48o79N25J27n14P74j43
$$ 68 -308 333 632 -532 150 542 -615 157 242 -127 312 -168 -42 106 -573 -48 79 -435 339 196
3298A96n59N36j65O5J99m69O85k27p13R04k90p02R99l65k75J91p6O3J64n13P46
$$ 196 -363 173 8 73 272 -197 488 261 -452 452 162 -540 459 94 -181 10 -66 -3 161 -352 394
3319C94m27l37M91k88l75P98l29r1K83n58Q07j50o73O33J1l53M49m19j02N89n73
$$ 394 -33 -370 121 -167 -542 256 -73 -164 119 -439 368 218 -455 178 189 -164 285 -134 -236 353 -220
3340b20J57K56o01P84l47n37R40m04k51M08k98K03J97p60P33l85j04O55n89l01
$$ -220 -63 193 -408 376 29 -508 432 28 -223 185 -113 90 287 -473 260 -125 -229 426 -163 -464
3360d64Q26n78j0M18o71N07J7j71N69m40l26R29o90K6O35o63J74Lk59N52m84J77
$$ -464 362 -216 -226 192 -479 28 45 -126 443 3 -323 606 -84 -58 577 -86 88 91 -168 384 -100 77
3382G7J0l61J49O18r97M18L17n14K80K1k2J87n66K42L86m12R3M09o62L08J16m42
$$ 77 87 -274 -125 493 -504 -86 231 -283 -3 18 -4 183 -383 -141 245 -167 -74 335 -327 -19 97 -345
3404c45N20O2n56O04m08K76K04q40N14K52m45K15n8qM49o22J21L66n89L47M4n73
$$ -345 175 237 -319 285 -123 153 357 -483 31 283 -162 53 -5 -13 436 -186 -65 301 -288 59 103 -470
3426d70N52P1n51O87m52k45O61n80O36n9o65N56J5o09N76J2l08M32n27L96L6n15
$$ -470 82 153 -398 289 -163 -408 253 -327 309 250 -415 141 156 -453 123 135 -173 259 -268 128 164 -351
3448c51K95L4m38O24l46l91Q74k79m18M06q8J91j13m87R05J19j009Q75l75l61
$$ -351 -56 -22 -460 164 -182 -573 301 22 -396 10 -78 113 0 -487 418 537 -472 403 28 -333
3468c33N24j96j90N21n41J61J78m53Q14n23l76O87n30n3N50k09K18l27k97P67
$$ -333 191 -5 -195 326 -215 -54 124 -329 485 -38 -414 273 -257 -310 240 31 249 -78 -375 392
3488C92n99j04Q46o67j62P57m72l37M68k48J68k57O2Q44r28o6Q94n59l43N74l64
$$ 392 -207 -311 535 -132 -294 463 -9 -346 122 -126 42 -215 -153 691 -237 -303 591 32 -311 263 -101
3509a01K66k84J97L11o52J68Q34j098L3Q27p36j48P57k20R7m41K34M24j103K81
$$ -101 165 -119 78 389 -263 -95 739 -359 -326 501 -235 -383 374 154 251 -190 44 468 -635 -354
3529c54J137j110L52N45o33k62K94j10L0k83Q99J22j257N86M68j323M92J168m31
$$ -354 783 -327 25 570 -63 -325 -31 -141 -111 -394 505 627 -630 -44 424 -899 -407 761 330
3548C30m78M5L14j94p02J107M31j212M50M67j258M00M58k07J12K01J76n23j082
$$ 330 -148 -103 211 17 -685 422 853 -359 91 558 -700 -300 158 -49 63 264 440 -83 -1165
3567a165J336O7j005J128O82j232k26K08J93l56L00Q74k66j103P43l2j267J334
$$ -1165 171 238 -767 361 1043 -189 -415 -207 -14 -370 -70 804 538 -565 178 146 -1121 213
3585B13N77q04m5K7J16p56j53J621k26j100J108k85j307P02M72O7k18M53K76j160
$$ 213 790 -14 -59 -32 84 -672 -825 796 570 -530 578 293 -1014 -312 160 227 9 462 738 -422
3605d22o85J378m08n42J434K19j393Q9L16k54l51P96R87j256m82J288p84j020
$$ -422 -1107 271 -137 -679 755 974 -419 -330 -14 -268 -619 177 1164 -92 -574 714 -70 -1090
3623a090J350J40n27J76K75l86p34N17J132j291J81J302j141p33R08M15p02R1
$$ -1090 260 400 -127 49 324 -62 -796 -279 853 -438 -257 1045 -96 -829 79 494 -208 -117
3641a17N18M25j296L32Q82j174j04J247n39q85R92Nl16n54O02N88j533O68J372
$$ -117 401 826 -470 -138 744 -430 -534 713 174 -711 281 286 -30 -584 18 606 -927 -259 1113
3660A113j460l57J344n68n79M75N27k03p53N88L94j302O75R26r84m0O11m1q10
$$ 1113 -347 -704 640 72 -507 -32 495 292 -461 127 521 -781 -106 820 -164 -204 407 366 -444
3679d44J22P31k27p35Q61N84j682M69J016r62o8P62k1k91m56P40l91q48J096O32
$$ -444 -322 409 182 -553 308 892 -790 -321 695 -267 -335 427 406 115 -341 399 8 -840 256 888
3699H88j366M70N48r32j72P35M58o39j95O61k62j240J285N45j189N64M60q58j70
$$ 888 -478 -8 540 -392 -564 171 629 -10 -205 456 194 -1046 239 784 -405 159 619 -239 -409
3718d09K11K55k46l40J317n40j022J053n1j057O98O27l58r9k27O30n73l82J085
$$ -409 -198 57 -189 -529 788 248 -774 279 228 -829 -131 496 138 39 -188 442 -131 -513 572
3737E72j58r92Q43K8r95N53M23l38M6J62L04n41q31J275k77n92P69K64p57P1J70
$$ 572 414 -578 265 293 -702 -149 274 -64 -18 144 448 -93 -924 351 74 -518 251 515 -242 -171 -1
3758aJ6j62k44R12l51n85R24n54n12O67M3l26O4J94L52n19l58J138p27n61J002
$$ -1 15 -147 -391 521 170 -415 509 -45 -557 110 153 -173 -109 85 437 -82 -440 698 -29 -590 412
3779D12l92l76L09L49j28j52j02K60m30l3O02m77l64R51k32o89M41J01o5j20j04
$$ 412 20 -356 -47 302 174 22 -80 180 -250 -283 319 -158 -522 429 197 -492 -51 50 -15 -135 -239
3800b39Q55p98j5P52n36l60N44l08n7JL9L79j81l41P93q64KQ39o66j45O15k66
$$ -239 616 -182 -197 555 19 -341 203 -105 -162 -161 -122 257 76 -265 528 -336 -334 505 -161 -306 309 43
3822D3J9k53K87L33p07J20O67q29K47M51o27L73j52j18j1O7J07K03l98J16N41
$$ 43 62 -191 96 429 -278 -158 509 -320 -73 378 -249 124 -28 -146 -157 -90 17 220 -178 -62 479
3843D79q06K22P9l24P03l38j67K77l05P9J38n85Q24j60m17L26j01j3L10p6n5J15
$$ 479 -327 -105 -26 -350 353 15 -152 125 -180 -101 37 -548 276 116 -301 25 -76 -89 221 145 90 205
3865B05m19K50K70o31J06L88k02L10n27j6L95j47k94M64m00L79j73j41L74l80
$$ 205 -214 36 306 -325 -219 169 -33 277 -250 -266 129 -18 -312 152 -248 131 -42 -183 191 -189
3885a89m2L02r4J00p2k9N1J18l48L62k40j14L55k83l9L63m11K33m8j38M15k87
$$ -189 -231 71 -23 77 5 -24 27 145 -203 159 -81 -195 160 -123 -162 201 -210 23 -25 -163 252 -35
3907c5q6N15p8k87P8q9K7m2m35P37k99j24L34j59k55L72l14l8L40l41K76n1q2
$$ -35 -121 394 316 29 107 18 45 3 -432 305 6 -118 216 57 -198 174 -140 -178 162 -179 97 46 -36
3930c6L97k69m91M72N7k93L54m55M38o5l33K93k18j24J77K5k6M23n42Q8L58l64
$$ -36 361 92 -399 73 130 -163 191 -264 174 109 -224 69 -149 -273 -96 -71 -97 326 -216 -128 230 -134
3952a34J10q9R2K94k30k20N32m68L4L63l94NJ13r2L36l35O4J17j93PN08p17J14
$$ -134 -24 -113 -21 273 43 -177 355 -113 -79 284 -110 -105 8 -84 252 -83 -19 98 -95 -88 420 -297 -183
3975a83O28r0k52j76K00Pl15J06L48n84M03J67n86L00K78m53J49m1J97o7l81N85
$$ -183 445 355 103 -73 127 134 -181 -75 273 -311 92 259 -327 -27 251 -202 -53 -94 103 36 -345 240
3997B40J16o84M59L39o34J7K58p6P1o8P9n3p44P60J74m41K40J88l90J16K70k90
$$ 240 356 -328 131 470 -164 -147 111 35 106 38 117 64 -680 80 254 -187 53 241 -149 -33 237 -53
4019e3q9m8M69j27o71O23Q0m20K93K44l23M9k39L44l70k02P22j48n13P57j37o88
$$ -53 -142 -190 279 152 -519 104 184 -236 57 301 -22 27 -212 132 -238 -440 282 134 -379 378 241 -447
4041d47M22K93k43m4rL99p55O3O83o2n97P75j19p73L21q1N3m0K11M87o49k32J031
$$ -447 -25 268 25 -19 -28 371 -384 -321 362 300 -297 478 359 -414 -93 -174 -121 -161 50 537 -112 -344 687
4064F87q97l52P08K40n29P5K30r7n44L59Q09p24j83O81o98l57Q27J16n66L93K27
$$ 687 -210 -562 146 386 -143 -68 162 65 -479 -120 689 -35 -218 463 -235 -592 235 351 -215 178 405
4085D05r2r63M59P71p16j68Q63n71l46L10MJ94m24P30K45j223K49O27j017l2R38
$$ 405 313 -650 -191 580 -136 -304 559 -12 -358 -48 -44 150 -274 456 701 -522 -273 354 -663 -695 243
4106B43nq27M85K02j98o45Q61N38j236N72P33j053j89P43J30n66K16P7k07m69
$$ 243 238 -589 -104 98 -100 -745 116 654 -582 -10 723 -330 -519 224 354 -212 4 81 -126 -595
4126e95P81J40r86O85R34j185k40O71k86k46K27O01l0j081R17J67j077M07M71
$$ -595 186 326 -660 25 959 -226 -466 205 -81 -327 -100 501 471 -610 307 474 -603 -196 275
4145B75l64k43N24k0m35j39P35k10p21J045J55j269M23P08o72j16N30J13o23j13
$$ 275 -89 -332 192 172 -263 -402 333 123 -598 447 602 -667 -244 464 -208 -324 206 319 -304 -417
4165d17Q08j52p26Q37J86j054M37M39l50k81M47L37m41m19P58m40o97R78J88p86
$$ -417 391 239 -487 350 536 -518 -81 358 8 -273 174 511 70 -349 409 -31 -728 250 438 -348
4185c48P9N62M3o43L57L42n33k00P27k91o80N07N99q32J06O83j56p54R2Q98p47
$$ -348 -269 293 336 -307 50 392 -141 -341 386 95 -585 -78 521 -311 -205 478 322 -432 -340 558 -189
4206a89k89R83l63o75P26L4m77R9L37J49o21J43Q09r35m04J160l26p17O85K70
$$ -189 -478 505 142 -533 193 227 -250 -151 186 335 -286 -143 666 -269 -673 487 161 -556 129 399
4226C99m32k02M65j96o13J99Q57n22k45N51l64m23N17M18k97m08L69M74q94J76
$$ 399 -33 -235 230 34 -579 -380 477 -45 -290 261 -103 -526 -9 409 112 -296 73 547 -347 -171
4246a71Q15q38j59O41r7l93j26N61j57k83L16K78p80K86O05q46J6P52m65j60M3
$$ -171 644 -194 -353 288 191 -202 -328 233 76 -207 109 387 -393 -107 498 -348 -332 420 -45 -205 -162
4267a62K56J68o14M56M29o48j73N79m24k08K90K35n2k57K55J4m21L48M61q42J84
$$ -162 94 262 -352 104 533 -115 -288 291 -133 -341 -51 184 132 -125 130 144 -277 71 532 -310 -126
4288a26M30o76N5K80K69k22k70L66L48r55O92jn52L17J42k95J91Q2N3k27m14P14
$$ -126 304 -372 -317 -37 232 10 -260 106 454 -501 191 190 -362 -45 97 -198 -7 75 128 -99 -513 201
4310B01j7m43K94K63n69K70J28j30M6l2L4J91o12N70o2l72K74J80k14J2p4J30
$$ 201 184 -259 35 298 -271 -1 127 -3 43 11 45 236 -376 194 132 -240 34 214 0 12 -62 68
4332F8l5j7J17J9l55M19k12l27L60l9j02K26m04N11j69l46O38j75n24N01k27k10
$$ 68 33 16 133 152 -203 216 4 -323 37 -2 -104 122 -282 229 60 -286 352 177 -347 154 -73 -283
4354b83M84k47m1j5R2N9kk70M60j18l85N20k98N7P1m13M53Ql25M06k39j13L77
$$ -283 201 -46 -87 -102 -10 49 47 -223 237 119 -266 254 -44 13 84 -329 124 132 -193 213 -26 -139 238
4377B38l24M4L27j54l0k5k68L13m4k68N44m10k89O02m73p9M16j03K07l08K9L06
$$ 238 -86 -42 285 131 101 76 -192 121 77 -191 353 -57 -346 256 -217 -296 120 17 224 -84 -55 251
4399B51l82R7M64m84j79K75kJ9R9k84J62Ok23K72k22P5J99k85K00n7j45J49J21
$$ 251 -131 -34 430 -54 -233 42 40 59 158 -126 36 42 -181 91 -131 -56 143 -142 58 1 -144 5 126
4422A26k82L31j64k23L92l26J50P1l59L88j91L5J79J9k45K03k30N2K56o87N06
$$ 126 -156 175 11 -212 180 -146 4 75 -284 104 -87 -52 127 146 -99 104 -126 -74 182 -505 1
4443AN0k84K36J04j29P2k56K57J45m66L06L88p69O93k25k80J83j64QJ52O2J7j67
$$ 1 51 -233 3 107 -22 50 -206 51 196 -270 36 424 -345 348 123 -157 26 -138 -130 22 84 101 -66
4466f6k10P44l73l87L97k77K78Q6j51J16K0l35K71m5JJ65l35j13L19j22q6J73
$$ -66 -276 468 95 -292 105 -172 106 192 41 157 177 -158 113 68 69 234 -101 -214 105 -17 -103 70
4488G0p0K35l47p6L55l7l96O27k56j07J46M7l01J75k43M38j55n18N83k98k42P80
$$ 70 0 235 -112 -188 167 130 -266 361 105 -2 144 191 -110 65 -178 260 105 -413 170 -128 -370 410
4510D10m68m5K32j11N4l9M4K71n33j12O34m20p2J67j45R8J35j59J55j31%J88m40
$$ 410 -58 -103 129 18 72 33 77 348 -185 -297 337 -83 -155 12 -133 -35 100 -59 96 -35 -35 153 -287
4533b87j7O83m79m16P38l8j92j11K45K29o58K57N01o12j74N07k30j84K55J95n4
$$ -287 -304 379 -100 -516 222 184 -8 -119 126 355 -303 -46 455 -157 -331 176 -54 -238 17 212 158
4554A58l58L52K70q49M68N56q91p5Q17m18k60P5M01j70k72L62R1o76M02J43m02
$$ 158 -200 152 422 -427 41 597 -294 -369 448 30 -230 -155 246 76 -196 166 257 -419 -17 126 -276
4575b76O6L92k03j48j21L66J61q37R12J23q36L83N03n83j55L28J18k17m1M88k77
$$ -276 -210 182 -21 -169 -290 76 237 -600 312 435 -401 -18 485 -98 -253 75 193 -24 -65 423 146
4596A46m94M60M72r88O09K65n02l11M18K86l14k21O38l41m89O69O9o15L17K76
$$ 146 -348 112 584 -404 205 470 -32 -343 75 361 47 -174 464 123 -366 303 372 -243 74 350
4616C50m08r4J78K51o52K08M40j93m38N64J31p53J48M74j02k02J40L71o47j01
$$ 350 -58 -152 26 277 -375 -167 273 80 -358 206 337 -416 -268 206 104 -98 42 413 -234 -335
4636c35N90k08m91O68N2o78M31K04l92j43J97L73k50k50Q08o02m44M43J32j54
$$ -335 255 47 -444 224 276 -402 29 233 -159 -302 -105 268 18 -232 576 -26 -470 -27 105 -49
4656d9j65L90m2l16MN41p79M9J010o31m45M81J51k52k61M70K11o32k7M74m54j02
$$ -49 -214 176 134 -182 -178 363 -416 -367 643 12 -433 48 199 -53 -314 156 367 -265 -292 182 -272 -374
4678c74P23k56l64K90P8l12j28O10R2o11J67N80m96l72N95k33j46P9L19k25k71
$$ -374 349 93 -271 19 97 -215 -343 267 359 -252 -85 495 -1 -373 222 -11 -157 -78 241 16 -255
4699b55K76L08p25R3Q24m60k51K75p4j12N5K72j18l99L48J68o33K58N49n53l1
$$ -255 21 329 -396 -303 521 61 -190 85 11 -101 -46 226 108 -291 57 225 -408 -150 399 -154 -185
4720a85M96j17l76k35O89k84j79L79J78n86J54L84n05M5J76ok31j08N89J0p90
$$ -185 311 194 -182 -417 272 -12 -191 188 366 -220 -66 318 -187 -142 34 28 -203 -311 278 288 -502
4741e02P44M5n32J97L38m06k2p0J84k50J5M37l53k53M18K07m13L64j05O2o7j12
$$ -502 242 287 -245 -48 290 -116 -138 -208 -24 -274 -259 178 -175 -428 -10 197 -216 148 43 105 38 -74
4763g4K43k37l55M99J50n11M95j3m71L07J58l12q1J02M40k50m12N25M4m67L07
$$ -74 169 -68 -423 76 226 -285 210 197 -274 33 191 -121 -202 -100 340 90 -322 203 247 -220 87
4784H7qj17j64J18J85p5j19N34n72j03L78j90P1j4K9M9p3j01K13l76J47N40m54
$$ 87 79 -38 -202 -84 101 26 -93 441 -131 -234 144 -46 25 11 40 89 16 -85 128 -248 -101 439 -15
4807a5j43L74r0l22L33r1J34k75RK69l57n3M62m7m62M48k37m3K25Q2Rj57j38J50
$$ -15 -158 216 126 -196 137 46 180 -95 -86 183 -174 -227 235 188 -274 174 -63 -106 119 201 210 53 -85 65
4831F5k99K42L59l80j34K8K5J46Q9l30L30j80L2mo4J25R2k70J16J78j16K8k34
$$ 65 -234 8 367 -13 -147 -119 -94 52 141 -189 141 -39 -7 -11 -75 50 142 -128 -12 166 50 78 -156
4854a56J22K18k83J23L26k79j6O8j61J62m7l34J56P9J74r7j81J56J42l37K89j27
$$ -156 -34 184 -99 24 350 71 55 123 -38 124 77 -257 -101 -22 152 55 -126 30 172 -165 124 -3
4876cj49K64n4J7k5j26o4J87k75L71j27j13L49m67J61K23o7n1m9k66K88j62j86
$$ -3 -152 112 58 75 50 -76 -140 47 -228 143 16 -97 252 -215 -54 169 102 51 2 -264 24 -138 -324
4899c24L87l6l38J50R0J03k7l74J65K46j04K2K0nQ7j21q9K40j66L58k22k48K52
$$ -324 63 27 -311 -161 -71 32 5 -369 -204 42 -62 -40 -20 -25 62 -59 -148 92 -74 284 62 -186 66
4922F6L9k89K92j60lQ2j46m3K78j24r4O0l79N17j05j49M04l87r0M46j07j06J17
$$ 66 105 -184 108 -52 -55 27 -119 -162 116 -8 -102 -42 -421 96 -9 -158 246 -141 -231 215 108 2 119
4945A19k87L15Lm18M94l51K9J09r5J01q3j9lQ7k1K14j58k97M21j96p5L77m10J74
$$ 119 -168 147 150 -268 226 -125 -96 13 -82 19 -64 -83 -86 1 -20 194 36 -261 160 -36 -111 266 -144 30
4969C0K0J08q8k8j35J65N4k50J82j74P3L17l44j14J4J38J90m62Q1L77k72m1L34
$$ 30 50 158 70 42 -93 72 126 -124 58 -116 -43 274 -70 -184 -170 -32 158 -304 -223 154 -118 -159 175
4992A75j14j27O6R5J09k99n1K25j26j24M18k58P3L9j67P5K7k27M27k26J8P8m28
$$ 175 61 -66 0 95 204 -95 -146 79 -47 -171 247 -11 62 101 -66 9 36 -191 236 10 28 106 -322
5015c22M29k3j29R9N0K6j46k30K64J6l77M98Q7n42M15M9m43L90Mj32o5J18QJ25
$$ -322 107 84 -45 54 104 130 -16 -246 18 34 -343 155 242 -300 115 164 -279 111 115 -17 -82 36 44 169
5039A69j98K47k54L2N7L3k34m0M00j49o3k0Q5k52k05N31L9k37J88N7r0j56j2K93
$$ 169 -29 218 -36 -4 53 86 -148 -188 212 63 0 -20 65 -187 -392 139 178 -59 129 186 96 -60 -72 221
5063B21k61k10M68j85j92K53lk22K03o8j90J63j07L21k14j76M19j75l47M06J03
$$ 221 -40 -250 218 33 -159 94 91 -131 72 4 -186 -23 -130 191 -23 -199 220 45 -302 104 207
5084B07j64P4k54J38Nj54L22k32q4M86l72l22N57j48k28M03l44K01l43J7M71k63
$$ 207 43 117 -137 1 6 -148 174 -58 -142 344 -28 -350 207 59 -169 234 -110 91 -252 -235 236 -27
5106b7l36N44k09j24K79j7k15N8J5J78m73K13L12k71j01M53k25j30J72o6l0n8
$$ -27 -363 181 -28 -152 127 110 -105 -47 -32 146 -327 -114 198 -73 -174 279 54 -76 96 30 0 -58
5128e8j95O88o41L67N7m40J23L07j13l46J44J25k2k40K42K26l51L4M63m41j58
$$ -58 -253 435 -206 161 218 -222 -99 208 95 -251 -107 18 -4 -244 -2 224 -127 -93 370 -71 -229
5149b29K45m8q9Q7P2Q6m11K07P8n22M80K38m24M2K45L2o7j14K14N6n68N87J9o76
$$ -229 16 -32 -121 -34 38 124 -287 -80 -2 -524 -44 194 -230 -188 57 89 22 -92 122 178 -390 197 216 -460
5173d60M73K27k47NL7K7j62n7L25m1l76L44k4k37O3N10n80M2J15J28k27Q2K22
$$ -460 13 240 -7 -2 35 62 -100 -157 168 127 -249 95 71 -166 -103 407 -173 -131 -16 112 -115 -33 189
5196A89j20m58O11j75l09lK79j2k7J98%l05k08M32p2l79O05l0l22J38n4p6l1k7
$$ 189 69 -389 222 47 -262 -265 14 2 -25 173 173 -132 -340 92 20 -359 246 216 -106 32 -22 -98 -129 -156
5220a56J60J09n55N44Pk70L44N9m16K04N5j85J39n5M79n77j29L65l19P1K08J0
$$ -156 4 113 -442 102 109 -161 183 242 -174 30 85 -100 39 -16 463 -114 -243 122 -197 -126 82 92
5242I2%j60J17K45l56N7K38l60r5L50j45Q8m6m6m6o4K09K68l85j16K62j87j18
$$ 92 92 -68 49 294 -62 -5 233 -127 -222 128 -17 71 25 -21 -67 -131 78 346 -39 -155 107 -80 -198
5265a98L97k06kJ36r0J6k01k3J56J29j97K46m41M56k72J61m34L64o1J77l57M15
$$ -198 199 -7 -9 127 37 53 -148 -171 -15 114 -83 163 -278 178 -94 67 -367 -3 -64 113 -244 171
5287A71J89m51j6L38l30L1K63j30j91K8K70k07O8K31J75m93Q3J78l19J35p3N1
$$ 171 360 -91 -107 231 -99 -68 195 65 -126 -98 172 -35 33 264 439 -54 29 207 -112 23 -50 1
5309AJ91l08K50L6l11M19k56q6K68L7k56K4K3O0m2r2J56k5m27L52L7l49J63Q3
$$ 1 192 -116 134 170 -141 278 22 -64 204 241 -15 9 32 92 50 -42 114 89 -338 14 51 -298 -135 -52
5333e2J30j97K25n6R6l76K59k2k12J86j72L79k52J08k5o0J0J63j91r3M61m43J
$$ -52 78 -119 106 50 146 -230 29 7 -205 -19 -191 188 -64 44 19 -41 -31 132 -59 -152 309 -134 -133
5356a33J50n2J47k7l60L78j82l3K04j81Q7R5J04o60O97l41K35l11L08l8K9k67
$$ -133 17 -35 112 85 -275 103 -79 -112 92 -89 -2 93 197 -463 234 -107 128 -183 125 87 116 -151
5378a51Q5Q6j17K60k82L01q9m69K40qq2L54j95L0O1j26m7J84l29K11K61j71L5
$$ -151 -66 20 -97 163 -119 182 93 -376 -136 -144 -226 128 -67 -37 24 -102 -149 35 -294 -83 178 7 42
5401D2L9k93K55o3J8L6j10R8P6m1j13J75j33K36l46J59L4j89J6L72m00L7J40j14
$$ 42 81 -212 43 -20 -2 34 -76 22 98 57 -56 119 -14 222 -124 35 69 -120 -104 268 -132 -95 45 -69
5425f9K21o2j00Q5L6N2n8l4n7J01K5J17k60k5J04j59J37Q8j68J95k68q8P9K81
$$ -69 152 90 -10 75 111 163 105 71 14 115 140 257 -3 -28 76 -83 54 142 -26 169 -99 -187 -108 173
5449A73k00RK05r0N4m40J94L05m19K30j09O8N5Oj66j02M5K06K3j92J59q9p2L06
$$ 173 -27 -18 187 97 151 -289 -95 210 -209 21 -88 -20 35 41 -125 -227 -182 24 47 -145 14 -75 -147 159
5473A59j92l9J77k8q3M1n0K29p2j72P8oj85K82r7k79K67k0l4J72l54P1K31l39
$$ 159 -33 -72 105 77 -6 35 -15 214 142 -30 48 42 -143 139 42 -237 30 10 -24 148 -206 -135 96 -243
5497b43L75j0j86J00J30j70L1j86J69k5j1J52k21oK83j97k3j87K15j35J15p4N0
$$ -243 132 122 -64 36 166 -4 27 -159 10 -15 -26 126 -95 -101 182 -15 -38 -225 -10 -145 -30 -104 -54
5520e4J26r5K01k11k44N75l70P9N2j95L57j10l29M31n4k53N9p6M9R8o8M0J7n5
$$ -54 72 -23 178 -33 -277 298 -72 7 59 -136 221 111 -218 213 159 -94 -35 -111 -62 36 -32 8 25 -30
5544c0q8K34m3K6j80J1J98j40j65M53k58O1L7o9J47k70J5J01p7J14K5k93J96j54
$$ -30 -118 116 73 99 -81 -70 128 -12 -177 276 18 79 116 47 194 -76 -61 40 -37 77 102 -191 5 -149
5568a49J95q7R6o5J77m48K87R6k51J11P1j42K08k44j9K05j80K24Q4K7k45M7j87
$$ -149 46 -41 55 -10 167 -281 6 102 -149 -38 33 -109 99 -145 -164 41 -139 85 169 196 -49 -2 -189
5591a89J54J84k17k2j6O4o6k58M30N5l64R9K66k95K6K40j70o6K89N8j48j51K12
$$ -189 -35 149 -68 -90 -106 -42 -108 -366 64 119 -245 -146 120 -175 -149 91 -79 -145 144 202 54 -97 115
5614A15K9l79N74l2m16j3K8J09Q6j90nM07m56K90k03j20J34L03k44n4O3n8L1l3
$$ 115 144 -235 339 307 -109 -122 -94 15 101 -89 -94 313 -143 147 -56 -176 -42 261 17 -37 26 -32 -1 -34
5638c4J06k7O6p4K42n15J96O8M1k44K19K4j98J4J17j89j75L91J59k16p8L11k06
$$ -34 72 45 111 37 279 -236 -40 28 69 -175 44 68 -130 -116 1 -188 -363 28 187 -29 -107 204 -2
5661bJ37l92N62m07j38N21k26k53K96M6j07k47K35Qn5O1J3j35k7M23l00k33L83
$$ -2 135 -257 305 -102 -240 281 55 -198 98 144 37 -210 25 33 -22 39 52 -83 -110 313 13 -220 163
5684A63o5r3k08K24N2k70K33L82l47q4K65k50k35K99j05Mk36M03J82p23M17M28
$$ 163 98 5 -203 21 73 -197 36 418 71 -13 252 2 -233 66 -39 -35 -271 132 314 -409 8 436
5706D36m49k05K37j38P4j76K03L7N1J7O5k33J58P7l76J14J60j02j32J14Q5J30
$$ 436 -13 -218 19 -119 -45 -221 -18 19 70 87 152 -81 77 154 -222 -108 52 -50 -182 -68 17 147
5728A47l82M24n9m3mJ38l59j41K97r8M7m1J31J80l86O4K47l41L61O3l47P7K12
$$ 147 -235 189 130 87 83 221 -138 -279 18 -80 -33 -74 57 237 -149 -85 162 -179 182 245 -102 -25 187
5751A87j89j41R3Kl1J32J39rm38Q4J79l0P0k15L86k68q9P6K58l10J98n0j96L0
$$ 187 -2 -143 -50 -48 -79 53 192 183 -255 -171 8 -22 48 -167 219 -49 -138 -62 196 -114 84 34 -162 -132
5775a32J80l37K53M1P6J44l92K46k1k79K35J48k43j59J37P9j07p8K10J77l42J78
$$ -132 48 -289 -36 5 81 225 -167 79 58 -221 14 162 -81 -240 -103 -24 -131 -209 1 178 -164 14
5797A4nP9J46l87K55j10O0j8r7m4L94j34l18L60l37L4J90k20P4L9JJ77r7j58Q6
$$ 14 9 88 234 -153 102 -8 52 34 -63 -107 287 153 -165 195 -142 -108 82 -138 -64 -25 -24 153 56 -102 -16
5822a6L5n3J92k25k34N97k68k2p1j00K09j8j23J20j14L9O3R1l70L77j41j96J51
$$ -16 19 -34 158 -67 -301 296 28 6 -65 -165 44 26 -97 23 -91 -52 11 102 -268 109 -32 -228 -77
5845g7J63Rk58L3N3J16qr0q4j27M51m9j54J35k18J30k34K81P8j43j1J15J06j49
$$ -77 86 95 -163 -130 -77 39 31 -59 -143 -270 181 132 -22 113 -105 25 -209 72 150 7 -4 111 217 68
5869F8N4p2no0K5o1k18N18k86J1J46J65o83M09k4M1J74j43r3jj0J18j05o8L44
$$ 68 122 50 45 -15 10 -51 -269 249 -37 -26 120 285 -398 11 -13 28 202 59 -34 -35 -45 73 -32 -100 244
5894B44j10%p6j50J14l8J30j69M7j16K20j25J67j10j2N9l3j51J39J64l93L92k74
$$ 244 134 134 58 -92 22 -16 114 -55 -8 -124 96 -29 138 28 16 75 42 -109 30 194 -199 193 -81
5917h1N0J2O7n7J77J0k83o2K5K11K00l39rK19k15R4o4J36k62J00J50j33o0J97
$$ -81 -31 -19 48 -9 168 178 -105 -167 -142 69 269 -70 -79 140 -75 19 -45 91 -171 -71 79 -54 -114 83
5941H3J5j52k2j00J84k25J33R4K2ok84L31k76M16k10k0N3K05l88K5n0O9J37j8
$$ 83 98 -54 -76 -176 8 -217 -84 10 32 26 -258 73 -203 213 3 -17 36 241 -147 -122 -172 -103 34 16
5965A6k1J08K1j97J31k30K15r3j22K60j02j76O8O9j0L0J29M6p4O3k75q9J39n6
$$ 16 -5 103 124 -73 58 -172 43 -50 -172 88 -14 -190 -122 -53 -63 -33 96 142 68 131 -144 -233 -94 -150
5989a50K52J20l6k35O2j65J40P9j03j4j47J12K01j18j35L44j09l08K69J6j76J63
$$ -150 102 222 186 -49 13 -152 -12 67 -36 -50 -197 -85 116 -2 -137 207 98 -210 59 75 -101 62
6011F2p5K09j80k1j01O5P9R5k82J69q7N7l2M9RL7J17l08J16J15l2q5k0K7J83q9
$$ 62 -13 196 16 -5 -106 -41 38 133 -149 20 -67 -10 -42 7 16 53 170 -138 -22 93 61 -24 -44 -17 166 77
6037G7J2p9j39P5j7J82j51L1J08K03l82R1q7k1K08j38J14j07j7J68N4l27L49j71
$$ 77 89 10 -129 -54 -71 111 -40 -9 99 302 -80 11 -76 -97 111 -27 87 -20 -37 131 185 -142 207 36
6061C6q6p7J71J3Kk95J84J69j54QP1o1J23j52q6P3L2p0P3j26O9K01k50L15P9l34
$$ 36 -50 -127 44 57 59 -236 -52 117 -37 -29 42 -19 104 -48 -134 -61 -29 -99 -26 -152 -83 118 -132 183 262 -72
6087g2J07KM7J80l18N8m0L4L19k28q8J15j7j55J55k72K74j54k31L16Qj18L66k98
$$ -72 35 37 84 264 -54 4 -36 -2 317 89 1 116 99 -56 99 -173 101 -53 -284 32 40 -78 288 -10
6111a0j78J39P3j90L07j07R6p6n8Q1J1k23K5J79k25K59l19K29j35r7K92j20oO1
$$ -10 -188 -49 24 -166 141 34 130 54 -4 77 88 -135 -110 69 -156 103 -216 13 -122 -219 73 -47 -53 8
6135Hk61M51j23j30KJ47J72l45J68p6L8j47m3M42m48R6N5J38j87r9n8K19rM9j76
$$ 8 -253 198 75 -55 -53 94 266 -79 89 13 51 -96 -139 303 -145 -49 6 144 -43 -142 -200 19 10 59 -117
6160a17K37Q2k41J25j63J87k19O4J37J53l5k25q6L84k90k9J18R5q3k4j87M11k40
$$ -117 120 202 -39 86 -77 110 -109 -45 92 245 210 -15 -101 283 -7 -36 82 177 94 70 -117 294 54
6183E4K4k9kN4J25l61J11K15o6j6p5j08M15k96J05q3j19J29P3m66K96r6r7K11
$$ 54 78 49 47 101 226 -135 -24 191 125 109 34 -74 341 45 150 67 -52 77 150 -316 -20 -116 -213 -2
6207bj09L5J88Q5k75M1o4J92j57K08k08J3q2R3J35N7j64j97M11k91j08K89J48
$$ -2 -111 -76 112 197 -78 -37 -101 91 -66 142 -66 -53 -135 -42 93 150 -14 -211 200 -91 -199 90 238
6230B38l03J59K6j34J5q5J69L5j73J72l7j85L89l94K8N3R8j27j43MM56k40P8N8
$$ 238 -65 94 120 -14 1 -84 85 120 -53 119 82 -103 286 -108 -80 -27 71 -56 -199 -195 261 21 99 157
6254A57o4k71K72j74K12j38J82k13R0k53J31N4P4R4l3k31K87o4n4n1j26K69j29
$$ 157 93 -178 94 -80 132 -6 176 -37 53 -200 -69 -15 59 153 120 -111 176 112 58 7 -119 150 21
6277B1j39J91K2j92O3j8N5l5R3j02M2k5J75j83k0K39m04M11j63m4J32r8j64j22
$$ 21 -118 73 95 -97 -34 -52 3 -32 61 -41 1 -24 151 -32 -52 187 -217 194 31 -13 119 21 -143 -265
6301b65K16o8J85J08l14J23J59k10M0M7LO1J75k15l16J59J37n8K5J34j19p1L8
$$ -265 -49 -117 68 176 -138 -15 144 -66 -26 21 24 85 260 45 -271 -112 25 -33 -8 126 7 -64 -26
6324b6M3J9j65K87ol19K22K2l6Q4r6j66P5j00J50K7J94k29N7k18l7L59j93J07
$$ -26 17 36 -129 158 152 -167 55 77 41 125 29 -137 -62 -162 -12 15 209 -20 37 -181 -218 141 -52 55
6348E5r5Q0Q7l85K83J74j68o6K50k60Q5J03Kn3r3J11o6o4o2J15k02K42K0j95M03
$$ 55 -40 40 127 -258 25 199 31 -35 215 -45 40 143 145 92 -1 110 44 -20 -82 33 -169 73 93 -102 301
6373C01l49k5Q9l05M25k62Q6K47m67J08J91p5O1J06k2j61K92l20J66O7j41K04
$$ 301 -48 -73 16 -289 136 -126 -40 207 -260 -152 39 -36 25 131 109 -52 240 -80 86 153 12 216
6395B16j65K76l40L6K0J11k43j3J87j6j67J05j14Q1m0j73K90J14j12J43k83J44
$$ 216 51 327 -13 23 43 154 -89 -102 85 69 -98 7 -107 -26 -66 -239 51 165 53 196 -87 57
6417E7R4k07J0K43Oj25J3J04j99Q6p8q5J41j08l6K06r5j4O4n5o4L48k41l11L89
$$ 57 151 -56 -46 197 203 78 91 195 -4 82 4 -81 60 -48 -84 122 27 13 77 22 -42 306 65 -246 143
6442A43j58l3J00k8J75j96j13J75q8N2k3Q2r2M8L8l28M33j22M0K9q8q2n2O3j37
$$ 143 -15 -48 52 24 199 3 -110 65 -23 29 6 88 -4 44 82 -246 187 65 105 134 46 -36 -88 -25 -162
6467a62J62J10R4k80K04j13n6J4J05n0K3q3o6J38o0j37K19k10MK41l04K27J61
$$ -162 0 110 204 -76 128 15 -41 -27 78 28 51 -32 -98 40 -20 -157 62 -148 -144 97 -207 20 181
6490A81j79P5J38k12j78L07L1l9r3j31L1J66j54R9n4J00l3M1q7n5J19Jk48J09
$$ 181 2 77 215 3 -175 132 163 124 31 -100 -69 97 -57 42 -12 88 55 96 9 -46 73 74 -174 -65
6514f5Q9n2k9K5RJ10l79K51j1K08n6l6q8k75J20P4Q8j87L33k52k31K62J13r4K62
$$ -65 24 -28 -57 -32 -23 87 -292 -41 -52 156 100 64 -24 -299 -179 -105 -17 -204 129 -123 -354 -92 21 -73 189
6539A89k76K41j41P9k30K71j9o6J09k5r7K5J20k94J90l50K31p4K09N7k2r0p8J77
$$ 189 -87 154 13 92 -138 133 114 48 157 132 35 60 180 -114 76 -274 -43 -117 92 149 127 37 -41 136
6563A36q4n7J13J26m7k22Q7j2k78K38J4P8k3N4n4j06K0k4J14J16N9p3j10r7m5
$$ 136 52 -5 108 234 187 -35 52 40 -238 0 14 92 69 123 69 -37 -17 -41 73 189 248 175 65 -32 -77
6588g7K61n56L72n6j38K10o1j69J29J21J07k44K07m72K46M1M0K07k15R5K26j73
$$ -77 184 -372 0 -56 -194 16 -45 -214 -85 36 143 -101 106 -366 -120 -79 -39 168 -47 48 274 101
6610A01k07R0n4K11l6j3k2k88M1J66j59k2J33N2K3N1j83J37K7J74j63J5j10J60
$$ 101 -106 -16 -70 141 105 92 70 -218 -177 -11 -170 -192 -59 -7 16 67 -116 21 48 222 59 74 -36 124
6634A24j69J33j36K5J66l28K82Kl05L02r4k64L31j13J09L5j23k88K68p2L12k47
$$ 124 -45 88 -48 -23 143 -185 97 99 -206 96 2 -262 69 -44 65 100 -23 -311 -43 -115 197 -50
6656e0%J7J12o5l1p0K04r9P7j82J1P0K28k52k0J57q7r3L14j87k55N36l95N6l9
$$ -50 -50 -33 79 14 -17 -87 117 18 95 -87 -76 -6 222 -30 -50 107 20 -73 241 54 -201 335 -60 -4 -43
6681d3j89jK46j48J52j06J15oq3J64j3j26N1j08L9L1q8M7J27n1P4j69J42j9o7
$$ -43 -232 -233 13 -135 17 -89 26 20 -63 101 88 -38 13 -95 -56 -25 -113 -66 61 10 84 -85 57 38 -29
6706b9j05K18j75p6J96j55J22l3K27k34K04n0j84M7J19Q2k48j72J41K53j10j16
$$ -29 -134 84 -91 -167 29 -126 -4 -37 190 -44 160 110 -74 -27 92 174 -74 -246 -105 148 38 -78
6728g8K5K12k65j2K1M7J26j7j09L6P7q3M6Q5j5j84J94nr4j46M1J46J58j62m4M5
$$ -78 -53 159 -106 -118 -97 -50 76 59 -50 -14 63 -20 26 111 96 -88 106 101 7 -139 -98 48 206 44 0 45
6754D5J3k37J68N8j4R5Q0j40j34J1r1q4J13K91j4O9l7p3k52Q5K44n28K52J75o1
$$ 45 58 -179 -11 47 33 128 208 68 -66 -55 -146 -230 -117 174 160 229 192 119 -133 -48 196 -332 -80 95 34
6779C4K22j82q1J24k4Q6nl06Q6O9k24M26n6j46r6J51m1J5j39J81K20m33L83j74
$$ 34 256 74 -7 117 93 179 174 -132 -46 23 -201 225 169 23 -73 78 37 52 -87 94 314 -119 264 90
6803I0n5j28O0j31K46RJ28k47M9k0K8O1j13j1Q9J6r5R6M4l1j56n6J65p0j74J84
$$ 90 35 -93 -33 -164 82 91 219 -28 21 1 29 90 -23 -34 55 71 -24 72 116 85 -71 -127 38 -32 -206 -22
6829b2p8J27l0N9j64K20j9k94L70j64M1r5o3M6J87m04J08K54j60K84m23P6M89
$$ -22 -100 27 -3 56 -108 112 93 -201 169 5 46 -49 -112 -66 121 -283 -175 79 -81 203 -220 -144 345
6852C45m25J20J12l75M7K46j14N8O2j23j37J21N3P3O1k07J79j76K50J04l47L5
$$ 345 -80 40 152 -223 -176 70 -44 14 76 -47 -184 -63 -10 63 124 -83 96 -80 170 274 -73 -38
6874c8m8J66N9M5p7n6j46K35r7j47J63k18J58K06l02j07L93j90k1Q9J4k08K37
$$ -38 -86 80 139 184 107 51 -95 140 43 -104 59 -159 -1 205 -97 -204 189 -1 -22 67 81 -127 110
6897A10L1j8k40J90J99l17P2j1Q7j75J15n8P5k47J75J94l15R0P5l2kJ53j05N6
$$ 110 141 123 -117 73 272 -45 27 16 103 -72 43 -15 60 -187 -12 182 -133 -43 32 0 -2 151 46 102
6921A02j44o9o0K04N8R4n1r6N1q0k5J00j44O6P2j30L6K08j66j97J08J55k96L03
$$ 102 -42 -111 -171 33 91 185 134 38 89 9 -16 84 -60 6 78 -52 -16 192 26 -171 -63 92 -204 99
6945I9j84J9M2P8Q4k06R8j01K7Q6l10M54Nk31j10J25Q2j32j70Ql6L55j5j73J4
$$ 99 -85 -66 -24 54 138 -68 30 -71 -44 42 -268 186 191 -40 -150 -25 57 -75 -245 -237 -273 82 67 -106 -92
6970i2J56j39J1J47Pk15J09p4Q6P5l29K09N1pr0J77n5o1J70l64L20k75j9K68r3
$$ -92 64 -75 -64 83 90 -125 -16 -90 -4 71 -258 -49 2 -5 -95 82 27 -34 136 -228 92 -183 -202 66 -27
6995b7Q0k41K21j79K29j07m4J94k64J35L8jk92K63J4k35L08m8o3J19m4l7J16k16
$$ -27 53 -188 33 -146 83 -24 -68 126 -138 -3 35 34 -258 5 19 -216 92 44 -19 100 56 19 135 -81
7019h1M2r5L6J64j64R0R1k21L81j71j37J53l3r8kK9J27l20K53o5P5q1k8O1l0J9
$$ -81 -39 -134 -98 66 -98 -8 83 -138 243 72 -65 88 55 -43 -45 -16 111 -209 44 -21 54 -27 -55 6 -24 -5
7045eJ56j69J00M5J1p7k39J82Q6m8R1l06L6K57k50K7J00j8j61L42q1k31J74j23
$$ -5 151 -18 82 127 138 61 -178 4 90 42 133 -173 -137 120 -130 -103 -3 -21 -182 160 79 -152 22 -101
7069a01N8J68k47R5K49k58m1J10j9j27k9jl3L51Jn8k23j49K32J37q6k83K80O2
$$ -101 -43 125 -122 -27 222 -36 -77 33 14 -113 -142 -143 -176 175 176 118 -105 -254 -22 115 29 -254 26 88
7093H8K32k04j24K31k6j15n7K0Q5j57j88K24j09K98k29K8p3O8K08j22j44M5K13
$$ 88 320 116 -8 223 197 82 25 45 130 -27 -215 9 -100 198 -31 -3 -76 -8 200 78 -66 -21 192
7116A92j76J39k29R8j72J35P9M4k94L02J19k85k9L3J06k27L09q2M0j10j10m6K01
$$ 192 16 155 -74 24 -148 -13 66 110 -184 118 237 -48 -77 -44 62 -165 144 62 102 -8 -118 -164 37
7139C7j04p0J72j7J29n1P2j89o6O3m8J47j52J86n7j36jk98K30K70l8J8q6j07O2
$$ 37 -67 -137 35 18 147 96 168 -21 -87 -24 -72 75 -77 109 52 -84 -85 -383 -153 117 79 97 11 -96 -34
7164c4q8l0O2j1j15L20j45%k2J14j95Q5K11q2p5J71j51j23K0l1K90k67O6k54K30
$$ -34 -122 -152 -90 -101 -216 104 -41 -41 -63 51 -144 -59 152 70 -5 166 15 -108 -88 -119 171 -96 -30 -284 -54
7189e4k07J14O9K2R7j26P0K6J13o1n8q2J04j06M45k39J81m14O8K50j16j52j66
$$ -54 -261 -147 -78 -56 41 -85 -15 11 124 63 5 -77 27 -79 366 127 308 -106 -38 212 96 -56 -222
7212b22N14k36J95l58Lk8J89k10K85m52K39J82l63M28q0K7%r9j82J09r8k6K23
$$ -222 292 56 251 -107 -104 -132 57 -153 132 -320 -81 101 -262 166 86 113 113 14 -168 -59 -157 -183 40
7235D0j1k0K37k70K14j40o3K17r8j02o1rK08l28L92j79q1j87K53M1K21J2m86J38
$$ 40 29 9 246 -24 190 50 -13 204 106 4 -57 -66 142 -186 206 27 -54 -241 12 53 274 286 -200 -62
7259f2J34j20j3Q8J00l1j11LK9N2n8P9r7J12l16K84K48j20j65m9n5n1K66k38K39
$$ -62 72 -48 -61 27 127 96 -15 -12 17 69 11 90 -7 105 -211 73 321 201 36 -13 -68 -119 147 -91 148
7284A48j86O2l8m6q7K26J9n0O0l39L37k21L50r6r8Q1mj19j10M8L3K73l35k5J98
$$ 148 -38 24 -14 -60 -147 79 98 48 108 -231 106 -115 235 139 41 122 118 -1 -111 -63 -30 243 -92 -117 81
7309H1n9k5j48L12j96J01j36l0J54q3K91m52P9L05q8o0j52K31J1j84P1j50J3L6
$$ 81 22 -3 -151 161 -35 66 -70 -100 54 -29 262 -190 -111 194 106 46 -106 125 136 -48 23 -127 -114 -78
7333g8Q2Q5n0No0P5l1l5J58k09q9J15k16L70k33K01M6j21j42J23K84k17M9l52
$$ -78 4 89 39 44 -16 59 28 -7 151 -58 -147 -32 -248 122 -111 90 136 15 -127 -4 280 63 112 -240
7357b40J81J51j10LO7p8J94q3k32J68j13O9O1j9Kr4k25M82j21J1l6J79m33J17
$$ -240 -59 92 -18 -15 52 -26 168 85 -147 21 -92 -23 38 19 21 -73 -298 184 63 74 38 217 -216 -99
7381i9J81l49J60K04p3O0j57J48Pr0J4j01J05l43L05M0J25j79N8j28K61j30r0
$$ -99 82 -267 -107 97 24 84 -73 75 82 -8 6 -95 10 -333 -28 12 137 -42 16 -112 149 19 -71
7404g1j62L25j65K46j08N4j44M9p7K33p3k19K93j46k62R1J98O4j42o1L31l54O4
$$ -71 -233 92 -73 173 65 119 -25 24 -53 180 107 -112 181 35 -227 -136 62 126 -16 -77 254 -100 -36
7427c6J87k36J7J38m9P7P2KJ9j49L9j24r7J90J20j42j01R0j61J79m3J19k01k7
$$ -36 151 -85 -68 70 21 98 170 172 191 42 81 -43 -140 50 170 28 -73 17 -144 35 -8 111 -90 -117
7451a17J03L48l74K48l42Q5n5L5R4J7N2k89J41j0j21L17k02J8J01k36J74J7QK11
$$ -117 -14 334 -40 208 -134 -49 -104 -69 25 42 94 -195 -54 -64 -185 132 -70 -52 49 -187 -13 4 12 223
7475B23k29Ml2o9M2o9K40k24R1O9j5N4K6j83K06l19K91j12m3J48j92OK65l03J27
$$ 223 -6 -2 -34 -103 -61 -130 110 -114 -23 46 31 85 111 -72 134 -185 106 -6 -49 99 -93 -87 178 -125 2
7500BJ40p1n9j61J48J42pP1k85N4O1j24N1j33K50k17O9R7K1j99j3K40k11J86j2
$$ 2 142 71 12 -149 -1 141 134 205 -80 -26 35 -89 -38 -171 79 -138 -69 28 49 -150 -163 77 -134 52 40
7525D0O3j99J13J04k23J35K7%o8J40j28j14j60K63j71J06K16j61j2j15J50j86
$$ 40 103 -96 17 121 -102 33 60 60 -8 132 4 -110 -270 -7 -178 -72 144 -17 -29 -144 6 -180
7547a80n5J29K89K8j28L2j03j21q0R2L5J14R6k44Q5J61j32J1k6Q1o1j38J08m9
$$ -180 -235 -106 183 211 83 115 12 -109 -189 -97 -62 52 148 -96 -11 150 18 29 3 84 23 -115 -7 -56
7571e6Km1q6J72J4j88L21j59P5k5J81M8j09j01M5j31r6Q1RJ11j05k3p1P0pj26
$$ -56 -54 -95 -181 -9 5 -183 138 -21 54 29 210 258 149 48 93 -38 -134 -53 -44 67 -38 -61 -132 -62 -69 -195
7597a95R3r7J41J23j03k9J98L2j38k33Q3N0n7K39N6j34L3k62J62N6j6J34k13J91
$$ -195 -102 -199 -58 65 -38 -67 131 163 25 -208 -125 -75 -132 107 163 29 62 -200 -38 18 2 136 -77 114
7621A14j52m0J80lj64J29J2O5p5q2qO7P2J84l86j2J69n6m2J11j16J5j88K58l9
$$ 114 -38 -78 102 99 -65 64 76 141 66 -16 -24 43 115 299 -87 -99 70 14 -28 83 -33 -18 -206 52 13
7646A3o8J57K18m44Q3L15l20r7K9oJ44M0j69K00p4l0l8O5j81J14j8l1LP0p5K71
$$ 13 -55 102 320 -124 -41 274 -46 -143 -114 -120 24 64 -105 95 21 -9 -47 18 -163 -49 -67 -98 -95 -25 -100 171
7672A71j99J9M7lJ84k43P4j40M8K64k08J6j51l8K30j63K41Jk01m9J56k2m4n1K37
$$ 171 -28 -9 38 35 219 -24 50 -90 -42 222 14 30 -121 -159 71 -92 149 150 -51 -100 56 34 -10 -61 176
7697A76j94K35l37Q1p0rJ34M7l4J90j27m0J30j64j64P5L6K13l11N0l4R4J55k14
$$ 176 -18 217 -120 -39 -109 -118 16 63 29 219 92 52 182 18 -146 -71 -35 178 -133 -83 -117 -23 132 -82
7721h2nJ69j22J25J05p4o6j06O8l4L07l15k2j8p6J45RL7J08n5r1PP5l4J19j43
$$ -82 -87 82 -40 85 190 116 50 -56 12 -22 285 -30 -52 -70 -146 -1 8 45 153 98 7 14 89 55 174 31
7747C1p1k8K32j96L8k9M6Q3J6L2r1j81J31N0J7K3oj00j38m5J61l1J11k1j69J42
$$ 31 -40 -68 164 -32 6 -23 23 106 122 154 63 -118 13 63 80 103 97 -3 -141 -186 -25 -56 55 34 -135 7
7773Gj48lJ68k6k14M9J09Q4j31M5p7J8J90l40J78J41J20j74m4K37l3k53K98j72
$$ 7 -141 -144 24 -2 -216 -167 -58 26 -105 -60 -137 -119 71 -269 -91 50 170 -4 -48 189 156 -97 201 29
7797B9k7J62l43k5kJ20N4L9J9NM3j70K93L8k32k3O3q2k0j1J47M0k19K88k02L7
$$ 29 2 164 -179 -204 -206 -86 -32 7 26 31 74 -96 197 235 3 -20 43 -39 -59 -70 77 117 -102 186 -16 21
7823B1q9J8k68L13m0J63k03O8P1j05K8K9j06K90k22K88l59M5q6L81k79l1Q5j69
$$ 21 -68 -50 -318 -5 -45 118 -85 -17 54 -51 -23 6 -100 190 -32 256 -103 -58 -144 237 -42 -73 12 -157
7847a57n8K22p2n7r3K23r1J07q1K73k36o7N5m4J9L08k03j69l9J67L4n5nJ33o9
$$ -157 -215 7 -65 -122 -215 8 -83 24 -57 216 -20 -87 -32 -76 -57 251 48 -121 -160 7 41 -14 -19 114 45
7872D5N9J8k35J69N4j80J18o3M5j32K6P3j09J77m5K46l76K41l23K21j25m2J74
$$ 45 104 122 -113 56 110 -70 48 -15 30 -102 -76 -3 -112 65 20 266 -110 131 -192 29 -96 -138 36
7895C6q0J57o2j38K32n4N4j17K6j83J47O3Jj54R0o7n0M3j48J29K81j86qJ61l15
$$ 36 -44 113 51 -87 145 91 145 28 54 -129 18 81 82 -72 18 -49 -99 -56 -204 -75 206 20 12 173 -142
7920a42J91k93K02m2J10J04q2k87J05J65k7k1n8J17j83Q9R3l03K76k44O4O1J10
$$ -142 49 -244 -42 -84 26 130 48 -239 -134 31 4 -17 -75 42 -141 -52 41 -262 14 -230 -166 -105 5
7943Ej3o8J97j54J77j24o8P9p4R4n9J70j50j67J70l6N1j32K34L2o6o9j33p1J5
$$ 5 -8 -76 121 -33 144 20 -48 31 -43 51 -8 162 12 -155 15 -21 30 -102 132 164 98 29 -104 -175 -160
7968a60J06j48K06j34o8K41K5j00j2J38m2j88J32k1Q8j19K25k64j5mPJ85k29K93
$$ -160 -54 -202 4 -130 -198 43 68 -32 -44 94 52 -136 -4 -25 63 -56 169 -95 -110 -114 -107 78 -151 142
7992A42q7o1J57p8j9J24Kk85K53%K6k13k67J82kq5K97Mk36K36o9Om1n5K04L2k54
$$ 142 55 -6 151 73 54 178 180 -105 148 148 174 -39 -306 -124 -126 -211 86 90 -146 90 21 27 -14 -69 135 167 -87
8019h7J50N0j99r3K85n8J3k29K91j78k1L8m1R4j00J59M9p8j88J89q8n9j6K1m5
$$ -87 63 113 -86 -179 106 48 61 -168 123 -55 -76 -38 -79 15 -85 74 123 45 -143 46 -42 -101 -117 -96 -141
8044a41p3L33R5k24O0Nj29Q9k1J37k33RJ52j5O6m1j33J72j2r1K7k1q5K70j1l21
$$ -141 -214 119 214 -10 50 55 -74 15 -6 131 -102 -93 59 44 110 69 -64 108 96 5 32 11 -74 196 185 -136
8070a36K4p2P2J65j26J55L8P2k87o9j14K10N1P0n0q0M9NK20j50j34J13o5m14M43
$$ -136 -112 -184 -112 53 -73 82 120 192 -95 -164 -278 -68 -17 53 3 -77 -28 -23 197 47 -87 26 -39 -453 -10
8095a0k0j16K04O0m7Q0o1K9J9k91M31k53o0p7l4R3m6QJ04j5o3K8j26J18J43k65
$$ -10 -30 -146 58 118 71 151 90 119 138 -153 278 25 -35 -112 -146 -53 -99 -91 13 -2 -65 -37 -163 -45 98 -167
8121a67J07M5m9K12j34j06l9J21j4J55j42n4J94j93O7k06J3K12j41N1K88R6k06
$$ -167 -60 -15 -64 148 14 -92 -131 -10 -24 131 -11 -65 129 -64 3 -203 -190 22 -119 -68 220 316 110
8144A10l7n3k44J09J67p2Q6j31j52J02J40K8p5R6k0l7%L7j55J76k29Q1%J44j96
$$ 110 73 20 -224 -115 52 -20 66 -65 -217 -115 25 53 -22 74 54 17 17 54 -101 75 -154 -73 -73 71 -125
8169a25J07R1m0j77L11L3k14m5J26J11j76k2J20P2q7K4j78j72L11k13J04o
$$ -125 -18 73 33 -144 167 200 -14 -59 67 178 2 -20 100 172 85 109 -69 -241 70 -143 -39 -45
8191d5
$$ Imaginary data points
##PAGE= N=2
##DATA TABLE= (X++(I..I)), XYDATA
0@%%%%%%Qj6J6j6J6k4M0m8N6p2Q8j12J36j60K00k46K92l42M00m71N50o32P28q38
$$ 0 0 0 0 0 0 0 8 -8 8 -8 8 -16 24 -24 32 -40 48 -64 72 -88 112 -134 158 -184 216 -255 295 -337 391 -447
30d47R60j097J248j416J603j808K032k278K549k847L173l529L915m339M806n312
$$ -447 513 -584 664 -752 851 -957 1075 -1203 1346 -1501 1672 -1857 2058 -2281 2525 -2787
46b787N863o467P129p857Q655r532J0504j1586J2795j4152J5686j7441J9474k1856
$$ -2787 3076 -3391 3738 -4119 4536 -4996 5508 -6078 6717 -7435 8251 -9190 10284 -11572
60a1572K4688k8126L2404l7896M5244n5636P1558r9295J61202n44452J19553P68864
$$ -11572 13116 -15010 17394 -20502 24742 -30894 40664 -58631 102571 -441881 -322328 446536
72D46536o17852J93530N80608m38659p87377M22868L82363l86365P5107O85480
$$ 446536 -171316 22214 602822 164163 -623214 -200346 182017 -204348 -129241 556239
82E56239k88497n89954K98710K56253m21279J04136N30954j90620n38419J93946
$$ 556239 267742 -322212 -23502 232751 -188528 -84392 446562 255942 -282477 -88531
92h8531K15028m12039L5910O63345j06932n16064K03806J35597n34363l6443O19092
$$ -88531 126497 -285542 -249632 413713 306781 -209283 -5477 130120 -404243 -440686 178406
103A78406N3004l68671K57003K23054n64112k15779N11920J0208k99512L41295
$$ 178406 231410 -137261 119742 342796 -221316 -437095 74825 85033 -214479 126816
113A26816K88247m05724k23014L08359r718l16027K20963L34003k96395j87443
$$ 126816 415063 9339 -213675 94684 84966 -231061 -10098 323905 27510 -159933
123a59933L08650m7570l15136J86327K64849k56779j91117K70367N560l45957
$$ -159933 148717 101147 -213989 -27662 237187 -19592 -210709 59658 65218 -280739
133b80739J69463L71390k41371j96496L05974k5296l81702J00286L41145j28756
$$ -280739 -111276 260114 18743 -177753 128221 102925 -278777 -178491 162654 33898
143C3898j70818K96457R3546l67050k842K80448j61527j80671K55145J03007k42547
$$ 33898 -136920 159537 253083 -113967 -116809 163639 2112 -178559 76586 179593 -62954
154f2954p729K25587r4794k19885J64836J22751k49428j5642K44978q4793j64780
$$ -62954 -70683 154904 60110 -159775 5061 127812 -121616 -137258 107720 22927 -141853
165a41853J68729J02604k00685m1023K06352n8606k00141J64506J41644k12027
$$ -141853 26876 129480 -71205 -112228 94124 35518 -164623 -117 141527 -70500
175g0500q643K26278q1470j82149J21170J06091j74209n2388K15585n575j87203
$$ -70500 -79143 147135 65665 -116484 4686 110777 -63432 -115820 99765 94190 -93013
186i3013J06110J19615j79881n3584J58524k2413j23035P6098J03795j12438o3535
$$ -93013 13097 132712 -47169 -100753 57771 35358 -87677 -11579 92216 -20222 -83757
197h3757J48007j3491j54190Q7112R1269j39186k1077J45941j3163j06919O5085
$$ -83757 64250 50759 -103431 -16319 74950 -64236 -85313 60628 47465 -59454 5631
208E631R1349j18458p0362J39724k763j25700Q6087R1156j05022l4472R5674r799
$$ 5631 96980 -21478 -91840 47884 45121 -80579 5508 96664 -8358 -42830 52844 43045
220D3045j01544K6109Q7123p3666n7149J15770J4504r9152L9464N5011p1356l8613
$$ 43045 -58499 -32390 54733 -18933 -76082 39688 54192 -44960 -5496 49515 -21841 -60454
232f0454N9775K4723n1152J8722P0728n1296n0317O6831j1185o6459M2695L9280
$$ -60454 -679 24044 -27108 -8386 62342 11046 -39271 27560 16375 -50084 -7389 31891
244C1891l8535j1079M3804Q847n7107j054M8457m3556l0509O3259Q932k9850J9578
$$ 31891 -6644 -17723 26081 34928 -22179 -23233 25224 -18332 -48841 14418 23350 -6500 13078
257A3078J1788j9203k2815L921J7696j9178L687L6614j8292j0729K6540j7061
$$ 13078 24866 5663 -17152 -13231 4465 -14713 -11026 25588 7296 -3433 23107 6046
269F046k0716M372m314l76n56J5355K5704j3927l392J0228l3417j0030J9437m813
$$ 6046 -14670 -10298 -14612 -14988 -15544 -189 25515 11588 8196 18424 -14993 -25023 -5586 -10399
283a0399J0903J6606o40M1j7406p046Q827j8683L182K1888r865K154Q216l289
$$ -10399 504 17110 16470 16511 -895 -7941 886 -17797 -14615 7273 -2592 -438 7778 4489
297D489P117j4392j0393J6873j2117m795K2403J421L344N96j4567J856j0859j0538
$$ 4489 11606 -2786 -13179 3694 -8423 -13218 9185 10606 13950 14546 -21 1835 -9024 -19562
311a9562J6512l288K407J9696j2644k892P233j7391k691J909o09J4704p07O536
$$ -19562 -3050 -6338 -3931 15765 3121 229 7462 -9929 -12620 -10711 -11320 3384 2677 9213
325I213J6888j9596r028O658j6862K507J2357k412J1059j379q240J821j3590J345
$$ 9213 26101 6505 -2523 4135 -12727 -10220 2137 -275 10784 9405 1165 2986 -10604 -9259
339i259R878j4233R115J2052j2859Q510N234r375O278n997o915N399k492J1711
$$ -9259 619 -13614 -4499 7553 -5306 3204 8438 -937 5341 -656 -7571 -2172 -4664 7047
353G047M406j0454J5048q092k7724J3629N434j2755J1241J1198J950r019q999
$$ 7047 11453 999 16047 7955 -19769 -6140 -706 -13461 -2220 8978 10928 1909 -7090
366g090J3709j0412j8349K5200J673j6092K1221M632j4759J366J442k957j3313
$$ -7090 6619 -3793 -22142 3058 4731 -11361 9860 14492 -267 1099 2541 -416 -13729
379a3729K314K6619j4062j4131L1997p610k7993J6905R455j3239m258J2811Q111
$$ -13729 -11415 15204 1142 -12989 19008 11398 -16595 310 9765 -3474 -7732 5079 13190
392A3190k2280J867L0280k4808j9656L3262r116k7759K1387J9016j4194j4810
$$ 13190 -9090 -7223 23057 -1751 -21407 11855 2739 -25020 -3633 15383 1189 -13621
404a3621J6603P965l9543M919M7634j8952j6816L9155m822l8239M197K2664p807
$$ -13621 2982 10947 -28596 -23677 23957 5005 -11811 27344 22522 -15717 -11520 11144 3337
417C337j7803L1638K0222n0471j751M4134l4974k8659M5869P092m3111n10L9460
$$ 3337 -14466 17172 37394 -13077 -14828 29306 -5668 -34327 11542 18634 -24477 -24987 14473
430A4473j0119l9369L9728L4294o2229q741N5126k8962l3487N2854L0343m1539
$$ 14473 4354 -35015 4713 39007 -23222 -31963 23163 -5799 -39286 13568 43911 2372
442B372j3226M3391k0370o4662M5440N4660n9072k101P0424l4293o8788L3198
$$ 2372 -10854 32537 12167 -52495 -7055 47605 -11467 -13568 56856 22563 -46225 -13027
454a3027L9749m9128j7897P8710k688q5035L8890N4353p8064j4051Q7656j6272
$$ -13027 26722 -22406 -40303 38407 35719 -49316 -10426 43927 -34137 -48188 39468 23196
466B3196p4222L7921N6429o3715l3045R9799N763r9826M1916O5384q7988l0429
$$ 23196 -51026 -13105 43324 -20391 -53436 46363 52126 -47700 -5784 59600 -28388 -58817
478e8817R9555P156p8458L2946P0274p7315o4544R6321J2628j01595N0582Q5329
$$ -58817 40738 47894 -30564 2382 72656 -4659 -69203 27118 39746 -61849 -11267 74062
490G4062q6638n2065R0505O699r9799L0347J02154o8426p2521J09684J8731j20992
$$ 74062 -12576 -64641 25864 32563 -67236 -36889 65265 -3161 -75682 34002 52733 -68259
502f8259L8824J00862p3640n7499J01869K5310j14495J4724J10431p2015q2417
$$ -68259 -29435 71427 -2213 -59712 42157 67467 -47028 -32304 78127 6112 -76305
513g6305J18515L0755j29520K3517J03003p3778p8769J04161N0423j20560N9J19336
$$ -76305 42210 72965 -56555 -33038 69965 -3813 -82582 21579 72002 -48558 -48499 70837
525G0837p1793j02192J16044N4408j15745J7360J12793o5643j04484Q9273O5445
$$ 70837 -956 -103148 12896 67304 -48441 -31081 81712 16069 -88415 858 66303
536F6303j16884J442J40897n7469j17076R6415N6427j18097J399J26346l7968
$$ 66303 -50581 -49139 91758 34289 -82787 13628 70055 -48042 -46643 79703 41735
547D1735j16069P0866P2498j19955j5562J47812l2042j16211P6559N5201j22788
$$ 41735 -74334 -3468 69030 -50925 -66487 81325 49283 -66928 9631 64832 -57956
558e7956k6357J30883o135j10133P3057Q8303j28494m8220J37313j6392j12526
$$ -57956 -84313 46570 40435 -69698 3359 91662 -36832 -85052 52261 35869 -76657
569g6657P7956Q5607j08091n1489J22142L381j20256O5754J04199j19487o3721
$$ -76657 1299 86906 -21185 -72674 49468 52849 -67407 -1653 102546 -16941 -80662
580h0662J24263r069j14906O8070J05134r1319p2146J06756O635j32491N1839
$$ -80662 43601 34532 -80374 -12304 92830 1511 -70635 36121 42756 -89735 -37896
591c7896J23379q7355o2782J12851J667j22693L4256J09027o4748p1380J08062
$$ -37896 85483 -1872 -64654 48197 49864 -72829 -38573 70454 5706 -65674 42388
602D2388K3699j34939K7422J14398p5038o5920J07841K2294j18195J1063J07694
$$ 42388 66087 -68852 -41430 72968 -2070 -67990 39851 62145 -56050 -44987 62707
613F2707n2785p9286J03919L9871j27672Q010J03734o2112o6792R9432M3893j04428
$$ 62707 9922 -69364 34555 74426 -53246 -45236 58498 -3614 -70406 29026 72919 -31509
625c1509q520R5641n2045r1286R5869N8951j04378M908R8947n3262q3775P2906
$$ -31509 -40029 55612 3567 -87719 8150 67101 -37277 -32369 66578 13316 -70459 2447
637B447N4716q6872j3476J01700l3781r4523P3724N6241r1039l089R0643l5328
$$ 2447 57163 -29709 -43185 58515 24734 -69789 3935 60176 -30863 -33952 56691 21363
649B1363q3386N1081N6999p3138j7456J00678j7491r1303N0048M7847p8057j1822
$$ 21363 -62023 -10942 46057 -27081 -44537 56141 38650 -52653 -2605 45242 -32815 -44637
661d4637Q5735n654p0206L2563N2791p0042l3995Q5207l045p3704M3983M7439
$$ -44637 41098 35444 -34762 -2199 50592 -19450 -53445 31762 28717 -44987 -1004 46435
673D6435o6180k5886O7175L460o3092K6684N9472n7225l8566P2507K259o2455
$$ 46435 -19745 -45631 21544 25004 -38088 -11404 48068 -9157 -47723 24784 27043 -35412
685c5412L4514M7405m8273l0791M9306Q729n6394J8317N8365m3001l6988N5129
$$ -35412 -898 46507 -1766 -32557 16749 25478 -30916 -12599 45766 2765 -34223 20906
697B0906j26n6110K0106M3283k8766k8603L9333J5516n2185N321N0606l0414l0254
$$ 20906 20780 -35330 -15224 28059 -707 -29310 10023 25539 -26646 -21325 29281 -1133 -31387
710c1387M5149O593m1235R755L3175j7912k7375L0372J8602m1822K126M1767k3737
$$ -31387 13762 20355 -20880 -11125 22050 4138 -23237 7135 25737 -16085 -13959 27808 4071
723D071k5063L2556P977k9260J79K5850q004k7377K0176J9454l3166j875L1465
$$ 4071 -20992 11564 19541 -9719 -9540 16310 8306 -19071 1105 20559 -12607 -14482 16983
736A6983j7577k0539K0474Q230j8989k968K2811r73k4796J5801J8280k7496j016
$$ 16983 -594 -21133 -659 7571 -11418 -14386 8425 7452 -17344 -1543 16737 -10759 -11775
749a1775K6638q852j2698J3206Q357j1255r017J5000J497k1202J0633J3335k0096
$$ -11775 14863 6011 -6687 6519 14876 3621 -5396 9604 11101 -10101 532 13867 -6229
762f229j022J5066p327r490M475P073o142j0331J3208N488j6374Q772J1576j3388
$$ -6229 -7251 7815 488 -9002 -4527 2546 -3596 -13927 -719 4769 -11605 -2833 8743 -4645
776d645o11Q781j850m000Q73P882j452r162J0316J770j4122Q058N454j0253K466
$$ -4645 -5256 3525 1675 -2325 -1452 6430 4978 -4184 6132 7902 -6220 1838 7292 -2961 -495
791d95M753p74k001l664N776j272r712P909R91q333O673O59m817L599j812L0J11
$$ -495 4258 3484 1483 -2181 3595 2323 -7389 520 1511 -6822 -149 510 -4307 -708 -2520 -2490 -2379
808b379m245O214k40n212R718j73n308O794j942k633K757k985L122J505m477M962
$$ -2379 -6624 -410 -650 -5862 3856 3683 -1625 5169 3227 594 3351 366 3488 4993 516 5478
824E478k176m414M883n563k525N636n729j76M046l303L019k97l335N038l510j836
$$ 5478 3302 -1112 3771 -1792 -4317 1319 -4410 -4586 -540 -3843 -824 -1121 -4456 582 -2928 -4764
840d764N981l423K277M963n115L026J367n417L255j580k073N546m619J180N275
$$ -4764 1217 -2206 71 5034 -81 2945 4312 -1105 2150 570 -1503 4043 -576 604 5879
855E879o628Q59K058n409K616q12j837O629l481r84N330o080m0K015n390L102
$$ 5879 -749 110 2168 -3241 -625 -1437 -3274 3355 -126 -1110 4220 -1860 -1900 115 -5275 -2173
871b173J068k043N071k568N27N625p879q74O190n900L47N253K07K714k688N56
$$ -2173 -1105 -3148 1923 -645 -118 5507 -2372 -3246 2944 -2956 -2609 2644 2851 5565 2877 3433
887C433K729r953R36P200q817J464Q014n697j894K568k6k616n252O375L113j1637
$$ 3433 6162 -3791 -2855 4345 -4472 -3008 5006 -691 -2585 -17 -43 -2659 -7911 -1536 1577 -10060
903a0060Q472J0971j1534N27R142n448o167J799O818k100o324J2670K244j7695
$$ -10060 -1588 9383 -2151 -1624 7518 2070 -4097 -2298 4520 2420 -3904 8766 11010 -6685
917f685P112Q012j6426q46J2959j617q294L463J1403r392j3113J7159K133k1168
$$ -6685 427 8439 -7987 -8833 4126 2509 -5785 -2322 9081 -311 -13424 3735 5868 -15300
931a5300J1927J4623j4696k838J3737K80j4059J192J5806j1586j3716K3654K838
$$ -15300 -3373 11250 -3446 -6284 7453 7733 -6326 -5134 10672 -914 -14630 9024 11862
944A1862k2650J2704J4833j8974r665J5531L848j8454L723K5133j3547j9736K3316
$$ 11862 -10788 1916 16749 -2225 -11890 3641 7489 -10965 -7242 17891 4344 -15392 7924
957G924P19k7766J0792K0239j4197j0907J8955O862k6058J046K9499j6885k0365
$$ 7924 8643 -19123 -8331 11908 -2289 -13196 5759 12621 -13437 -12391 17108 223 -20142
970b0142L0780N211k9932R076K5303j3843j9248J9501J1915l2379j524L4876j5674
$$ -20142 10638 15849 -14083 -5007 20296 6453 -12795 6706 18621 -13758 -15282 19594 3920
983C920k1701L0357N004l4402J166K5165j1529k1593K6960K1212l5612n612L5529
$$ 3920 -17781 12576 17580 -16822 -15656 9509 -2020 -23613 3347 24559 -11053 -16665 18864
996A8864j8298k7424L1757J6441k9113k016K9360r647l2133K3043K5453l5486
$$ 18864 566 -26858 4899 21340 -7773 -9789 19571 9924 -22209 834 26287 -9199
1008i199n679L8521j7761l2126K7940K0111k9906o937L4330q083m2018K1518L2573
$$ -9199 -14878 23643 5882 -26244 1696 21807 -8099 -15036 19294 11211 -30807 -9289 23284
1021B3284l4650n544M3502j2688l9618J7996K1976k7861q327M4810J851m4986
$$ 23284 -11366 -16910 26592 13904 -25714 -7718 14258 -13603 -21930 22880 24731 -20255
1033b0255J6873K7912m1890j1518M9034m35l5374J6787K6455l3596k4211M3715
$$ -20255 -3382 24530 -17360 -28878 20156 19721 -15653 1134 27589 -6007 -30218 13497
1045A3497R270m3872J7492L3488m0031k0546M2247N315l4331J3281L2849l2687
$$ 13497 22767 -21105 -3613 29875 -10156 -30702 11545 16860 -17471 -4190 28659 -4028
1057d028l3326M1483J3649m2853K0815M2897l5443l0368L3266P440l7986J0841
$$ -4028 -37354 4129 17778 -25075 -4260 38637 3194 -27174 6092 13532 -24454 -13613
1069a3613M7304k1586l6020L6626R106n1047J2281M4974k4830k6115L4924J2027
$$ -13613 33691 12105 -23915 12711 21817 -29230 -16949 28025 3195 -22920 12004 24031
1081B4031m5193PM7487j9203l7475M1195J6786n0410L966M3488j8679l0844L1538
$$ 24031 -21162 -21155 26332 7129 -30346 10849 27635 -22775 -18809 24679 6000 -24844 6694
1094F694K0562m3930p945M6672j6913l7531M0710K1519m5939j363L9915j6732
$$ 6694 27256 -16674 -24619 22053 5140 -32391 8319 29838 -16101 -17464 22451 5719
1106E719l5432K9316K9762l8587r461M7086j4619m2300L0921K2243l8289m268
$$ 5719 -29713 -397 29365 -9222 -18683 28403 13784 -28516 2405 24648 -13641 -17909
1118a7909L9165p972l6542K1028K8016l8331j3155M5784r634l8559K7389K4585
$$ -17909 21256 13284 -23258 -2230 25786 -12545 -25700 20084 10450 -28109 -720 23865
1130B3865l4548j1064L6788l33l7137J7255L2182l3965j6371M1555n299l4548
$$ 23865 -10683 -21747 15041 14708 -22429 -5174 27008 -6957 -23328 18227 12928 -21620
1142b1620K2367K4232k8709j4745L1598J580l6398J5495L3376k9765j6905L5277
$$ -21620 747 24979 -3730 -18475 13123 14703 -21695 -6200 27176 -2589 -19494 15783
1154A5783l184l2952J3320K4763j9543j7660K6704P468l4086Q529L0514k3549
$$ 15783 12599 -20353 -7033 17730 -1813 -19473 7231 14699 -19387 -10858 19656 -3893
1166c893j5655K9791N09k7416Q269K5117j3289j9037K5002J0836l2905L827K8127
$$ -3893 -19548 10243 10752 -16664 -8395 16722 3433 -15604 9398 20234 -12671 -8844 19283
1179A9283j8105j5719K3643N852k2537N33K0630j0387k1143J9316J0930k7372
$$ 19283 1178 -14541 9102 14954 -7583 -7050 13580 3193 -17950 1366 12296 -15076
1191a5076L930K5302j3731j4594J7469O623k0360l353K2242l209j9342J8508J3343
$$ -15076 -11146 14156 425 -14169 3300 9923 -10437 -13790 8452 5243 -14099 4409 17752
1204A7752k3616q36J8605r869j2880J2559R987j3860m790J9304m189k0288J3608
$$ 17752 -5864 -6700 11905 2036 -10844 1715 11702 -2158 -6948 12356 8167 -12121 1487
1217A487R756k0711q50J6764l705j0590P669J1019j2350j0110J4858j715j6178
$$ 1487 11243 -9468 -10318 6446 2741 -7849 -180 10839 -1511 -11621 3237 1522 -14656
1230a4656J2632J1161j2159K75J0976m486j1159L120J0552q483n911J7697N31
$$ -14656 -2024 9137 -3022 -2747 8229 3743 -7416 -4296 6256 -2227 -8138 9559 10090
1243A0090j4584Q221N631j1999l172O922J564o620K561R734o823p573J0197l543
$$ 10090 -4494 3727 9358 -2641 -5813 1109 2673 -3947 -1386 8348 1525 -6048 4149 606
1257F06j1754P397M820n563O43O869K787p580j191P575o786n990J0715J273m454
$$ 606 -11148 -3751 1069 -4494 -3851 3018 5805 -1775 -2966 4609 -2177 -8167 2548 3821 -633
1272f33N457J695l675k977o05J740m914M28Q609m536k257P187l490n525J384j90
$$ -633 4824 6519 2844 -133 -738 1002 -3912 -3484 5125 589 -1668 5519 2029 -3496 -2112 -2302
1288b302m11j287J995O090l410j434M527n348k522L353k141J429L128m12K018
$$ -2302 -2713 -4000 -2005 4085 675 -759 3768 -1580 -4102 -749 -2890 -1461 1667 1255 3273
1303C273j950r02K387n095m06M790k542N53L164j170R23k179k333K198l243q75
$$ 3273 1323 421 2808 -2287 -2693 2097 -445 108 3272 2102 3025 846 -1487 711 -2532 -3407
1319c407M075j828J343J721l796J291q9k969K308m13L26L866k758P94L072l482
$$ -3407 668 -1160 183 1904 -1892 -601 -690 -3659 -1351 -1764 -1438 2428 -330 464 3536 54
1335E4L30Q40j706K675j329j090L360k302j339J843l189R80J217l049K457K95
$$ 54 384 1224 -482 2193 864 -226 3134 832 -507 1336 -1853 -873 344 -2705 -248 47
1351D7k351J970j369J41K750l232J915K410l464J395J009k243K314j302n39L048
$$ 47 -2304 -334 -1703 -1562 1188 -2044 -129 2281 -1183 212 1221 -1022 1292 -10 -549 2499
1367B499k086N74R81l306K260j58m126L645J286k184J721o21j43r7l169K193P74
$$ 2499 413 987 1968 -1338 922 764 -3362 283 1569 -615 1106 485 342 245 -2924 -731 43
1384D3l075L888K90k754L038j329k437J538l03N03J75k58M885j777l952M438j484
$$ 43 -3032 856 1146 -1608 1430 101 -2336 -798 -1101 -598 -423 -681 4204 2427 -1525 2913 1429
1401A429m256K716P32l7P84k60J719k770k649L350l446k782O541j001k880M047
$$ 1429 -2827 -111 621 584 1368 1108 2827 57 -2592 758 -2688 -5470 1071 70 -2810 1237
1417A237O62j797k437P84L072m635k98Q032k668k609N757j438n118N77P33n20
$$ 1237 1899 102 -2335 -1551 1521 -3114 -3412 4620 1952 -657 5100 3662 -1456 -879 -146 -666
1433f66j652L096M636n966n29N633o732m454O530L85l421J719M677k88o238K206
$$ -666 -2318 778 5414 -552 -1081 4552 -2180 -6634 -104 281 -3140 -1421 3256 2968 -3270 -1064
1449a064N135q209j88Q325m340l074O169R35m125o37M497j691q464M998O816p727
$$ -1064 4071 -4138 -4326 3999 -341 -3415 2754 3689 -436 -1073 3424 1733 -6731 -1733 5083 -2644
1465b644Q45J0004m794p107L394J717n026k298R231K183r299M449N435j1549p80
$$ -2644 -1799 8205 3411 -3696 -302 1415 -3611 -5909 3322 5505 -3794 655 6090 -5459 -6239
1480f239R939l129n395N018M955o951n018J0937J609j2052O358P901j1427k799
$$ -6239 3700 571 -4824 194 5149 -1802 -6820 4117 5726 -6326 32 7933 -3494 -6293
1494f293J0766m45o981L827O472p903q354J1117J581j1626Q510R344j2000m733
$$ -6293 4473 4028 -2953 874 7346 -557 -8911 2206 3787 -7839 671 10015 -1985 -6718
1508f718R064n56r248M112J2513p054r518J2016J108j4730O371J0817q935m629
$$ -6718 2346 1790 -7458 -3346 9167 2113 -7405 4611 5719 -9011 -2640 8177 -758 -5387
1522e387R266R98j1640K005J3676q056r698J4274R62j6529N903J1953p614o393
$$ -5387 3879 4877 -6763 -4758 8918 862 -8836 5438 6400 -10129 -4226 7727 113 -6280
1536f280J1204L555j4191l13J4177p498j0508J5308K879j5224L308J0785p325
$$ -6280 4924 8479 -5712 -6025 8152 654 -9854 5454 8333 -6891 -3583 7202 -123
1549a23q362J0936O305j5330r05J6110q283j1918J5486N612j4300J011J1495o115
$$ -123 -8485 2451 8756 -6574 -7479 8631 348 -11570 3916 9528 -4772 -3761 7734 1619
1563A619j1346R810R144j3971j237J6506p961j2689J2664N319j3551m18J3274
$$ 1619 -9727 83 9227 -4744 -5981 10525 2564 -10125 2539 7858 -5693 -6111 7163
1576G163l629j3138R509J1030j5031l192J6405o353j3197J0635P209j1359k346
$$ 7163 3534 -9604 -95 10935 -4096 -7288 9117 2764 -10433 202 7411 -3948 -6294
1589f294J3317j843j4708P857J0762j4919l063J7368m259j2549R220Q547j1660
$$ -6294 7023 5180 -9528 -1671 9091 -5828 -8891 8477 4218 -8331 889 9436 -2224
1602b224o057J3483R72j4858P717J3161j3782n090J3806l394j2638O296R568q835
$$ -2224 -8281 5202 6174 -8684 -967 12194 -1588 -6678 7128 3734 -8904 -2608 6960 -1875
1616a875o368J3873J573j6001N781J2293j3036n974J3629O67j1089M573J1453
$$ -1875 -8243 5630 7203 -8798 -3017 9276 -3760 -9734 3895 4562 -6527 -1954 9499
1629I499p347r761J1567K276j5487N173J2870r372m745J1799N79j2615Q67J1163
$$ 9499 2152 -7609 3958 6234 -9253 -4080 8790 -582 -5327 6472 7051 -5564 -4697 6466
1643F466o992r480J3569M668j4448L733J1199r183p665R433L481j0363K49J2412
$$ 6466 -526 -10006 3563 8231 -6217 -2484 8715 -468 -8133 1300 4781 -5582 -5333 7079
1657G079n100r829J1306L381j3910K440J0399o329n843Q809N709r874k511J1680
$$ 7079 1979 -7850 3456 6837 -7073 -4633 5766 -563 -6406 2403 8112 -1762 -4273 7407
1671G407m975j1076R557N303j0034J728Q598m037p366M216N211r328k312J2225
$$ 7407 2432 -8644 913 6216 -3818 -2090 6508 2471 -4895 -679 4532 -4796 -7108 5117
1685E117l002q850Q524M016r604m25P279j527o648M134P526p425l187R999k895
$$ 5117 2115 -6735 1789 5805 -3799 -4224 3055 1528 -5120 -986 6540 -885 -4072 5927 3032
1700C032q286N911K909o569j25O351K43o821K949O099q071l810R203j413o398
$$ 3032 -5254 657 3566 -3003 -3128 3223 3466 -3355 -406 5693 -2378 -6188 3015 1602 -4796
1715d796N366L956m522l119M124J332o299J614O917n523k549P093j845m885L143
$$ -4796 570 4526 4 -3115 1009 2341 -3958 -2344 4573 -950 -3499 3594 1749 -3136 7
1730GK522k890l037M309K420n887J253O524n253l127N106r44l349J604K771p92
$$ 7 2529 -361 -3398 911 3331 -2556 -1303 5221 -32 -3159 1947 1003 -2346 -742 2029 1237
1746A237k965K403J891n788J102M677l577j482M675q46k511J49J927J75l756K790
$$ 1237 -1728 675 2566 -3222 -2120 2557 -1020 -2502 2173 1327 -1184 -1035 892 1067 -2689 101
1762A01L230m953P21L474k970o11J848k28j075q20J652J82l060K943K103m270
$$ 101 3331 -1622 -901 2573 -397 -1008 840 612 -463 -1283 369 551 -2509 434 2537 -1733
1778a733J012K371k732j21J262J044N6j870J737K14l108J680J465k277J303P87
$$ -1733 -721 1650 -1082 -1203 59 1103 1159 -711 1026 1240 -1868 -188 1277 -1000 303 1090
1794A090j967L16k60N38N65j770J920O39k950K006R01j956J385Mk48J81j213J247
$$ 1090 -877 -561 -821 -283 282 -1488 432 1071 -1879 127 1028 -928 457 461 213 394 -819 428
1812D28N95j701J821j22k144J590n57j168J866o94J26M66j309J462k89j846J603
$$ 428 1023 -678 1143 1021 -1123 467 -90 -1258 608 -86 40 506 -803 659 370 -1476 127
1829A27J12j475J829q26q5J062j311Q18M71j871J200j82j030K059r25o34K018
$$ 127 239 -1236 593 -233 -318 744 -567 251 722 -1149 51 -131 -1161 898 -27 -661 1357
1846A357j080r8N40j205J242k96j623K159q50o06J480j165J59O33j796N12K36
$$ 1357 277 179 719 -486 756 460 -1163 996 146 -460 1020 -145 14 647 -1149 -637 -401
1863d01j108J337k02m04K005j484l74J483j396K60P21o71J081l28o87J588j159
$$ -401 -1509 -172 -374 -778 1227 -257 -631 852 -544 -284 437 -234 847 519 -168 1420 261
1880B61n72J224j621L34J088j589R96K91r49P78q88k98J551j650K60J976j570
$$ 261 -311 913 -708 -374 714 -875 121 412 -537 241 -647 -945 606 -1044 -784 1192 -378
1897c78O26O38j365Q43r10n71J457r36O73J267j838J052L83k055O24M73m97J222
$$ -378 248 886 -479 364 -546 -1117 340 -596 77 1344 -494 558 941 -1114 -490 -17 -514 708
1915G08r13J082Q22k477O30J313k127P07Q08j081R33l15q7O58j783J198M59k630
$$ 708 -205 877 1699 -778 -148 1165 -962 -255 553 -528 405 90 3 661 -1122 76 535 -2095
1933b095J789J274k205J176J293q40p1p37J063l47k081K725P25k385J810P90k899
$$ -2095 -306 968 -1237 -61 1232 392 321 -416 647 300 -1781 944 1669 -716 1094 1884 -1015
1950a015L89K51j40J9l0K176j049k557L075l13l356K469J314j887O5J075L14j045
$$ -1015 -626 -375 -515 -496 -526 1650 601 -1956 1119 806 -2550 -81 1233 -654 -589 486 800 -245
1968b45m34K888j654k757K969l77k994K556J676j491j16R49N40k999p87M142k095
$$ -245 -679 2209 555 -2202 767 390 -2604 -48 1628 137 21 970 1510 -1489 -2276 1866 -229
1985b29k146M751n13l696J697J035j299r66J322K046l258n53M315k823k364M574
$$ -229 -2375 2376 1863 -1833 -136 899 -400 -1366 -44 2002 -1256 -1809 2506 -317 -2681 1893
2001A893l96l038J430J731j383k062K238K664m081n18M753l054k649L842j01k495
$$ 1893 1497 -1541 -111 1620 237 -1825 413 3077 -1004 -1522 3231 177 -2472 1370 1269 -1226
2017a226O38J759p70l190J813L250m446L58N247l197k606L282L88k742K9L034
$$ -1226 -588 1171 401 -2789 -976 2274 -2172 -1814 3433 236 -2370 912 1300 -1442 -1413 1621
2033A621Ll831K520L204m781k30M509l291k196K829R24k677m14L631k3m794K980
$$ 1621 1624 -2207 313 3517 -1264 -1494 3015 -276 -2472 357 1281 -1396 -1810 1821 1798 -2996 -16
2050a6L148n451m3M559k084k311K582J988k175k043L695J17n177L110L057m889
$$ -16 3132 -2319 -2362 2197 113 -2198 384 2372 197 -1846 1849 1966 -3211 -101 2956 -1933
2066a933o9M462j582k577J581K577k720k841M812P56n635K764L542m598j049L742
$$ -1933 -2002 2460 878 -1699 -118 2459 -261 -3102 1710 2466 -3169 -405 3137 -1461 -2510 1232
2082A232l79k401Q67K913k373l466M795N01m982L336L154l841r79K882O54l117
$$ 1232 853 -1548 -681 2232 -141 -3607 1188 1689 -3293 43 3197 -644 -1623 1259 1913 -1204
2098a204K18M128k280m073M851L90m966K814L146k982k092K060P78l509K14N109
$$ -1204 -986 3142 862 -3211 1640 2030 -2936 -122 3024 42 -2050 10 788 -2721 -2507 2602
2114B602j986l814M998j21m897K053L224j759j698K176J892l958j110N413j920
$$ 2602 616 -3198 1800 1679 -3218 -1165 2059 300 -1398 778 2670 -1288 -2398 3015 1095
2129A095l229M464j10m483R80K207p35k060K366K785m644j183M794k327l166M644
$$ 1095 -2134 2330 2220 -2263 -1283 924 189 -1871 495 3280 -1364 -2547 2247 -80 -3246 1398
2145A398R90l343k73J628M5l111K322L350l673j243M204k778k810L847J200j964
$$ 1398 2388 -955 -1228 400 445 -2666 -344 3006 -667 -1910 2294 -484 -3294 553 1753 -211
2161b11K4J748l67l840J702L972l717n55M138k331k911J983J046j202m04J986
$$ -211 -187 1561 1194 -2646 -944 3028 -689 -1244 2894 563 -2348 -365 681 -521 -925 1061
2177A061O58l941J068L223l613j05L870j651k130J508R95q60j508K676J312m078
$$ 1061 1719 -2222 -1154 2069 -1544 -1649 2221 570 -1560 -52 943 83 -1425 1251 2563 -1515
2193a515Q41K546l125j67K939j114p47K29P90o96j922K320J362l536J394K211
$$ -1515 -674 1872 -1253 -1420 1519 405 -342 -113 677 -19 -1941 379 1741 -1795 -401 1810
2209A810k586m6J664k15j110k63J120r1k238K463J104k907J243J043k207K41R26
$$ 1810 -776 -822 842 627 -483 -746 374 283 -1955 508 1612 -1295 -52 991 -1216 -975 -49
2226d9K70j06o49J836j85k872K326J078k878J254J263j605m1K40Q87l28j387K015
$$ -49 221 115 -534 1302 1117 -1755 571 1649 -1229 25 1288 -317 -358 -118 769 441 -946 1069
2244A069q85k299J971O26j496J480L19p99l44o84J187j96j088K690k44k062J315
$$ 1069 184 -2115 -144 482 -1014 466 785 -14 -358 -1042 145 -51 -1139 1551 1307 -755 560
2261E60m09j086P72K6O45j65n94R38j022q35K317p74j157J550n13q86N06M22P17
$$ 560 151 -935 -163 -137 508 343 -251 687 -335 -1170 1147 373 -784 766 253 -633 -127 295 1012
2280A012p48q86J567j318j240J657k62j81J315q16m69n9n50P79m48J3J960j090
$$ 1012 264 -622 945 -373 -1613 44 -218 -399 916 100 -369 -428 -978 -199 -647 -634 1326 236
2298B36o07J497j173l35Q17o19N06k54n35J129p52k91J062j431K02Q88j190L16
$$ 236 -371 1126 -47 -382 435 -184 322 68 -467 662 -90 -381 681 -750 -548 340 -850 -534
2316e34P69q08M86M8l23Q53j170RJ627j216M80O34j213Q07n27p65J084k56j86
$$ -534 235 -573 -87 -39 -362 491 -679 -670 957 -259 221 855 -358 449 -78 -843 241 -15 -201
2335b01J036j181N31M05j304P24J62q70J132m3k08Q19j189n5N84j130L48K93n95
$$ -201 835 -346 185 590 -714 10 172 -698 434 391 183 1002 -187 -242 342 -788 -440 -147 -742
2354g42J277l21q89J351q56m15O46q71O04O06p44Q76M4p84P78o55j64J005j252
$$ -742 535 214 -675 676 -180 -595 51 -820 -216 390 -354 522 566 -218 560 -95 -259 746 -506
2373e06N41O65q25L33k0j060J060o81k35R34m52K54O16r72N24O4j226J302j43
$$ -506 35 700 -125 208 188 -872 188 -493 -728 206 -246 8 624 -348 176 240 -986 316 173
2392A73m48R10n44M8Q48j570M74L80j199J004L55r32J238o75n96J024j107L38
$$ 173 -275 635 91 139 987 -583 -109 271 -928 76 431 -501 737 62 -534 490 -617 -279
2410b79L9m80J131J38j019J269o13n07O16q55K21P64j006J015o0r27J182o90p50
$$ -279 -240 -720 411 549 -470 799 186 -321 295 -560 -339 425 -581 434 374 -553 629 -61 -811
2429h11J461q45m03J392n28K75l02m82P51m68r16J446q23j57J107j171K46N22
$$ -811 650 -195 -598 794 266 541 239 -243 508 40 -876 570 -253 -410 697 -474 -228 294
2447B94q58N19k14m60R01n38j22J628j302k26J166r47K62J26m98R25o18j50P31
$$ 294 -564 -45 -259 -719 182 -356 -478 1150 -152 -378 788 -159 103 229 -269 656 38 -112 619
2466F19r86R9R61j303K83P30j073O10j36k43P79o88L48J084j852O37Q53j398O07
$$ 619 -367 -268 693 -610 -327 403 -670 -60 -196 -439 340 -348 0 1084 -768 -131 722 -676 -69
2485f9Q7k5N45n27P3M18r76N37O27j549Q65O77j094M32K12l0M1j037Q11O24j621
$$ -69 18 -7 538 11 84 502 -474 63 690 -859 6 683 -411 21 233 203 244 -793 18 642 -979
2506i79P64Q48j181L18M50o68P03q02M83M93j079J000M57j570J160J39j384J014
$$ -979 -215 633 -548 -230 220 -448 255 -547 -64 429 -650 350 807 -763 397 536 -848 166
2524A66P6K52K71o46N24J7j660Q52J47j132J237J88o15N79m37Q3J9n73Q63m50
$$ 166 242 494 765 119 643 660 -1000 -148 -1 -1133 104 292 -323 256 -181 -98 -79 -652 211 -239
2544b39j230K068L05j182J088J9p00m19o37J166l2m68J457l91j497J037n34j070
$$ -239 -1469 599 904 -278 810 829 129 -290 -927 239 207 -261 1196 805 -692 345 -189 -1259
2562a259J351K4jJ75n03O02o80n89J820o94r37J351n48q18O95j97Q62k58n87M82
$$ -1259 92 116 115 290 -213 389 -291 -880 940 246 -691 660 112 -706 -11 -208 654 396 -191 291
2582B91j102o68J905n99M10J538j001j129m61l33R98k25R79J652j447j255M07
$$ 291 -811 -1479 426 -173 237 1775 774 -355 -816 -1149 -151 -376 603 2255 808 -447 -40
2599d0j039l31J628k5M39j15o20k35p90K53J798r55L54P82j926k36P60M61J311
$$ -40 -1079 -1410 218 193 632 517 -103 -338 -1128 -875 923 -32 322 1104 -822 -1058 -298 163 1474
2618A474l90n02k35k070NJ315J00J700P67j530r02r27o60P28P73J437R53j922
$$ 1474 1084 582 347 -1723 -1718 -403 -303 1397 2164 634 -268 -1195 -1855 -1127 -354 1083 2036 114
2636A14k53j2j322O38J116J03M45o84o58L94r51P49J183p45L12l7j743O28N76
$$ 114 -139 -151 -1473 -835 281 384 829 145 -513 -119 -1070 -321 862 117 429 392 -1351 -723 -147
2655a47K63J228n36l74k81j792O65J160m41J292K65j080j33j243j72J107j86R90
$$ -147 116 1344 808 434 153 -1639 -974 186 -255 1037 1302 222 89 -1154 -1326 -219 -405 585
2673E85K52j186N29l74q04R32L29j43N17r43K09K23o80J042L76j093M94l28o29
$$ 585 837 -349 180 -194 -998 -66 263 120 637 -306 -97 126 -554 488 864 -229 265 -63 -692
2692f92N53j71L78P99o62jl21j112J218j5n05J321l93m95O2l70L32Q6p05J222
$$ -692 -139 -310 68 867 205 204 -117 -1229 -11 -26 -531 790 397 -98 -36 -406 -74 12 -693 529
2712E29j06r27P62n40l23J095q22M05L58q92L16K7m12J367m68o50J021o71m82
$$ 529 423 -504 258 -282 -605 490 -332 73 431 -461 -145 -118 -530 837 369 -281 740 69 -413
2731d13M95m67P37M2p07N96m48n01Q80m53q9N81p78L98K92m82L00K95l95L02l95
$$ -413 82 -385 352 394 -313 283 -165 -666 214 -239 -328 253 -525 -127 165 -317 -17 278 -117 185 -210
2752b10k84J028o91kO36q26O10Nj127J104k57m31P25n09M40K26o96J98L45q98
$$ -210 -494 534 -157 -159 477 -349 261 266 -861 243 -14 -445 280 -229 211 437 -259 -61 284 -614
2772f14P48k85l35J096q11j82Q43n76p1J22p21J015m77l23J054j51n48Q71q71
$$ -614 134 -151 -486 610 -201 -383 460 -116 -187 -65 -786 229 -248 -571 483 332 -216 655 -216
2791b16L0L79p38Q42K49n18O70o98l95Q33r21O4N74m10L35L48p65M34k55k32O62
$$ -216 -186 193 -545 297 546 28 698 0 -395 438 -483 -419 155 -255 80 428 -337 97 -158 -390 272
2812B72o41K53M64m44O56K28j077O91m27n80N56k23J08J010r07R7N73j111N69
$$ 272 -369 -116 348 -96 560 788 -289 402 -25 -605 -49 -272 -164 846 -61 36 609 -502 67
2831F7k63o36J129k05j48Q34n85j63J15q50N15M12q42O95L82m37M73o66j26M02
$$ 67 -196 -832 297 92 -56 778 193 30 145 -705 -190 222 -620 75 457 20 493 -173 -299 103
2851A03q01M13N75m79P18k90m07O06m41l93N75l77J92M60m64O62l07p58L37k99
$$ 103 -698 -285 290 -189 529 239 -168 438 -3 -396 179 -198 -6 454 -10 652 345 -413 -76 -375
2871c75l66P70n81L42Q63r73M49R4o86K25l9p4J110q14L97L62p76L80j27q11Q12
$$ -375 -741 29 -552 -210 653 -320 129 223 -463 -238 -277 -351 759 -55 342 704 -72 308 181 -630 182
2892A82k32m52R32k38q9L12r47K33M37q00O58M74n70J055q52l48N11o91J79M46
$$ 182 -50 -502 430 192 103 415 -532 -299 138 -662 -4 470 -100 955 103 -245 266 -425 -246 200
2912B00m90L78K18m51N83m00o35Q36o50N7O53n94Q64j71m32N04l68n02O73o08
$$ 200 -290 88 306 -145 438 38 -597 239 -411 -354 299 -295 569 398 -34 470 102 -400 273 -335
2932c35K08Q10m45j66J80n02L15j75o08R42l14m75R00l04k8L10p57M87M3l85N81
$$ -335 -127 683 238 72 252 -250 65 -110 -718 224 -90 -565 335 31 3 313 -444 43 86 -299 282
2953B82l56m1O82o06L7N74p64j20M79n93M64l12J0P73r18J07O50p02J47N55p09
$$ 282 -74 -115 567 -39 -2 572 -192 -312 167 -426 38 -274 -264 509 -409 -302 348 -354 -207 348 -361
2974c61N39J19m81M39k52Q6L56q59K69Q19j039M32K62n07P9k20q5O02m76L84M53
$$ -361 178 297 -184 255 3 89 445 -414 -145 674 -365 67 329 -178 -99 -319 -404 198 -278 106 559
2995E59r67L56L36j036R86O5o20N86l10j27J89n78N01N84r92N65K12n57M33k51
$$ 559 -408 -52 284 -752 234 299 -321 265 -45 -172 17 -561 -60 524 -468 97 309 -248 185 -66
3015f6M5O85o67L75K45j017L73K21p39Q95K03r33N12l26K55rr71J304J28j313
$$ -66 -21 664 -3 372 617 -400 -27 194 -545 350 553 -380 132 -194 61 52 -919 385 513 -800
3035h00R78J9m93O21k95j6K19m93M86j91l27J056m35j004J236p7j094N22J49L1
$$ -800 178 197 -296 325 30 14 233 -260 226 35 -292 764 329 -675 561 484 -610 -88 61 92
3055I2j68m59J058l31p09J032n35q52J119j32m69M03J92L62n96k31Q34j028m15
$$ 92 -76 -535 523 192 -517 515 -20 -872 247 115 -354 49 241 603 7 -224 610 -418 -833
3074h33J487n09o49R18j55n09p9J47N99n58m79J195o25l39J089o48l29O51n70
$$ -833 654 145 -504 414 259 -250 -329 -182 417 -141 -620 575 -50 -389 700 52 -277 374 -196
3093a96k0j26J34Q00p52k04J569j525l46J114m47j58M95R0J75o55j74Q06j079
$$ -196 -216 -342 -208 592 -160 -364 1205 -320 -666 448 1 -157 338 428 603 -52 -226 580 -499
3112d99L62Q48j170L6J142q95j95K71Q1J49p99M21R92j441M04J302j399K64P63
$$ -499 -137 711 -459 -423 719 -176 -371 -100 -19 130 -669 -248 744 -697 -293 1009 -390 -126 637
3131F37o90j5k70N87K49p63N57P14j866L60J131j238K41O41N6n4o65N52K81j466
$$ 637 -53 -68 -338 249 498 -265 292 1006 -860 -500 631 -607 -366 275 331 277 -388 164 445 -1021
3151a021J081O03j163Q16K79r21K39J25K54j71o56J075Q3j764J261L87r23L82
$$ -1021 60 663 -500 316 595 -326 -87 38 292 121 -535 540 623 -1141 120 507 -416 -34
3169c4O27n52r4m68M81J97p42J097M89j826R63j60r11O25N84j94qk55N31n17r74
$$ -34 593 41 -53 -521 -40 157 -585 512 1001 -825 138 -22 -933 -308 276 82 74 -181 350 -167 -1141
3190a141J456L66j152R13Qq28J43Q6L40Om62J202q94j310J492j82q78J130K32
$$ -1141 315 681 -471 442 450 -378 -235 -149 191 197 -265 937 43 -1267 225 43 -835 295 527
3209E27m83k35l44O22n01n1J534n18q78P96m92o76R61j88L20p1l53L18j020K41
$$ 527 44 -191 -535 87 -414 -465 1069 551 -327 469 -23 -699 262 74 394 323 -30 288 -732 -491
3229d91J135m38o62J262o62q52K69J98L79k38Q3P53j186l89J285r89L42J001m42
$$ -491 644 206 -456 806 144 -708 -439 -241 138 -100 -17 736 -450 -839 446 -543 -201 800 358
3248C58k62J22l69K58o21L77R17j181K81P51j076j45P57l9J41j88j16K77p19L44
$$ 358 96 218 -151 107 -514 -137 780 -401 -120 631 -445 -590 167 128 269 81 -35 242 -477 -133
3268a33Q14j048L01P51j108l8N09n0J96m32M95K92r36K34O30q10L51N17n50J60
$$ -133 681 -367 -66 685 -423 -461 48 -2 194 -238 257 549 -387 -153 477 -333 18 535 -15 145
3288A45j84k36P05n18K37M06j040O65Q8n78L60L52n05J46m26J46M42r21Q64K10
$$ 145 -39 -275 430 -88 149 555 -485 180 268 -310 50 402 -103 43 -383 -237 205 -716 148 358
3308C58o86M12K53o64O35m16r4M47m22L65j7o35P57J23r03O02Q5l69O13n67J01
$$ 358 -328 84 337 -327 308 -108 -202 245 -177 188 171 -464 293 416 -487 115 200 -169 444 -123 -22
3329b2N49q26M38r3m64N81n8k84O28n09k71L75j02R3M0o02P27J02q77Q55m8l79
$$ -22 527 -299 139 46 -418 163 105 -179 449 -60 -331 44 -58 35 75 -527 200 302 -575 280 232 -147
3351a47M20m51K24K60o41M46k2m28Q53n34q4N68p36J22L36m56M01j52m21M80p5
$$ -147 273 -178 46 306 -335 111 89 -339 514 -20 -104 464 -272 -150 186 -270 131 -21 -442 38 -37
3372c7n28P57k15j89N45q63O70mn08M79o7n55R71m37l57O87p38K13L78n11M12
$$ -37 -565 192 -23 -212 333 -530 140 136 -372 107 40 -515 456 19 -338 349 -389 -176 202 -309 103
3393A03j22n63J021n35j43O67o69j08P57n68L26J84n16K90k48q9N08n39J09N39
$$ 103 -19 -582 439 -96 -239 428 -241 -349 408 -160 166 350 -166 124 -124 -213 295 -244 -135 404
3413D04q16L62M04n21K89Nl80O24m72k43O96o93L16K58n43L77K47n87M93j61l79
$$ 404 -412 -50 354 -167 122 127 -253 371 -101 -344 352 -341 -25 233 -310 67 314 -273 220 59 -320
3434c20M54m44K91M06p20K97K83n25M66j24k28O91m49k8J95m98N17M6p59P16j05
$$ -320 134 -310 -19 387 -333 -36 247 -278 188 64 -164 527 78 50 245 -253 264 310 -449 267 162
3455A62n76N34j28j40K94n79O35O2q03N27M79p93N02O7n28O77m67o1J95j80M14
$$ 162 -414 120 -8 -148 146 -433 202 264 -539 -12 467 -326 176 243 -285 392 -75 -136 59 -121 293
3476B93o7o37P01k37m30O44n17L87j97k59N34j00n93Q98j91p26P79k49l84M53
$$ 293 226 -411 290 53 -377 267 -250 137 -60 -319 215 115 -478 420 229 -497 282 33 -351 102
3496A02j50J00K3m75P19l86o04J228k94o55M51J33m85M4J82L74m60Q2M74m30l23
$$ 102 -48 52 75 -400 319 -67 -671 557 263 -392 59 192 -293 -249 -67 307 -153 -71 403 -27 -350
3517c50Q68o87m14Q83k06m9Pm4L51p46j78J078o70l64J070m59n06L96L07K8m04
$$ -350 518 -169 -583 300 94 45 52 8 359 -387 -565 513 -157 -521 549 90 -416 -20 287 315 -89
3538h9m8N26q76k2J161q07l19J297p13l60J78j4m8m66P97J106j617j8J032r30
$$ -89 -137 389 -487 -509 652 -155 -474 823 110 -250 -72 -86 -134 -600 197 1303 -314 -332 700 -230
3558b30k37R37k63j68J30ql3q66O49Q69j167K25R51j329k57Q29n0k0R7P10m47
$$ -230 -467 470 207 39 169 161 128 -738 -89 780 -387 -162 789 -540 -797 32 -18 -38 59 769 322
3579C22j223P76O42j108R10P38r25l82J25j0l59j02J308J31j334M98O36j595L76
$$ 322 -901 -125 517 -591 319 1057 132 -250 -125 -135 -494 -596 712 843 -491 7 643 -952 -576
3598e76J187l42k91K26O5p71l96J348kj019J250N8j456K02Q07n5o09Q00O35q77
$$ -576 611 269 -22 204 269 -502 -898 450 448 -571 679 737 -719 -517 290 235 -374 426 1061 184
3618A84j378J375R7j285J399N95r55j94K50k09n54L42J028n29p04J273p01j262
$$ 184 -1194 181 278 -1007 392 987 32 -162 88 -121 -675 -333 695 166 -538 735 34 -1228
3636a228J207N74r43J52O81J5q88k28J207m55r36J459p5j168O85K39m91k54O15
$$ -1228 -21 553 -390 -238 443 458 -430 -658 549 94 -842 617 542 -626 59 298 -193 -447 168
3655A68L65q03j89J290j093q32J602j70r87P55L44m19n17N67M28j157J26J465
$$ 168 533 -270 -459 831 -262 -1094 508 338 -649 106 450 31 -486 81 509 -648 -522 943
3673I43j016o32J471n17q76L74N78%o99M36O07j336oJ549r99m39J071k1r69p3
$$ 943 -73 -705 766 249 -627 -253 325 325 -374 62 669 -667 -673 876 -123 -562 509 488 -481 -554
3693e54O64L68r28O21P16j517K40J044j118k78J095J84l29l83J98L66j383R78
$$ -554 110 478 -450 171 887 -630 -390 654 -464 -742 353 537 208 -175 23 389 -994 -16
3711a6O20q89K21Q28q88l64N89J22j99k14O38l08j183J061N65j019L25Q77n01
$$ -16 604 -285 -64 764 -124 -488 101 223 24 -190 448 140 -1043 18 583 -436 -111 766 265
3730B65p70L60K04N9n14J030Pj106L83M04q54J44Q33l09p4j23M43m55o92R12L32
$$ 265 -505 -145 59 118 -396 634 641 -465 -82 322 -532 -388 445 136 62 -61 382 -73 -765 147 479
3751D79j152O49M87o98n4N42O6k74j47N79l24p68Q88P4q34R37O1r38K93r3J46
$$ 479 -673 -24 463 -235 -289 253 319 45 -102 477 153 -615 273 347 -487 450 511 -427 -134 -227 -81
3772h1j90J5N55K1p74P36q0o04N36j0l6j05l7M99m08m66O93l38m49Q18j20o57
$$ -81 -271 -256 299 320 -454 282 202 -402 134 124 88 -17 -54 445 37 -429 264 -74 -523 295 175 -482
3794d82M86K47k84k09m2L39j62m64P67j93n18Q81k71l18L6J92J12j86j80L10P3
$$ -482 4 251 -33 -242 -284 55 -107 -571 196 3 -515 366 95 -223 -187 5 117 -69 -249 61 134
3815A34l95Q55o82k12K97J8k8P3N4M4l39m2N18n01k53Q96n34L7N44o04L1J54l01
$$ 134 -261 594 -88 -300 -3 15 -13 60 114 158 -181 -223 295 -206 -459 437 -97 -60 484 -120 -89 65 -236
3838b36L04l77m0Q07p93J72M28l54N4n2k10N55l33J4L86o47P3L73l49J45P1k31
$$ -236 68 -309 -349 458 -335 -163 265 -89 -35 -87 -297 258 -75 -61 325 -322 -249 124 -225 -80 -9 -240
3860b40K65M7P9M5n40L15M55o31P1P50o21oJ96l04K21j66j68M61m87K33K76o11
$$ -240 25 72 151 196 -344 -29 426 -205 -134 616 -5 -11 185 -119 102 -64 -232 229 -258 -25 251 -360
3882c60L55J06l54K93K28m19L57l19m0L56k46J83r3j48M4J94m91M57k01k10L91
$$ -360 -5 101 -253 40 268 -151 206 -113 -153 203 -43 140 47 -101 -57 137 -354 103 -98 -308 83
3903H3l90K40J2j99K83Q0j27L11j65l62N73o01K23M54o96J98K71m38N67l54k07
$$ 83 -307 -67 -55 -254 29 109 -18 293 128 -234 339 -262 -39 415 -281 -83 188 -250 317 -37 -244
3924b44M95l83m4J91k70M34l01l00N28k17l67P47j78R0j04k3q0L42l77J84k01
$$ -244 251 -132 -176 15 -255 179 -122 -422 106 -111 -478 269 91 181 77 54 -26 316 -61 123 -78
3945g8k72P31m69M6J77m5j80J38j49J43j47m0L70Q4o07N49j77k35M35m25K40k32
$$ -78 -350 381 -88 -42 135 90 -90 48 -101 42 -105 -145 225 309 -298 251 74 -161 274 -151 89 -143
3967a43J46K02j94l00M77m14k03O91k21j00J93j16L7r7j68N80n17J0O83o98j07
$$ -143 3 205 11 -289 188 -226 -429 262 41 -59 134 18 55 -42 -210 370 -147 -137 546 -152 -259
3988b59M96n09K21jKJ52j81J21J86m54K62M90p13q1O05k37l31L7K10K93o49N14
$$ -259 237 -272 -51 -52 -50 102 -79 42 228 -226 36 526 -187 -268 337 100 -231 -194 16 309 -340 174
4010A74J20o26J75P54p55j33N13j06l08m0K96K84r04N14N30o91K58M27m54n9N5
$$ 174 294 -332 -157 597 -158 -291 222 116 -192 -232 64 348 -556 -42 488 -203 55 482 28 -31 24
4031B4j16K24l11N56M9p93K68M21p96K15O42l00J30k15K23k20m71Q76j50o59L88
$$ 24 -92 132 -179 377 426 -367 -99 322 -474 -259 383 83 213 -2 221 1 -470 406 256 -403 -15
4052a5M13o26J38L75j48j50K8N54q30m67J018O6j024Q71M40r59k06M31K8j09K20
$$ -15 398 -228 -90 285 137 -13 15 569 -261 -728 290 356 -668 203 643 -316 -522 -91 -63 -172 48
4073D8N73l44o80N21j92m02L97N73o46J08J8k2l23r0J258o42p25J011j4j044P75
$$ 48 621 277 -403 118 -74 -476 -79 494 -152 -44 -26 -48 -371 -461 797 155 -570 441 427 -617 158
4094A58J87k86k41L54K47r14N2J011o09l44J045l32q30K78L67m19j09M39P89j224
$$ 158 345 59 -182 172 419 -495 -443 568 -41 -385 660 328 -502 -224 143 -276 -385 54 843 -381
4114c81q1J206r86m49J075j42m27M55pl38k11L53N16j024M3J278j325l66J031
$$ -381 -462 744 -242 -691 384 242 -185 270 263 -75 -286 67 583 -441 -398 880 -445 -811 220
4133B20K03p06P4O11m3q59M51P10j307M01J005q68j28M34N1n53Q2M71L2r74P24
$$ 220 423 -283 -209 402 359 -500 -49 661 -646 -245 760 -108 -236 198 249 -304 -222 249 281 -693 31
4154C1N85j268M56P89m27l96N17J09m86m43P65K11j006O61O06j253L68O27o09
$$ 31 616 -652 -196 593 166 -230 287 396 -90 -533 232 443 -563 98 704 -549 -181 446 -163
4173a63k35L96J92k76j65M67J49j229Q25O51p76j28N83j3n84K68M79m00m40N70
$$ -163 -398 -2 190 -86 -251 216 365 -864 -39 612 -164 -292 291 278 -306 -38 441 41 -399 171
4193A71L4j163J069M62r39J20M55R8o35N9O85n42m50R21L02j227P62K29n16k15
$$ 171 205 -958 111 573 -366 -246 209 307 -328 -269 416 -126 -576 345 647 -580 182 411 -105 -320
4213c20L88K44m29p8N44n24n43J182J5j001N22M52m81k96L92M63q24k41Q64k21
$$ -320 68 312 -117 -195 349 -175 -718 464 479 -522 0 452 -29 -325 67 530 -294 -535 329 108
4233A08p32R51o9o49N94P6l90jJ4O04n70k56J132o40p13Q97k94j88jL66j62j49
$$ 108 -624 327 258 -391 203 279 -111 -112 -98 506 -64 -320 812 172 -541 356 62 -126 -127 239 77 -72
4255g2J04K85n49j71Q54n57k72O50No14L84M2R6n78K71N25m83k53N81k72l69Q02
$$ -72 32 317 -232 -403 451 -106 -378 272 277 -337 47 89 185 -393 -122 403 -80 -333 248 -24 -393 409
4277D09k69l66K91p1J34k42L8O35o90j1N28m41j32J92J44j01p8J83L63o39O4N08
$$ 409 140 -226 65 -6 128 -114 -76 559 -131 -142 386 -55 -187 5 149 48 -30 153 516 -123 -59 449
4299D49k68k91L70m18j5Q2L83r2n05N96m7n76K38M11p11K33K76j29J07R7Lj67
$$ 449 181 -110 260 -158 -173 -91 292 200 -305 291 244 -332 -94 317 -394 -161 115 -14 93 190 193 26
4321B6k25K68K08m24K58L1m84J99J16J50j15l29L46J69n60K79K86m23K47K04l85
$$ 26 -199 69 277 -147 111 142 -342 -143 -27 123 8 -321 25 194 -366 -87 199 -224 23 227 -158
4342a58L36k74J48M0l46K29L95n06K75k47n7N13m70J89j83J61k59L80l40N15l98
$$ -158 178 -96 52 92 -254 -25 370 -136 139 -108 -165 348 -122 67 -116 45 -214 166 -174 341 -57
4363e7j36L23j76k50L64O6j13J20k76K66k27qJ99l0j03K45k08l00L44L1K1J29
$$ -57 -193 130 -46 -296 68 134 21 141 -135 131 -96 -104 95 65 -38 207 -1 -301 43 74 95 224
4385B24m70K62l9j25K22k6j46K54p1L4R0k69kJ46j55K78l09j34M06n9l49L44j4
$$ 224 -246 16 -23 -148 74 48 -98 156 85 119 209 -60 -62 84 -71 207 -102 -236 170 111 -238 106 92
4408I2k9K6l12M26m2j81L21k82k41M18j57j05K65l84J44j92N3L78k58j2K18l37
$$ 92 63 89 -223 203 161 -20 301 19 -222 196 39 -66 199 -185 -41 -233 -180 198 -60 -72 146 -191
4430a91K4L87l10J05k90j77P40l70m0M60l52j23K31l54J20J57k92K00R5o7J73
$$ -191 -167 220 -90 15 -275 -452 288 -82 -122 338 -14 -137 94 -260 -140 17 -275 -75 20 -47 126
4451A26m0p4J65l58M9L76l22K77p2m72M01o9J99n3m58L86J91o50O07K7m02K55
$$ 126 86 12 177 -181 -132 244 -78 199 127 -345 56 -13 186 133 -325 61 252 -398 209 236 -166 89
4473H9j61L5J38j86J92j11l7J44l7q7M3M5j69K93j88j41L26o05M43J09l57J46
$$ 89 -72 -37 101 -85 107 -4 -41 103 66 -21 22 67 -102 191 3 -138 188 -417 26 135 -222 -76
4495g6L1L1K9j22Q0K80k50r0K51k56K3J57k13L23j19k64L65l96M19k93j79N36
$$ -76 -45 -14 15 -107 -27 253 3 -87 164 -92 -69 88 -125 198 79 -185 180 -216 203 -90 -269 267
4517B67l75k25P00o8n57L55J57j31k97K19Q1j51j67M00p8m34M41j0l25M20j70
$$ 267 -108 -333 367 299 -258 97 254 123 -174 45 126 -25 -192 208 130 -304 137 127 -198 222 52
4538E2p0k29J78K52j21k93M46j81m91O24L6l94K16j37M8j08J20J80l97K0P33n60
$$ 52 -18 -247 -69 183 62 -231 215 34 -457 167 203 -191 25 -112 -64 -172 -52 128 -269 -249 484 -76
4560g6k54O03j84j67K12Q5k03l70K83K34m59J3O42m34k89O75k74m16M44O1j11
$$ -76 -330 273 89 -78 134 219 16 -354 -71 163 -296 -283 359 -75 -364 311 37 -379 65 126 15
4581A5m78L87N91q58p0Q40m77p7K57j04l13K69N1l7k65M24J63p23J25P53q15j30
$$ 15 -463 -76 515 -343 -413 427 -50 -127 130 26 -287 -18 33 -4 -269 155 318 -405 -280 473 -342 -472
4603d72P94j82r8k92N81j63m54J56M73p02L16M77l33k78K70K45m91l32P91j10
$$ -472 322 140 42 -250 331 168 -286 -130 343 -359 -43 434 101 -177 93 338 -153 -485 306 196
4623A96n85L41M99q30J28N46l12k28L09J15k35m83P40l4o35P18km91M4M35k05
$$ 196 -389 -48 451 -379 -251 295 -17 -245 64 179 -56 -539 201 167 -468 250 248 -243 -199 236 31
4644C1k58J48L42m69j17N97L2p64L81N55o09k9J96j72k00L02N48l50l56M55j46
$$ 31 -227 -79 263 -206 -323 274 306 -458 -77 478 -131 -160 36 -136 -336 -34 514 164 -192 263 117
4665A17n94M66K31m03j1L42K14n81J1M77k84m47P92O7p52L66J78l22Q5J00K35
$$ 117 -477 -11 220 -183 -194 148 362 -219 -208 269 -15 -462 330 397 -355 11 189 -133 -48 52 287
4686B87n52J4P93n29n03O99J69n60J97K50j65m78L48K46l81N9O81p50l72Q40l96
$$ 287 -265 -251 542 13 -490 209 378 -182 15 265 100 -378 -30 216 -165 -106 575 -175 -547 293 -103
4707a03q6K81K1L9k57O1N31n85k21Q55o58kL13J55o15J73L64j49n16M15O20r83
$$ -103 -189 92 113 152 -105 -44 487 -98 -319 536 -122 -124 189 344 -271 -98 266 117 -399 16 636 -347
4729c47K75N82q00J48K33o8R0m45N74r5n93M65L86n57J70K07n0m34M05j96J84
$$ -347 -72 510 -290 -142 91 23 113 -332 242 147 -446 19 405 -152 18 225 175 -259 146 -50 134
4750A34m48L52J53m54K63K22l16j6K77j87p8J96J28k72m17P55J25r47M93M16p82
$$ 134 -314 38 191 -263 0 222 -94 -110 167 -20 -98 98 226 -46 -463 292 417 -530 -37 379 -403
4771d03K98J57K68l85o0J32r3k17M44o2k74K56Q4r9j40J88N4l0j94L54k45l29
$$ -403 -105 52 320 -65 -125 7 -86 -303 141 79 -195 61 145 46 -94 94 148 118 -76 278 33 -296
4793b96N55j57k49J23J87k79K2Q7n3m3n8M19j92l94M07O2k26M33k98j99J84k17
$$ -296 259 102 -147 -24 163 -116 -94 -7 -60 -103 -161 258 66 -328 79 141 -85 348 50 -149 35 -182
4815a82K52j44j09K58j4l29K51J26k55K05m2O3K8j61K08j11j40M75n89p7M50k26
$$ -182 70 -74 -183 75 61 -268 -17 109 -146 59 17 80 108 -53 155 44 -96 379 -210 -287 163 -63
4837f3R6q2m1L17k08j09J19R5q3J17qj14oJ43j41p3J39P2l82R0J29J37k56J89
$$ -63 33 -49 -90 227 19 -90 29 124 41 158 150 36 30 173 32 -41 98 170 -212 -122 7 144 -112 77
4861G7q4m7J37r4J9J02k39J17j06j03L29j25J03j93J38r0j39J64J59k21K5M80
$$ 77 -7 -54 83 -11 8 110 -129 -12 -118 -221 108 -17 86 -107 31 -59 -198 -34 125 -96 -71 409
4883D09n74J89j01m7J67K25m44J08j40J8M74m47K37K23l32qR5o9p9L36k35j2j50
$$ 409 -165 24 -77 -124 43 268 -176 -68 -208 -190 284 -163 74 297 -35 -43 52 -17 -96 240 5 -7 -157
4906a57M8L42l27k30M54m7l5J45k38M70m28n0J47K1m2O3l82L77R1k24p7K13k78
$$ -157 -109 233 -94 -324 130 83 48 193 -45 425 -3 -53 94 115 73 136 -246 131 222 -2 -79 134 -144
4929a44K01o8j6J13k71J42j2J62j32m1o7L16n7j73J28j96K84j05l79N53k24o1
$$ -144 57 -11 -27 86 -185 -43 -55 107 -25 -66 -133 183 126 -47 81 -115 169 64 -315 238 14 -47
4951d7P2M5k16J13P0j18L3m8J19k00O3P0J33l45L69L4l15K56k32L11r4l06L90
$$ -47 25 70 -146 -33 37 -81 -48 -96 23 -177 -114 -44 89 -256 113 147 -168 88 -144 167 73 -233 157
$$ [...]
8191f3
##END NTUPLES=NMR FID
##END=
