##TITLE=1H_13-2024
 DMSO-d6
 8 sc, 
 12.2.2024
##JCAMPDX= 6.0         $$ Bruker NMR JCAMP-DX V2.0
##DATA TYPE= NMR FID
##DATA CLASS= NTUPLES
##ORIGIN= UXNMR, Bruker Analytische Messtechnik GmbH
##OWNER= root
$$ XWIN-NMR		Version 3.5
$$ Mon Feb 12 13:54:18 2024 Russian Standard Time (UT+4h)  she@DPX200
##.OBSERVE FREQUENCY= 200.1313
##.OBSERVE NUCLEUS= ^1H
##.DELAY= (6, 6)
##.ACQUISITION MODE= SIMULTANEOUS
##.ACQUISITION SCHEME= undefined
##.AVERAGES= 8
##.DIGITISER RES= 18
##SPECTROMETER/DATA SYSTEM= spect
##.PULSE SEQUENCE= zg30
##.SOLVENT NAME= DMSO
##.SHIFT REFERENCE= (INTERNAL, DMSO, 0, 15.7039)
##AUDIT TRAIL= $$ (NUMBER, WHEN, WHO, WHERE, WHAT)
$$ ##TITLE= Audit trail, XWIN-NMR		Version 3.5
$$ ##JCAMPDX= 5.01
$$ ##ORIGIN= Bruker BioSpin GmbH
$$ ##OWNER= she
$$ F:/spectra/data/she/nmr/H-F/1/audita.txt
$$ ##AUDIT TRAIL=  $$ (NUMBER, WHEN, WHO, WHERE, WHAT)
(   1,<2024-02-12 13:53:13.18 +0400>,<she>,<DPX200>,
      <created by zg, POWCHK disabled, PULCHK disabled
       configuration hash MD5:
       00 E9 B6 7A A2 85 ED C7 34 08 36 98 17 FE 4E 26
       data hash MD5: 16K
       EF 8B E0 53 B2 EA 7E B9 91 50 C7 23 B1 AD C8 5A>)
$$ ##END=
$$ 
$$ hash MD5
$$ A9 FC 28 8A C0 72 0B 8D 96 51 35 E1 CC 6E 0E 99
##$RELAX= 
##$RELAX= 
##$RELAX= 
##$RELAX= 
##$RELAX= 
##$RELAX= 
$$ Bruker specific parameters
$$ --------------------------
##$DU= <F:/spectra>
##$EXPNO= 1
##$NAME= <H-F>
##$PROCNO= 1
##$TYPE= <nmr>
##$USER= <she>
##$AMP= (0..31)
100 100 100 100 100 100 100 100 100 100 100 100 100 100 100 100 100 100 
100 100 100 100 100 100 100 100 100 100 100 100 100 100 
##$AQSEQ= 0
##$AQ_mod= 1
##$AUNM= <au_zg>
##$AUTOPOS= <>
##$BF1= 200.13
##$BF2= 200.13
##$BF3= 200.13
##$BF4= 200.13
##$BF5= 200.13
##$BF6= 200.13
##$BF7= 200.13
##$BF8= 200.13
##$BYTORDA= 1
##$CFDGTYP= 0
##$CFRGTYP= 5
##$CHEMSTR= <none>
##$CNST= (0..31)
1 1 145 1 1 1 1 1 1 1 1 1 1 1 1 1 1 1 1 1 1 1 1 1 1 1 1 1 1 1 1 1 
##$CPDPRG= <>
##$CPDPRG1= <>
##$CPDPRG2= <>
##$CPDPRG3= <>
##$CPDPRG4= <mlev>
##$CPDPRG5= <mlev>
##$CPDPRG6= <mlev>
##$CPDPRG7= <mlev>
##$CPDPRG8= <mlev>
##$CPDPRGB= <>
##$CPDPRGT= <>
##$D= (0..31)
0 1.2 0 0 0 0 0 0 0 0.06 0 0.03 0 0 0 0 0.0002 0 0 0 0 0 0 0 0 0 0 0 0 
0 0 0 
##$DATE= 1707731592
##$DBL= (0..7)
120 120 120 120 120 120 120 120 
##$DBP= (0..7)
150 150 150 150 150 150 150 150 
##$DBP07= 0
##$DBPNAM0= <>
##$DBPNAM1= <>
##$DBPNAM2= <>
##$DBPNAM3= <>
##$DBPNAM4= <>
##$DBPNAM5= <>
##$DBPNAM6= <>
##$DBPNAM7= <>
##$DBPOAL= (0..7)
0.5 0.5 0.5 0.5 0.5 0.5 0.5 0.5 
##$DBPOFFS= (0..7)
0 0 0 0 0 0 0 0 
##$DE= 6
##$DECBNUC= <off>
##$DECIM= 32
##$DECNUC= <off>
##$DECSTAT= 4
##$DIGMOD= 1
##$DIGTYP= 9
##$DL= (0..7)
0 120 120 120 120 120 120 120 
##$DP= (0..7)
150 150 150 150 150 150 150 150 
##$DP07= 0
##$DPNAME0= <>
##$DPNAME1= <>
##$DPNAME2= <>
##$DPNAME3= <>
##$DPNAME4= <>
##$DPNAME5= <>
##$DPNAME6= <>
##$DPNAME7= <>
##$DPOAL= (0..7)
0.5 0.5 0.5 0.5 0.5 0.5 0.5 0.5 
##$DPOFFS= (0..7)
0 0 0 0 0 0 0 0 
##$DQDMODE= 0
##$DR= 18
##$DS= 0
##$DSLIST= <SSSSSSSSSSSSSSS>
$$ [...]
##$SUBNAM2= <"">
##$SUBNAM3= <"">
##$SUBNAM4= <"">
##$SUBNAM5= <"">
##$SUBNAM6= <"">
##$SUBNAM7= <"">
##$SUBNAM8= <"">
##$SUBNAM9= <"">
##$SW= 18.0517328524113
##$SWIBOX= (0..15)
0 0 2 0 0 0 0 0 0 0 0 0 0 0 0 0 
##$SW_h= 3612.71676300578
##$TD= 16384
##$TD0= 1
##$TE= 0
##$TE2= 300
##$TE3= 300
##$TEG= 300
##$TL= (0..7)
0 120 120 120 120 120 120 120 
##$TP= (0..7)
150 150 150 150 150 150 150 150 
##$TP07= 0
##$TPNAME0= <>
##$TPNAME1= <>
##$TPNAME2= <>
##$TPNAME3= <>
##$TPNAME4= <>
##$TPNAME5= <>
##$TPNAME6= <>
##$TPNAME7= <>
##$TPOAL= (0..7)
0.5 0.5 0.5 0.5 0.5 0.5 0.5 0.5 
##$TPOFFS= (0..7)
0 0 0 0 0 0 0 0 
##$TUNHIN= 0
##$TUNHOUT= 0
##$TUNXOUT= 0
##$USERA1= <user>
##$USERA2= <user>
##$USERA3= <user>
##$USERA4= <user>
##$USERA5= <user>
##$V9= 5
##$VALIST= <valist>
##$VCLIST= <CCCCCCCCCCCCCCC>
##$VD= 0
##$VDLIST= <DDDDDDDDDDDDDDD>
##$VPLIST= <PPPPPPPPPPPPPPP>
##$VTLIST= <TTTTTTTTTTTTTTT>
##$WBST= 1024
##$WBSW= 4
##$XGAIN= (0..3)
0 0 0 0 
##$XL= 0
##$YL= 0
##$YMAX_a= 150907
##$YMIN_a= -242518
##$ZGOPTNS= <>
##$ZL1= 120
##$ZL2= 120
##$ZL3= 120
##$ZL4= 120
##$ABSF1= 10
##$ABSF2= 0
##$ABSG= 5
##$ABSL= 3
##$ALPHA= 0
##$AQORDER= 0
##$ASSFAC= 0
##$ASSFACI= 0
##$ASSFACX= 0
##$ASSWID= 0
##$AUNMP= <proc_1d>
##$AZFE= 0.1
##$AZFW= 0.1
##$BCFW= 1
##$BC_mod= 2
##$BYTORDP= 1
##$COROFFS= 0
##$CY= 11.3945322036743
##$DATMOD= 1
##$DC= 2
##$DFILT= <>
##$DTYPP= 0
##$F1P= 15.7292609196834
##$F2P= 12.9074282941183
##$FCOR= 0.5
##$FTSIZE= 0
##$FT_mod= 4
##$GAMMA= 1
##$GB= 0.15
##$INTBC= 1
##$INTSCL= 1
##$ISEN= 128
##$LB= 0.24
##$LEV0= 0
##$LPBIN= 0
##$MAXI= 10000
##$MC2= 0
##$MEAN= 0
##$ME_mod= 0
##$MI= 1.114404
##$NCOEF= 0
##$NC_proc= 0
##$NLEV= 6
##$NOISF1= 3.799351
##$NOISF2= 2.8
##$NSP= 1
##$NTH_PI= 0
##$NZP= 0
##$OFFSET= 15.70392
##$PC= 1
##$PHC0= -24949.69
##$PHC1= 10.05268
##$PH_mod= 1
##$PKNL= yes
##$PPARMOD= 0
##$PSCAL= 0
##$PSIGN= 0
##$REVERSE= no
##$SF= 200.130013532006
##$SI= 16384
##$SIGF1= 3
##$SIGF2= 2
##$SINO= 400
##$SIOLD= 16384
##$SREGLST= <1H.CDCl3>
##$SSB= 0
##$STSI= 0
##$STSR= 0
##$SW_p= 3612.71676300578
##$SYMM= 0
##$S_DEV= 0
##$TDeff= 0
##$TDoff= 0
##$TI= <>
##$TILT= no
##$TM1= 0
##$TM2= 0
##$TOPLEV= 0
##$USERP1= <user>
##$USERP2= <user>
##$USERP3= <user>
##$USERP4= <user>
##$USERP5= <user>
##$WDW= 1
##$XDIM= 8192
##$YMAX_p= 0
##$YMIN_p= 0
$$ End of Bruker specific parameters
$$ ---------------------------------
##NTUPLES= NMR FID
##VAR_NAME=  TIME,          FID/REAL,        FID/IMAG
##SYMBOL=    X,             R,               I
##VAR_TYPE=  INDEPENDENT,   DEPENDENT,       DEPENDENT
##VAR_FORM=  AFFN,          ASDF,            ASDF
##VAR_DIM=   8192,          8192,            8192
##UNITS=     SECONDS,       ARBITRARY UNITS, ARBITRARY UNITS
##FACTOR=    0.0002768,     1,               1
##FIRST=     0,             0,               0
##LAST=      2.2672688,     0,               0
##MIN=       0,             -242518,         0
##MAX=       2.2672688,     150907,          0
$$ Real data points
##PAGE= N=1
##DATA TABLE= (X++(R..R)), XYDATA
0@%%%%%%%%%%%%%%%%%%LrJ4j6J6j6J6j9K7l2L3l7M4n1N7o5P3q1R2j03J14j27J41
41G4j57J75j94K15k38K61k87L18l51L86m24M66n14N70o32P00p80Q75r88J123j288
62f90J499j777K160k725L646n405R952m4738j31025j9380M8066Q5284Q1269P0533
76I6669L8560p258n7527p0965n4964k0405O348K5635M1188M5088K0351j0387k7763
89B4570k4874j8152k0568j8943N596K9865K9267P823o897L36O213o631j6061p745
103a6201Q707J6545P769k808p3L235k041j1385j2415j25O999l30j196Q279J1061
118A6021L95j4901j3595J460K847r466j3389J003J8788J7105J882l278L918P862
132A6652J885j0022j2102j948K662p31p17N986J0483K544o567j046N866j659j3543
$$ plain form
0 0 0 0 0 0 0 0 0 0 0 0 0 0 0 0 0 0 0 0 3 -6 8 -8 8 -8 8 -11 16 -16 17 -20 24 -27 30 -35 38 -43 49 -54 60 -67 74
41 74 -83 92 -102 113 -125 136 -151 167 -184 202 -222 244 -270 300 -332 368 -412 463 -525 598 -690
62 -690 809 -968 1192 -1533 2113 -3292 6660 -38078 -169103 -188483 -140417 -55133 26136 96669
76 96669 135229 127971 70444 -521 -55485 -75890 -69542 -43907 -2719 42369 62720 52333 24570
89 24570 -304 -18456 -39024 -57967 -52371 -22506 6761 14584 7687 8023 14236 7605 -8456 -16201
103 -16201 -7494 9051 16820 14012 13939 17174 15133 3748 -8667 -8792 -1793 -2123 -3319 4960 16021
118 16021 16416 1515 -12080 -10620 -7773 -17239 -30628 -29625 -10837 6268 8150 4872 8790 16652
132 16652 18537 8515 -3587 -5535 -2873 -3604 -4321 1665 12148 14692 8125 7079 12945 11286 -2257
147b257j4275oJ0267K258o934k433Q701J1095K84r657m724M728L651k256m652
162f210L317R138K670l837k08M190m74q190n496M862N661l126n930K095Q309L924
178A0695q846j0279r5N704J099p350n027P138J0282K046m107j262L905J368n645
193c74l604L347J426k376j409N500P418r47p665l332L722L108m269r044j436Q942
209i93O335k885n772J132O335K36p248l750K353K428o93m83M427M580j603k969
225A430K72L153o65o949n377L869O743J533n122l040O615O798l419q480k781L733
241a687K802l995l248K727L621N27n99Q89K306o28m335o60L338K214k587n125
257d440R88O747K385n381n239K225O753P68o511k330M182L864j293m221o66K673
$$ plain form
147 -2257 -16532 -16538 -6271 -4013 -10947 -13380 -4679 6416 6700 -2957 -7681 -2953 698 -1558 -6210
162 -6210 -2893 6245 8915 5078 4870 9060 8586 396 -5100 -238 5423 2297 -3633 -1538 6771 10695
178 10695 1849 -8430 -8525 -2821 -1722 -9072 -14099 -6961 3321 5367 1260 -2 3903 5271 -374
193 -374 -3978 -631 795 -1581 -2990 2510 9928 8981 1316 -2016 1706 4814 545 -8499 -9935 -993
209 -993 5342 2457 -3315 -2183 4152 4388 -2860 -6610 -4257 -1829 -2522 -3005 1422 6002 4399 1430
225 1430 1702 4855 4190 -2759 -8136 -4267 2476 4009 -1113 -4153 2462 9260 5841 -2639 -5420 -1687
241 -1687 1115 -2880 -6128 -3401 220 747 148 1037 3343 2715 -1620 -2280 1058 3272 685 -4440
257 -4440 -3452 3295 5680 299 -4940 -2715 4038 4806 -1705 -4035 147 4011 2718 -1503 -2169 504
273E04J32j839l02Q34J526j140j506K542L151j660m926j592M812M208m631o000
289e887J408O719K841m469m589K365M453L01k059k335O38J252o98o13P76M4j081
306i34j746J257M612Q40m713k844L633M593j458o705j584M658L241j818l319L
322b284L835J528k159j791j63J530j82j470K54K014m5j395p06K219J355m069l391
339d920K321M409J27l544j618M552M163j410m378k873J569K995j106k746m15K647
355b27K948Q46p11J61j060l460j541J446Q04k500l144K190O486K494k466l067
371h01K14L291L78l749l256J38L416K304j174k03J566Q90j182j039j53o6k193
388a619j593K621K591q82k231q20K159J242k896l115J87K970L227p24j981J244
$$ plain form
273 504 636 -1203 -1505 -671 855 -285 -1791 751 3902 2242 -2684 -4276 536 4744 113 -5887
289 -5887 -4479 2240 5081 612 -3977 -1612 2841 3142 1083 -1252 -614 638 -60 -673 103 147 -934
306 -934 -2680 -1423 3189 4029 -684 -3528 105 4698 3240 -3465 -5049 -391 2850 1032 -2287 -2284
322 -2284 1551 3079 920 -871 -1034 496 314 -1156 -902 1112 1067 -328 -1034 1185 2540 -1529 -4920
339 -4920 -2599 1810 1937 -1607 -3225 1327 5490 4080 -298 -3171 -1602 1393 287 -2459 -2874 -227
355 -227 2721 3567 2856 3017 1957 -1503 -3044 -1598 -794 -3294 -6438 -4248 2238 4732 2266 -801
371 -801 -587 2704 3082 -667 -3923 -3785 -369 1935 761 558 2124 3014 1832 793 640 574 -1619
388 -1619 -3212 -591 2000 1118 -1113 -1933 226 1468 -1428 -4543 -4356 -1386 1841 1117 -864 380
404C80L374J024k924l799n6J325l4K90J206J383N57J96R99L72l148m598k181J318
422d316K129mk040L43M422L993Lm295l327J366J283q59j122n2K762K260J250J430
440E226j01k961k024o37K13k27j584q30K288L161J661k148l382p66J331j220k774
457d774j841K152M084J604p0N85Q04K33p98j498j214j542l8J989K338J037Q4j100
475B035J84J355q77l522l652n44L531J968j769j150P13K409J127j977k158o92
491c019L35J893J562O40L21Q2O07J087q10k075k696j457K096K766K88q51N38K650
509C957J437k816m085k586n90L2K37j49J059K773L071K069k53j686j561j648q98
526a637m22o08n46Q00L088M105J093k315j190N48J67j979l483j577M66J415J546
$$ plain form
404 380 3754 4778 1854 -1945 -2001 -676 -710 -420 786 2169 2726 2922 3921 4293 1145 -3453 -5634 -4316
422 -4316 -2187 -2191 -4231 -3888 534 4527 4530 235 -3092 -1726 -443 -1302 -2424 -2476 286 2546 3796 5226
440 5226 5125 2164 140 -497 -284 -511 -2095 -2925 -637 2524 4185 2037 -1345 -2111 -780 -2000 -4774
457 -4774 -6615 -4463 -379 1225 1155 1740 2544 2777 1979 481 -733 -2275 -2313 -324 2014 3051 3135 2035
475 2035 2219 3574 2697 -825 -4477 -5021 -1490 478 -1291 -2441 -1728 681 1808 -169 -2327 -3019
491 -3019 -2684 -791 771 1411 1732 1814 2421 3508 2698 623 -2073 -3530 -1434 1332 1620 769 1307 3957
509 3957 5394 2578 -1507 -4093 -4683 -4651 -4414 -4563 -3504 -731 2340 4409 4156 2470 909 -739 -1637
526 -1637 -2059 -2667 -3213 -2413 675 4780 5873 3558 2368 2916 3083 1104 -2379 -3956 -3490 -2075 -529
543e29J12j071K15J530J86k95j002q09R12R00J078J72j424j194K83J539M5j822
561a174o62J974K784P59k80j542q71M62p67k264k791j266J879K293J242J422P56
578A954K61J156o2j758l085l297M5K149J200K72L79K101L009J448j115k529k594
595d66p78N13o82j597m45J346K459J428N7o52j065n00R30N7j482j427K02K101
613aQ97p33p91l03P37J186Q5p47l18N51J433O69j857j493k47L7J43m64m92Q9J333
634b86K157J258j279j695j89M62m89j155j930k86J514K160J996o97j200P80J182
651B303J57j745k389j019O41J414J055j90j129O86J730R89q19k311q49M06P58
668c12P50o91q93L32J338Q75m35j431p86R90R06m21m50k95K04Q41O04m49j467
$$ plain form
543 -529 -417 -1488 -1273 257 443 148 -854 -1663 -751 149 1227 1399 -25 -1219 -936 603 648 -1174
561 -1174 -1836 138 2922 3681 3401 1859 988 1450 683 -1581 -4372 -5638 -3759 -1466 -224 1198 1954
578 1954 2215 3371 3309 1551 -1534 -4831 -4786 -2637 -1437 -1165 -786 1315 4324 5772 4657 2128 -466
595 -466 -1244 -731 -1413 -3010 -3455 -2109 350 1778 1835 1183 118 -382 548 605 -877 -2304 -2102 -1
613 -1 896 163 -628 -931 -194 992 1077 330 12 563 1996 2665 808 -685 -932 -895 -752 -1216 -1708 -1619 -286
634 -286 1871 3129 1850 155 -34 428 -61 -1216 -3146 -3432 -1918 242 2238 1541 341 1121 2303
651 2303 2460 715 -1674 -2693 -2052 -638 417 227 -902 -216 1514 2503 1684 -627 -1476 -1070 -312
668 -312 438 -253 -1146 -814 524 1399 964 -467 -1253 -263 643 222 -228 -523 -319 522 1126 677 -790
687g90m25J313J97l90n75j7J017O83N4p33j152m68J411P76r29j391j19J575J215
706A252Nq32j123m7J343R92q35j847m40J191J576j23j182r31n8J286R29l60j355
725e59r34J133J486J40j140p80N9Q36Q31n77j108p22O66J627J37j256o62M35R32
744E44L46m28r71k58M74Q43J49j476k44N27J167K04r79l98L82N54M21q5j635l95
764a258R34R06L31j256o59R25R74O54n49j586p29P29R50M38j412q90P86J431N51
783A270n66j147n34P04Q77L71j080j304P21J640M98n81j042o43N52P49j33q38
801d86q31N07J362O75l34r58m95R40o0J3r20p30L16J443Q45o94q98K21J242j24
821A034o60j107p93N58J052M79m75p95K19J297M44j090j111k86O08Q18J15m73
$$ plain form
687 -790 -1215 98 295 -95 -670 -687 330 1013 1067 334 -818 -1286 125 901 -28 -1419 -1538 37 1252
706 1252 1257 425 -698 -745 598 1590 755 -1092 -1532 -341 1235 1112 -70 -1001 -1059 227 1156 796 -559
725 -559 -1493 -360 1126 1266 126 -654 -595 241 1072 495 -613 -1335 -669 958 1095 -161 -823 -388 544
744 544 890 462 -509 -767 -293 550 699 -777 -1021 -494 673 877 -102 -500 -118 436 857 772 -863 -1258
764 -1258 -324 582 913 -343 -1002 -77 897 1551 1002 -584 -1313 -584 366 804 -608 -1498 -712 719 1270
783 1270 704 -443 -977 -273 604 975 -105 -1409 -688 952 1450 869 -173 -816 -264 485 352 -486
801 -486 -1317 -810 552 1227 893 -65 -560 380 320 333 -587 -1317 -1001 442 1287 593 -305 -84 1158 1034
821 1034 374 -733 -1526 -968 84 563 88 -707 -488 809 1253 163 -948 -1234 -626 192 307 -166
839a66p60J61J545O27j061j153k06Q74R64k16l40m07J29J073N46r80j471m26O41
858f26O82j47o20n4O29J091O11j062j529m27M33J028m40p27J73R86J410M92o35
877A268q16o01M49O80p06j289k91R78J067M41l07j064j90K30O37l30j641m28P45
896a168J170N81n99m33J94N03M25J32j226j48P04R61O39j009m20K18L39j9m98
915C46j238l86O39Q13J7q12o23Q37P60l29r49o42k46R09R23K86n24n02J424J078
935A781q4q53p78o03R39O75k6q91o61P48J316P9j518j181l59Q08K07n26m91l63
955a781O23J306L96o90q67J19R10K91k15j72o5N84J139O81p59q62j0N20J4j170
975ho74k25O78N19O6o41n30j15N82P2j066n87K24J100M96K63m42nN76J200L66
$$ plain form
839 -166 -926 -765 780 1407 346 -807 -1013 -139 825 609 269 -138 -9 1064 1610 630 -841 -1267 -626
858 -626 56 -91 -711 -765 -136 955 1566 504 -1025 -1452 -1019 9 -431 -1158 -985 1 1411 1903 1268
877 1268 452 -149 300 980 274 -1015 -1306 -328 739 1180 873 -191 -381 -151 486 156 -1485 -1913 -1168
896 -1168 2 583 -16 -449 -255 248 673 805 -421 -569 135 1096 1735 726 306 524 863 844 346
915 346 -892 -1278 -639 174 191 -621 -1244 -407 353 24 -925 -1567 -1813 -904 19 305 -219 -721 703 1781
935 1781 1697 844 66 -537 402 1077 1051 160 -501 247 1563 1642 124 -1057 -1416 -608 -401 -927 -1418 -1781
955 -1781 -1158 148 544 -146 -1013 -894 16 307 92 -80 -145 439 1578 2259 1500 638 628 1148 1162 -8
975 -8 -682 -907 -229 290 356 -285 -815 -930 -348 -276 -1342 -1929 -1705 -605 -109 154 -288 -293 283 1483 1849
996A849j122j025M53R05Q27n37j118o6L57M80J64j278j360J07P62P01p34p47j20
1015a502N53O39K47m26q99j33J202J068K51o25j86J086M31L91j015p71j88N31
1033F54Q1k38q85j32O61L49l12q17k89k7N2N7k87q15K16J125Q35k34k99j4Q19
1054E00O27n7l18r16J98J217O80p18j172k28Q30M72l48r97n08j64L83R01n04j136
1074a258m39N98R51K43r42q9j14J193O82k21n77j12N71Q18r8o03o06J22O08K03
1094I30m01o20j37q4P44m5r88o42M02M42K78l09n87M0O12R35j70r21k34Q53P17
1115H15j16m76p59N90M94N77k09q88k67M44O97j72p76p04J21M62N25l35o83j96
1135h56L40O89L21q48o90M79O99M65j98q02p4O98M00J58o38p15L41R36l4m88o25
$$ plain form
996 1849 727 -298 155 1060 1887 1350 232 166 523 1003 1167 -111 -1471 -1364 -602 99 -635 -1382 -1502
1015 -1502 -949 -310 -63 -489 -1388 -1521 -319 749 1000 375 189 1275 1706 2097 1082 311 123 654
1033 654 735 497 -388 -520 141 490 178 -639 -928 -955 -903 -846 -1133 -1948 -1732 -607 228 -6 -305 -319 500
1054 500 1127 1070 752 -164 34 1251 1931 1213 41 -187 643 1115 767 -230 -738 -902 -519 382 -122 -1258
1074 -1258 -1697 -1099 -148 95 -847 -936 -1050 143 825 604 27 -85 486 1304 1206 603 -3 119 727 930
1094 930 529 -91 -228 -312 432 387 -601 -1243 -841 -399 -121 -430 -1017 -977 -365 570 400 -521 -755 98 815
1115 815 699 223 -536 54 548 1125 916 28 -239 205 902 730 -46 -750 -629 -167 358 23 -660 -856
1135 -856 -516 173 494 -354 -1044 -565 134 599 401 -401 -475 223 623 781 143 -572 -231 705 671 183 -442
1156d42K7N58L07j20m61o80M19Q58J05n23q11K07O12L83o2l38o47M55P14J52m49
1177B64r67O4J106p0k38l64l72L01O07L79o44q62J88Q98N03n28o66m5J52P45J08
1198E59l96n31K9M75O29p63k98j36M71M28l94l71l09K16N89N45p43p18N8O51O68
1219F59l55p08o1J47Q23J08m60n51O4M72O99m59q81J44J82N44J79l82n17l03P94
1240A38L71k41r62r2L70R18K59o45n23j5M93O73m57q08p3L66M70L06n43k02K27
1261C0J67K96j16r54m5M48M11o9l67j44K57M70l1k27m05KO5O47r4p31k34Q15O41
1284H32l50p07l60k2N22M77k30n98j92O66P88k32n15m93j73L91P66M2p12m54M04
1305a50J075J80o92q67j37P24J93l39l31n90N00Q76J97n72m39r0M19K36k68m77
$$ plain form
1156 -442 -415 143 450 330 -131 -811 -392 466 571 48 -763 -556 56 439 377 39 -608 -153 561 713 264
1177 264 -703 -639 467 397 159 -205 -577 -276 331 710 66 -796 -608 290 793 265 -401 -446 -294 451 559
1198 559 163 -368 -339 136 765 2 -296 -432 39 467 73 -298 -607 -391 198 743 0 -718 -660 -9 659
1219 659 304 -404 -465 -318 505 613 153 -398 -334 138 837 378 -503 -359 -177 367 546 164 -353 -656 138
1240 138 509 268 -694 -786 -416 502 761 116 -407 -422 71 744 287 -521 -594 -228 242 548 5 -197 30
1261 30 197 493 377 -577 -622 -174 237 168 -199 -343 -86 384 353 126 -279 -277 -212 435 341 -390 -624 191 832
1284 832 482 -225 -585 -607 -85 392 162 -436 -628 38 826 594 79 -414 -587 -196 570 612 -100 -554 -150
1305 -150 925 1105 413 -454 -591 133 326 -13 -344 -934 -434 442 639 67 -372 -462 -43 193 -75 -552
1325e52m9L97O97K43n45j34L59L62n4o89l41j4L97K86p6l08l58K17N52Q2q56p23
1347a107N78L12J93n1n49l8J82P77K32o13n85M68P60L03j34k72j69M34K11o8o84
1368A80p59p5N63M95o45l89P9M39L05R0o57p50J6K35M72P5l76L09Q29N51J72k22
1390I37m78k56N17M5l82p19M2P79K19m71j48l84J98K00k63m98m62MM47O14l93
1411d52k94J5M10P66J8m18l32L08P13O30k72n94k18N37J78l16n64n03r3M37L73
1432C29q5p84k34L05M52n15p32k99L21M65P19K54m04K75N94M40o7p60j96K35J87
1453E00J46M3j55k08J99N18k96j014n54J90K59Nm22m39K27M16O43J6o63l86N02
1474d73M47J58l34j09N88M17K92L30m94n17K50K64Po32o63K55M35J60k22m97k90
$$ plain form
1325 -552 -601 -204 493 736 191 57 416 778 724 35 -306 -320 77 363 287 -21 -379 -162 390 472 -384 -1107
1347 -1107 -529 -217 -24 -75 -624 -662 -480 297 529 -84 -669 -201 559 862 728 456 287 721 932 864 180
1368 180 -579 -654 -91 404 -241 -630 -551 -112 193 283 -374 -1124 -1108 -873 -401 -326 -702 -393 436 987 1159 937
1390 937 459 203 720 765 383 -336 -294 485 704 233 85 -299 -101 99 -164 -662 -1124 -1120 -673 -59 -452
1411 -452 -746 -731 -321 445 463 45 -287 21 734 1364 1092 498 280 817 995 679 115 -388 -481 -44 329
1432 329 244 -540 -774 -469 -17 -532 -1264 -1563 -1242 -777 -58 196 -208 67 661 1101 1034 274 78 313 500
1453 500 646 689 534 326 525 1043 747 -267 -821 -631 -372 -367 -789 -1228 -1001 -585 58 74 -589 -975 -473
1474 -473 -26 132 -202 -311 277 694 986 1316 822 305 555 819 826 194 -469 -214 221 381 159 -338 -628
1495f28K04K33O3p82m92L42O95L47m24n8K06L95O00K14q43k26L25Q30O6m55n93
1516A9M6L25p4j96k78n01K07P69K79q70k74J1N39N0l16m20m36L88O87L13J05j28
1538B45J18N58K59m02n52n90rL75M69n16l39K08M58N98m65n43N3m8j8k30n24M2
1560h53K01N14L63k84j26K76K27M44j03n46m58K84O4N17n58o63K77O48O41m97
1580C68m91p7M57J90n7n19n33p1K21M75j46l38J0N65K84M18J8o21k97L35N0j66
1602G5p84pM13M53L56n01j31M02K51M6r6p92k04L01K01j40j22k65L65M05L05M3
1624E74l34l49J16K64l2o71k79M16M94K02m93l89L12P69J57l70o40l6J45M31m58
1645a71q6l50L20L07O05L4m69n13L69N39l5o72m58J6N57L75k57n09j28K90O90
$$ plain form
1495 -628 -424 -191 -128 -910 -1402 -1060 -365 -18 -442 -500 -294 101 701 915 72 -154 171 1001 1067 612 19
1516 19 65 390 316 120 -158 -659 -452 317 596 -274 -548 -537 2 52 -264 -684 -1120 -732 -45 268 373 245
1538 245 363 921 1180 778 226 -364 -373 2 471 -45 -384 -176 282 880 415 -128 -75 -123 -141 -371 -895 -853
1560 -853 -652 -138 225 -59 -185 91 318 762 659 113 -345 -61 3 520 -38 -701 -424 224 865 368
1580 368 -123 -200 257 447 390 -129 -662 -733 -512 -37 -183 -521 -511 54 338 756 774 153 -144 191 241 75
1602 75 -709 -716 -303 150 506 5 -126 276 527 573 477 -315 -519 -218 -17 -157 -279 -544 -179 226 531 574
1624 574 240 -109 7 271 239 -432 -711 -295 199 401 -92 -481 -169 600 757 387 -253 -289 -144 287 -171
1645 -171 -257 -607 -287 20 625 659 190 -323 46 585 550 -122 -580 -564 -7 368 111 -398 -526 -236 454
1666D54k12m13j31J86K17J97K5n61K7r1N52J44m28m52L4N99K64L0n56j00J67N15
1688D67k35p12n0J38M37K90n21p2P17m61L32k11l63j30n4M11L31j79k58k19P09
1709C67J53j25n65k62J95M03J39p20k05M60N89J9l09o32K88n2L14k50J9j44J65
1730a53J97O75j78o74k49L1K56M16l96m46K57M68P16o75n21J39M39o5l83k89K40
1751a95J83K08J14m5j32l35K31J47N7n21k98J12N79L09l5n20p9N04R9l89o85o9
1773g60P85K7J52m00L62O0J31p7j94m06M0k04M98J82l0k31r5O83K43l62r26LL04
1796b15M56j16m82rM40L64l0l92k73j08K67R7p1OoJ80J67K83q6o95k28M1N12L12
1820D14p54k38Q20N58j3m31n75p0K75o9l32m55K32O76L20J10j0M1l71J17k12r2
$$ plain form
1666 454 242 -171 -302 -116 101 298 323 -238 -211 -302 250 394 -34 -486 -452 147 411 441 -115 -215 -48 467
1688 467 232 -480 -530 -392 45 335 -186 -258 459 -2 330 119 -244 -374 -428 -17 314 135 -123 -342 367
1709 367 520 395 -170 -432 -237 166 305 -415 -620 -160 429 448 139 -493 -205 -257 57 -193 -174 -318 -153
1730 -153 44 719 541 -133 -382 -351 -95 321 -75 -521 -264 204 920 245 -276 -137 302 237 -146 -435 -195
1751 -195 -12 196 310 265 133 -202 29 176 233 -288 -586 -474 105 414 379 -141 -220 284 383 -6 -691 -760
1773 -760 25 52 204 -196 166 226 357 280 86 -320 -280 -484 14 196 166 -65 -160 523 766 404 -522 -519 -215
1796 -215 241 125 -357 -366 74 438 408 16 -257 -365 -98 -1 -72 -66 -72 108 275 558 472 -223 -451 -410 102 414
1820 414 -340 -578 242 800 787 356 -219 -289 -14 -83 -415 -870 -638 38 358 468 458 499 128 245 33 -59
1842e9k25m32M0O59O74k33l68J47M27n3l99o27ML80Mp9k70J97J49K83l04K03l34
1865b16k7J17K50J36j47l62l8N34Q6l73p71K41P30L33q5n57J93M59L16k17r96
1886c94k44J54J96K6J74k7M47j77L42M25m22n71l51J13K92l21l46J83N82O65J43
1907H89o12j19r7n4Km88j40K52K21J60r7K53J3k95J74L76k25m52N0LM83J00k97
1930A00n93L69M46j06k36l03nP25R0m83j2r6K59N1j48m86j38J94L25L29L70m65
1952A87j89N7L90p4k58n85j13L72M63k88j44J67L90J13l81k28k29J52m6J73J46
1973G5N7m27L35R9J67n9n14J70J11J85Ml30j45M62M71j27o73j67L98K90m71l97
1995d86q7N05K68Q7J55n66J04n1L69j08r0n84n9M03M78q8l26j16L05N81k56n30
$$ plain form
1842 -59 -284 -716 -676 -17 657 424 56 203 630 577 178 -449 -445 -65 -61 -140 -410 -213 -64 219 -85 118 -216
1865 -216 -243 -126 124 260 113 -249 -287 247 333 -40 -811 -570 160 493 408 -149 44 503 819 602 -394
1886 -394 -638 -484 -288 -262 -88 -115 332 155 497 922 500 -71 -422 -309 -17 -338 -684 -501 81 746 889
1907 889 277 158 61 7 9 -479 -619 -367 -146 14 -83 170 183 -112 62 438 213 -239 -189 -186 297 397 100
1930 100 -493 -124 322 216 -20 -323 -328 397 487 4 -8 -104 155 206 58 -428 -566 -372 -47 282 652 187
1952 187 -2 55 445 371 113 -472 -585 -213 250 -38 -182 -15 375 488 107 -121 -350 -198 -244 -71 75
1973 75 132 -295 40 139 306 247 -267 -97 14 199 203 -127 -272 190 661 534 -139 -306 92 382 -89 -486
1995 -486 -573 -68 200 287 442 -124 -20 -71 298 190 100 -484 -543 -140 338 250 -76 -192 113 694 438 -92
2017i2k24L30P2L09n85q9j3L34j08L20j86O4k19J18L41k73o2l21Q1K42J96m78
2039b43k93K34N31K36k38k84o9N88j29l06m59n5J54L99j35r2J31K60q2R0L6J7
2061B91n61J37M3L48m20n16K90K49O88l34j07k31N96J48m05n81N8R1n9K09k12
2082b78L7K90K31m7K83J21n81k04J55J82l07m10Q9K33O65j61l81j26L92L31j37
2103C77l31l36k12L65N5p0j9J02o2J53K81K4l29j32J30M10l65k22l17M05J91J26
2125B24l91j86L83K82m6k21k35J70l3L41k22l28Pj57L08J88J15j00o1n0L75Q1
2147D44l45o02K83K72j07Kj74o3P34J06k49m67j0M06k96j54Q7j97q6L45L99p0
2169B58j66k93J34J47O2m9l14M7K04L76j56l71k70L99K94k14k41j78K90R1rR6
$$ plain form
2017 -92 -316 14 86 395 -190 -279 -292 42 -66 254 68 132 -87 31 372 99 37 -284 -203 39 235 -243
2039 -243 -536 -302 229 465 227 -57 -126 462 333 27 -432 -487 -333 66 -69 -161 -30 230 148 238 274 291
2061 291 -270 -133 -90 258 -162 -678 -388 -139 549 215 108 -123 473 621 216 -365 -307 -216 -275 -66 -278
2082 -278 -241 49 280 233 516 637 56 -148 7 189 -118 -528 -439 -206 459 298 -83 -209 183 514 377
2103 377 46 -290 -502 -137 -82 -152 -171 -69 -131 22 303 327 -2 -134 -4 406 41 -181 -498 -93 98 224
2125 224 -167 -353 30 312 266 45 -190 -20 -53 288 66 -262 -255 -412 -104 84 199 99 38 -12 363 444
2147 444 99 -503 -220 52 -55 -53 -227 -290 444 550 301 -166 -176 230 -66 -220 -133 -330 -416 -71 328 258
2169 258 92 -201 -67 80 142 93 -221 -174 30 406 250 -121 -391 8 302 88 -153 -331 -41 50 41 137
2191A37k00P2N5j69J60o0k03J6J73K26L3k78lK59J35j06n36l58N12N37k74l3j31
2214c6N9J61k5l1k52j76L18L2j46L0j87N1K43M14k35j89k43Q0J38K42k59j82J86
2237gK95Q8j61l90K7j10J67K44n01N1K18K50j34K78k14r6l10J31M34k39k51Q9
2259a41L22m2L31m97j79J24Q4j6k18l13M15K42Q5j57k5K5K5l6j39j63R2m2K00
2282b3M62j75j48j57L08J63l11l19J11k31N18j85J82n21K92J19K32k02n52j6K04
2303b49J55n5J6o7n4M02K63m5l29j12P7K37M5j33r8N8Q1K60n34j66M0M3P7m3M
2328a27N8J02Q8q8Q1j97l38J05L14j47J40J18J16J01no2N9k54K53M2n48k61K00
2351b50L27M8O6L3p9j3O9k33J63o20j39k1N21M0o3l3K42K03J87l35m0l34N17j45
$$ plain form
2191 137 -63 9 64 -105 55 -5 -208 -192 -19 207 240 -38 -41 218 353 247 -289 -647 -135 402 128 95 -36
2214 -36 23 184 159 128 -124 -300 18 50 -96 -66 -253 -202 41 455 220 31 -212 -132 6 248 -11 -193 -7
2237 -7 288 376 215 -175 -148 -258 -91 153 -348 -297 -79 171 37 315 101 5 -305 -174 260 21 -230 -141
2259 -141 181 139 470 -27 -206 -82 2 -14 -232 -545 -130 112 197 40 15 40 65 29 -110 -273 -181 -223 -23
2282 -23 439 264 116 -41 267 430 119 -200 -89 -320 198 13 195 -326 -34 85 317 115 -437 -453 -249
2303 -249 -94 -149 -133 -200 -254 148 411 366 37 -75 2 239 284 151 53 111 192 452 -82 -248 -208 -165 -88 -131 -127
2328 -127 -69 33 121 33 114 -83 -421 -316 -2 -149 -9 109 225 326 321 259 318 64 317 359 -189 -450 -250
2351 -250 77 125 191 224 145 132 201 -32 131 -489 -628 -649 -128 -88 -151 -184 58 261 448 113 73 -261 256 111
2375A11P2k14o8J08N9K42j48j98r0J49Q6o4k4l19J00J6K82l53j47k4j3N21n2m9
2399a7J23j4L12R7n18j38P0L2no5J50k2K10J63j76n7k62j4k3j26l5m0j55J49K79
2424h2rJ87l56L80J4J24k81j79M7J22K40J08n5k38QJ99o8J30l20r6J67O8j6k81
2448a87p4m3J79M4K0n2j70L50N7j3rj59P0K76j80k73L5R6J35K20j99j16o8J62
2472A01J43K60n54j04j67J89O8n7j07M3J69J96j73k34J03q4M08j23Nk43J76m5
2494c0K48K6r4k90J01o7K62j45k74J87K20Q8k20Nk2J09K47j00k66k52J57K66M6
2517B02O7n05K28n1K36j01ql67K41L1MO4l93J89qL97j09L9k32O4P8Lq0j70p2O3
2543a90N22k28j23k5p0K73p9Q9J6p07M30j32J58J4j59J67j11L19k12J28j57K44
$$ plain form
2375 111 183 -31 -99 9 68 310 162 -36 -126 23 109 45 21 -298 -198 -182 100 -253 -400 -424 -437 84 32 -17
2399 -17 106 92 404 501 -17 -155 -85 -53 -58 -123 27 5 215 378 202 145 -117 -131 -154 -280 -315 -355 -510 -361 -82
2424 -82 -91 96 -260 120 134 258 -23 -202 -155 -33 207 315 260 22 30 229 161 291 -29 -125 42 110 94 -187
2448 -187 -261 -304 -125 -81 -61 -113 -283 67 124 111 102 -57 13 289 109 -164 -129 -33 102 322 123 7 -61 101
2472 101 244 504 -50 -154 -321 -132 -64 -121 -228 -185 -16 180 7 -227 -124 -208 200 77 82 -161 15 -30
2494 -30 218 244 150 -140 -39 -106 156 11 -263 -76 144 232 12 17 -5 104 351 251 -15 -267 -110 156 202
2517 202 269 -236 -8 -59 177 76 68 -299 -58 -27 -23 41 -352 -163 -171 226 117 156 -76 -12 66 69 -11 -181 -253 -190
2543 -190 332 104 -19 -44 -114 159 80 169 185 -522 -92 -224 -66 -52 -211 -44 -155 164 -48 80 -77 167
2565A67j12Q9j74j15j36L56p1j84K54j99J84J67j55q0J03o5Q8L4k88j20J64r9
2587a92J78Q4m39K70J67K4L49n78J7n8J13L0J70k34q5J25K85J35q1j67j27J53
2609A39O7k08k01N5P4K4j9l1k08K34L10J43l16j90J44QJ18j17rj05R5m4L18j00
2633A81k39P3K07q6r0n2l8j35K62m9q1m36J03M08Qq8k0J89n6J14k61O0k89K54
2657f1K63m8j4l71K24J59N7Q3j48l55J78L2J88j32k12O0J26P2q4J95m31J73J41
2680I5L8k54J4o9m5K76l1j28J24m8j9J35j45k9j52K17J91J19l09k3J17J36J7l26
2704i9j45J36K02o2R2j90n6J20K03k17j29J10p0K37j17R4k10L1O9rJ10k53L2L5
2728h6N5J49m0k3k39K81J54k4k78m8O7J45J27j94j23O7N2J68M0n41J40J54J30
$$ plain form
2565 167 55 144 -30 -145 -281 75 4 -180 74 -125 59 226 71 -9 94 29 117 151 -137 -257 -93 -192
2587 -192 -14 70 -369 -99 68 92 441 -137 -120 -178 -65 -35 135 -99 -184 -59 226 361 280 113 -14 139
2609 139 206 -2 -203 -148 -74 -50 -69 -100 -308 -74 236 379 63 -127 17 25 143 26 17 -88 7 -37 281 181
2633 181 -58 15 222 136 46 -6 -44 -179 83 34 -47 -483 -380 28 36 -52 -72 117 61 175 -86 -26 -315 -61
2657 -61 202 154 140 -231 -7 152 209 292 144 -211 -33 -1 187 55 -157 -97 29 101 17 212 -219 -46 95
2680 95 133 -121 -107 -176 -221 55 24 -104 20 -28 -47 88 -57 -86 -238 -21 170 289 -20 -43 74 210 227 -99
2704 -99 -244 -108 94 32 124 -66 -122 -2 201 -16 -145 -35 -105 132 15 109 -101 -70 -1 -10 100 -153 -121 -86
2728 -86 -31 118 78 55 -184 97 251 227 -51 -99 -32 113 240 46 -77 -10 42 210 250 -291 -151 3 133
2751A33kk90R3m7L6Q1J89k31J3k26N02k21qk22J87O8R4P9k90oJ51J41j54k63J44
2776d9N3P0N7q1r3j61J9L53k43r2J23j73J80qJ55k42J69j6m7L42k30k74J52J90
2800A54R7K7k58O7J54k2k5n8m47J44K71j27n8j72P8J65P5P2j48j20l5n4L45k19
2824i4m9P3J23J97N1k73r0J96j1o0J1k58J2J77J06j88k4J01j09j33L60k01k33
2847c16J71K09J53j63j82O6j8J61Oj93K20M7j23L0J30l11J65o8j0R3l48k08K86
2870b03P5J59n7k97K01J67P2l4j18k63K83RJ00j92J2J14J13KM7j78m7J87j29J04
2894A27j05j83J16l0K81q9l11J88m4K5J61j90l4o6K9K67j88j43N3K33p6j61m1
2917a81J91J6L8K7l00K91j71J60k7J21l76J81J17K0J51j92j74lM3K6J75k07M6
$$ plain form
2751 133 131 -159 -66 -113 -77 4 193 -38 -25 -251 251 30 22 -200 -13 55 149 228 -62 -68 83 224 70 -193 -49
2776 -49 4 74 131 50 -43 -204 -185 168 -75 -167 -44 -217 -37 -45 110 -132 37 21 -26 316 86 -188 -36 154
2800 154 251 278 20 87 241 219 194 136 -311 -167 104 -23 -81 -253 -175 -10 65 137 -11 -131 -166 -220 125 -94
2824 -94 -143 -70 53 250 301 28 -62 134 123 63 74 -184 -172 5 111 -77 -101 0 -109 -242 118 -83 -316
2847 -316 -145 64 217 54 -128 -62 -80 81 87 -106 114 161 38 68 198 -113 52 -16 -26 67 -281 -489 -203
2870 -203 -128 31 -26 -323 -122 45 117 83 -35 -298 -15 -6 94 -98 -86 28 141 143 190 12 -35 152 23 127
2894 127 22 -161 -45 -75 206 117 -194 -6 -50 -25 136 -54 -88 -154 -125 142 -46 -189 -136 97 21 -140 -181
2917 -181 10 26 64 91 -209 82 -89 71 44 165 -211 -30 87 107 258 66 -108 -111 -68 -42 133 -74 -28
2940b8j21K90j14j5m3j2N2J07j80J19k10O9K49k1l40R2N4J21O3Q2l73J17P4m9
2964a7K76l10k29K35J09k9pr0Q4k15J29K26o5k25m5J12Q6l0j57j5J38P4M2j11
2988c4k22K25K3l9jk27J98K69O9j71j75j73L66p4k6j0q2p7L59j71r7m8j0J57K11
3013B40K6l86j01J71P2r6K30k97N9kJ58q4l3k2N2j11K96J7k98j05K60k5l4R4p8
3038Cp2mL25j68p4j81K18n4Rj08K9N8J74nj2j81q5L33n5o0o0j06j12J03J67p1
3064A1q9q6L60j47J05o1l58L68K18k39m73L35j19K23R3j77plL5J47j29k00K95
3087A02k69m8K92o1o3p1K0K01o8m0pP3O3K7j32m7M4m1o2K18j79J20j33K73j38
3112G4j73Q0K6j7K89k53j68j30K51j0OJ78j27k75L52q0K14k43n2J34k32K83N1
$$ plain form
2940 -28 -149 141 27 12 -31 -43 9 116 -64 55 -155 -86 163 142 -198 -106 -52 69 132 214 -159 -42 32 -17
2964 -17 259 -51 -280 -45 64 35 28 -62 22 -193 -64 162 97 -128 -173 -61 25 -5 -162 -177 -39 35 77 -34
2988 -34 -256 -31 -8 -47 -48 -275 -77 192 261 90 -85 -258 108 34 8 -2 -84 -161 198 27 -70 -118 -128 29 240
3013 240 266 -120 -221 -50 22 -74 156 -141 -82 -84 74 -10 -43 -65 -13 -124 172 189 -109 -214 46 21 -13 81 3
3038 3 -69 -73 252 84 10 -171 47 -7 2 -106 -77 -19 155 150 138 -43 -128 205 150 90 30 -76 -188 -85 82 11
3064 11 -78 -164 196 49 154 93 -265 103 321 82 -391 -56 -175 48 141 -36 -43 -46 -11 136 7 -193 102
3087 102 -167 -215 77 16 -47 -118 -98 103 35 -5 -12 61 124 151 19 -28 16 -25 -87 131 -48 72 -61 212 74
3112 74 -99 -19 7 -10 279 26 -142 -272 -21 -31 -25 153 26 -249 103 23 237 -6 -58 76 -156 127 178
3135A78k10N1p4J65J26k75j21K41J5J39l68q6K44o6P8m3K3k41K23l1P0k36L33
3158A35O8o7N4j77j03j4K97O3j53k94J12R1J62p4l46K43j05M4J76k5q1j02J19
3181B3J11o7l8j31P0J94R1q1k65qJ82L9j65L9Jk9l4k7Jm5J98m8Q4J3j93P9n8L77
3209C13j41j40q7j8p7K56P2k30J12k1j04Km5J57j88J17J49j09j04j7L71k67K54
3232B55l28q6K35k9N1k4j40m8O6l3J92r7m9j45L05J22j80k85K36k56K40Q9K2r9
3256A4K9l05K82L1k23R3J48l3j48KJ21mk47K93J20k37M9Q4k9j66N3K04m5K38m43
3281a19J95j24l45N45k73L20n9j05j72J91k02p0K88%jP1j52j10j4J37P1q3n2k5
3305h8O2r3K17j51J6R0q6K30j66j62M0L4J87j84N4o1J8m7n0J10K6l0J0k8J46j02
$$ plain form
3135 178 -32 19 -55 110 236 -39 -160 81 96 235 -133 -219 25 -41 37 -6 17 -224 -1 -32 38 -198 135
3158 135 203 136 190 13 -90 -104 193 256 103 -191 -79 12 174 100 -246 -3 -108 -64 112 87 6 -96 23
3181 23 134 67 29 -102 -32 162 253 172 -93 -101 81 120 -45 -6 -5 -34 -68 -95 -94 -139 59 11 95 108 -85 -6 -64 313
3209 313 172 32 -55 -73 -150 106 178 -52 60 39 -65 -63 -108 49 -139 -22 127 18 -86 -103 268 1 255
3232 255 -73 -159 76 47 98 74 -66 -114 -48 -81 111 14 -35 -180 125 247 67 -218 18 -238 2 91 113 14
3256 14 43 -262 20 51 -172 -79 69 36 -112 -110 11 7 -240 53 173 -64 -15 69 40 -126 -73 131 86 324 -119
3281 -119 76 -48 -393 152 -121 199 140 35 -137 54 -148 -218 70 70 69 140 -12 -122 -136 1 72 -11 -63 -88
3305 -88 -26 -119 98 -53 -37 53 -33 197 31 -131 -91 -57 130 -54 0 -61 -43 -90 -140 -30 -4 -34 -24 -52 94 -8
3331hN9j66l1J90j85J22R1j66nK54k87N3Q6m0M4m5q2rp0O7K38j50o2p3J02K41
3357A68j90N1k9K5K8p9R2j25J8J64k3j35MO3j27J53n7O4j57L7K46k7j70k1P7j53
3383a03K33J41j72j53q8K70M0k8m08L51L3m7L9m6o8l9l1J63N0j67j7J85o9K5J00
3408A94k68R2N3N6j68m8MK44j07r7J40l0j24K3j9J66k4j85J81m4%k20K4R6K23
3433A62j00p9R7j65J61J44j55n9l2L9j40n9K9J19K14j81l9N6k3j45J05L64l60
3456d7JJ24J17o1q8j0M3j30Q6l2Rm3K2m0J98k40R9j28J29j46J62m7J18k27m1J88
3482A6j31J96j18j98K56j77J58N8o2k55K98m7J32j96O7K60j51k44K8J22N5j08
3504d1qM0K1j50J7J22k7K0j8K26l48L43j25k49J61J11n0k05R6O3o2K88p7j31l25
$$ plain form
3331 -8 51 -115 -146 44 -141 -19 72 -94 -99 155 -132 -79 7 -33 11 -34 -116 -125 -195 -128 110 -40 -102 -175 -73 168
3357 168 -22 29 0 25 53 -26 66 -59 -41 123 100 -35 -31 32 -95 58 1 65 -92 -55 191 164 -6 -27 50 -103
3383 -103 130 271 99 -54 -142 128 168 140 -268 83 116 69 108 62 -6 -45 -76 87 137 -30 -47 138 69 94 194
3408 194 -74 18 71 127 -41 -89 -85 159 52 -45 95 65 -59 -36 -55 111 87 -98 83 39 39 -181 -157 -61 162
3433 162 62 -17 80 -85 76 220 65 6 -26 13 -127 -186 -157 -38 176 -5 -44 12 -11 -156 -51 313 -47
3456 -47 -46 78 195 134 46 36 79 -51 35 3 12 -31 -9 -49 149 -91 8 -120 9 -137 25 -22 96 -131 -172 16
3482 16 -115 81 -37 -235 21 -156 2 60 -2 -257 41 -6 126 -70 -3 257 106 -138 -110 12 67 -41
3504 -41 -49 -9 12 -138 -121 1 -26 -6 -24 202 -146 197 72 -177 -16 95 45 -160 -64 -1 -63 225 148 17 -308
3529c08J56K77L4lk33R6j91K46l7N7j9j59K26m5k50N6p3K15K49j96j42P7J51l44
3553a60J25P5j3j05J86K0j30r9J62l8L4kj31J65j47L46m12J1j31K01P3rJ9o9o0
3578h9J31J5l1o6R1q4K52K7k54j03Q8Q3j15K57k18L1kP4l52J71J92j42O6j10Q1
3603gJ87l35j3j19K11R7j19Q2j1j4L7J00ml10L17K7o0o9J38l38J74K97j59l14
3627b05K28N9l3o8J13m1r6m6pL32k18n6r4K06r2L9j07R6k04J66L9o8o9J61k13
3652a78O2j24L39j29Q1J65m00J36k6O8o8J14J4j93J34MJ1l08J80J49Kj17J98M4
3676A58k04o4J25L5j7l33K73O8P5k26L7K6R4K2j26J19J20j93rK15j71m7k2j35
3700a80L38o7k75J12j91M16j14j28j4J72R7l9k23k02J49Q8J00M0j49PjJ70r0J55
$$ plain form
3529 -308 -152 125 159 156 -77 19 -172 74 37 94 75 -84 142 97 -153 -97 -170 45 294 98 -44 33 184 -160
3553 -160 -35 40 27 -78 108 128 -2 -101 61 23 57 55 -76 89 -58 288 -124 -113 -244 -43 30 21 40 -29 -89
3578 -89 42 57 26 -40 51 -33 219 246 -8 -111 -23 60 -55 202 -16 15 13 87 -265 -94 98 -44 22 -88 -7
3603 -7 180 -155 -168 -287 -76 21 -98 -16 -27 -41 -4 96 92 -218 99 126 66 -3 135 -203 -29 268 109 -205
3627 -205 23 82 49 -19 94 53 -43 -89 -96 236 18 -38 -132 74 -18 21 -86 10 -194 -28 11 -57 -126 35 -178
3652 -178 -116 -240 99 -30 51 216 -184 -48 -74 -6 -74 40 54 -139 -5 -1 10 -298 -118 31 33 -84 114 158
3676 158 -46 -110 15 50 33 -300 -27 41 116 -110 -73 -47 47 69 -57 62 182 -11 -20 195 24 -23 -45 -180
3700 -180 158 91 -184 -72 -263 153 39 -89 -103 69 166 127 -96 -298 -149 -61 39 79 -70 -63 -64 106 16 171
3724A71l11J11L36k99J53k57J11J55Nr4j46k63M74j07M7j93j1J14KK76k68J49
3746A55j67J12J31r4l1k04O5K29j07k10L8j43L75j50j03P9K2J05j1n3J26j82R6
3769G8p0L8O4M7k46Qn6J77q1N4l9K21r8l0mm15M07N6M1K9l20Q7J0Q5J18j28q5
3796e2MPm1J48J3j11k2M5J94j84M1j20J31K1J12l8j87M0J51j73j35K5J42j91K48
3821F8m6q2o4K04Mk20J59j00j2K07j64q6J33r3M5K26j58L7j57J05q5K11o0k53
3845a81J55R5n0k67L34p3J31k4j4j97o7K08J18j76j9j07P5L2j73L48k84N5n2J29
3869dK80l36L4j08J80N0Ok38q4K58J60J19k35r4n8P8M6k48N5L3K28k64J48Nl4
3894b3J22r1J2j39J30Qq2J25J24l5k28J40j17%Q8j3o2J8L55k45k23M4J70j51j
$$ plain form
3724 171 -140 -29 307 8 161 -96 15 170 175 81 -65 -328 146 39 86 -107 -118 -4 -2 274 6 155
3746 155 -12 100 231 137 106 -98 -33 196 89 -121 -83 -226 149 -1 -104 -25 -3 102 91 38 164 -18 78
3769 78 8 46 110 157 -89 -81 -137 40 -41 13 -26 195 97 67 63 -352 55 111 152 181 -139 -52 -42 43 161 33 -52
3796 -52 -48 -41 -82 66 79 -32 -54 -9 185 1 42 -78 53 74 186 148 -39 1 152 -21 -156 -131 11 -180 68
3821 68 22 -60 -124 80 84 -136 23 -77 -89 118 -46 -132 1 -92 -47 179 21 58 -99 6 -79 132 72 -181
3845 -181 -26 69 19 -248 86 13 144 120 106 -91 -158 50 168 -8 -27 -134 -59 -27 -200 148 -136 -81 -133 -4
3869 -4 276 -60 -26 -134 46 96 102 -136 -220 38 198 317 82 -12 -70 8 54 -194 -139 -106 122 -142 6 11 -23
3894 -23 99 8 20 -119 11 19 -63 62 186 151 -77 63 -54 -54 34 21 -41 -23 332 87 -136 -92 78 -73 -74
3919g4J3Q9l3j01K60q1K1j14p7L12j72r9j28o4J93n8K62m1o7K2r5PK7j77R8Q4
3945GO5p2j5K46k83P1P2j06j34j28K92P8j01n7R5j13mJ65j13J8K31l67L22k37
3969f8J84k35J81j98J92j24O8N0j19J33K5k55k9J07qK47l14L40o9j78J04Lk30
3992a93l2L58j93Jl1Q6J93j47J45n9k68J35j20P2k5N8rJ8qJ5O5q6p6J55N9k79
4018a66J83r2j08J77j21J55J00j10J39j01r9P4l4m8n0J81n0R9k11Q8j28m9J45
4041b6J27p3No3r9l9J35j43M11k83O2j29Q2O9N9j37J11K6k04J04j58J31J66j35
4065aQ3P4j62R3j68R1r0k0J06j8J35j20J54j96J08K18l36Jo5J8J61j72JJ42L7
4090G4q4m1K57n2k1q9j20J03j88J83n0j04J86o5Q0l18N02j38N3m23K87J47j84
$$ plain form
3919 -74 -61 28 -5 -106 154 73 94 -20 -97 215 43 -56 -184 -248 -55 -113 149 108 41 63 -32 -25 2 -175 -77 7
3945 7 72 0 -15 231 -52 19 91 -15 -149 -277 15 93 -8 -65 30 -83 -87 78 -35 -17 214 -153 169 -68
3969 -68 116 -119 62 -136 56 -68 0 50 -69 64 89 -166 -195 -88 -96 151 -163 177 108 -70 34 37 -193
3992 -193 -225 133 -60 -59 -90 -4 189 42 187 128 -140 -5 -125 -53 -78 -20 -29 -11 -19 -4 61 -25 -101 54 113 -166
4018 -166 17 -75 -183 -6 -127 28 128 18 157 56 -43 31 -3 -51 -101 80 30 129 -82 6 -122 -171 -26
4041 -26 101 28 33 -30 -129 -168 -33 -176 235 -48 14 -115 -33 36 95 -42 69 95 -109 -5 -163 -32 134 -1
4065 -1 82 156 -6 87 -81 10 -80 -100 6 -12 123 3 157 -39 69 287 -49 -48 -113 -95 66 -106 -105 37 74
4090 74 -10 -51 206 154 133 44 -76 27 -161 22 -28 -132 54 -11 69 -249 253 115 168 -255 32 179 -5
4113em4K4j90L42j58P0R6j83J43j08j22K00R9j68J8n0j5J99j69J62j50N5j48P0
4137c2J01j42J78r3R8j5j53K0N5o0N8j27P6J28k95K24K07k54j31R5N7L7r3J37
4161G6n3j79O4J77n6r7r7R0K4J97k00J62j47J11j08J22m5j62q2K09j11O5P0LK25
4186B58l43J07N5k07K28j90J87j21j57K30j97J67N8pp6N4O4j48j47K45l0QO9l37
4210b30J49P1J21k95P4J73n9J24Lk37O2K8p7J02O3j00J32l15K04N5q6Q6J06q7
4234F7j1q0kM8j85K77k38K9J85k83J33j0l5K8N2j52J48k0o9J56M8k4N4k44J91
4259F3j69P1Q9j81J37O7j43j67J45K3j09K15P7n4k9J92p5j58m6J22j56L02k44
4282b8K6P9n5K4j06K78j52L5J30k18kK3k2M5k40J86j22J29m7R9k35J46J4n9j9
$$ plain form
4113 -5 -49 -25 -215 127 -31 39 135 -48 95 -13 -135 65 164 -4 14 -36 -51 148 -21 141 -9 46 -102 -32
4137 -32 69 -73 105 12 110 95 -58 -38 17 -43 15 -112 -36 92 -203 21 228 -26 -157 -62 -5 32 -61 76
4161 76 23 -156 -92 85 29 -68 -165 -75 -51 146 -54 108 -39 72 -36 86 41 -121 -203 6 -105 -40 30 33 258
4186 258 -85 22 77 -130 98 -92 95 -26 -183 47 -150 17 75 68 -8 46 110 -38 -185 60 30 38 107 -230
4210 -230 -81 -10 111 -184 -110 63 4 128 131 -106 -44 -16 -93 9 72 -28 104 -211 -7 48 -38 48 154 67
4234 67 56 -24 -26 22 -163 114 -124 -95 90 -193 -60 -70 -105 -77 -25 -177 -29 -49 -118 38 86 62 116 -128 63
4259 63 -106 -35 54 -127 10 77 -66 -233 -88 -65 -174 41 118 64 35 227 152 -6 -52 70 -86 216 -28
4282 -28 -2 77 22 46 -60 218 66 101 231 13 11 34 12 57 -183 3 -119 10 -37 62 -173 -27 -13 -72 -91
4307i1M3Q7n8LJ09o4j19N2J01N6q3L3N8j11j31k6P1k8q2K77qJ1k99L33j14p8J71
4334A13j56R5rR5j08J0J56l24O7o0L85k67J8j3j00K22j18K8j2j58J24J4J2o9j11
4359a66L10l7j7j71j8M5n4P5P9p2j74L65k48J27k25L07j62Q3r4m8K4J12j00J10
4383E1n2J69j82j30j15K67J32M9j89K9j4o0J6l7J26k44j1K67k6o3p5M8Q2l14L55
4408G9R6l94K71j44o4J27K6K5Q3k19M19l87J77n9p9p4LK13J22l03L4r5J13J35
4432A05K6j90O2J27l12J42N5k5Q4j66J02J18k25Op7J53Nk03j0J77J52j35j05M0
4456i4O3N6j10R4m9m2N0P5j7J9j01j99J51M2j13L30j21q5J0Q0j08K71q2j20O0
4481F0rJ26k28J4J7J2K07k90K4K31p1L6j2j71J81p9m4j84K36n0o6J30k12q3L5
$$ plain form
4307 -91 -48 39 -19 -16 93 29 -90 -38 63 119 36 69 127 16 -115 -141 -70 -98 -180 97 89 100 -199 134 20 -58 113
4334 113 -43 52 43 138 30 40 196 -128 -61 -121 264 -3 15 2 -98 124 6 34 22 -136 -12 2 14 -55 -166
4359 -166 144 107 90 -81 -99 -54 -108 -33 46 -26 -200 165 -83 44 -181 126 -36 47 -47 -95 -71 41 -59 51
4383 51 -1 168 -14 -144 -259 8 140 189 0 29 15 -45 -29 -66 60 -184 -195 72 46 -17 -92 -44 38 -276 79
4408 79 175 -219 52 -92 -156 -29 -3 22 105 -114 305 -82 95 36 -43 -117 -114 99 221 -82 -48 -143 -30 105
4432 105 131 -59 3 130 -182 -40 15 -10 74 -92 10 128 -97 -91 -168 -15 -10 -213 -223 -46 106 -29 -134 -94
4456 -94 -31 25 -85 9 -40 -82 -32 43 26 45 -56 -255 -104 -62 -175 155 34 -51 -41 39 -69 202 120 0 60
4481 60 51 177 -51 -37 -20 -8 199 -91 -67 164 93 129 117 -54 127 48 4 -180 56 6 -60 70 -142 -225 -190
4506a90P5N8O4rj63R1P5p8M2j13J52j56LJ82k9p2K4R3k70L12R2l54K23j74J18
4531dN0k7Q7k3l7M4k60J54O0k21J44j57n7K90p0J21j31J12j15nO0L8r6m8J09k67
4557b49J94JJ43Oo0j54J33j4m0Q1k54K73q0J67m6k50L25j80q2J37j13p4K19J4
4581I7n1k03K32k81K25J44j99L5r2O4j6QK70k48r8K66j88N6N7j73Q3J06l12L08
4605I0J25k22p7j0K18J3o8j19J05l9K09l06J33j50J02m3j1P9kJ08k03Qj33J01
4629i2Q5J06m7L5j08L4J3J0k24L54o3k70J43r6K23j48K96j85j30L09j93j55mJ93
4653H6j03M7J43k39R0J88k36K7l9q1J74k54Q1q7K01Qj2qN7j7j3J15j91J56r8K96
4679B91l84L1J22Q4j92m0n1K27j87J59o9P0l1p1J00n2M5j17M5J85k21PJ3l1J67
$$ plain form
4506 -190 -115 -57 7 -2 -165 -74 1 -77 -35 -148 4 -152 -149 33 4 -68 -44 49 -221 91 183 -171 52 -122 -4
4531 -4 46 19 106 83 46 90 -170 -16 44 -177 -33 -190 -247 43 -27 94 -37 75 -40 -45 15 53 -43 -91 18 -249
4557 -249 -55 -54 89 95 35 -119 14 0 -40 41 -213 60 -20 147 101 -149 176 -4 -86 51 -62 -136 83 97
4581 97 46 -157 75 -206 19 163 -36 -1 -93 -29 -45 -37 233 -15 -113 153 -35 21 78 -95 -12 94 -218 90
4605 90 215 -7 -84 -94 124 137 69 -50 55 16 225 -81 52 -98 4 -39 -50 29 27 135 -68 -60 -193 -92
4629 -92 -7 99 52 87 -21 13 26 36 -188 166 103 -167 -24 -120 103 -45 251 66 -64 245 52 -103 -107 86
4653 86 -17 30 173 -66 24 212 -24 3 -36 -117 57 -197 -116 -203 -2 6 -6 -14 43 26 13 128 -63 93 -5 291
4679 291 -93 -62 60 144 -48 -88 -139 88 -99 60 -9 61 30 -41 59 7 52 -65 -20 165 -56 -49 -36 -67 100
4704A00k07M3K61l00O0J14j01N6P9j21o4K7L9m3QJ30Qo6j05j94L36M5j15k07J82
4729c5J07j36j12P4J70q4L9k0K49j34k18k5L65j13k87J90m2Q8J12m28J93P0N5
4752G8J1j90J01k7j19K10j30p0J86Lr0m6j39L54k33L07k52N1j43J22M4j25J8J50
4776G1m2j07J3J55j54R8j2n0p3J86j08j08K77j60K4n0J21J04L4j83j10p4L31k24
4800d1J67k02N4J70j83n0Q4P6k29M8nJ42O2j33N1J76j46J85m66K87j94P2J57j70
4824h8K51J23l97J08J04j86M5Oq6P0j27J77L3O0M3o0Qj43J2J89l3j52m9J08j38
4849a22K25P9k03L5J2%j31J77o6j00Qm6J48j34p8J14P8m3P7J61m1j20r0J39J65
4874B44l66J1Q3J78k96n1K92L8j05J96p7k86J87O3o7n9J8j22Q3p2K38m9L3k20
$$ plain form
4704 100 -107 -64 197 -103 -43 71 -30 26 105 -16 -80 -53 -14 -57 -49 81 89 23 -82 -276 60 105 -10 -217 -35
4729 -35 72 -64 -176 -102 68 -16 23 3 252 118 -100 -125 240 127 -160 30 -12 76 188 -240 -47 23 78
4752 78 89 -101 0 -27 -146 64 -66 -136 50 53 -37 -83 -222 132 -101 206 -46 5 -138 -16 28 -97 -79 71
4776 71 29 -78 -65 90 -64 34 22 -28 -101 85 -23 -131 146 -14 10 -40 81 185 219 36 -74 -148 183 -41
4800 -41 126 -76 -22 148 -35 -85 -1 75 -154 -106 -111 31 93 -40 11 187 41 226 -240 47 -147 -75 82 -88
4824 -88 163 286 -111 -3 101 -85 -40 -34 -120 -50 -177 0 33 93 136 76 84 -59 -47 142 109 -43 -92 16 -122
4849 -122 103 182 -21 14 26 26 -105 72 6 -94 -86 -132 16 -118 -196 -82 -4 -47 30 191 150 30 -60 79 244
4874 244 -122 -111 -28 150 -146 -197 95 133 28 224 147 -139 48 111 44 -15 3 -119 -36 -108 130 81 114 -106
4898a06l8J62L7n2J14j64K1k02J82J4J04n4Kj85K79pn2NK6k22L29r3j43m3J74
4923H8l02L89k11m9O2o3M2j31K22j01L3k02J72M7K93k76r3J33M3j26J51n8p0R8
4947I1p2P7O5k26J52j06l5n9o4J69m3k4R1n9k6rO4J86L3j32M2j7j25o5J41q2J05
4974G2m7Q6k92K44O5m36K51j66K48M8N0m8Nj39J95k3j78J7k30L58j34R4j15M5
4998c0J11k10O2l7KJ08R5O8k37J04K06m4k32Q7j62l5J42J49m04K07J01o1J30k51
5022a31J5K8k1m2R0j00K05o6L6o5oK21p5j02N9J2O0j18l7J04r4N6j11O4PJ22J6
5049A27m8Jk06J26L6R5nk23rJ13%j89L29k44q3K11qj14J75j87m2mJ55N7r1K14
5075A86k14l2N1K9K5k4O2k07q7K03m0K7L3mL5m2p8Nj9q5K25p2K05j59m5J37j16
$$ plain form
4898 -106 -144 18 55 3 117 -47 -26 -228 -46 -32 72 18 20 -165 114 107 55 60 86 -136 193 100 -43 -86 88
4923 88 -214 175 -36 -85 -23 -86 -44 -175 47 -54 -21 -223 -51 -4 289 13 -80 53 96 -30 121 63 -7 91
4947 91 19 96 161 -65 87 -19 -54 -113 -177 -8 -51 -75 16 -43 -69 -78 -14 172 205 73 115 98 -27 -92 49 -33 72
4974 72 25 111 -181 63 128 -308 -57 -223 25 73 123 75 80 -59 136 113 -65 -48 -278 80 -54 40 -75 -30
4998 -30 81 -129 -67 -104 -102 6 101 169 -68 36 242 198 -34 53 -109 -144 -2 147 -257 -50 51 -10 120 -131
5022 -131 -116 -88 -109 -151 -61 -161 44 -22 14 -51 -57 164 89 -13 46 58 118 0 -37 67 -27 29 -82 -18 -11 111 127
5049 127 79 80 -126 0 36 131 126 -97 -106 7 7 -182 147 -97 -180 31 23 -91 84 -103 -145 -149 6 63 -28 186
5075 186 -28 -60 -9 20 45 21 83 -124 -211 -8 -48 -21 12 8 43 1 -77 -72 -91 -176 49 -23 182 23 -22 115 -1
5102aj32O1K69m16J97P8j48J18j7r1l2r8R1K06p2j4P4j7mj77J79J86j77jN5O5
5128A82k83j01Q0jj3K29q4J41o5m9jj06K67m9ok57P0J48P1k16J12p2n6J93j78
5153d4o4N9n0N1m9J6k9LK9P9J59j10N2j02J40k31J12o2lP6r4J13n9N0j13Q7J2
5180B8p1Q2O8j9Q2j21J74m47J23r7O0M5M7q2p4K62j70K19j43M0q9N1K20j72rr9
5206i2j66K31J47Qr6q8K27k84J6k5N2J28p5K21m03J82j56K17K04m49J59j10J55
5229CQ3l2q2K36k78R4p0M4J49k17L3J39J47j05j26j41J06n1K13k73J72j57qN3
5253f8R8o9R6p9q9J15J19j23J9J7m7Kj33J48l6K3K10k30M7q7J88m6l0j00L9j7
5279c3J55j41k8o2K51j42JJ10j08j08K79j78j28K09p2pj17Q9J23m7J1m2OJ42j16
$$ plain form
5102 -1 -133 -72 197 -219 -22 56 -92 26 9 -82 -114 -212 -121 85 13 -1 73 56 52 -125 54 240 63 62 117 182
5128 182 -101 -202 -122 -123 -136 93 9 150 85 36 35 -71 196 147 141 -116 -46 102 173 -43 69 -3 -59 134 -44
5153 -44 -108 -49 -99 -48 -97 -81 -110 -107 -78 1 160 50 102 0 140 -91 21 -41 -44 32 -62 51 -8 42 -71 16 28
5180 28 -43 39 107 88 170 49 223 -224 -101 -198 -138 -93 -46 -128 -202 60 -110 109 -34 6 -83 -32 188 16 7 -92
5206 -92 -258 -27 120 128 32 -56 171 -113 -97 -122 -70 58 -17 204 -199 -17 -173 44 248 -201 -42 -152 3
5229 3 86 54 -28 208 -70 24 -46 -2 147 -70 -37 102 249 144 18 -123 -17 -68 145 -128 44 -113 -121 -68
5253 -68 30 -39 57 -22 -111 4 123 0 19 36 -11 -9 -142 6 -30 -7 203 -27 20 -67 121 75 45 -55 -16 -33
5279 -33 122 -19 -47 -109 142 0 1 111 3 -105 174 -4 -132 77 5 -2 -119 -30 93 46 57 15 21 163 47
5304D7j59K33j32P7q6J5j35J63P8O3l30J34Q4Q7l0p2O5l1p7k33K83J6o9M3n9R3
5330F8j16J84k61J72j50N7M43m77K76j09j41P1P2j00J34j61l8J68M6j53l6J78
5352A27j64J5Q0P6k49j33K43N9j48K15j42P0Q4l14J59mj2q3J75J10R3j79o5P8
5376I1k08o1K24k1j07K70k04P8j05mQ0k31M03j60k42J60K1l8om1J06q7K03k47
5400a26Q5J16L9l9P7l20K25l8j07J03l9P9J6P7q1j18M8k02J72j6L13k43l6M0k67
5425b42L62l32K05m7J79q1j55Q0J19L4k23J59o8p2O7k7K1k3P6o7p8j97K63L6j49
5450a60J28l7ol9K18r0j17J31L9k2j94J78r0K16j52nl8K84r2k20K34r3n2j11J21
5475C1p5M2r6M1M3pKk25J79J0n0J7L8K86k02oq2o4L5L6n5J6O7R8j58P2m4OK4j51
$$ plain form
5304 47 -112 121 -11 66 -20 -5 -140 23 101 164 -166 -32 52 139 109 37 102 71 -6 -239 44 60 -9 34 -25 68
5330 68 -48 136 -125 47 -103 -46 397 -80 196 87 -54 17 89 -11 123 -38 -76 92 138 -15 -51 127
5352 127 -37 -22 58 134 -115 -248 -5 54 -94 121 -21 49 133 -181 -22 -26 -38 -121 54 164 257 78 13 91
5376 91 -117 -178 46 25 -82 188 -16 62 -43 -47 33 -198 205 45 -197 -37 -16 -54 -60 -101 5 -82 121 -126
5400 -126 -41 75 114 75 152 -168 57 19 -88 15 -24 55 71 148 67 -51 -3 -205 -33 -49 264 21 -15 25 -242
5425 -242 120 -212 -7 -54 125 44 -111 -31 88 122 -101 58 -10 -82 -15 -42 -21 -44 32 -35 -113 -310 -47 -11 -160
5450 -160 -32 -69 -75 -114 104 14 -103 28 67 45 -149 29 -61 155 3 -2 -40 244 152 -68 166 73 21 -90 31
5475 31 -44 -2 -98 -57 -14 -21 -19 -244 -65 -55 -105 -88 -50 236 34 28 -54 -118 -83 -47 -102 -86 -19 79 -79 -7 -51 -45 -21 -172
5505a72P3k11L71L4j48k6P9J08o0q1l7L5l1K59k29K8k3o4L07k99j85Q9K42n6Q1
5530H4K8k10K32k93J60l5J77j76O1J21j65J07k9j67K02j23m3J25P6q4n2jM2n6
5554a9p5J80o8J16k25J09l3J69k34K49l50k7M44m28K52J46j86J36k30K07j73p9
5576a19R4j88K78Rl19J79J25K6p1N3k3nj03J5N9p6J33q1q0J11k2N8j09O8j86L25
5602A51r1R5j17j14M6O2O7j50J4L5K00o9k30R9k5J4o9k9J83j27J76j36K0jN0K7
5628H1J05p2j65R1L5J8l56N4K64J3kl3r4K02r8P5j2k56K0%J32O3j8j14J2J15N8
5655A18j60o1Q5j9n7K8M8K8R2o0N2j83J87k00J36j7j9q4Q3j58J09j1j28L76l40
5680a55J70p6mJ16j90J91j8R2k22J99J23k68j50K08J57l13L84k59j16p5K69p6
$$ plain form
5505 -172 -99 -310 61 95 -53 -79 0 108 48 -33 -70 -35 -66 193 -36 -8 -31 -95 212 -87 -272 -183 59 3 84
5530 84 112 -98 134 -159 1 -34 143 -33 28 149 -16 91 62 -105 97 -26 -69 56 132 48 -4 -5 37 -19
5554 -19 -94 86 18 134 -91 18 -15 154 -80 169 -181 -208 236 -192 60 206 20 156 -74 133 -40 -119
5576 -119 -25 -213 65 74 -245 -66 59 85 14 67 44 39 -64 -49 10 -66 67 -14 -94 17 -5 53 -56 12 -174 151
5602 151 60 155 38 -76 -30 32 99 -51 -37 -2 198 129 -101 -2 -27 -13 -82 -111 72 -55 121 -15 5 4 54 81
5628 81 186 114 -51 40 75 93 -263 -209 55 68 66 33 -61 141 43 118 106 -150 -130 -130 2 65 47 -67 -55 60 118
5655 118 -42 -103 -18 -37 -94 -66 -18 10 102 42 94 -89 98 -102 34 17 -2 -86 -3 -161 -52 -63 -191 185 -155
5680 -155 15 -61 -65 51 -139 52 34 126 -96 103 226 -42 -192 16 173 -140 244 -15 -131 -206 63 -13
5702a3J29j77P2J46k92R7K84k66J35p2J54l80L65j71P8k24L39j46k0q9Q0J05j49
5725a5N6R6j24k23K17P1m9o7n1J89j17R7j06K8J75q2j13m8O2j08M5j20J57r3J4
5750a09J58o7L7nr4P2rK2k1J33L3j90N4M6l7j22Q0N9O2j29j5R8p0r0J25L6j78
5777a21J35J57j64J53j00Pj10j4k9J69j04JJ02N3j81m4J16K5q8j42K17j14P6J83
5801A83k3j99J11J76k54k9P7Q4j88K35r7L3o4q0J52L7l2j30R0lj5lO2j74R6J2
5827E7j90k1K27j01J61k0j91M9K6n9m7K14k40L04k5k6l7j43J47m0J80l86K19l7
5851B1Q1M9j97n3L34k63j2l8N2Q6R5j47MJ39j29k21Q5M9L1O0K0j3j72J90Q4n0
5877H5ln6m1LR7m3J68k34J89j14p4p6J38K0j20k1n7Q0P3m1k9Q9r8J61j09p8K48
$$ plain form
5702 -13 116 -61 11 157 -135 -38 246 -20 115 43 197 -183 182 11 89 -135 204 58 38 -51 29 134 -15
5725 -15 41 137 13 -210 7 78 29 -38 -89 100 -17 80 -26 2 177 95 -18 -66 -4 -112 -67 -187 -30 -123 -109
5750 -109 49 -18 19 14 -80 -8 -17 5 -16 117 150 -40 14 60 23 -99 -19 40 102 -27 -42 56 -14 -104 21 57 -121
5777 -121 14 171 7 160 60 67 -43 -57 -86 83 -21 -20 82 135 -46 -90 26 51 -37 -179 38 -76 0 183
5801 183 160 -39 72 248 -6 -35 42 126 -62 173 76 109 45 -35 117 154 122 -8 82 79 64 61 123 -51 45 57
5827 57 -133 -154 73 -28 133 113 -78 -29 -3 -62 -109 105 -135 169 144 118 81 -62 85 45 225 -161 58 21
5851 21 102 151 -46 -99 235 -28 -40 -78 -26 60 155 8 12 151 22 -199 -114 -65 -34 26 46 33 -139 51 135 85
5877 85 82 26 -15 -12 85 42 210 -24 165 51 -23 -99 39 59 -61 -82 -139 -59 14 -27 -56 33 -65 96 -13 -91 157
5904A57k64P9m8L1K5L2J01j91O9l03L51r7J9m9Pm0L7K14k60J7J79k67J26M5J6
5929a4j35k6J54J22k33J22j8J24n8J49r2r5o9K70j61P8r2j58J12O5j39j9Q3r9
5953a29J40J2J16K4k35P8l1J43k64R2O8J33o4Q4k63J22J32l8P8k04O2k5n0J51
5977A32o4l00K25J09KK75n71J72R5j84L18k40J83o4j11J2j21J33P2kO2j15j54
6000a36N4K5J4rK40n1k26J36J7j2o6L2p0K21k50J86j06j4j47J66p4L30m07J44
6024cJ27l6k1j17L6j86L14j53M1j02O1R2k8j27k6J61j74J77N1j80M6N8Qn0j66
6049a97K99j01j10P6J67m9m2p6J49j37J03k47K15j76O9K01l9j15O3J66k96J81
6071A04j14J63j34j0j49J94l0J2j76n7J37M4K9J13q3O0k0J79k20j08J23j92K80
$$ plain form
5904 157 -107 -28 -76 -45 -20 12 113 -78 -9 -312 39 -58 -39 -88 -81 -121 -84 130 -130 -113 66 -201 -75 -30 -14
5929 -14 -149 -175 -21 101 -132 -10 -28 96 38 187 95 0 -69 201 40 118 26 -132 -20 45 -94 -113 -30 -129
5953 -129 11 23 139 163 -72 6 -25 118 -146 -54 14 147 83 167 -96 26 158 120 198 -6 56 31 -19 132
5977 132 68 -232 -7 102 104 379 -192 -20 75 -109 209 -31 152 88 -23 -11 -132 1 73 71 133 18 -136
6000 -136 -82 -57 -43 -52 188 137 -89 47 64 52 -14 18 -52 169 -81 105 -1 -15 -162 4 -70 260 -147 -3
6024 -3 124 88 67 -50 -14 -200 114 -39 2 -100 -39 53 25 -102 -128 33 -141 36 87 -93 -47 11 19 -31 -197
6049 -197 102 1 -109 -33 134 85 43 -33 116 -21 82 -165 50 -126 -57 144 105 -10 53 219 -77 104
6071 104 -10 153 19 9 -140 54 24 36 -140 -197 -60 -16 13 126 43 103 83 262 42 -66 57 -135 145
6094A45k15P5M0j36J49K4N2j86j5j33L15k65l2M64l46j1M9L55k22n4kjk7R9j87
6119f5J51Nj05j7O3rN7k7j9J2j72J70J0K0q1j49K16l1q5j37J57J18j80M3n5L4
6145g6l2M5O0O0k2%ql1MjJ3j53J87O5p2j44K3k2Q9J18q5j9j65J48n3p9Q0J80j21
6174a1r2P1j0J61r3j21J74p8q5J14j54J56N5J07k49R5j50K54j47j48K21p5m5M0
6198a0J3k02L73j56j45J95J27j17j69P6j13r5K29J05j93k9J21J44j16j5N2n7J35
6221A53N9k88N0J16K6j74P9J17j57j6J09k7J1j33J6J22J35j08Pk40K37mKR1k16
6246c3p3J48R4r7L3k73J59K5J18p0j87J27k0J81j31O6lo5N4l8J04k19J30k03J20
6271e3K04j73r6N3J5P3k4m5j92L10j50K40j00j16K11j36p5Q3n0p3L58l31K8J13
$$ plain form
6094 145 -70 5 45 -91 58 82 134 -52 -67 -200 115 -150 -182 282 -64 -75 -26 329 107 53 51 50 23 122 -65
6119 -65 86 91 -14 -31 32 23 80 53 34 46 -126 44 54 74 -7 -156 60 29 -56 -193 -36 82 -98 -55 -110 -76
6145 -76 -108 -63 -3 57 35 35 27 -4 0 -1 12 -141 46 111 39 -105 -82 -104 -15 103 18 -1 -166 -18 -71 -150 -70 110 -11
6174 -11 -103 -32 -42 119 26 -95 79 1 -84 30 -124 32 87 194 -55 40 -110 144 -3 -151 70 -5 -50 -10
6198 -10 3 -199 174 18 -127 68 195 78 -91 -15 -128 -223 6 111 -82 -111 10 154 38 23 75 18 153
6221 153 212 -76 -26 90 116 -58 21 138 -19 -35 74 47 58 -75 -59 63 198 90 97 -143 94 90 92 183 -33
6246 -33 -106 42 136 39 72 -201 -42 -17 101 31 -156 -29 -49 132 1 67 64 -1 53 15 119 -100 30 -173 -53
6271 -53 151 -22 -118 -65 -50 23 -1 -46 -238 72 -78 162 62 -54 157 21 -54 29 -21 -94 264 -67 -39 74
6295G4m7q9P9J88r0j06l9J1r3O4L7mm9J39j30J34k5j01J90l72K97k4n6J87j41
6320C4O8L6k00p1O5J02p6LM3j17K56k00N8J9o7lM7J15j05j58M9J26o0k6J8ON0
6347A2m7O1m9L1r5J11K0j8j67J98j19O1j14J09LJ05J42j95m4o3Q9J09l41M49k71
6372b3p9R8j19L46k28J4O9j51N7j15J79J29k20K09j37j73J44qN9Q6o8p4K06k3
6396A78o4j91kJ51m0k8mq7k0J10m5J12m4Mj77J84j43O8MLq7K84k01r9Q4J81k2
6423A09Q1l27M9J09K6j7o1J2j39J1J62J73j63J11l40J75K29j50j19j02R2M2r0
6446a27K59j22l7j90J38p1J72J0J06k25M8R1k69J95Q7k29O9k7J91j7L5q6q8J99
6470A12k03K19k71J97m9M1r4R5j20J61n2j88P5PK1J41qj05j17J35L7k1O3k59K27
$$ plain form
6295 74 27 -62 17 205 115 9 -30 -19 -112 -48 -11 -15 -64 75 -55 79 54 -47 143 -229 68 44 -12 175 34
6320 34 102 138 -62 -133 -68 34 -42 -39 4 -113 143 -57 1 20 -47 -50 -3 112 7 -151 -102 24 -36 -62 -44 -38 12
6347 12 -35 26 -23 8 -87 24 44 26 -141 57 -62 -1 -115 -6 -3 102 244 49 5 -58 31 140 -201 248 -23
6372 -23 -102 -4 -123 223 -5 9 78 -73 -16 -131 48 177 -43 166 29 -144 0 -8 51 137 69 -5 201 178
6396 178 114 -77 -79 72 32 4 0 -87 -107 3 -42 70 26 30 -147 37 -106 -38 -34 -31 -118 166 -35 -134 -50 131 109
6423 109 190 -137 -88 21 47 30 -31 -19 -158 -147 15 188 25 136 -204 -29 200 50 -69 -171 -79 -37 -127
6446 -127 132 10 -27 -217 -79 -150 22 32 138 -87 -39 52 -217 -22 65 -164 -95 -122 69 52 87 1 -87 112
6470 112 -91 128 -143 54 5 46 -48 47 -73 88 36 -152 -77 -70 -49 92 84 -21 -138 -3 34 13 76 -183 44
6495D4l7k12J77J58k13J80j43J80p3j13J87k10Q5j36J25o7j2J38m7k6Q1k0nq0
6519c9r4J82k8O9oN9j11j02J04J07l17L19j70J2J57l8N2k19O8n2J20O0k12N3J90
6544A64k70J71l47L34M0p1q8m6J01k4O1NJ24l49K53O8k02J13j70K15k3j66J34
6567B7lK6N1k6M7j57K41k98L2j46L43k55J27L5J28o9j30j6J83j42J49J34k89m
6591a2r7O6N8J73k48n0R6j13J91j61J12m1M2K0L4n5j1J87k74K78j35o7M5r0N7
6616Ej91J98p0L9O3m8l05K57N5j30K13kn5M3o1P8M0k4j27j43J43Rj25K4J32p4
6642e6K15j16O0j25M5J68j24J59k12J44j77j43K87J1j53Q9O1l33K0Q3J22p4Q9
6665D0k53L45n3l3r0J11J0k11o2K32J29j98J13R2l9r8j65J35j51J26J35J3j45
$$ plain form
6495 44 7 -205 -28 130 -83 97 -46 134 61 -52 135 -75 10 -126 -1 -68 -80 58 11 -15 66 46 41 -39
6519 -39 -133 49 21 90 84 143 32 -70 34 141 -176 143 -27 -15 142 104 156 -63 5 -47 73 133 -79 -26 164
6544 164 -106 65 -282 52 92 21 -67 -113 -12 -36 25 30 154 -195 58 126 -76 37 -133 82 59 -107 27
6567 27 24 50 101 75 122 -35 206 -92 -60 -206 137 -118 9 44 172 103 -27 -43 140 -2 147 281 -8 -12
6591 -12 -109 -43 15 188 -60 -110 -14 -127 64 -97 15 -26 16 36 70 15 4 191 -83 195 60 -7 38 -52 5
6616 5 -186 12 -58 -19 44 -4 -309 -52 3 -127 86 84 29 72 11 89 129 105 -22 -165 -22 -13 -138 -114 18 -56
6642 -56 159 43 103 -22 23 191 67 226 14 158 -19 -162 125 136 -17 72 133 -200 -180 -97 25 -49 40
6665 40 -213 132 79 46 -44 67 77 -134 -196 36 165 -33 80 172 133 35 -130 5 -146 -20 115 128 -17
6688a7q5M2K42j95k3J83N9k90O1M2j89L87j27j10j75R4L2o4RK66j92n7J9q1K62
6713I3m1j46K82Q2k62P7m7P5p3j87J94j65J23K65j63k51Q9J57PL0Rl82J61J97
6737A24j55l1K4k4lp5J60R1j14L4m5J20o3L7r5j8k9j10P1L7Q4N0j96K0L50j94
6763E0l3j57J98l3k87L45K9j4J9k09K31j3J8j40k18J27J04M4o5j19K73l52N9K23
6787H0j67J66q2n9J08K0k13K48j51J06J62j42O7J17k45P6J56k73J6J23j18J5J15
6810A25MKn8j10R9n0N5l6m0n9m2J67P0k2j0j94J28j21O9J53j69K53k63N0j62K17
6836E6j51K5K50k6k38P3J67r8j05n4J9M7R3j48R5J6j70J94n1q3J65k10j0J01L1
6861a2J45k14r9J97Ko3J07q6j7p1K17j93J96j67K6P3j56N0j76K40R2k01J01p2
$$ plain form
6688 -17 -102 -60 182 -13 -36 147 206 -84 -23 19 -170 217 90 -20 -195 -101 -69 -133 -124 142 -50 -107 -88 -169 93
6713 93 52 -94 188 270 8 85 38 113 40 -147 47 -118 5 270 107 -144 -55 102 109 139 148 -234 -73 124
6737 124 -31 -62 -38 -62 -65 -140 20 111 -3 31 -14 106 43 80 -15 -33 -62 -172 -101 -64 20 70 -126 -106 244 50
6763 50 17 -140 58 25 -262 83 112 98 117 -92 139 126 144 4 -214 -87 17 61 -4 -123 150 -202 -143 80
6787 80 -87 79 -3 -62 46 66 -147 101 -50 56 218 76 143 260 15 91 247 -26 -10 113 -5 10 125
6810 125 129 131 73 -37 62 12 67 31 -9 -68 -110 57 127 105 95 -99 29 -92 -23 130 -39 214 -49 1 -161 56
6836 56 -95 -70 180 154 -84 -11 156 58 -47 -101 -82 -35 58 -90 5 21 -149 45 -6 -89 76 -134 -144 -43 -12
6861 -12 133 -81 -180 17 19 -44 63 -23 -40 -111 106 -87 109 -58 -32 41 -115 -65 -241 -1 91 -110 -9 -81
6885h1J32N8l65M43J4j64j14k8J97L0j50O7R3o7r1MJ00K2j22m5l3M4J09J3P7k58
6911a15Q8P8j17Qk3j25K41L7m9P1r2oj19L0J16L8J40j40j0K93k86l0o2J07p8J15
6937A10j87K1J61j19O4k1K20l54K29rL6l18J76J73j34Nj72K33r9j50K14j9j00
6960d0n4R4J59l14J98q6M6J82j82k23J69j31J84j53MJ16J25L5l25K80j65K8j07
6983a60J86m7M7m6k23M26l57J32K5n7K34m6k4Pj34J50q9%r2JJ2R9j7J48k3j14
7009C8k03O4N9k7K30o0m8j08j3M7p9J3K13Jr7o1J19M8jj18Nj7j20J26l6K3M1J64
7037B03j74n5L0J2k6k41k7K68J06K26j57j92O5m0r0J62Or6j21K50j78k05R1K71
7061H8k6j14J53n3l7L1j6l5J69m0j33pJ45j67J33o6l1J02j67k2J03k8J07j67j1
$$ plain form
6885 -81 51 109 -256 187 201 37 -77 -105 92 122 -28 39 132 65 -26 -22 78 100 -22 -67 -100 -56 53 66 143 -115
6911 -115 -27 51 -66 -58 -81 -206 35 72 23 94 2 -4 -123 -93 23 61 201 61 51 344 58 28 -34 73 -5 110
6937 110 -77 -56 105 -14 50 29 249 -105 124 115 151 -167 9 182 48 53 -119 114 15 -135 79 60 -40
6960 -40 -94 0 159 -155 43 -43 3 185 3 -220 -51 -182 2 -151 -147 -31 94 129 -196 84 -81 -53 -160
6983 -160 26 -21 26 -20 -243 183 -174 -42 -17 -74 160 114 90 97 -37 113 24 24 -68 -67 -55 44 27 175 152 38
7009 38 -165 -101 -42 -69 161 101 53 -55 -68 -21 -100 -87 126 127 30 -31 88 136 135 17 22 5 -115 11 -25 -2 39 203
7037 203 29 -26 4 16 -10 -251 -278 -10 96 322 165 -27 38 -2 -92 70 76 -20 -141 109 -69 -274 -183 88
7061 88 62 -52 101 48 11 42 26 -9 160 120 -13 -20 125 -42 91 25 -6 96 -71 -93 10 -18 89 -78 -89
7086h9l5N5j43K34m4K2qJ19j12Kj2j49O3m6K07r5J44j05j0O2j58J74j21J26j19
7111c8K18k36l2L0K3P4K9pk18R7J82k01p5K57K1n1J04k73M8K4q4K37j69m2J08
7136B6M1r4M5P9p8j88J62J51ok59J90m7Q1l8j36M5L9m2P0J12j77J49j85J26o8
7161bl1Q3o7r1K1oO6R3k03J15q7M24l01k20K64p4N2m5KJ91r1k12M2L10j26j92
7187h5M4J3J63q2Q3L2j67j56J78j05j57L04J1l0L2p1K4O2M2j61P1n5Q0j80Q2J6
7213a2m7J16N9j34k6J47q9J6j46J82k50K04J0J1j93K5O8M1r1J50j2j66R7j5J25
7238G0r1R3j56J06j19Q5R5r2r2K4J01M1k36K21p7o1J76j87q7K26j22J92j89K3
7262e6j07K21K10k13k31K18q0j8j2l1l9J54k8L02l44L6N0m6J38j14j25J1J57J16
$$ plain form
7086 -89 -124 -69 -212 22 -22 0 -8 111 -1 1 -11 -160 -97 -143 64 -31 113 8 -2 60 -98 76 -45 81 -38
7111 -38 180 -56 -88 -58 -35 39 68 61 -157 -60 122 -79 -154 103 124 73 177 -96 -48 -24 -108 129 -40 -82 26
7136 26 67 -27 18 97 19 -169 -7 144 138 -121 69 22 103 65 -71 -26 13 -29 41 153 -24 125 -60 66 -2
7161 -2 -33 50 -17 -108 -87 -93 -27 66 -137 -22 -109 315 14 -206 58 -16 36 -9 -7 184 93 -119 -77 233 107 -85
7187 -85 -41 -28 135 53 136 168 1 -155 23 -82 -239 65 76 46 78 7 31 93 135 -26 45 -10 70 -110 -28 -12
7213 -12 -59 57 116 -18 -44 103 14 30 -116 66 -184 20 30 41 -152 -127 -59 -18 -109 41 29 -137 -40 -55 70
7238 70 -21 72 -84 22 -97 -12 83 -9 -101 -77 24 65 -171 50 -27 -88 88 -99 -186 40 -82 110 -79 -56
7262 -56 -163 58 268 55 -176 42 -38 -56 -68 -99 -138 16 -12 290 -54 -18 32 -14 124 10 -115 -104 53 169
7286A69j21J8l7l9M4l1J20j67m8J69M5K9j19j45K88j06l5l9N2J06l43J98P6k4
7310F0j31LL51k85q9P6L35l08K7M6M0J3p5j52K9J40j08j5Q6k6N2k07J55M7o1K0
7336B3j44K69k25K64l28K1L4K63K3q4M5k79K9K30j38j30J03m5R3J02l01J98O3
7359H6j21r2nK27j59p1M2J05L2J05k15J05k5J76j37j84K9j7MJ39M5K6n9q0N1p7
7385g0r5J43OJ1k7Nq7J55j7lJ7K8O4j83l4J26N6K2L1j39n2K8Qj9Q3l7L4o8j93
7414b07J98K1k07K17l4J37j10Q2q9k17J61R8Rj57o4J91P0k65L21k45Q9P1K4Q0
7438A74o6k8l05K13j30K81j15j23P1QJ64j30o7ol2J23l6J97o4j55J5J3Q0Ok4j26
7464f2O5o4nj20k4L17N5k15N4L8J49j41N5m9k4M4j39j34O4J27R1j92O8lJ01pp
$$ plain form
7286 169 48 66 29 -10 34 3 123 -44 -92 77 122 151 32 -113 175 69 34 -5 47 153 -190 8 84 60
7310 60 -71 -68 283 -2 -91 -15 320 12 39 85 125 138 63 -89 -60 80 -28 -43 43 17 69 -138 17 64 3 23
7336 23 -121 148 -77 187 -141 -120 -86 177 200 116 161 -118 -89 141 3 -127 -24 -69 24 126 -175 23 86
7359 86 -35 -127 -132 95 -64 -135 -93 12 44 149 -66 39 14 190 53 -131 -102 -119 -115 24 69 95 36 -44 7 -70
7385 -70 -165 -22 -16 -5 -32 -27 -114 41 24 21 38 66 130 -53 -87 39 95 117 148 9 -43 -15 -7 -26 57 20 54 -14 -207
7414 -207 -9 12 -195 22 -12 125 15 97 8 -209 -48 50 59 -98 -162 29 99 -166 155 -90 -1 70 94 174
7438 174 108 80 -225 -12 -142 139 24 -99 -28 -20 144 14 -53 -59 -91 32 -4 193 129 -26 -11 2 82 88 64 -62
7464 -62 3 -61 -66 -186 -210 107 162 -53 1 39 188 47 102 53 29 73 -66 -200 -136 -9 82 -110 -42 -45 56 49 42
7491D2J65j94Q1nj73KJ88k8j43o1J17j9k6J34j26k3Q5j84J65L0k11J19P8Nj04
7516h6J40j47M2J11j98K86k89J91K58j81j22J00j06J08j6j53J8K12j54J39o5j24
7538c6j14jJ63N7j7J25l69J08J97k41K3p5N3n7J54j9Q3j14m0J70o0J41l53K60
7562C8r1k3OJ38k06J66O9j49l6K85j73o0P8L9j44%J0J12j01J23J6j05j00K37j23
7587Fj56K14M1k10K55j22j27n0K92k03m3j6J47k63L30M0p6K6N1m0k17K63k45j06
7611b09K07M7m7j12K47j15J2K2j8Pj55M8J01M7J50j53l54L44p7Nj3n5K1LJ52k85
7637a80L47k35M7jM8J3J9k2J58j90j11M2N4J75j40k4J14m5M7nj43r4J23j4K1J08
7663A12j02N3K2j39J95L3r3j74J54j69j4N4j65J86J69j42L3r0J03k67J77K90j05
$$ plain form
7491 42 207 13 94 89 -84 -82 106 78 -65 -126 -9 -28 -54 80 -46 -69 16 -168 -3 27 -184 -65 13 18 -86
7516 -86 54 -93 -51 60 -138 148 -141 50 308 127 5 105 -1 107 91 -62 -44 168 14 153 88 -36
7538 -36 -150 -151 12 69 52 177 -192 -84 113 -128 -105 -180 -127 -184 -30 -49 34 -80 -120 50 -10 131 -222 38
7562 38 -53 -76 -70 68 -138 28 97 -52 -88 197 24 -36 42 81 -63 -63 -53 59 -42 81 97 -8 -108 129 6
7587 6 -150 64 105 -105 150 28 -99 -149 143 -60 -103 -119 28 -235 95 135 59 85 136 96 -121 142 -103 -209
7611 -209 -2 45 -2 -114 133 18 30 52 34 41 -114 -66 35 82 232 79 -275 69 -8 -3 -16 -71 -50 -47 105 -180
7637 -180 167 -68 -21 -22 26 39 58 36 194 4 -107 -65 -11 164 24 0 114 69 116 111 -32 -126 -3 -17 4 112
7663 112 10 63 85 -54 141 174 81 -93 61 -108 -122 -68 -233 -47 122 -20 13 -77 26 -241 -64 226 121
7686A21K7l4j91pJ83Kr3Kjj31L71n0k48oJ40o0N1j76J22K5L0p1J05o2n1j4J18
7713A02R8j78r3J09k0j66J14J77q8j10J10KK92k22q3q4K09j45K5J61l29Q0M1R2
7737I4k1O1r1p6O1j85M3J17J50j97N6Q5k38K14M1j52L07j67q7j68R8J15n4r5L5
7762e4Q5n3j53J85Lj29Q4K8p3J87j40pQ6r8n6K34j37j6J33p7j3M5j69J51k38J77
7788a5L34k97K9K4o7k62Q1Q4J24p0J28k69M6J93j23J32j19N1J17k31L19k53N3
7811Ij52J55K9N8j11n1J07j43kJ9J67p1m9J1J37j08l7N5r4J05L4j01N0r6L5R1
7837D7K7j62R1j85K33p9j07J55k1j26L8n9J19k0J36r6o2J8jR8L7J06j37j4qj16
7863h8Q4m1P1j20l5L8J42l2O2k3j60k2K57QO4j69q2L0R6j32J49M6j84K18j69o9
$$ plain form
7686 121 148 114 -77 -84 99 101 8 10 9 -122 249 199 -49 -55 85 25 76 -100 22 47 77 6 111 49 -2 -16 102
7713 102 200 22 -71 38 18 -148 -34 143 55 -55 55 57 349 127 44 -40 169 24 49 210 -119 -39 2 94
7737 94 73 134 43 -33 28 -157 -114 3 153 -44 12 97 -141 73 114 -38 269 102 15 -153 -55 60 6 -89 -54
7762 -54 31 -22 -175 10 13 -116 -32 -4 -77 110 -30 -37 49 -49 -105 129 -8 -24 109 32 19 64 -105 46 -192 -15
7788 -15 319 22 51 75 8 -254 -173 -89 35 -35 93 -176 -130 63 -60 72 -47 4 121 -110 209 -44 9
7811 9 -143 12 41 99 -12 -63 44 -99 -101 -82 85 14 -35 -24 113 5 -32 23 -71 34 68 -33 17 -79 -44 47
7837 47 74 -88 3 -182 51 -28 -135 20 -1 -127 -89 -148 -29 -49 87 -9 -71 -53 -54 44 81 187 50 36 28 -88
7863 -88 -4 -45 26 -94 -129 -91 51 19 81 58 -102 -124 133 141 205 36 -46 -16 80 -52 97 143 -41 177 8 -61
7889f1q2K79j47j0J39k88L06j35j3k6RL6k5O6np1L1p1K53J18l93M8O0P5j11J32
7915A14k53Q0K8K7J85l27J35P3j30j23J47J72j56J08J51l17Qj2J54O3O1j60m3
7938a5R0lj16J1R1q0l1k1MP6N4r2J77j07r3J31M2j21J23o5j03K12j65k8j89J67
7964e1l4nK07k28J86j6L1O5j07M2j54R0O9n7nj4j47J48J05j08j05K97l24pJ10
7989a2M9K97k89j70J91j14P5j47P2J08j44M7J61jk5J53j94J0k90K12K4j19o8L47
8013A73l2j93N2J44l43K97j90K32j25j7O2J95k20j87L50k24N5j90K38j1l2j9P6
8036I1n0J38R2j31n8j8N9l4q4j3oj30J33K21l11R9P5P1kr9r2Om5J55j09qM6pp8
8065h9M66k01k93O5K58j71KK79m60L14k04J02k4o8j27J39P7K1k42K45Or1L1j06
$$ plain form
7889 -61 -143 136 -11 -21 118 -170 136 1 -12 -38 -29 7 -18 48 43 -28 3 -68 185 303 -90 -42 18 93 -18 114
7915 114 -139 -59 -31 -4 181 -146 -11 62 -68 -191 -44 128 -28 80 231 -86 -78 -90 64 127 188 28 -15
7938 -15 75 72 -44 -33 58 -22 -53 -74 -70 6 60 -32 145 38 -55 76 118 -3 120 55 -48 164 -1 -29 -218 -51
7964 -51 -85 -90 117 -111 75 59 90 155 48 90 -64 26 95 38 33 19 -128 20 125 17 -88 209 -115 -122 -12
7989 -12 37 334 45 -125 66 -48 27 -120 -48 60 -84 -37 124 123 98 251 57 67 -223 -11 13 -106 -174 173
8013 173 141 -52 0 144 -199 98 -92 140 15 -2 60 255 35 -152 198 -26 29 -161 77 66 34 15 91
8036 91 41 179 271 140 82 64 123 89 5 -8 -14 -144 -11 210 -101 -2 73 144 142 43 -49 -43 -88 67 -42 -50 -4 -11 -89
8065 -89 377 176 -117 -52 206 35 37 316 -144 170 -34 68 44 -24 -151 -12 65 86 -156 89 95 4 35 -71
8089g1O6J14l2r6o0O4j6J78j40Q3j59P4n4m1K32q3l27L91j17Ok0j49J17j27J55
8114a2q2J11kK0r2Q2J3j21L3r2K39l5o8j30J99O4p1p0J60k4m4j76J13j19K10m0
8140F6k4l1M7Rkj34N4K70l64j0J32j25N1P3J2k44K64K5OQ6q5j52j8J31k02K68
8166A03k56l6J61J96j68N4m3J72r1j04K8k9j9P7j92j4J46j52J65j3p0m6j9N9K30
$$ plain form
8089 -71 -5 109 77 -19 -79 -15 -31 147 7 90 -69 5 -49 -90 142 59 -268 123 6 12 -8 -157 -40 -167 -12
8114 -12 -94 17 15 35 -57 25 38 -83 -50 -142 97 62 -6 -136 63 127 56 -14 146 122 78 -98 15 -104 106 66
8140 66 42 11 58 67 65 -69 -15 255 -109 -119 13 -112 -61 12 24 -220 44 69 75 161 76 -76 -94 37 -165 103
8166 103 -153 -189 -28 168 0 54 11 183 92 -12 16 -13 -32 45 -147 -161 -15 -167 -2 -15 -85 -131 -150 -91 139
8191A39
$$ Imaginary data points
##PAGE= N=2
##DATA TABLE= (X++(I..I)), XYDATA
0@%%%%%%%%%%%qJ6j6J6j6K4l2L2m0N3o1P2q8J04j20J36j60J88k12K41k80L19l60
34a92M08m62N19n81O51p26Q09r00J001j109J228j356J495j651J820k007K212k436
52a277K684k959L268l617M010m459M979n588O315p200Q306r730J1642j4370J8610
67A0614k6164M3794j66159j04603J93884R6604R3133R804r273p2302p6550p5257
79h2475j6682J2852M6052L9319M4279K5292K679l0420k7767k0135l904q242l806
92b2958R862K6608J1311j0214k1257n215L148n572j4139l1J3364J6360L605m309
106E63Q08P669J706n917o718K248N433l776o105M540R291J719o595o45J2149P981
122B4351j1336j7682o109N019j69j3041r774P196J5416R991R7k243M646L699o022
$$ plain form
0 0 0 0 0 0 0 0 0 0 0 0 0 -8 8 -8 8 -8 16 -16 16 -24 29 -32 40 -48 56 -64 72 -88 100 -112 129 -151 168 -192
34 -192 216 -246 273 -308 343 -383 426 -474 527 -582 646 -710 785 -866 954 -1053 1159 -1277
52 -1277 1407 -1552 1716 -1901 2109 -2350 2629 -2959 3356 -3844 4462 -5268 6374 -7996 10614
67 10614 -15550 28244 -137915 -242518 -48634 47970 141103 150907 141634 69332 -7218 -82475
79 -82475 -99157 -86305 -40253 -934 43345 68637 71316 40896 13129 -7006 -10910 -19152 -22958
92 -22958 -13096 13512 24823 14609 -6648 -11863 -8715 -14287 -28426 -28457 -15093 1267 4872 563
106 563 1371 9040 10746 4829 -1889 359 5792 2016 -4089 451 9742 11461 4866 4221 16370 24351
122 24351 13015 -4667 -10776 -5757 -5926 -18967 -28741 -21545 -6129 3862 3959 1716 6362 10061 4039
137D039r035l116K417l26l341O397J5305O915n741o295L188N987o612j5996p422
152a3636O507Q062p34p087J72Q786L409o513p820p31N118k04m109K692Q218L765
168E895l891k302N303L175p261p440K659Q862L737n035m388N771P817k296j1027
183d21q127K925N507l449o123J137P432M812k604k033L223j08n667l477K920N160
199A107q99m663K583Q788M738m955q615j416O688J691p245n774L611Q896K016
214F551n775k062L213N70m331m083J108K765j806j082M365N895J172m963l699
229b162L552L845l863p802k159P341P499k587n851J620O476K013n910n606J417
244b177J896j886j726J291K812M10k326N95M012P75l709m145J450N920J029o015
$$ plain form
137 4039 -4996 -8112 -5695 -6021 -9362 -2965 12340 19255 13514 7219 10407 16394 9782 -6214 -13636
152 -13636 -7129 933 199 -6888 -6716 2070 5479 -1034 -8854 -9585 -4467 -4671 -8780 -6088 2130 5895
168 5895 2004 -298 5005 8180 919 -6521 -3862 5000 8737 3702 -686 5085 12902 10606 -421
183 -421 -8548 -5623 -116 -3565 -9688 -8551 -1119 3693 1089 -944 2279 2171 -3496 -6973 -4053 1107
199 1107 208 -4455 -1872 6916 11654 6699 -1916 -3332 3356 5047 -2198 -7972 -4361 4535 6551
214 6551 776 -1286 1927 2497 -1834 -5917 -4809 -2044 -3850 -4932 -567 5328 6500 1537 -2162
229 -2162 1390 5235 1372 -6430 -8589 -1248 6251 3664 -2187 -567 5909 7922 2012 -3594 -2177
244 -2177 -281 -2167 -3893 -2602 210 620 -1706 -1111 2901 3676 -33 -4178 -2728 3192 4221 -1794
260a794l341M029O021j017p295j684N466L583k618l646P82L743O53k644r17O17
276f2K57j428j286K312K846j967k992P62M623K668n648n744K812N823Q50n899
292b073l822L775M742l83k983j226J533K222m33q19M71k70j482j234R20K948l71
309A515m371j290M715M697k189o002j45N136K119m011l914P35L985J057k288j108
325a359J215K044l29k142k83J314k15j438L02K773J282k918k729K834K836k600
341E87m765j545M891L745j648l375O18L741K709k128m835j232J474J303l54p07
357a521J582K059k33J120K076j39m531m421N21L804m51m028j026L324N095J363
373D594l394k607M48J839k50l042j572K092K067M77N78R54O99j705j803J511R41
$$ plain form
260 -1794 -5135 -1106 4915 3898 -3397 -5081 385 3968 1350 -2296 -1514 2229 2882 238 -679 -62
276 -62 195 -1233 -2519 -207 2639 672 -2320 -1558 3065 5733 85 -5659 -2847 2976 3826 -2073
292 -2073 -5895 -2120 2622 2239 -744 -1970 -437 1785 1352 533 1004 734 -748 -1982 -1062 1886 1515
309 1515 -2856 -4146 569 5266 3077 -2925 -3070 2066 4185 174 -3740 -3005 980 2037 -251 -1359
325 -1359 -144 1900 1571 -571 -854 460 245 -1193 -891 1882 3164 246 -2483 351 3187 587
341 587 -4178 -5723 -832 2913 1265 -2110 -1492 2249 4958 2830 -2005 -3237 -1763 -460 -814 -1521
357 -1521 61 2120 1887 3007 5083 4944 413 -4008 -3487 317 -134 -4162 -5188 -1864 3231 4594
373 4594 1200 -1407 -959 880 630 -2412 -3984 -1892 175 652 1230 2184 2883 1178 -625 886 1827
390A827j839k023Q32L383J781k626l015L59J434m2k844l046J782M368J774j467
406F38j270J538K045j629k673r88m13O1J320K730K907k02j226L82J411j14l708
423H09n283j392K996L208j69k309J20L912K234k334l934j936L78L67N7J443J588
440b45M57J126K211J129j172l426k282R74J566N75q70m57K674L493o29l739l057
457a672k3O77j988k240O41K371K243J034N68k15r38j245j24j66j395n58Q54K433
475B57L442J246j515j890N7K051o77m402k518J522L212J086j276j530O00n1k53
492f39r87j674p60N02K255K596J282o28p16o34P86P4k673k866O64L625L116L78
510C701p28R26J338q20k581l786k581m78O68J046J100P32J922K282P33m29k271
$$ plain form
390 1827 -12 -2035 -1203 2180 3961 1335 -1680 -1321 113 71 -2773 -5819 -4037 331 2105 638
406 638 -632 906 2951 1322 -1351 -2339 -2752 -2691 -1371 1359 4266 4064 2838 3220 4631 4517 809
423 809 -4474 -5866 -2870 338 169 -2140 -2020 1892 4126 1792 -2142 -4078 -3700 -3333 -3276 -1833 -245
440 -245 212 1338 3549 4678 3506 80 -2202 -1228 338 913 43 -414 2260 5753 5124 1385 -1672
457 -1672 -1695 -1018 -3006 -5246 -4605 -2234 9 1043 1611 1396 458 -787 -911 -1077 -2472 -3030 -2176 257
475 257 3699 4945 3430 1540 1597 3648 2971 -1431 -3949 -2427 785 1871 595 -935 -335 -386 -639
492 -639 -1626 -3300 -4060 -3558 -1303 1293 2575 1947 1231 597 1383 1457 -1216 -4082 -3418 207 3323 3701
510 3701 2973 3899 5237 4417 1836 -1950 -4531 -5009 -4341 -3295 -2195 -1463 459 2741 3474 3045 774
527G74k769j778J69J163K5j017J519M176K896k3k021j266N68m14j367j408j679
544b452M30K045R55n11q43p53N23O02j67j05q57l34J936J213p25k465j554J134
562a928J461m36o45J68K025L092J439r19j927j444k62r10k085j915j1J354K556
579c87K732P90o10q33J67M31k069l663k135M49K626J958O12O15J131J732J727
596E273j647l021k116m3M98o0n12K81O73J026J644K99j657j313RJ104J50j297
614g09r03K76R54Q36m66j332m93P76J588Q43j391j31J577J093k30j498j637r30
632a777L97Q24K08p94j20K200K071K89j217k260r12K88l9m43j368r61K114K898
650A398J193q27j293oJ000m0r86j758j371M14K316J113j71j321Q0J306N11o50
$$ plain form
527 774 -1995 -3773 -3604 -2441 -2416 -3433 -1914 2262 5158 5135 3114 1848 2416 2002 635 -773 -2452
544 -2452 -2022 23 978 467 -376 -1129 -606 -4 -171 -276 -1133 -1467 469 1682 957 -1508 -3062 -1928
562 -1928 -467 -903 -1548 -1380 645 3737 5176 4257 2330 886 624 -286 -2371 -4286 -4297 -2943 -387
579 -387 2345 3135 2525 1692 1859 2290 221 -3442 -5577 -5128 -2502 -544 68 683 1814 3546 5273
596 5273 3626 605 -1511 -1554 -1056 -1116 -1628 -1347 -674 352 1996 2295 638 -675 -666 438 588 -709
614 -709 -1612 -1336 -382 454 -12 -1344 -1837 -1061 527 1370 -21 -152 1425 2518 2288 790 -847 -1777
632 -1777 -1380 -556 -348 -1142 -1262 938 3009 3298 2081 -179 -1091 -803 -842 -1285 -2653 -3614 -1500 1398
650 1398 2591 1764 471 465 1465 1425 439 -1319 -2690 -2276 40 1153 982 -339 -259 1047 1558 908
668I08j250j222K44J317R02o88q81n8J345N58q70p38m74M40O94L51l87m91P1J145
688I16J55j100j041j7Q37P27k09l46m68J77J503O15j647j554J18J472Q58q96j000
707i00k77P52J660O43j387j617l9J542Q21l30j622n31P43J238P27r77j435m41
725a430J365J396o10j518j48N44J259L76n28j449k46P65J330o02j496o3P47P79
743D71K43o22n70R4O13Q03l52j339l30J027O56m36r06l37P64Q25L90m68q71k63
763f08Q17Q99o29j503m90J189J156j62j58q63k32J255P15l54j570j197J032J419
781G16J05r54r61L21J274O86j15j641q89M71J695K4r13n67K97J214N42l30j236
800b61o68j3J253J71r22m27N41J078P07o41r04o55L82P02k20p55q77R19J398M30
$$ plain form
668 908 -342 -1564 -1320 -3 899 211 -670 -728 617 1175 305 -433 -907 -467 227 578 191 -300 -229 916
688 916 1071 -29 -1070 -1087 -250 477 268 -78 -546 -369 1134 1749 102 -1452 -1334 138 996 100 -900
707 -900 -1177 -425 1235 1878 491 -1126 -1165 377 1198 868 -754 -1285 -542 696 1423 446 -989 -1430
725 -1430 -65 1331 721 -797 -945 -401 858 1234 706 -743 -989 -224 1106 504 -992 -1055 -308 471
743 471 714 92 -478 -384 229 1032 680 -659 -989 38 694 258 -648 -985 -221 604 994 526 -345 -608
763 -608 209 1108 479 -1024 -1514 -325 831 669 511 -352 -584 671 1386 1032 -538 -1735 -703 716
781 716 821 -133 -1094 -773 501 1187 1072 -569 -1458 -987 708 732 -181 -748 -451 763 1305 975 -261
800 -261 -929 -942 311 482 -440 -867 -326 752 1459 818 -86 -741 -359 343 123 -632 -1509 -590 808 1238
820A238p37m94q4K26N67l43r94q32M87J777L35r92n40L19O22K31m45j149n22L60
840i70J288N60j121q51O76P94O06j161p61l06P24Q28J128p01r40N18O94M55j193
859B67j447r2O45P69N97p89o46R33Q54M15j235j898j85P81N16J57n44r0R17J182
879A107N43o32j442k31Q34K72k08n63j95M83J255N48m91j522o01R81K88o50r18
898a142n68Q02R39M67m48q51n39J079M84l32n75k43R59J089L65l89p26k44P20
917H47M05p19j082l55J165R17l30n75o77L52J33o9q87j073k09R44J385k81m65
936e74N4N01R53L10p77j210m31J081J548j29r24j59O73J099j94q89j359o20M63
955e84P30j87p49o71N86Q76lp62p98p1K70J072Q4l87n0R65J355J01p81o65L61
$$ plain form
820 1238 501 7 -77 149 716 373 -621 -1453 -966 811 1146 154 -386 -67 555 786 341 -808 -1330 -970
840 -970 318 878 -243 -1094 -418 376 982 -179 -940 -1246 -522 306 1434 733 -207 311 1005 1460 267
859 267 -1180 -1272 -627 142 739 -50 -696 237 1091 1506 271 -1627 -1812 -1031 -515 -358 -902 -992 -75 1107
879 1107 1650 1018 -424 -655 179 451 243 -320 -515 -32 1223 1771 1280 -242 -843 138 426 -224 -1142
898 -1142 -1710 -908 31 498 50 -801 -1340 -261 223 -109 -684 -927 32 1121 1486 1097 371 127 847
917 847 1252 533 -549 -904 261 1178 848 273 -404 -52 81 12 -875 -1948 -2157 -1213 172 -109 -574
936 -574 -520 -19 934 1244 467 -743 -1174 -93 1455 1326 402 243 916 2015 1821 932 -427 -1047 -584
955 -584 146 -41 -790 -1461 -875 1 -2 -764 -1562 -1633 -1363 -291 -207 -594 -644 321 1676 1777 996 331 692
976F92J73J72k20p69j9N70P02j90j178p22M71Q9k25n32r43N0J042O92J84r04n95
997a460R47J292Q7p68q57M61J327O41l4q09p26N99R32j71j112r40j35R41K61j84
1017B92n88j145J94P29L58p76j055J38Q39J071K00m37J6M65Q41K89n35q25j77
1036a06P54M20m88Lo7M01K27p0r25p89p7L00K40p47q05K15R07O01m24l56j60J84
1058g62J125N86r03p33J61J223P35m56o62Q7Q3P97J82p16j009k39O29R74j022
1077H0j006m48L21O15L47o24p59J4J035J194o18n32m3M20P79mn98j01j37P18P51
1098A404j04q04m21L80M75l22q75n62K18M67N53p35p10j98J182L73l88p87m0P05
1118a89M31r2r0m17QR96L82N5j179l11P20N04j19m08n91j48M21O46k43j020o44
$$ plain form
976 692 865 1037 817 48 29 599 1301 1111 -67 -789 -318 -229 -454 -986 -1929 -1879 -837 -145 39 -865 -1460
997 -1460 -513 779 866 98 -759 -298 1029 1670 1636 827 101 700 1632 1461 349 -591 -726 215 476 292
1017 292 -296 -1441 -1247 -518 -160 -936 -1991 -1853 -1014 57 257 -180 -164 301 1142 1431 896 71 -106
1036 -106 648 1068 580 583 516 917 1144 1074 149 -640 -717 -417 -177 -924 -1729 -1514 -607 -6 -430 -786 -946 -762
1058 -762 363 949 46 -687 -526 697 1432 976 314 401 484 1281 1463 747 -262 -501 128 1102 80
1077 80 -926 -1374 -1053 -438 -91 -715 -1474 -1460 -425 769 151 -381 -424 -4 775 771 173 72 -65 653 1404
1098 1404 1300 496 75 455 930 608 -267 -829 -611 -144 409 -326 -1036 -1234 -52 321 -67 -854 -894 -189
1118 -189 242 150 60 -357 -349 647 1029 1084 -95 -406 314 818 699 291 -300 -448 -27 619 376 -644 -1288
1139a288Q89Q15k07n20m87J43O08L90j39n35m21M30Q72j09o29k67L18M98L32k11
1159D82n18o37M03R45l0j017m15N37P15J66o45n25k20O24M67L6n63m07L80J002
1179G80L0o93l20j74N29K45J02p22l30O1Q09M45p62l25q3N26L52k67m14m11M20
1200b02M66L70n65m75J97N10M16m75n42J28k0N45K67p27m08K04O26K93n70r38
1220i00J16P09L02J75n73o46N48R52J48n14r55J06Q56J78p3p04k37O5R99J77m61
1241B68q13J6P18M37n27k69m98K30Q20K95l49p63n7Q43J82k11n17j19K31M75K01
1262E93k57n28k37P72M7l5r81n9N34M65j09j55l94Q1O74R0l32o72o4O06O61j95
1284E05p43k57N88J39L24n55o17k3M83O25k73o09j45K81P01J88n42n22m69O35
$$ plain form
1139 -1288 -399 416 209 -311 -798 -655 -47 343 204 -331 -752 -322 550 441 -188 -455 -137 361 693 482
1159 482 -36 -673 -270 675 645 -372 -787 -250 465 631 -14 -539 -759 -135 332 368 -195 -602 -222 780
1179 780 810 117 -203 -377 152 397 499 -223 -553 -492 317 762 0 -325 -408 118 470 203 -211 -622 -202
1200 -202 264 634 69 -406 -209 301 717 242 -300 -172 -192 353 620 -107 -515 -311 315 608 38 -900
1220 -900 -784 -75 227 402 -171 -817 -269 683 831 317 -638 -532 324 502 429 -275 -512 -447 552 729 268
1241 268 -545 -529 189 626 99 -170 -668 -438 382 677 328 -435 -492 351 533 322 -195 -314 -83 392 593
1262 593 336 -192 -429 343 390 355 -626 -685 -151 314 205 50 -344 -263 411 501 169 -503 -567 39 700 505
1284 505 -238 -495 93 232 556 1 -616 -639 -156 469 196 -413 -558 -277 424 612 70 -452 -921 -286
1304b86Q33rm59l35L76Q07L5o53n31j26J77M79O6m15m54L02P31m2n08m19j90K76
1326c45K24K8n42j72M98N74M63n63k58J66M39o3l56k31j96N60N70j8n88m72M48
1347A66M52l70m36n77N9O60J56j1o49m28L61O80M8n14n62M64Q92O37j51n32j58
1368A87K53N68P7q91m51L4L77N34k33k63l18J84L31J55r96j042O7M92K40K0j16
1389g91J37N77O06J66j88p56Q8L58L59k33l33K77L85O13j86m51n80P0K74l9q49
1410d96n14L1L13O07l30n78l0J60L73M89j96p20M84R92L24p6n12k44L28M31J36
1431I72o06n90M26L58N88m07o09l92J83Q5l08n72o46J48N14O37M6k85jN07L36
1452C84j74l05k58J55L09O96K37n00j00P58L5n00m82o69N9N74j28m43m92m0P26
$$ plain form
1304 -286 547 538 79 -256 120 927 962 309 -222 -348 -171 308 374 -41 -495 -193 538 496 -12 -431 -621 -345
1326 -345 -121 -93 -635 -807 -309 265 728 165 -93 73 512 449 93 -138 -334 226 796 778 190 -282 166
1347 166 618 248 -188 -765 -706 -46 110 99 -550 -978 -617 63 111 -403 -965 -501 391 1028 877 345 187
1368 187 440 1008 1085 194 -257 -223 154 688 455 192 -126 58 389 544 -452 -1494 -1427 -935 -695 -675 -791
1389 -791 -654 -77 529 695 507 -249 -161 197 556 323 -10 267 652 1265 1079 628 48 118 392 353 -496
1410 -496 -1010 -979 -666 -59 -389 -967 -997 -837 -464 25 -171 -891 -407 585 909 833 321 77 405 836 972
1431 972 366 -224 202 560 1148 741 132 -260 -77 8 -300 -872 -1518 -1370 -856 -219 -173 -458 -459 48 384
1452 384 210 -95 -353 -198 111 807 1044 544 444 1202 1237 737 255 -414 -355 219 91 -352 -844 -884 -158
1473a58L65m57q04k25L11L38K44J15m09K71Q81N45Q1p49k49J00N38r3m77m06J47
1494i1O57M07k77p22m35L10L20l40n74k27K01J72L44J62l91j46L73O08k29m25
1514c03j88O63M97l2j78m60r4L74N94k74p32j23K69M92L45n37m39j89R9J34l68
1535d50n14l82L85Q27K78nj16l2M87K66k83m29n25N8O16J58k03k45K94M59J53
1556G97j94n57l58L51J8l40m07l05J48O26L40k18P2q8K91K26P5n94m43L78M44
1577B62J29l81n22K51M15M20j53k11q3l0M87J0n74o53j52L50L29O2J1n09L70O78
1599E06L87k87r13J12J58J70j68p15N3K55N98M04r8l56j4L50K87n48j89n49K22
1620c35J53K03ml97J70M79L52j25m29k52L06L68l80n64k76M11K58K99l31k10M68
$$ plain form
1473 -158 207 -250 -1054 -1279 -968 -630 -386 -271 -680 -409 472 1017 1098 349 100 200 738 645 168 -238 -91
1494 -91 566 973 696 -26 -461 -151 169 -171 -745 -972 -771 -599 -255 -93 -484 -630 -257 351 122 -303
1514 -303 -491 172 669 637 459 -1 -95 279 873 599 -133 -256 13 505 850 313 -126 -315 -216 -82 -450
1535 -450 -964 -1346 -961 -134 144 139 23 -9 478 744 461 32 -493 -435 181 339 136 -109 185 644 797
1556 797 603 46 -312 39 57 -283 -690 -995 -847 -221 119 -99 -27 -115 176 402 477 -117 -560 -182 262
1577 262 391 10 -512 -261 154 574 421 210 127 97 584 594 20 -633 -785 -435 -106 -44 -33 -542 -172 506
1599 506 893 606 -307 -195 -37 133 -35 -750 -697 -442 156 560 462 106 92 442 729 181 -8 -557 -335
1620 -335 -182 21 17 -380 -210 269 621 496 67 -185 121 489 109 -455 -731 -320 -62 237 -94 -304 164
1641A64M18O5k23m37l98J55oK90k60k27m1O16O74j77o78k01L69K94M9m68o41J60
1663e03N38K78l8p02KJ94L58j44K9k77mJ70L05J90m63m93K58M39J84k50k06QM77
1686C50K26j89m10k09K95J02j55m98j5L82L66j73K5k41R0J65J51j34m23m34L59
1707c70N06J81j65k87q4N28K72k54o35k59M47L67J73o93R3M08K30k54L9m92k88
1728e37L32K25M4Q5k37P3K04K96P5p03k97P4N72N1n78k19O09O60j13n32l04q8
1750c08J15K52k81J4k9J69L05J43R1n27k08l9N47j23n67k61K46Q03L54m34n38
1771b76M09J79j12n71l30R3K99L85K00K10k33k50K41o9l98l31j16J69N17N22k91
1792B47m33J80M52K20o36o44J1N32N54l00m62J14K87L29k61k65k19q5J72P2N14
$$ plain form
1641 164 582 647 424 -13 -411 -256 -262 28 -232 -459 -500 116 790 613 -65 -266 103 397 446 -22 -663 -503
1663 -503 35 313 275 -427 -425 -231 127 -17 12 -265 -269 -99 206 396 -67 -560 -302 137 321 71 -135 -127 350
1686 350 576 387 -23 -232 63 165 10 -488 -503 -121 245 72 97 -144 -54 111 262 128 -295 -729 -370
1707 -370 136 317 152 -135 -219 309 581 327 -308 -567 -120 247 420 -273 -180 228 458 204 243 -249 -537
1728 -537 -205 20 64 149 -88 -15 189 485 560 -143 -440 -366 206 257 -321 -540 69 729 616 84 -220 -308
1750 -308 -193 59 -222 -208 -237 -68 237 380 471 -56 -264 -303 244 121 -446 -707 -461 342 696 262 -276
1771 -276 133 312 200 -371 -701 -608 -309 76 276 486 253 3 244 175 -223 -554 -670 -501 16 538 247
1792 247 -186 -6 446 666 30 -614 -603 -71 483 183 -279 -165 122 451 190 -75 -294 -379 -207 -135 379
1813C79M0m76j32N87L15n68m85m90N26O20k53l01J91M01N19j61o14l02k93J57
1833c40q1M8l6o8N55N20N6m0l30n06NM19j39n83o7L89Q58Nl00l58J31L71P0o49
1857g0m39R6N26K30j74l24J29oJ59N2K11l15m67L84N49J5n00m90K21M17K4o12
1879c84m04J77N85P05j96k11k21K96K02l90n04l01j49K63L36N01o2j5l9L47N58
1900A094p86o44m42L06L74l0l85J94N57N62j58o32L0M7J47m81j19L0j1O8L24K62
1922C07M1m41j14M34m8j03n65K69J88N67j79o41j36L93L56k29n57j16N29M14N8
1943D27j31k13j56k23J68K08k13k78PL61M68J98j48m86r6L11L79p35k89j32N39
1964c4J69j01k28K59K44j82q0j05j79L9K12j36K13j83j35L01J89J81k93n31J32
$$ plain form
1813 379 419 -57 -189 398 713 145 -340 -830 -304 316 63 -238 -47 354 873 712 98 -204 -497 -340
1833 -340 -421 -373 -409 -477 78 598 654 614 284 -222 -217 202 63 -520 -587 -198 660 665 365 7 138 509 579 -70
1857 -70 -509 -413 113 343 169 -155 -26 -32 127 179 390 75 -392 -8 541 556 56 -434 -213 204 228 -384
1879 -384 -788 -611 -26 679 483 272 51 347 549 159 -345 -646 -795 -532 -196 305 243 228 189 536 1094
1900 1094 308 -336 -778 -472 -98 -128 -513 -319 238 800 642 10 40 87 234 -247 -366 -336 -347 -279 45 307
1922 307 348 -93 -207 227 179 76 -489 -220 -32 535 356 -285 -421 -28 328 99 -458 -574 -45 369 427
1943 427 296 83 -73 -296 -128 80 -133 -411 -404 -43 425 623 475 -11 -107 204 583 -152 -441 -573 -34
1964 -34 135 34 -194 65 309 127 47 -58 -237 -198 14 -122 91 -92 -227 74 263 444 151 -380 -248
1985b48M21J96q7n46Q6O31J20n07l40Q4J87k4J18l44j00K86J44L78n8k18k76k69
2007c66J40L53r8m84j77N25N56p7m68l60N27O13l99k95k23J3K12J74l5n13K13
2028a69J24O2R1K90m03k0J0L62j17m91l73K68K86O9n61K14N06K29kl14j21j21
2050a81L25k20j03k76Q8K87j38K34N6M1k3J8L21L45m42o88N1L23J35k81l30L19
2072a39K87L81j08m02m0K28K27k36n31j55J44n0K29O7J15q7J06N52J13m08l05
2093a2l59M27J6l32m00J56M40L06m8n3k87K95J34m4j43j76Rl12J29J17j4j11O8
2116a94L74M18m46l36j52M44J87m0l55l17K85L86j44j83j84J42M45k2k30j11J11
2137G8k58pq6K30n3k61J88M81q0k72o1J61K43Q8p80j52P1M80J30j04l47K47O81
$$ plain form
1985 -248 173 369 282 -264 -178 453 573 66 -274 -190 -3 -27 91 -253 -353 -67 77 455 397 179 -97 -366
2007 -366 -226 127 29 -455 -632 -107 449 372 -96 -456 71 684 285 -10 -233 -220 -8 166 131 -382 -169
2028 -169 -45 17 108 398 -5 -25 -15 347 230 -261 -634 -366 -80 -11 -572 -358 148 377 375 61 -60 -181
2050 -181 144 -76 -179 -455 -367 -80 -218 16 72 113 90 108 429 774 332 -356 -305 18 153 -128 -458 -139
2072 -139 148 529 421 19 -21 207 434 198 -333 -488 -344 -394 -165 -98 17 -70 36 588 701 293 -12
2093 -12 -371 56 72 -260 -660 -504 -64 242 194 141 -146 149 283 239 96 -80 -71 -383 -254 -137 -151 -262 -194
2116 -194 180 598 152 -184 -336 108 295 255 -100 -417 -132 254 110 -73 -257 -115 330 308 78 -33 78
2137 78 -180 -187 -273 -43 -96 -357 -169 312 232 -40 -101 60 303 391 -389 -541 -470 10 140 36 -311 -64 617
2160F17k50n5k02j82j10J09j9jk30J31L08K26j50l14k28R0L05M25n34m70L04J92
2182c8M41k17l34K9J33J02k56K4R1k11K10M62j41l54k73J95k9K49m51Q6J00J44
2204c8N37k22j20l27L39nk41j75j32K10K87M0j88R2J40l5K2k31J2q6j85J37J90
2227B1L35m48N1J52J69M3p19J12J42J75J3P1l60L34K07P3j82k04k58Q6M8Q9K00
2250A50m29K30J25L08j37m18l3j77M25L56m12j75J32K50K39j16m20p9J12J17k09
2271a61J8OJ47J48MJp3j34k19J74L4r7l30L11L57J53k2l41J8J48K70k56k55k36
2295c35L29J82Or9j73L26q7j96J17j59l38r9L46L11j0n70K36K58N3K2k61l08L60
2318h9L76N0k18j52J72L05o8k99j89k05L04K20j49J37r6j80K91j49J43n40j68
$$ plain form
2160 617 367 312 110 -72 -182 -73 -92 -93 -323 -192 116 342 192 -122 -350 -260 45 470 -64 -534 -230 -38
2182 -38 403 186 -148 -119 14 116 -140 -116 -25 -236 -26 436 295 -59 -332 -137 -166 83 -368 -282 -182 -38
2204 -38 499 277 157 -170 169 164 -77 -252 -384 -174 113 153 -35 57 197 162 184 -47 -35 -121 -306 -169 21
2227 21 356 -92 -41 111 280 323 -396 -284 -142 33 46 117 -243 91 298 371 189 -15 -273 -187 -139 -50 150
2250 150 -279 -49 76 384 247 -171 -204 -381 44 400 -12 -187 -55 195 434 318 -102 -181 -69 48 -161
2271 -161 -143 -137 10 158 162 163 90 -44 -263 -89 -55 -152 -482 -171 186 339 317 -24 -6 142 412 156 -99 -335
2295 -335 -6 176 182 83 -90 236 149 -47 70 -89 -427 -526 -180 131 121 -449 -213 45 98 120 -141 -449 -89
2318 -89 287 337 119 -33 139 444 376 77 -112 -317 -13 207 58 195 99 -81 210 61 204 -336 -504
2339e04J3K77J04q7Q0J89K82K40l88l82J85J57j08p8m39L83J03K02K66j58k20
2360A17l7n9m4J12l69k12j2L34Q9j23j75K51J47M08m61J16k05r5L96L4K1k50J52
2383A35j05K61j39j56%J31J48jl41o1j96m2K20o5r4j15L61j3K25k12J93j8J24
2406B40k7k26j20j57K05k7L13j83J41K80j17J7k62j43rj77K98k20r7k1J25K53
2428H6j82J55k42K1K59M5l08K33m3j41K92kj81L2m9K90R8l01L9j56J55L1l0j56
2452e5o2k2L57Rm04k3P6j24L23O7k59o8J26J67J12j40n30L37P5J77k5j14K5p6
2476e1K76j20n2l24J27L53Kk12P2l30K06J06Q5k77P8O2R3K03k12j58J6O8J48P1
2500B30k70k10P4R6K30k44l9%M70k52mj63j56K22J68j73j77R3n1K43J49k48r0
$$ plain form
2339 -504 -491 -214 -110 -197 -117 72 354 594 206 -176 9 166 58 -20 -459 -76 27 229 495 337 117
2360 117 80 21 -23 89 -280 -492 -504 -170 -81 -204 -379 -128 19 427 -34 82 -123 -218 178 212 233 -17 135
2383 135 30 291 152 -4 -4 127 275 274 -67 -128 -324 -366 -146 -211 -305 -420 -59 -72 153 -59 134 116 240
2406 240 213 -13 -133 -290 -85 -112 201 18 159 439 322 339 77 -66 -75 -252 46 -174 -271 -292 -167 86
2428 86 -96 59 -183 -162 97 142 -166 67 24 -117 175 173 -8 24 -25 265 363 62 101 -55 100 131 101 -55
2452 -55 -117 -139 218 227 -177 -200 -124 -248 75 142 -117 -185 -59 108 220 80 -450 -113 -38 139 114 0 25 -51
2476 -51 225 105 53 -271 -144 209 211 -1 71 -259 -53 53 138 -139 -61 1 94 297 85 -73 -57 11 159 230
2500 230 -40 -250 -176 -80 150 -94 -133 -133 337 85 81 -82 -238 -16 152 -21 -198 -105 -156 87 236 -12 -102
2523a02L5M0J54K16j70l32K6K17n3k44K2R4J20K09Jj99j18l8K9L07%l27k7R6m5
2548h9Q0p7J99p6J84R8Rn51N7M60l84P2q9m0j16L57K46j53j68j09J21P4J00l11
2572a06o6J30Q6P7Rj45L5O4K06q6j39l6j8Mn2J04k40j61R0L29O5j41k80L26J27
2597A82j24k51j1L1k5K78j5j05j49M4M05lk56j3j6J93r4j39J63l26J32J68j28
2620e9N2p2n5J34M0j9j57j79J34K09N0P3k60J2K03j7Rr7o0rK84P4j94k51K32L3
2646A10M6l53o8QL73J40l0j60k31L17kN2k13r6q4J47K70j85j11R4L6q7J70j78
2670c5j79K63n8k5K57k29J01j64Q7L5N6r7j81M9J73%p1K2J07K0JKl49J49L04k3
2696B15j88j43M8J52k4J06l6l12M1K90%k04j93J50J83K04l23m4J08L6j45J63j24
$$ plain form
2523 -102 -67 -27 127 343 173 -159 -133 84 31 -213 -191 -97 23 232 233 34 -84 -122 -93 214 214 -113 -140 -44 -89
2548 -89 -9 -86 113 37 221 319 328 -223 -166 294 -90 -18 -107 -147 -263 94 340 187 19 -90 31 105 205 -106
2572 -106 -172 -42 44 121 130 -15 20 84 290 204 65 29 11 15 -37 67 -173 -334 -244 85 150 9 -271 55 182
2597 182 58 -193 -204 -173 -198 80 65 -40 -189 -145 260 257 1 -12 -28 165 71 -68 95 -231 -99 69 -59
2620 -59 -7 -79 -134 0 40 21 -136 -315 -181 28 78 151 -109 -97 106 89 98 1 -59 -68 216 290 96 -155 77 110
2646 110 156 -197 -265 -257 116 256 226 66 -165 152 150 202 -11 -107 -191 -44 226 41 -70 24 60 -27 143 -35
2670 -35 -214 49 -9 -34 223 -6 95 -69 18 53 109 12 -169 -120 53 53 -18 4 111 131 132 134 -215 -66 238 215
2696 215 27 -116 -68 84 60 166 130 -182 -141 149 149 -55 -248 -98 85 289 -34 -78 30 66 -79 84 -40
2719d0k21K62Q2M5N2j05j20J22j02J15k24p3K14N9J67r1l06K96K5j66N0ko2k43
2743b66M81J67m09J64k54K72N8k50j1j10K1J47Q1r4k86N2K63J63k47j9k02kL74
2766I3j73K56k16j22K08R8r7M1j87K01j3J24k1l52J59J04J0J23q3j94J73k28L05
2789B09j98n5n1J41J41k76l9n6J65q0Q8Kk49J49K11l5j6n0M8j61L86j05k06k28
2813b65K64k80L81p1K2k70N7L23j8k08k2J31r4QJ14j72K59l0j9j53O0Q4j6K06
2837B91j05j84R0q4J51O2j28l22J19P3j32L05j20j68p8K72o4N6o0n5L9k03K82
2860C7j00k20J76K39J13j7k68Q2J60r9J50l80m5N8L07M1j69j02J8MJ59L3l32p5
2884b30N8L33q7l7k0p9R4J90j20k04K12k32K00K3Kk69K88k64J8K68k72k0J37J16
$$ plain form
2719 -40 -261 1 83 128 180 75 -45 77 -25 90 -134 -207 7 66 233 142 -164 132 157 -9 41 39 -23 -266
2743 -266 215 382 -27 137 -117 155 213 -37 -48 -158 -137 10 91 -3 -289 -237 26 189 -58 -77 -279 -281 93
2766 93 -80 176 -40 -162 46 144 47 88 -99 102 89 213 192 -160 -1 103 113 236 153 -41 132 -96 209
2789 209 11 -44 -95 46 187 -89 -128 -184 -19 -99 -11 -9 -258 -109 102 67 51 1 49 -112 274 169 -37 -265
2813 -265 -1 -281 100 29 51 -219 -162 161 143 -65 -87 44 -50 -42 72 -100 159 129 110 -43 17 101 85 291
2837 291 186 2 92 8 159 221 93 -229 -110 -37 -169 136 16 -152 -230 42 -22 34 -26 -81 -42 -245 37
2860 37 -63 -283 -107 132 245 228 -40 42 202 103 253 -127 -172 -114 193 234 65 -37 -19 -15 144 177 -155 -230
2884 -230 -172 161 74 37 17 -62 32 222 102 -102 110 -122 78 101 103 -166 122 -142 -124 144 -128 -148 -11 105
2908A05P0k63L06k32O8n5j4j04j11K46j08J46k29NK20L4J6nkm00M32J2j65J51
2932A23l25P9L4L09m3r0k00P3R4k0j48mp0L78j21J44l27m5L15Q1r2k10j13L6J35
2957gn5l4k97K80R5J64j43k1O2j72P7M8j06j15K08j24L30k31j11K18J37j81j08
2980h6K42l43q4L63nk23J03j76J61J96j13L2j40P8j55M30r0k62l8J41J17j6j71
3003c9r0J74J30o4j12j86J46L9mm6n9O6R8K13j76M1l18N3J83K16j86j54J59p6
3027HO4J62j94j87Q0K80k30J89j86n4k5J40j09J07j42J93J7n8j8k2l8l2K3P7j24
3052g9QJ27N4J56j00l16j0J56J14o2j85J28j80J32K12k10k0q2J86L7l2m7m4nm4
3077a06M2kJ9%N6m4P5k00J24J57O7j75j47J05j9l5J36p4j08J10j22K26Nk18M1
$$ plain form
2908 105 175 -88 218 -14 54 -1 -15 -119 -230 16 -92 54 -175 -170 50 84 100 95 93 -307 125 137 -28 123
2932 123 -202 -123 -89 220 177 87 -113 -40 54 34 -114 -118 -188 190 69 213 -114 -159 156 237 145 -65 -178 -142 -7
2957 -7 -62 -96 -393 -113 -18 146 3 -18 44 -128 -51 -3 -109 -224 -16 -140 190 -41 -152 66 203 22 -86
2980 -86 156 -187 -271 92 87 -136 -33 -209 -48 148 35 67 -73 5 -150 280 190 -72 -110 31 148 132 -39
3003 -39 -129 45 175 111 -1 -187 -41 -2 -6 -52 -111 -45 53 266 90 131 -187 -134 49 265 79 -75 84 8
3027 8 72 234 40 -147 -67 213 -17 172 -14 -68 -93 47 -62 45 -97 96 113 55 37 15 -23 -55 -32 45 -79
3052 -79 -71 56 110 266 166 -150 -160 -4 110 48 -137 -9 -189 -57 155 -55 -75 -157 29 66 34 -13 -57 -62 -106
3077 -106 -64 -66 -47 -47 9 -35 40 -160 -36 121 188 13 -134 -29 -48 -83 53 -21 -129 -19 -141 85 90 -128 -87
3102h7r8J14J67j05p1M1o9J41rj64n5K72P7j38o0j9p3K19J2j13j59M7K50k02J47
3127F5J57k44l9K2K61k27j49J59l7j6J12L6j47l3J75Q4k15q6J1R5L8LJ28j07O
3152E2J5l4R7j6j61o9K23lO1k66K5P1J33r5o3J5J47n8P7l88J15rJ43j44K36q3
3178B1j52K67j50K33r4o7j82J02N7o3Pl6P2r4J62j42Q4l5M3J73j97k46J03J22
3202a2N8J50k21k25J56K48j33j01rr9J38J14l1k3j88QK21L8ln37O42j50Q1j16
3226Fq5o3J96J34k14k25J66j2Q0R9r4k50J89KK96Qk82j23J30j02J61J4k60K18
3250a1K19j77j22J03P5j23J42o0q1j56j0L54k06K10l43J50J04J65k04M0k07r8
3272b36L68l7n5r5l5J40R6l47R9r2K12m4N9j42N6j02K71l0o2rj94Q4R2k5Q4k02
$$ plain form
3102 -87 -185 -71 96 -9 -80 -39 -108 33 24 -140 -195 77 154 16 -44 -63 -136 83 95 -18 -177 -130 120 -82 65
3127 65 222 -22 -61 -39 222 -5 -154 5 -32 -48 64 100 -47 -80 95 179 -36 -122 -111 -16 22 25 153 46 52
3152 52 67 33 130 114 -47 -116 107 104 165 -101 -76 -5 128 33 -30 -15 132 74 151 -237 -122 -131 12 -132 104 21
3178 21 -131 136 -14 219 125 58 -124 -22 35 -28 -21 -57 15 -79 83 -59 25 -10 33 206 9 -237 -134 -12
3202 -12 46 196 -25 -250 -94 154 21 -80 -89 -188 -50 64 33 10 -178 -170 51 89 86 -451 191 41 122 6
3226 6 -79 -142 54 188 -26 -251 -85 -97 -17 82 -12 -262 -73 -71 225 233 -49 -172 -42 -144 17 31 -229 -11
3250 -11 208 31 -91 12 87 -36 106 46 -35 -191 -201 153 -53 157 -186 -36 68 233 29 69 -138 -236
3272 -236 132 95 40 -55 -90 50 146 -201 -102 -194 18 -26 33 -109 -53 -155 116 86 24 15 -179 -95 -3 -28 56 -146
3298a46K7J84J15o0k60m2O9R6N0M0m8J24k74M90j90Ll01q4J83K06j87k38K97k9
3322B5O6o5K3k31K40q9P6p2o3J56j26L16l60L3L0j5J25O0o5no8M3k17L08o5k20
3348a60J15R5R7n8l04m4L35OR4m18Q4K09r9J20k06KM5J68j86M3j66L92r0k04J39
3373IM6j25K52j16l0r4m6K84j76J06R1k18n5R4P5K3n5o0Ml2K04l31J18kR1l1K8
3400E4M6k38L10j26J0j43L7k5J21N0p4m7k1qJ81p0r6J35o5P1k89K76J27k99r7
3425a80M62k49L6j77J11j18K03j54Q3k1l7L5R1o5n8j23K35J15k21j47K67j86o
3448a04K40k23J48k87J96L23l8m34K73j00j37Q8L5j08LK82k54J74j66n7K09J08
3470A71J1l70Q2Q1J09j04Lk1j3Q0Q7k42J40q2o1J39j08m1k7J68pJ23Mj95J04l3
$$ plain form
3298 -146 -119 65 180 120 -140 -182 -113 -17 33 73 25 149 -125 365 175 178 -123 -207 -24 182 -5 -243 54 25
3322 25 91 26 49 -182 58 -31 45 -27 -90 66 -60 256 -104 -71 -41 -56 69 129 64 59 -9 34 -183 125 60 -160
3348 -160 -45 50 147 89 -215 -259 76 82 176 -242 -158 51 -48 72 -134 -132 -87 81 -105 -62 -228 164 74 -130 9
3373 9 55 -70 182 66 36 -58 -104 180 4 110 201 -17 -72 22 97 120 65 5 9 -23 181 -150 -32 -34 57 26 54
3400 54 100 -138 172 46 56 -87 -50 -75 46 96 22 -25 -46 -54 127 57 -39 96 31 102 -187 89 216 -83 -180
3425 -180 282 33 69 -108 3 -115 88 -66 17 -4 -41 -6 85 20 -38 -161 74 189 -32 -179 88 -98 -104
3448 -104 136 -87 61 -226 -30 293 255 -179 94 -6 -143 -55 -20 -128 -125 157 -97 77 -89 -146 63 171
3470 171 182 -188 -106 -25 84 -20 -17 -38 -51 29 116 -126 14 -68 -129 10 -98 -139 -166 2 -5 118 122 -73 31 -2
3496bn6J15L2j30J8m0J81j21k5j15J53K1j2k06R6m4K18k53K65j17j40L13m1j3
3520I7j58o5p8K56N0p4q2K94k39J8J3j71o2M2J52O8q6K3j9o8K17k48K29j61J01
3545D9J81j86K3n8p6P3j15kp9J71lm3J83j02m8J00m9Q2k92K54P3j90M22k24j37
3570GM4j69J88P7q5k17J87j87J83k25K78p3j02J37R6q3n3q6J64j72J27j64l3K62
3594A01p4J09j13Q0R7k44r4L36k85J08N6k27M00l18J31N9n7Q8j05k04O1J85O9
3617A59q8K5l1j82K48k75K13j31P5Q9p1p5m9n9J27j11K42p6k43J03l8L12k11r4
3641a41k5K27r0p6J29n8oL5n8O3J35k87J61P1j65J65l34J57mR0M4j23n7l1J17
3666f1R5J14k20P5P1q5L8j8j34J77R4k0n8J47m30J80R4j69J65j58J48J88j67j19
$$ plain form
3496 -2 -58 57 89 -41 -23 -63 118 -3 -28 -143 10 31 19 -187 -91 -135 83 -170 95 -22 -162 151 110 97
3520 97 -61 -126 -204 52 102 28 -54 240 1 19 32 -139 -201 -159 -7 61 -25 -2 -21 -89 128 -120 109 -52 49
3545 49 230 44 67 9 -67 6 -109 -111 -190 -19 -22 -65 118 16 -32 68 19 101 -191 63 136 -54 368 144 7
3570 7 51 -118 70 147 62 -155 32 -155 28 -197 81 8 -94 43 139 56 3 -83 81 -91 36 -128 -161 101
3594 101 27 136 23 103 200 -44 -138 198 -87 21 77 -150 250 -68 63 122 65 153 48 -156 -95 90 159
3617 159 71 96 65 -117 131 -144 69 -62 13 102 31 -44 -93 -152 -25 -136 106 30 -213 -110 -148 164 -47 -141
3641 -141 -166 61 -29 -105 24 -34 -40 -5 -63 0 135 -152 9 80 -85 80 -254 -97 -101 -11 33 -90 -147 -178 -61
3666 -61 34 148 -72 3 74 -11 27 9 -125 52 146 126 68 215 -215 -35 59 -110 55 -103 45 233 66 -53
3690e3L3N7J17j15j3L4j87L6K7P6J21r2j12rjo6K14j67m4J16J36k33J14p3K03
3715A19j22l1J98j42m3J20j15k2m0K8L6J37j44O7j40l8L9Jo8J02J65o6Lk05K07
3740D6k42K42J26k37j56J34K7J67j7n3j3k44J89l7J93p0j32j13K06N7N3k17J68
3763G7R1n4j14J00r9k43L28j24J4k5N7R5K0j78K15j05r0j36K15Jj48J03n1k7L5
3788d3J55o3j07J49j80KJ51n3J51j53J1l2n9J97k3j06j14J70J90j07j48M2K5J06
3812A61k59K41j00o8K7J19k38P3j23K21m2j57O9M6J2J76l3j24L8O4k19j36M00
3835A48j59J83j71j16K10j04J2l5J57l20K40n8L0o2%j35K47J77k39M1j77L93l89
3858a27M3K03l2r1j0P6p7J1j99J73Pj93K09O4q2R2q8%j06P4J68n8k75J98j4Q5
$$ plain form
3690 -53 -20 37 154 39 26 60 -127 -91 -64 12 133 41 -71 -80 -81 -147 67 -100 -144 -28 108 -125 -11 -84 119
3715 119 -3 -34 164 22 -21 99 -16 -38 -78 -50 -14 123 -21 46 -94 -132 -93 -92 -160 -58 107 41 44 -161 46
3740 46 -196 46 172 -65 -221 -87 -60 107 90 37 24 -220 -31 -68 125 55 -77 -190 16 73 126 -91 77
3763 77 168 114 0 100 1 -242 86 -38 -24 -49 8 103 123 -55 160 55 -35 -171 44 45 -103 0 -51 -78 -43
3788 -43 112 49 -58 91 -89 -87 64 11 162 9 20 -12 -71 126 103 -3 -117 53 243 136 -12 30 55 161
3812 161 -98 143 43 -25 2 121 -117 -44 -167 54 12 -145 -76 -30 -18 158 125 1 39 103 -116 -252 148
3835 148 -11 172 1 -115 95 -9 3 -32 125 -195 45 -13 17 -45 -45 -180 67 244 5 46 -131 262 -127
3858 -127 -84 119 87 -4 -14 62 -15 -4 -203 -30 -23 -216 -7 57 -25 67 -21 -21 -127 -53 115 57 -218 -20 -34 51
3884E1j37oK16j54J82J45k98K9J83l42J26J84j17j32r3K21rj0K0Q8k47Q1qN7l6
3909fO5K1j76J2ON9j24K89j67K24k26j26J44K9R1j54Q3J64j52nm9j54J3L18k21
3934d2L0l3m6J77J9J1j72K27q5n3j3l6j44J47KL2j18M6J25J7O2j00KR8j47O4m8
3961B2R3k26J82P6l5Po9j13j04o3L77r6l3J07j72R3k2n4q2JJ67Q5j51R1k17Q1
3987e5p9l6L48k98K77j66J60j70J01l7n5k1J76J00l90J08p2K16M6j53P5j24J03
4010E4j40P7j5p7Q8n9P9pJ64o6o2j21K08k43J40P3k5Mq8J76j06j30K06k03j00
4035a73K09L7j04j40N9NK86j44l5LL9M0J26l21R0RlR5J05K3j85j22Q6j56K70P5
4061A74k86K09j23r0J1J20j05P7j15J20K7j30K04j08PQ9jJ27l09J32j04K53r8
$$ plain form
3884 51 -86 -92 124 -30 152 297 -1 28 211 -131 -5 179 62 -70 -163 58 49 39 59 147 -100 -19 -27 30 -6
3909 -6 59 80 -96 -84 -78 -19 -143 146 -21 203 -23 -149 -5 24 115 -39 44 208 56 51 2 -152 -139 179 -42
3934 -42 -12 -45 -91 86 105 116 -56 171 86 33 20 -16 -160 -13 -11 21 -97 -51 74 91 153 53 55 153 6 70 22
3961 22 115 -111 71 147 112 119 50 -63 -167 -230 147 51 18 125 -47 46 24 -30 -112 -111 56 141 -10 81 -136 -55
3987 -55 -134 -170 178 -120 157 -9 151 -19 82 45 -10 -31 145 245 -145 -37 -109 107 153 0 75 -49 54
4010 54 -86 -9 -24 -101 -13 -72 7 0 164 98 36 -85 123 -120 20 93 68 72 -16 160 54 -76 130 -73 -173
4035 -173 36 73 -31 -171 -112 -107 179 35 0 3 42 82 208 -113 -23 -14 -17 78 183 206 21 -101 -15 -171 99 174
4061 174 -112 97 -26 -116 -105 15 -90 -13 -128 -8 19 -111 93 -15 -8 81 80 207 -102 30 -74 179 81
4084H1j49m1J41k93M0L12J6j40NL9k00R3N4J28K5p6j47R9O0r0J87Lk71J77j52
4109i9M9P2Q9m5j18J47k19k4N6n4J93J37l05J94j56K00l4r9j81J08k5J39j8j5
4133hQ0r0K1J17l07Q7J98j26K6N2QM4Mk12M3NJ18j19O1l0J57k30J05n5P4N8n9
4160B2j96J57O9L8k9j46N5J51o6l6J4Kk98K31O2m8M8M0J19k00J99k31K02k76J30
4185A3J17k63J70q6Q2r9L1J3P4k21K23m3K77l81L4M0j5L7n9M2Q1M3j44n4L8P4
4211B4O7MM5j40Q3j93J08k4k8J26r6R1l4J18j18k4J09j23q0J0M3J78J4j03q0O3
4237D0q0l2Q6m7J18K13m60J82n2J07k58J60j61LK17K2k36P7R7K1L8j40J28j22
$$ plain form
4084 81 -68 -109 32 -261 -221 91 107 -33 -28 11 -189 -96 -42 86 111 35 -112 -13 47 -43 144 147 -124 53 -99
4109 -99 -50 22 111 66 -52 95 -124 -148 -92 -146 47 184 -121 73 -83 117 83 -16 -197 -89 -114 25 7 -8
4133 -8 72 -18 3 120 -187 -100 98 -28 -2 50 58 102 106 -106 -63 -58 60 -59 2 -28 129 -101 4 -51 23 81 22
4160 22 -174 -17 52 90 61 -85 -30 121 55 19 33 35 -263 -32 30 -18 30 70 189 -11 188 -43 159 -117 13
4185 13 130 -133 37 -49 33 -66 -35 -22 52 -169 54 11 288 -93 -59 -19 -34 3 -56 -14 67 110 -34 -88 -50 24
4211 24 91 95 140 0 83 -110 -2 -26 -54 72 -24 67 33 151 33 9 118 -5 -85 -75 -32 146 160 57 -23 40
4237 40 -40 -72 14 -33 85 298 -162 20 -32 75 -183 -23 -184 -181 36 58 -178 -101 -4 17 55 -85 43 -79
$$ [...]
8191c7
##END NTUPLES=NMR FID
##END=
