##TITLE=1H_13-2023
 CDCl3
 8 sc, 
 13.3.2023
##JCAMPDX= 6.0         $$ Bruker NMR JCAMP-DX V2.0
##DATA TYPE= NMR FID
##DATA CLASS= NTUPLES
##ORIGIN= UXNMR, Bruker Analytische Messtechnik GmbH
##OWNER= root
$$ XWIN-NMR		Version 3.5
$$ Mon Mar 13 14:04:16 2023 Russian Standard Time (UT+4h)  she@DPX200
##.OBSERVE FREQUENCY= 200.13135
##.OBSERVE NUCLEUS= ^1H
##.DELAY= (6, 6)
##.ACQUISITION MODE= SIMULTANEOUS
##.ACQUISITION SCHEME= undefined
##.AVERAGES= 8
##.DIGITISER RES= 18
##SPECTROMETER/DATA SYSTEM= spect
##.PULSE SEQUENCE= zg30
##.SOLVENT NAME= CDCl3
##.SHIFT REFERENCE= (INTERNAL, CDCl3, 0, 15.7039)
##AUDIT TRAIL= $$ (NUMBER, WHEN, WHO, WHERE, WHAT)
$$ ##TITLE= Audit trail, XWIN-NMR		Version 3.5
$$ ##JCAMPDX= 5.01
$$ ##ORIGIN= Bruker BioSpin GmbH
$$ ##OWNER= she
$$ F:/spectra/data/she/nmr/H-F/1/audita.txt
$$ ##AUDIT TRAIL=  $$ (NUMBER, WHEN, WHO, WHERE, WHAT)
(   1,<2023-03-13 14:02:47.81 +0400>,<she>,<DPX200>,
      <created by zg, POWCHK disabled, PULCHK disabled
       configuration hash MD5:
       00 E9 B6 7A A2 85 ED C7 34 08 36 98 17 FE 4E 26
       data hash MD5: 16K
       60 EA 13 FE D5 73 C9 8B D9 35 D2 D0 D8 A6 4E 0A>)
$$ ##END=
$$ 
$$ hash MD5
$$ DB D0 24 1E 31 B3 4F AC 9F 31 25 0B 73 0D 4D 89
##$RELAX= 
##$RELAX= 
##$RELAX= 
##$RELAX= 
##$RELAX= 
##$RELAX= 
$$ Bruker specific parameters
$$ --------------------------
##$DU= <F:/spectra>
##$EXPNO= 1
##$NAME= <H-F>
##$PROCNO= 1
##$TYPE= <nmr>
##$USER= <she>
##$AMP= (0..31)
100 100 100 100 100 100 100 100 100 100 100 100 100 100 100 100 100 100 
100 100 100 100 100 100 100 100 100 100 100 100 100 100 
##$AQSEQ= 0
##$AQ_mod= 1
##$AUNM= <au_zg>
##$AUTOPOS= <>
##$BF1= 200.13
##$BF2= 200.13
##$BF3= 200.13
##$BF4= 200.13
##$BF5= 200.13
##$BF6= 200.13
##$BF7= 200.13
##$BF8= 200.13
##$BYTORDA= 1
##$CFDGTYP= 0
##$CFRGTYP= 5
##$CHEMSTR= <none>
##$CNST= (0..31)
1 1 145 1 1 1 1 1 1 1 1 1 1 1 1 1 1 1 1 1 1 1 1 1 1 1 1 1 1 1 1 1 
##$CPDPRG= <>
##$CPDPRG1= <>
##$CPDPRG2= <>
##$CPDPRG3= <>
##$CPDPRG4= <mlev>
##$CPDPRG5= <mlev>
##$CPDPRG6= <mlev>
##$CPDPRG7= <mlev>
##$CPDPRG8= <mlev>
##$CPDPRGB= <>
##$CPDPRGT= <>
##$D= (0..31)
0 1.2 0 0 0 0 0 0 0 0.06 0 0.03 0 0 0 0 0.0002 0 0 0 0 0 0 0 0 0 0 0 0 
0 0 0 
##$DATE= 1678701767
##$DBL= (0..7)
120 120 120 120 120 120 120 120 
##$DBP= (0..7)
150 150 150 150 150 150 150 150 
##$DBP07= 0
##$DBPNAM0= <>
##$DBPNAM1= <>
##$DBPNAM2= <>
##$DBPNAM3= <>
##$DBPNAM4= <>
##$DBPNAM5= <>
##$DBPNAM6= <>
##$DBPNAM7= <>
##$DBPOAL= (0..7)
0.5 0.5 0.5 0.5 0.5 0.5 0.5 0.5 
##$DBPOFFS= (0..7)
0 0 0 0 0 0 0 0 
##$DE= 6
##$DECBNUC= <off>
##$DECIM= 32
##$DECNUC= <off>
##$DECSTAT= 4
##$DIGMOD= 1
##$DIGTYP= 9
##$DL= (0..7)
0 120 120 120 120 120 120 120 
##$DP= (0..7)
150 150 150 150 150 150 150 150 
##$DP07= 0
##$DPNAME0= <>
##$DPNAME1= <>
##$DPNAME2= <>
##$DPNAME3= <>
##$DPNAME4= <>
##$DPNAME5= <>
##$DPNAME6= <>
##$DPNAME7= <>
##$DPOAL= (0..7)
0.5 0.5 0.5 0.5 0.5 0.5 0.5 0.5 
##$DPOFFS= (0..7)
0 0 0 0 0 0 0 0 
##$DQDMODE= 0
##$DR= 18
##$DS= 0
##$DSLIST= <SSSSSSSSSSSSSSS>
$$ [...]
##$SUBNAM2= <"">
##$SUBNAM3= <"">
##$SUBNAM4= <"">
##$SUBNAM5= <"">
##$SUBNAM6= <"">
##$SUBNAM7= <"">
##$SUBNAM8= <"">
##$SUBNAM9= <"">
##$SW= 18.05172834244
##$SWIBOX= (0..15)
0 0 2 0 0 0 0 0 0 0 0 0 0 0 0 0 
##$SW_h= 3612.71676300578
##$TD= 16384
##$TD0= 1
##$TE= 0
##$TE2= 300
##$TE3= 300
##$TEG= 300
##$TL= (0..7)
0 120 120 120 120 120 120 120 
##$TP= (0..7)
150 150 150 150 150 150 150 150 
##$TP07= 0
##$TPNAME0= <>
##$TPNAME1= <>
##$TPNAME2= <>
##$TPNAME3= <>
##$TPNAME4= <>
##$TPNAME5= <>
##$TPNAME6= <>
##$TPNAME7= <>
##$TPOAL= (0..7)
0.5 0.5 0.5 0.5 0.5 0.5 0.5 0.5 
##$TPOFFS= (0..7)
0 0 0 0 0 0 0 0 
##$TUNHIN= 0
##$TUNHOUT= 0
##$TUNXOUT= 0
##$USERA1= <user>
##$USERA2= <user>
##$USERA3= <user>
##$USERA4= <user>
##$USERA5= <user>
##$V9= 5
##$VALIST= <valist>
##$VCLIST= <CCCCCCCCCCCCCCC>
##$VD= 0
##$VDLIST= <DDDDDDDDDDDDDDD>
##$VPLIST= <PPPPPPPPPPPPPPP>
##$VTLIST= <TTTTTTTTTTTTTTT>
##$WBST= 1024
##$WBSW= 4
##$XGAIN= (0..3)
0 0 0 0 
##$XL= 0
##$YL= 0
##$YMAX_a= 406216
##$YMIN_a= -453431
##$ZGOPTNS= <>
##$ZL1= 120
##$ZL2= 120
##$ZL3= 120
##$ZL4= 120
##$ABSF1= 10
##$ABSF2= 0
##$ABSG= 5
##$ABSL= 3
##$ALPHA= 0
##$AQORDER= 0
##$ASSFAC= 0
##$ASSFACI= 0
##$ASSFACX= 0
##$ASSWID= 0
##$AUNMP= <proc_1d>
##$AZFE= 0.1
##$AZFW= 0.1
##$BCFW= 1
##$BC_mod= 2
##$BYTORDP= 1
##$COROFFS= 0
##$CY= 11.3945322036743
##$DATMOD= 1
##$DC= 2
##$DFILT= <>
##$DTYPP= 0
##$F1P= 2.36226072786647
##$F2P= -0.459571619588291
##$FCOR= 0.5
##$FTSIZE= 0
##$FT_mod= 4
##$GAMMA= 1
##$GB= 0.15
##$INTBC= 1
##$INTSCL= 1
##$ISEN= 128
##$LB= 0.24
##$LEV0= 0
##$LPBIN= 0
##$MAXI= 10000
##$MC2= 0
##$MEAN= 0
##$ME_mod= 0
##$MI= 1.114404
##$NCOEF= 0
##$NC_proc= 0
##$NLEV= 6
##$NOISF1= 3.799351
##$NOISF2= 2.8
##$NSP= 1
##$NTH_PI= 0
##$NZP= 0
##$OFFSET= 15.70392
##$PC= 1
##$PHC0= -19103.37
##$PHC1= 10.80074
##$PH_mod= 1
##$PKNL= yes
##$PPARMOD= 0
##$PSCAL= 0
##$PSIGN= 0
##$REVERSE= no
##$SF= 200.130013532006
##$SI= 16384
##$SIGF1= 3
##$SIGF2= 2
##$SINO= 400
##$SIOLD= 16384
##$SREGLST= <1H.CDCl3>
##$SSB= 0
##$STSI= 0
##$STSR= 0
##$SW_p= 3612.71676300578
##$SYMM= 0
##$S_DEV= 0
##$TDeff= 0
##$TDoff= 0
##$TI= <>
##$TILT= no
##$TM1= 0
##$TM2= 0
##$TOPLEV= 0
##$USERP1= <user>
##$USERP2= <user>
##$USERP3= <user>
##$USERP4= <user>
##$USERP5= <user>
##$WDW= 1
##$XDIM= 8192
##$YMAX_p= 0
##$YMIN_p= 0
$$ End of Bruker specific parameters
$$ ---------------------------------
##NTUPLES= NMR FID
##VAR_NAME=  TIME,          FID/REAL,        FID/IMAG
##SYMBOL=    X,             R,               I
##VAR_TYPE=  INDEPENDENT,   DEPENDENT,       DEPENDENT
##VAR_FORM=  AFFN,          ASDF,            ASDF
##VAR_DIM=   8192,          8192,            8192
##UNITS=     SECONDS,       ARBITRARY UNITS, ARBITRARY UNITS
##FACTOR=    0.0002768,     1,               1
##FIRST=     0,             0,               0
##LAST=      2.2672688,     0,               0
##MIN=       0,             -453431,         0
##MAX=       2.2672688,     406216,          0
$$ Real data points
##PAGE= N=1
##DATA TABLE= (X++(R..R)), XYDATA
0@%%%%%%%JrJ6j6J6k4L2m0N4o8Q6j04J20j44J76k09K47k88L37l93M56n29O06o94
31c71P95r05J026j160J306j470J651j846K060k296K556k840L147l481L848m250
47b230M690n168N692o270O909p614Q395r269J0250j1359J2627j4093J5804j7835
61i471K0297k3350K7252l2442L9717n0728O9527j10008L46091k93940l38149P61420
73D06216l90211m69436N69573K38894n47959J78905L11684l68006j51935L50728
83A28453q4917j60961J87715K3218k22469M2693J09788r2183k8911K14552j7784
94I9194k38986J08360J46903l13120r054M03027j50930k91448L80897R2085m89961
105b63033J55641M10374l87277j54728M70367j46312l60045L39291J34558l03337
$$ y = [0, 0, 0, 0, 0, 0, 0, 0, 1, -8, 8, -8, 8, -16, 16, -24, 30, -38, 48, -56, 64, -80, 96, -113, 134, -154, 183, -210, 246, -283, 323, -371, 424, -481, 545, -615, 691, -779, 872, -974, 1086, -1210, 1346, -1494, 1653, -1828, 2020, -2230, 2460, -2708, 2984, -3286, 3623, -3991, 4404, -4865, 5385, -5974, 6653, -7440, 8364, -9471, 10826, -12524, 14728, -17714, 22003, -28725, 40802, -69206, 276885, -17055, -355204, 406216, 16005, -453431, 116142, 355036, -192923, -14018, 297666, -70340, -222275, 128453, 43536, -117425, 70290, 93508, -128961, -86268, 23520, -68663, -97574, 116978, 99194, -139792, -31432, 115471, -197649, -206703, 196324, 45394, -246054, 134843, 226928, -263033, -107392, 302982, -84295, -239023, 231344, 85032, -275013, 64278, 198836, -104501]
115a04501J23800J86072k30783o0648J33264r7067j5102J65038l9215n1471R7739
126A07126q5756j27374R4667M2757p1445L8490Q3104m3349j18030J7445J02682
137D0317o9241n2356J73081J0417k13026L5752J23791j58157k9423K42515k2593
148H1077j41982J22632j2323j79364O9951O7011p0509R8869O1666j14758L4692
159A6962M9510j42505J8277J57551q8383p1331J56445l5419j57737J00876P8830
170H3076j06972J5162Q7200m7381o9243J7009L3456k2563k1117N0200K4969n5493
182a1697j1203M0613k6413l4086M5386o3m3921L9791K037m4932O8879J4193q4803
195d6219N6276L3842j22978K4006J13040p2267l2489J27655k6674j20827O4806
$$ y = [-104501, 19299, 205371, -25412, -86060, 47204, -49863, -64965, 100073, 60858, 9387, 107126, 21370, -106004, -11337, 31420, -40025, -1535, 81569, 38220, -79810, -62365, 40317, -28924, -81280, 91801, 102218, -110808, -75056, 48735, -109422, -138845, 103670, 81077, -60905, 61727, 49404, -129960, -60009, 7002, -63507, 35362, 97028, -17730, 16962, 66472, -76033, -57756, 99795, 11412, -59919, 96526, 61107, -96630, 4246, 83076, -23896, -8734, 78466, 31085, -38158, -21149, 12307, -10256, -31373, 18827, 43796, -11697, -22900, 17713, -8700, -42786, 2600, 2537, -41384, -1593, 444, -44488, 24391, 38584, -46219, 10057, 43899, -79079, -55073, 57967, -14300, -46789, 80866, 54192, -66635, -1829]
206a829M0432r7608L4898Q7312m9593j8344L4178l5334k0943K4653L538J0742
218A2102K1947j3934k7439J159m124k0398J9445M0366k78k0941k52O439l7332
231b3240l2280N8171K6254n6820L6823N4336q2683l0285P2818k6029n0294O6873
243A3644K8328o4268J3411L7630n1139m963M6017k6128k954L9102k9301j5403
255a6024L5360j9400k8062L4962J3599l5304R572L7925k6737k8621L1799L641
267A2710l5058O499L3293m038k7514J8280K2035m2317j2979M1842j2064k1107
279b0418L4306P135k8538L069P460j7894N222K1946j0598N563K2605l3037j6200
292a9379L3680k0402k3300M7693J2984l7581R598K3598l3836k6367L3706R721
$$ y = [-1829, 38603, -59005, -24107, 63205, 13612, -4732, 29446, -5888, -26831, -2178, 1360, 12102, 34049, 20115, -7324, -6165, -10289, -30687, -11242, 29124, 28846, 7905, 7653, 14092, -23240, -55520, 2651, 28905, -27915, 8908, 63244, -19439, -49724, 23094, -2935, -53229, 13644, 41972, -22296, -8885, 28745, -22394, -27357, 18660, -7468, -10422, 28680, -621, -16024, 19336, -64, -28126, 6836, 20435, -14869, -5297, 32628, 5891, -22730, 9069, 12710, -22348, -15849, 17444, 13406, -14108, 4172, 26207, -16110, -29089, 12753, 689, -20418, 13888, 21023, -7515, -4446, 3014, -14880, -9658, 12288, 1690, 7253, 29858, -3179, -19379, 14301, -6101, -29401, 18292, 31276, -6305, 3293, 26891, -6945, -33312, 394, 10115]
304A0115k6999J6020K3945j9834j7532O959O396j1307n999K2394N044j9149M513
317e434O220j0260j630O087R155M110o029k088L293m317j3983N772K5376p446
331H826j2094L0139k854l7996R314J6260k1889k413K8546N911j7827L563Q718
344A6204j8405j0165P350K804L067j780J600J0210j1297j2905J1632J841j0427
357a0271K367J0080j550j4085O02J1633o144n367J3507J0232j0258j1899R626
370a527K21k2278R702K5571p855j516J5985l012j5742p183M193L682k741O811
384D311J4355K981j2409o454J0909q343j9176J9876J3005k2408J607J5496j1197
397B553j2598Q885J0662r188r205Q707j762j4755j879J1254N470p503L990J3710
$$ y = [10115, -16884, -864, 23081, 3247, -14285, -7326, -930, -12237, -18236, 4158, 9202, -9947, -5434, 786, -9474, -11104, -5017, 4138, 8248, 2219, 131, 3424, -893, -14876, -9104, 16272, 8826, -3268, 26871, 24017, -13979, -4665, 11595, -10294, -12707, 15839, 21750, 3923, 7486, 16204, -2201, -12366, -5016, -2212, 855, -925, 675, 10885, -412, -13317, -1685, 156, -10271, -7904, 2176, 626, -13459, -12857, -1224, -7368, -12735, 772, 11004, 746, -11153, -1527, -1306, -23584, -13882, 11689, 3834, 2318, 18303, 15291, -451, -7634, -3441, 241, -2500, 4311, 18666, 21647, 9238, 2784, 13693, 5350, -13826, 6050, 19055, -3353, -1746, 13750, 2553, -10045, -1160, 9502, 314, -8891, -184, -1946, -16701, -18580, -7326, -1856, -9359, -5369, 8341]
411H341j1678j3872R130m83p189M677O850Q682q71n143J0572K466j6894k096J4097
426F589m452j3262J9943J6920k0243R3J7399j7318j3907J1980L631l384R13M290
440I192J995j0427o498P612M274n571n70Q195q067j8769N412Q228m483P954J0117
455H594j004p917j6250j441O660r384P454K6322k690j7133O950L448k1574L4K5505
470G574k354r374J2997j024j1880J924M082R058K662r016M601K200j8544l54J9484
485A2036M34r363J2032M641k2517n204J1806o082j738P656j07j378q170m247J2169
500A968k800r565J1000N43j9075j298J3396j226q84J5369Q69j3796k551m918m49
515a3417J0783L31P854J4179j6919j2463J3776m872r450K0734J2270j6592n040
$$ y = [8341, -3337, -17209, -8079, -8562, -15751, -11074, -4224, 4458, 3587, -1556, 9016, 11482, -5412, -7508, 6589, 2137, -11125, 8818, 25738, 5495, 5588, 22987, 5669, -8238, 3742, 7373, 3989, 4902, 9192, 11187, 760, -5738, 1874, 6148, 577, 7, 8202, 135, -18634, -13222, -4994, -9477, -1523, 8594, 7590, -327, -16577, -18018, -11358, -20742, -13288, 13034, 10344, -6789, 161, 3609, -17965, -17931, 7574, 5220, -4154, 8843, 7819, -4061, -2137, 1945, 11003, 13665, 4649, 9250, 11450, -7094, -7448, 12036, 12470, 3107, 15139, 19780, -2737, -7941, 3865, -2217, -3955, 3701, 3594, 2216, -5954, -10201, 1968, -832, -10397, 603, 1146, -17929, -19227, -5831, -7057, -7941, 7428, 8297, -5499, -8050, -12968, -13417, -2634, -2303, 5551, 19730, 2811, -9652, 4124, -748, -10198, 10536, 22806, 6214, 1174]
528A174O556j2527n616J7585O488O25J631j2554o120l610j0075J2680J8054o160
542H131j176L887j4753j3800O390P957J322O374J928p477m505q273p39J6999o45
557A620n935J5624r083k3692J1801J0004r288J0805J5183j1580j1686M062m390
570f555k420J3227L456k94N189j3517p252J2006m644n81J8578m042j5031J444
584d36o72p227O863J1529J500l126n722j0064j232qo11J6587O473j5409J818n39
600b76j9125N432J6722k044L518O187j2386r516L605j757L615J7846o16j0892
614C13N941q346j7094J4925J1921o258R061M403j5155o716J098L88O026O582J816
629H905p74n860j1660L79R455l011M709J2199j1101j0350M418n320K61J2057J219
$$ y = [1174, 7730, -4797, -10413, 7172, 13660, 14285, 15916, 3362, -2758, -6368, -16443, -3763, 14291, 8131, 6955, 10842, -3911, -17711, -11321, -3364, -2042, 4332, 6260, -1217, -5722, -13995, -14734, 2265, 1620, -4315, 11309, 2226, -21466, -9665, 339, -8949, 1856, 17039, 5459, -6227, -2165, -6555, -8975, 4252, 7708, 7414, 12603, -914, -8166, 3840, -804, -1385, 17193, 13151, -1880, -436, -1108, -8335, -1472, 10057, 11557, 8431, 2709, -7355, -8587, -8595, -9206, 7381, 13854, -1555, 263, -276, -19401, -13969, 2753, 709, 4227, 10414, -1972, -11488, -7883, -9640, -6025, 11821, 11205, 313, 6254, -2092, -19186, -4261, 7660, 1402, 10463, 14866, -289, -7005, -5907, -5519, 507, 7089, 8905, 8131, 2271, -9389, -9010, 445, -2566, 2143, 14342, 3241, -7109, -2691, -8011, -7750, 4307, 5526]
644E526M89N17j1614m423P831j364m10J5446j57j7674K835M883j4244P192J6918
659A1751o459k749K281r910l418M040J232P692N430p128n089J717p039m247J4317
674B421N303p144M189j279j1121p3L032M268P366k907j803K467j0367o481J1687
689d42N677o054N750O437j3938o859R708k155o08J0520j504l557j009q572J765
704d841Q719m016J634J0300p003j2716O107M453r140M956J2462p483p228K835
718i61k590k196J343L927O782n056p786N219j422q762O985J0294m255m768N146
733A900k324q085M150N794N02K819k620r46K529q029m84J3460k320p075Q459R29
749H659j2900L5J0580l368m253Q693k37q293o44J68O80J282l065M204K520q664
$$ y = [5526, 6015, 6532, -5082, -9505, -1674, -3038, -3448, 11998, 11841, -5833, -2998, 1885, -12359, -5167, 11751, 5292, 2543, 4824, -5086, -8504, -4464, -3232, 4460, 9890, 2762, -2327, -610, -7649, -11896, 2421, 7724, 580, 4769, 3490, -7631, -7704, -4672, -404, 6962, 4055, 2252, 4719, -5648, -12129, -442, 5235, -819, 4931, 11368, -2570, -9429, 279, -1876, -2484, 8036, 6532, 2975, 1966, -6606, -4841, 3878, -138, 1496, 11796, 4793, -7923, -1816, 2637, -6503, -1547, 10915, 3432, -3796, -961, -3551, -5747, -4404, -477, 6305, 1249, -6537, -1318, -2740, -11502, -4517, 5777, 1522, -3246, 1900, -424, -8509, -4359, 1435, 1937, 4756, 2136, 1190, 3719, -4310, -4794, 8666, 6346, -729, 7730, 8659, -4241, -4206, 6374, 3006, -1247, 7446, 7209, -1084, -1728, -1560, -880, 402, -2663, 1541, 4061, -4603]
765d603r82N880k629l312M500L149n463l302L913P99j716O36L191K914o175l755
781f955R518k241q194J0438N478j0291j13Q121l641n903O902L989n614k33K174
796C435j631J54j121K060N722n083m397N944l204p082M443N650l035k841M285
811C299p4p173j313M087m98k826Q25M822j399p876M634N212q635M76Q217l330
827a552m841M003K475k685n14M023J364o24q87l94K719j892m492P587K727o974
843D3L856O026o142l675L600O11m755o0N018n40l222J228J271j436n019j09M703
860A398m021l142O364r3n017J593J846j264j981N63L046j283l717J897L399j772
876b184k874O221L997q040O74P122o790m327P771J540l008K399M026j348m598
$$ y = [-4603, -5585, 295, -2334, -5646, -1146, 2003, -3460, -6762, -2849, -2050, -3766, -3130, 61, 2975, -3200, -6955, 2563, 322, -7872, 2566, 8044, -2247, -2360, 5761, 2120, -3783, 3119, 7108, 1494, 1261, 3435, 1804, 1958, 837, 2897, 8619, 3536, -861, 5083, 1879, -5203, -760, 4890, 1855, -986, 3299, 3225, -3948, -5261, -1174, -1672, -4498, -3673, 1149, -250, -8126, -3492, 1720, -6915, -6439, 1778, -1552, -6393, -2390, 85, -2600, -3114, 909, 2273, 1649, 762, 368, 3087, 1195, -3297, 4290, 7017, 43, 3899, 9925, 3783, 108, 3708, 4319, -436, -496, 4522, 3982, 760, 1988, 3259, 1823, -3196, -3305, 1398, -2623, -5765, 599, 506, -4511, -2918, -1072, -2336, -4317, -3754, -708, -1991, -5708, -3811, -412, -2184, -5058, 1163, 5160, -2880, -2206, 4916, -1874, -6201, 1570, 3110, 102, 2501, 6527, 5179, 581]
891E81L13Q13q90r49J346M684q73m781K837J918o910J52M665j769k407R08J781
908A419j435l633K024L437k785k742K979J250o253r43P146k706l800P336J479
923B773o014J372J325k058o76L34K411K373r65J36L139n31n218J016M446m807
939i44j056P879q05m039K243J093k680k855Q61L537j796k549K707J107n152j465
955c914N404j3m756M167K798p287j486K649j093J138J962K091J872m077l680K464
971a761q95l060M391O355k997l771N065k088o383L786L892k410J151Q99p32j076
987C66k410J839L500k143j155L190j097n054R64M474k171j298M346j258k495J6
1003c86o63J887o46l041L942P13n544K075N269l550k366L870n12o516J854M574
$$ y = [581, 894, 1707, 817, -132, 1214, 5898, 5025, 244, 3081, 4999, -1911, -1759, 2906, 1137, -1270, -362, 1419, -16, -3649, -1625, 1812, -973, -3715, -736, 514, -5739, -6682, 464, -2242, -6042, 1294, 2773, -3241, -1869, -544, -2602, -3278, -2944, -533, 1840, 875, 1011, 4150, 3619, -1599, -583, 3863, -944, -2000, 5879, 5074, 1035, 3278, 4371, 1691, -1164, -303, 3234, 1438, -1111, 1596, 2703, -2449, -3914, 1490, 1477, -3279, 888, 3686, -3601, -5087, -2438, -3531, -2393, -431, 1660, 3532, -545, -4225, -1761, -2656, -5716, -1325, 5030, 2033, -1738, 3327, 1239, -5144, -1358, 2534, 124, 1275, 2174, 1442, 366, -2044, -205, 3295, 1152, -3, 3187, 2090, -2964, -2000, 2474, 303, -995, 3351, 2093, -402, -386, -1049, 838, 192, -2849, 1093, 1806, -3738, -1663, 3606, 56, -2310, 1560, 1048, -5468, -3614, 960]
1019I60k031J517K371k029o08k970j758M639Q07j204M186R86o330k132L033l96
1035i59j075N445K772l893k621j500r57O11l92N384M005n926k157K586n679k930
1051g286P148L784k542P44J394m876l357K174J924K387K056k098J367j711o495
1066e387L071M910l132J404M479k785n171J483J768k006O99K783p79j875j573
1081b111N50K654j571j289M737k541n840L510J916k204K076L284j402l447n78
1096b256L52M63J674P02K174N64o419k54M596l176M30Q120j481n913L9p45l051
1113d181R61N447L285p29j501k745k371k611j011O107L990l622J583J041p499
1128c856j933M146J327J13J976M59k823l698m87K760K271p8J635K902n682n507
$$ y = [960, -1071, 446, 2817, 788, 180, -2790, -4548, 91, 898, -306, 3880, 4866, -1464, -3596, -563, -959, -2034, 3411, 6183, 2290, -331, -1831, -2788, -2177, -2569, 2815, 6820, 894, -1263, 1323, -4356, -7286, -138, 3646, 1104, 1848, 3242, -1634, -4991, -2817, -893, 1494, 3550, 1452, 2819, 1108, -5387, -2316, 2594, -538, 866, 5345, 2560, -2611, -1128, 640, -1366, -667, 2116, 1337, -538, -2111, -1561, 1093, -478, -1767, 2970, 429, -5411, -1901, 15, -2189, -113, 3171, 1769, -1678, -2256, -1904, -1441, 233, 935, 3109, 3673, -2746, -3000, 1596, -1580, -1150, 6970, 5489, -424, -385, -1130, -4181, -3220, 2227, 5512, 4783, 3282, 537, -1834, -4445, -5456, 651, 4641, 1019, 2602, 3643, -3856, -5789, -1643, -316, -203, 1773, 2232, -591, -4289, -4776, -2016, 255, 177, 1812, 4714, -968, -6475]
1144f475M687J81k899O157L598l531j505M19j377r82R80K227Q48r46j541J545
1160A386J566k670Q87M581m925l556L652j200j757L360K240l05k283k078l97n88
1176b087j818K315L655j399l872K193P3m703L351N202k375j634R78k942k210R22
1192d351L126M195P95q16j04k459m995n09N406J279l37N315k20o185q18P90j281
1209a169J331K050J328p73l127o42K024j080m71L551J169m655j931J967l433p50
1225d611N018J610j468N64j133j185j581j474K157J297j530Q99K858j337j822
1240a738K390R69l836l85K484j766J12L005J353O77j277j348N88j490j571K896
1256A063K412j912k18J911j843k831K597J808k119O20J40k303j203j036J541K721
$$ y = [-6475, -1788, -1607, -4506, 1651, 5249, 1718, 213, 632, -745, -1727, -747, 1480, 2328, 1382, -159, 1386, 2952, 282, 1169, 5750, 825, -2731, 921, -279, -2036, 1324, 3564, 3259, 976, -1102, -1499, -2087, -3905, -1590, 2065, 666, -3206, -1013, -940, -5643, -2292, 2910, 535, -1099, -121, -3063, -5273, -4351, -1225, 2970, 3765, 2949, 2845, 386, -4609, -5118, 288, 1567, 1230, 6545, 6325, 140, -678, 112, -1169, 162, 2212, 3540, 2767, -360, -1002, 1022, -58, -529, 3022, 4191, -464, -2395, -428, -3861, -4611, 407, 2017, 549, 1113, -20, -1205, -2786, -4260, -2103, -806, -2336, -1437, 1421, 84, -1738, 652, 1621, -2215, -2600, -116, -1882, -1770, 1235, 2588, 3265, 1988, 640, 1228, -262, -1833, 1063, 3475, 1563, 1345, 3256, 1413, -1418, 1179, 2987, 868, 1488, 1628, -675, -1878, -2914, -1373, 1348]
1272A348l49K91J444l070m443J61J858r68J772M287J8k831l47q36j313QM67K998
1290D95J136k236P84J753l184R6L163L67k160O99J454k746r18K690J78K82M45
1307B298r7M86k321k264K094k56j925K396K105j450j068J500r07l068J65J120
1323a192o77M97J055J282L47j907o52J215k662p97L323O76j454P55J360j509j561
1340a901J764O68m93M54Q9J58r94j497J737J691j354J292K189k462k234N34J81
1357a78j394J121K806L24j289O5q63j136j485j60K988n45j374K700p8l272K50
1374a520J285p26o87J177J429j294q04M91L0k57L9J281J522k064q63K149j642
1391d54k223K734J337r33L57J521j083k139K68N30n35K42P73J678l77k160L16
$$ y = [1348, 999, 1290, 2734, -336, -4779, -4618, -2760, -3728, -1956, 2331, 2349, -482, -829, -1665, -2978, -2970, -2503, 495, 1631, -605, 179, 1932, -1252, -1156, 2007, 2374, 214, 913, 2367, -379, -1297, 1393, 1571, 1853, 2298, 2201, 2687, 366, -1898, 196, -60, -1985, 411, 2516, 1066, -2, 1498, 591, -2477, -2312, -1192, -1869, -1372, -317, 965, 1312, -595, -1247, -32, -2694, -3491, -168, 508, -946, -191, 1169, -340, -1901, -137, 531, 38, 492, 581, 739, -255, -1752, -15, 1676, 322, 1614, 3803, 1341, -893, -359, -178, -1572, -451, 2355, 2679, 1390, 1455, 592, -544, -2029, -2189, 799, 254, -1120, 1580, 1502, -1770, -1520, -235, -961, -1648, -471, 958, -336, -1140, -649, -619, -876, -837, 444, 1966, -98, -961, 1188, -454, -2677, 57, 1394, 461, 818, 2339, 1256, -883, -615, -85, -620, -378, 395, 2073, 1696, -464, -148]
1408a48R86k600j13K847o11l77Q22J09j295j057O11O90m6J93P50O34j860j062
1426a527J650j12j769K479J651k351k52R18q20j414L83J513M76m20L92J54q76
1443G5j694O17J679j070o7K673j150k195M30Q09j031M14Q41J263n96j259N20j34
1461A25j285m77K008Q92j420O43J568k601q66J746n23p29J189Q18J22r15m14O73
1479E54m80o56J16J622n89j227J768Jk564Q01J443j093J48P39J2j006j022K60
1497a173O90j031N91J789M66j604p22R07j530r55K107J083k36Q94j94q41q07p35
1515a301J217Q39o27O46J117r24k244J326J296j664O13K387j587j893P68k18l53
1532f02N37N85J238r04j557N38l07j662P04J616k02j085J557M03j939k1J141j080
$$ y = [-148, 838, -1762, -1875, 972, 361, -16, 806, 915, -380, -1437, -826, -136, -182, 11, 761, 1395, -465, -1527, 123, 11, -1758, 721, 2372, 21, -231, 687, -133, -1547, -1164, 349, 825, 405, 797, 951, 75, -1619, -1002, 677, -393, -460, 2213, 1063, -1132, -702, 107, -924, -510, 331, 1594, 998, -261, 259, 125, -1160, -1637, 371, 1263, -157, 486, 2054, -547, -1413, 333, -190, -919, 270, 1088, 1210, 295, -119, 554, 74, -582, -466, 1156, 567, -660, 1108, 1109, -1455, -654, 789, -304, -156, 583, 595, -411, -1433, -1173, -483, -1514, -923, 866, 1332, -272, -994, -87, -1617, -2572, -465, 618, 382, 1276, 1082, 241, -566, -1301, -84, 755, 128, 774, 1891, 967, -1277, 49, 1345, -319, 294, 2681, 1094, -799, -31, -249, -602, -65, 520, 1758, 854, -703, -165, -472, -2134, -1430, 186, -16, -1101, 456, 859, -1080, -1101, 40, -1040]
1550a040q2JO16P36m63J00J533r34j670J120L02j522M60K435k38j551Q74J46j136
1569c13M29M00P57P5j349K17M94j477k8K503J58j199M71m89k033r19J651L55L74
1588G7J209j95l81j869j545J287K22n82K136J038j935o86N31m21o54J637J266
1605A135r13m64k62l81O40q1J127J457r45j301J050q25j715J329J611n11N2O58
1623A661l63j246K01K34r9k64n26O31k31j185J076J476j404o92P67r87j414R64
1641a401J236L42l50P72m74j077n85K41J376Pl73Q63j54j981N47J492k10M00J204
1660A875q44j286j109M59N91P15J026R09Rk123j152Q36m24l38K324N34j212l95
1678C95j93o86n28O69Q42P8n50m82P3m34p75J308J289j039p2N83j718p20J183
$$ y = [-1040, -1122, -1121, -505, 231, -232, -132, 1401, 467, -1203, -83, 219, -1303, -843, 1592, 1354, -197, 677, 823, -313, 116, 516, 1273, 1348, -1, 216, 710, -767, -795, 1708, 1866, 667, 1138, 649, -1384, -2303, -652, -297, 77, 1286, 1091, 710, -1159, -2704, -1417, -1195, -1777, 359, 1397, -538, -1224, -693, -1114, -1768, -131, 1135, 222, -242, -504, -885, -245, -326, 801, 2258, 1313, 12, 1062, 237, -1478, -149, 1462, 951, 1003, 1661, 1298, 52, 253, 487, 388, 124, -402, 229, -2, -1187, -111, 1365, -39, -731, 36, -951, -2365, -1401, -165, 177, -173, 599, 125, -952, -1537, -1296, 80, 87, -286, 577, 423, -1558, -1011, 481, 271, 671, 1875, 1031, -255, -1364, -905, -314, 401, 1427, 2336, 2345, 222, -930, -94, -518, -856, 1468, 2002, 790, 395, 202, -484, -1012, -343, 499, 577, 27, -455, -382, -816, -1591, -283, 1006, -33, -105, 478, -1240, -1960, -777]
1697g77N52qK05M88l29m42m89Q33M32l29j88Q39n37q46R62J014j134J06N76m92
1717D36q96PN17M90J66L14M39j131j224L11O27l24K63J198r49j282N37j61k89
1736i51O75N75J90k64j114k33L31l72P85J436K15j318m75P61j520q5J701K79j47
1755D69J87m39l36n23J41R85J85o15L98K22j130k98J053K87l85M63M02r43n58
1774d35J29L88J08n8PM78q85o38R88K45o90K80O43r62n39J103l6o68N82J61j05
1795I6q51R7L74N34o04O60N07q77l47K59K38n00N07Q10l35r20N23m32j64J52L25
1816E2R00n82n57K44j82q41M95J179l60l41N57n08q52J83O43j81L05K04j95K5
1836A88o15J04O20k92l29Q15K60r43l36N40J18n68L60N64l02k64J08j4r2j32R0
$$ y = [-777, -225, -233, -28, 460, 131, -311, -800, 33, 465, 136, -52, 787, 250, -596, 366, 1380, 246, 352, 928, 436, -460, -453, 64, 554, 720, 1034, 1473, 342, -882, -571, 56, -268, -5, 1193, 244, -1038, -501, -662, -951, -276, 299, 489, 225, -889, -1122, -791, -1163, -378, 1058, 1273, -45, -520, 241, -1279, -1364, 337, 616, 469, 656, 217, -119, -642, -501, 484, 669, 54, 452, 674, -456, -754, 299, 586, 201, 664, 1066, 123, -435, -306, 82, 190, 132, 139, 617, -268, -906, 82, 327, -363, -83, 560, -402, -941, 162, 126, -542, 40, 201, 96, -755, -658, -284, 250, -354, 306, 813, -64, -411, -152, 86, -414, 93, 903, 568, -352, 171, -261, -425, -273, 52, 952, 370, -187, 57, -125, -966, -471, 708, 348, 7, 564, 56, -796, -613, 30, -151, 154, 358, 163, 188, -427, -323, 297, 5, -324, 491, 751, -192, -528, 12, 130, -438, -78, 486, 184, -80, 28, 14, -78, -210, -120]
1857a20P28j204J05J075l79p35N47M42o95k06O20j17l31N08J20m61J68n13P43
1876B95k57m48R37p1o16K17K72m08K17p0O75m95m74M32o9k84J88N4M89n86j48
1897a50P35o43q86Q56N58p23p3M19K50n63k61N09j0m92J44L83J9n44N0R14p89
1918b97m10J218m32n87K74L10p1j02L10J58r2m22M41j37L7o60Q37L09r04K76R14
1939I70p15k15N17J3p31O5L65q6j56o7L97k22m91O8M35m38l91M84N03r60K42K92
1961a21k09KM6J27j29J37M0q9pm79N02M92n73J01J116r22k63O71K4k96J16J54
1983D40J7j79k30K03j03j58K2O50j00o84J40N41q08n5O31n03J13jO9j05m30K49
2005b81J50m7l87K61K06l75q9O94o1p25N53k8l04J43M52j76R8j71K77q0m96K12
$$ y = [-120, 608, -596, -491, 584, 205, -530, 17, 459, -236, -442, 178, 61, -270, 238, 358, -103, 65, -448, 295, 38, -410, 527, 456, -160, 57, 329, -79, 138, 68, 743, 248, -226, 206, 137, -147, 41, 95, 584, -2, -150, 585, -58, -944, -88, 470, -253, -326, 93, 343, -220, -481, 28, 18, -474, -330, 53, 72, -472, -422, 492, -297, -707, 511, 79, -508, -234, 76, 5, -97, 213, 371, 279, -143, 298, 161, 198, -462, 375, 684, -220, 56, 970, 255, 40, 557, 570, -161, -96, 269, 183, 27, -40, 357, 135, -356, -288, 147, -291, -682, -198, 305, -655, -413, -121, -330, -328, -282, -155, -284, -147, -107, -196, -203, -682, -180, 312, -261, -160, 956, 34, -229, 442, 466, 170, 286, 440, 457, 278, 48, 251, 148, -10, 12, 662, 562, -122, 18, 559, -249, -304, 327, -176, -63, -64, 5, -100, -530, -281, -131, -178, -565, -304, -98, -473, -562, 132, 71, -654, -101, -129, -433, -290, 162, -14, 84, -87, 190, 110, -386, -174]
2027a74M16J94l99J77M84o17n40J140l81k05K47K47m18l56o7K46O83o35L02l05
2047C9j83k24P79m75o88M42P02r42J04J23m6k83M35M6K06k60m89N64L3j92L83
2068G4L63j19m73J94K46m07J63L16j23L9N1r0k37j66N09J24k8n87L60r0m90J52
2090b19N41k42n9K48k56l37J12j38M25J0m02O43k39n14o5M18k97qP17k77m70l31
2112g40M79r9O1M02J13j26m27j6M02r4j10O82J52o44N0J54k32j46L39L24m14m0
2134G0J53p7R9j93QN84m76l77L07n57K37L05K94m80M9j14k09m49N59L48oR5k82
2157a12O5j14m29M72O90p11K80K38l98m41J71L61o2O7K46N4l20m22K53J76m7K22
2179B39N10n7q15k49K90k82J74M42K17l83l69K68k52L9j11N66J93l64j42K32n78
$$ y = [-174, 242, 436, 37, 214, 698, 81, -459, 681, 300, 95, 342, 589, 171, -185, -252, -6, 677, 42, 344, 39, -144, -368, 411, -64, -752, -310, 392, -550, -446, -323, -369, -652, -217, -171, 35, -225, -714, -150, -117, -309, 74, 437, 318, -155, 39, 285, -122, 41, 357, 234, 273, 324, 234, -3, -169, 340, 464, 436, -151, 209, 119, -371, -219, 322, 80, 21, 269, 13, -324, -212, -350, 75, 85, -317, 326, 87, -427, -492, -74, -371, -379, 338, 61, -409, -740, -261, -360, -299, 103, 216, 90, -337, -353, 49, -45, -155, 527, 679, 35, 85, 239, 7, -139, 200, 524, 110, 70, 223, 146, 245, 52, 60, 644, 168, -209, 98, -459, -222, 83, 377, -103, -54, -168, -377, -826, -267, 81, 75, 170, -112, -47, -161, -590, -118, 572, -139, 141, 379, -19, -460, -289, 72, 10, 77, 323, 377, 57, -365, -112, 64, 17, 239, 749, 692, -123, -372, -82, -364, -190, 252, 469, 86, -283, -15, -267, -228, -339, 227, 420, 56, -86, 146, -432]
2200d32L4R14o76j21M84l43J44m46L49K85r5Q8j16j71j82J5K70M77o30K31K80
2221C59r10K44M08K70j20J15r7k44j66n0J69J94j29K06J10n94n16P24N0L1J82
2242B36L17m73j62p2k46K34O7N00J18n52q5j31J59j84L10O75n60Qo2o1k53j66
2264c83Q07k78r7J99j05m83j28J70M60k51j3N78l89m19K9N30l94j03p9K53P8k02
2286b20K43K28j59m63L46R6j1m04P59J58m55K53J73o99j6J81kO4oK29r6n28k1
2309c50L97l4l4J08J69o40k80O56j67OL40J10J6n75j90J70L3k9N46kl54K0j14
2332a98j05J02J09K75P8j85j01N0k05J41J19L56l05k05L83j74l69K09J94j54J90
2353B05K95l55k98p3K19q6k24J14J57J16j06%R3j87j78L47l20k42L99M16l48K9
$$ y = [-432, -398, 516, -160, -281, 203, -140, 4, -442, -93, 192, 97, 185, 69, -102, -284, -269, 1, 478, -152, 79, 359, -551, -307, 101, 371, 251, 366, 269, 25, -141, -191, -22, 172, 43, 249, 359, -235, -751, -27, 23, 54, 236, 553, 80, -82, -154, -400, -166, -99, 401, 519, -33, -118, -249, -90, -274, 36, 711, 151, 159, 97, 36, -217, -383, 424, 146, 49, 248, 143, -340, -468, -298, 162, -89, -102, 476, 87, -332, -303, 227, -167, -270, -349, -96, -18, -220, 23, 251, 92, -371, -25, 71, 60, -344, 415, 573, 118, 371, 544, -155, -171, 10, 8, 72, 66, 295, 199, -329, -350, 47, 13, -21, 87, 256, -384, -664, -8, -175, -169, 171, 281, 297, -278, -468, -298, -265, -294, 252, 250, -104, -84, -198, -303, -201, -92, 183, 261, 76, -25, 25, -180, -39, 80, 436, 131, -74, 309, 135, -234, -25, 169, 15, 205, 500, 145, -153, -226, -7, -93, -317, -203, -46, 70, -36, -36, 57, -130, -308, 39, -281, -523, -124, 292, -56, -27]
2375b7J40k74m86L91K14j89K88l5K65k71k75J47K05k80L03K72j43m8j32J6l61
2396b80L63J16K90m56O4k71Q5j1k15M82J48k17l9K02n39j74K19J11P1j23L60q2
2418A04j06lq1P5j80L3M04m83j75O09n27K53p9J86L22m79m5J78k02J41n9N4K21
2441A61j14M31J16q87J43K61j48j55J6O02m30L93j05j84l72K75J38k5k8k74L46
2462A60J1k87N4J25l91J74K59k11L8j18j9N7j04M56j70j08P4J22p2m32J9M66j60
2485e7Q1J56K94k12k25k6j30M9j02L78j02l4k65K54M5j59JL55n01K16P7r5l27
2508c29L67k4Q5k30O4m6p9k61M10q7K70l52J54L65m93K5K13k13j50J93M8M13k78
2531F5o8J73j91m22K81Q0M7RN75o18K6K44m25L3J83K52l61J09L8Q9p5q4N8J39
$$ y = [-27, 113, -161, -647, -256, -42, -231, 57, 22, 287, 16, -259, -112, 93, -187, 116, 388, 245, 197, 65, 81, -280, 83, 199, 489, 33, 97, -174, -89, -100, -315, 167, 315, 98, 59, 261, -278, -452, -233, -122, -51, -174, 186, 104, -2, -5, -86, -11, -191, -158, 246, -237, -412, 197, -330, -77, -156, 30, 352, -127, -172, 6, -196, -55, -114, -60, 161, 47, 478, 594, -293, -150, 111, -37, -192, -176, 426, -4, 389, 284, 100, -272, 3, 141, 116, 88, -186, 160, 171, -116, -62, 63, -328, -154, 105, -106, -68, -186, -205, -148, -252, 204, 34, -74, 0, 122, 50, -382, -363, 103, -57, 24, 180, 474, 262, 37, 11, -119, -70, -172, 206, 104, 70, -195, 59, 104, -55, -54, 301, -200, 16, 93, -2, -329, 38, 14, 99, -131, -67, -113, -192, -453, -43, -130, 140, -212, -58, 307, -186, -161, 52, -161, -311, -118, -70, 343, 65, -3, 170, -21, -443, -162, -82, -35, -26, 549, -69, -43, 201, -224, -191, -8, 244, -117, -8, 30, 119, 44, -40, 18, 157]
2555A57r7K03l17J73n93M5K93M3r2L46o9j65R6j22j18j05K03K33J1k25j52N17
2577B65k18m04L00L00l94J55K70k95p5J99M9K27m98K82j18R8j96O9J20j72m3L01
2599B22J7l35MN3k92R6L99j93N0p6K82l08J70q8r6l6R1k41M61k11J49k3j13k50
2623b68J3L90J15n1j33K3r4k37J90k4o4L24Q7l6j45l60J35lr0L70j48J26k00j0
2647i0j2m7j05L21J8M3k13J83k28j08M75r1k10L8N8k56o6J69q0J40M97m14J94
2670B16j48P4j85K68l18J85J02r8k91K80o6kk06K1J44k83J25L78J2m02J08L30
2692B44l86rP7j04K16j82L90k64O0j90P0L45k20J05K13k45j64K26k62j33K95J76
2714B58o5Nk03K68k80N5R6N2k61K61m0k91k08k8O22l73M38j65j44Q8n22K00K79
$$ y = [157, 60, 263, -54, 119, -474, -429, -136, -93, -185, 161, 92, -73, 23, -99, -217, -322, -119, 114, 125, -100, -252, 265, 47, -357, -57, 243, -151, 4, 274, -21, -96, 103, 152, 379, -119, 163, 45, 143, -53, 16, 136, -36, -79, 222, 239, -96, -92, -39, -331, -235, 164, -29, 21, -55, 227, -81, 89, 1, -95, -131, -40, -281, 180, -31, 118, 95, -18, -268, -255, 135, 250, 199, 66, 89, -5, -242, -52, -76, -140, 184, 271, 235, 90, -270, -135, -138, -228, 142, -6, 120, -80, -90, -102, -149, -254, 67, 85, 128, -85, 98, -130, -238, 237, 146, -64, -26, 32, -224, -290, -121, -201, -61, 436, 22, 216, 68, 142, -43, 225, -93, 92, 194, 96, -195, 85, 19, 17, -189, -168, -24, -307, -182, 196, 208, -194, -86, 244, -142, -151, -74, -178, 38, -144, 246, -18, 42, -148, -78, 267, 47, 152, 365, 120, -44, 182, -80, -213, 82, 258, 193, 198, -5, 263, -17, 38, 134, 186, -75, 186, 146, -145, -353, -381, 241, -132, 306, 141, -3, 85, -437, -237, 42]
2737D2m1p2Lk4o4K4J28R2k37M1M14m97K99j56L74k38j94K72j92J40j13J4k14K77
2761G8J04j5k38j99M24j03m3J02J31k36p7N1Kl19K82J23l8k94K6k9J50j77Q21
2784E26k42k58k08K88j79k53K78J29K1l3k38L22m91N6K09K4L91n12N09k57j49
2805f7J07j6m2J89J36k70k24J24qK13p2R9J94k65k15J56M4k89j4K59Rl27K05j76
2829b50K59j03l56K75K93m25K69J43o4L54k47M4m02M19k70j19J18J94o7Jo5m6
2851d5K8K0J19r5J37p0J81n7j95m1O8J54L7l14R8l73K99r2J82j41J05K02lj88
2875A6j76J61J3k27o6N35l1k18m5j34k62J17L94J2M3l23K15r6K8J47Rk05J4K01
2899A22Q4l60J66K34k68k07K23j82K40J51l09L13j51j85J72J37k26j18K89j20
$$ y = [42, 1, -71, -68, -92, -156, -132, -4, 88, -149, -108, 306, -191, 108, -48, 326, 88, -106, 166, -26, 114, 1, 15, -199, 78, 182, 167, -71, -270, 154, 51, 8, 110, 241, 5, -72, -21, -19, -338, -56, 67, 29, -265, -239, -268, -118, -295, 526, 284, 26, -182, 106, -73, -326, -48, 81, 102, 69, -169, 153, -338, -282, -73, -49, 342, -170, 339, 82, -67, 40, 24, -18, 171, 307, 37, -187, -63, -71, 142, 70, 169, 363, 98, -117, 39, 83, -206, -220, 39, 48, -279, -74, -250, 9, -94, -450, -175, 118, -307, -38, 105, 41, 395, 148, 192, -210, 209, -61, -180, -62, 132, 65, 66, 1, -45, -17, 3, 122, 27, 164, 94, 275, 218, 23, -18, 50, 204, 241, -73, 25, -348, -49, -141, 41, -100, 5, 207, 204, 16, -160, 1, 14, -213, -279, 256, 225, 7, -38, -172, -434, -317, 77, 89, 132, -191, 24, -72, -44, 103, 112, -93, -79, 122, 206, -154, 12, 246, -22, -229, -6, -188, 52, 203, -106, 207, 56, -129, 43, 180, -46, -164, 125, 5]
2919Ep5k44J78q4L23j00k16L2KM39k66j65J36J05j77l6K44l78K37j68o5L97l52
2942b28L24j79K53p5j89K11j11o9K29j61K1r4r4j37K7J92J98k19L11j6k19r5J60
2965D0Q4l13K47l72N24l81L2K17rj13R8q8J51j28l8J53j83k25J03Q4K10J10l17
2988a14r2j18K48J65j23jK18m03J10pM6j11OM2J12J31q0j07J46m6r9j50M24j65
3012C2O9j65J52k5N8k45K38J02l39L43l46J47J40k3l22q0L34J86j75l32L15j13
3034d9j31K87n7j44M1k14K98j15m4P6j21J97L3K20k64l4K14J09l51l6J31n5J08
3057I9k49J56N7k94J52j7J27j90k70N45K0j04QJ7j75j8K27j31K66n79M96j48M9
3080D4o2Qj50K54P1j69L4R0j15L9j17J65j21N5k6k0O5m3j4K8j93J54j45K91p8
$$ y = [5, -70, -314, -136, -220, 103, 3, -213, -181, -179, 260, -6, -171, -35, 70, -107, -143, 101, -277, -40, -208, -273, 124, -228, 96, -83, 170, 95, -94, 117, 6, -63, 166, 5, 26, -68, -162, -299, -272, -80, 118, -101, 210, 194, -25, -120, 40, 124, -189, 58, -314, 210, -171, -139, 78, 69, -44, 54, -34, 117, -11, -49, 104, -79, -304, -201, -117, 93, 203, -114, -206, -324, -76, 89, -34, -35, 183, -220, -110, -117, -71, -182, -176, -134, -22, 109, 29, -78, 68, 22, -77, -227, 197, 32, 101, -64, 88, 63, 121, -124, 114, 216, -123, 220, -126, 21, 161, 138, -184, -264, 70, 256, 81, -251, 64, -49, -180, 107, 50, -94, -53, -267, 31, -84, -128, -52, -173, 24, 57, 277, 13, -21, 193, 302, -49, -85, 46, -9, 99, -150, 6, 63, -231, -79, -96, 31, -159, -429, 116, 136, 32, 40, 57, -118, -136, 91, -40, 226, -353, 143, -5, 44, -18, -10, -160, 94, 165, -4, 30, 120, 5, 44, -73, 92, -29, 26, 0, -20, 45, 2, -12, 16, -177, -23, -168, 123, 45]
3105D5j07Q5J21l22K50J64n13J87L9j55J07p2N3K20j19P8p8q8K08K4J41k13j48
3128i3K09m5q5K51j75J67j06j58J78j62kp3R0q4k6Q4K3j30K33j70K23k41K17k82
3152a57l4R1J23N0K04m30J59l7P8m4mR7l42L54k36K59j18K14l55J98J40j62K7
3175G5l0P9J4oP6j86N2j35m8K07k83J74m5J62j92kL9k7J69j81p4P7p2J40J06l47
3201b58R3K50k69j02J12M93n15r1L39n6j05j41K01K63k05n9M2J65j59J5J35k30
3223h2O8l4K23q3J20l59K01l06P4K61k05J13l9L01l41K71q9j07J9O7Q3j84m61
3246d89N38k09J76K1r4N5j67N1K61Kq2k4j34J1J69m03L80j04R1J34q4J20k35j92
3270b08L14k88L4K49o3m21J35K39k16M3N12k48j93K11m61L17r8K88P9j39j71K5
$$ y = [45, -62, 23, 144, -178, 72, 236, -277, -90, -51, -206, -99, -171, -118, 102, -17, 61, -17, -105, 103, 127, 268, 55, -93, 116, 71, -14, 237, 62, 229, 123, -35, 143, -19, -21, -94, -4, -88, -114, -30, -7, -137, 96, -74, 149, -92, 125, -157, -191, -100, 23, 73, 277, -153, 6, -31, 47, 3, -1, 96, -246, 108, -128, 131, 13, 227, -128, 70, 210, 48, 75, 45, 124, 138, 132, 208, 22, 74, -61, -109, 98, -185, -11, -56, 106, -86, -88, -49, -76, 93, -88, -162, -85, -157, -17, 89, -258, -165, 85, -184, -286, -174, 319, -196, -287, 52, -4, -109, -250, -49, 214, 9, -50, -8, 157, -2, 13, 148, -82, -14, -48, 175, 92, 212, -147, 54, -252, -178, 83, -122, -9, -48, 253, -88, 183, 94, -13, 6, 73, 156, -28, -489, 49, -160, 16, 37, -57, -2, -169, -118, 143, 145, 63, 39, -95, -84, 85, -318, 62, -42, 49, 183, 99, 219, -16, -208, 106, -182, -148, 101, 38, -383, -248, -9, -225, -182, 330, 82, -111, 100, -361, -44, -142, 146, 225, 86, -85, -60]
3292f0N0R7N0l0k3k50L90r9k24O3J35j80J70K3J78l78o2j9K99r6j73K93l60L12
3316A06k88K68j37J35Q2r8Lk47r0K76J48r3r9J06J3k05J76p8J16j67L22j79j90
3339a20J33O8j84K38k23k50K22J14j09J00K0r4k2K43K4k17R2n5p1M6P3O4k55K39
3363G6k15m6N9J32M29n60R6J68k29J78j25J71j69o3N0j5q3J49R5j49Q4j37K81
3386A77k35j23K80n1p2n5K32j98j59K30Oj0j93J0K53k04J62J54k68q5M07j71n
3409H2k20L11jj33J2j29P3j14j2R7R0j10J77R6j11J8k09Q5q2J59Qj11J96j34j58
3434a20j%J75K47k73j10j10K85k98J23J11J38k01Q3J06l28J85j06j74K70J41j11
3456C2k69M4J55M0N3q1Q8L1l06J92P9L7l75K21R0p6J15j54K03o9N5jL6r8q3J6
$$ y = [-60, -10, 87, 137, 107, 84, -166, 224, 125, -99, -36, 99, -81, 89, 112, 290, -88, -150, -169, 130, 34, -139, 154, -206, 106, -182, 86, -51, 84, 166, 68, 71, -176, -266, 10, 158, 65, -34, 72, 85, -120, 56, -22, 94, -73, 249, 70, -120, 13, 81, -103, 135, -88, -338, -116, -2, -111, -11, 9, -85, -107, 136, 160, -57, 35, -20, -91, -45, 28, 92, -163, 76, -139, -185, -126, 6, 435, -125, -29, 139, -90, 88, -37, 134, -35, -98, -48, -63, -146, 3, 98, -51, 33, -104, 177, -58, -181, 99, 48, -24, -79, 153, -45, -204, 26, 32, 22, -171, -161, 92, -112, 50, 204, -64, -149, 258, 87, 82, -138, 173, 172, 39, 51, -78, -5, -119, -131, -34, 56, -54, 123, 219, 108, 126, -83, 2, -80, 79, 87, -24, 172, 38, -120, -121, -121, 54, 301, 28, -82, -192, 93, -205, -82, 29, 167, -34, 49, 155, -173, 12, -94, -268, 2, 143, 32, -237, -193, -38, 2, 55, -26, 62, 93, -213, -21, 58, 95, -280, -59, 31, -45, 70, -84, 119, 50, 105, 104, 140, 42, -41, -25]
3482b5p4J41j30l5k0J46J64j17j82J53M50o09R3K30J03l11L3Kk0J56k57J13j34
3505a30J22R3K4k27L9J38L6q4o0j79N20k86k06M28k29N4k7l03M00j58K17k92K10
3528A00L7J04j54KK16l56P1o3o7J58j34o1J89jl9n5J3L24k80j24K94n2k32K83
3552A73k94o1K73nJ15k36K53l08J56Lj66L06j63r2L22k42n8o6j2R9L08m18J99
3575H6j69K27M2l26J22o6J83j29P3j93K79k11K97j37j24p8J31j67J94j42P3J54
3597A19j47j57L14j47j00K04k20J65j86L02j98l00R0L88j0j68j12j6K70l12M5
3618a76M4K73O4k72m8K33k27J66J70k11L5J4P7j02m5J17j28j74K79lk17P3M06
3641C48o57K04J48M5R2k72L00o6l85J09K17J91m33O8K41k02J86j69l04J90R6j00
$$ y = [-25, -99, 42, -88, -123, -143, 3, 167, 50, -132, 21, 471, -138, -45, 185, 288, -23, 10, 12, -8, 148, -109, 4, -130, -8, 85, 109, -118, -79, 59, 95, 11, -49, -228, 292, 6, -200, 228, -1, 53, 26, -277, 123, -35, 182, -110, 100, 137, 241, 87, 89, 305, -51, 20, -43, -110, 48, -86, -147, 42, 41, 2, -53, -40, 284, 4, -120, 174, 122, -110, 173, -121, -182, 91, 86, 201, -35, 218, -90, 66, 69, -97, 209, 46, -46, 276, 34, -24, -90, -102, -3, 305, -113, 86, -83, 144, 186, -140, -18, -84, 99, -30, 43, -150, 129, -82, 215, 78, -46, -124, 7, -160, 34, -108, -35, 119, -28, -185, 129, -18, -118, 86, -134, 31, -155, 147, -51, -351, -261, 127, 117, -51, -163, -179, 91, -221, -176, -132, 141, 205, -67, -115, 118, -109, 57, 227, 16, 51, 65, 142, 40, -5, 112, -16, -190, 89, 86, -131, -58, 348, -309, -105, 43, 88, 180, -92, 208, 142, -243, -134, 83, 274, -159, -91, 150, -52, 134, -35, -339, -149, -53, -153]
3663a53J82J56k71L79k38j73J9J14K28k89K5N1l7m6J46p6J18j72J74J5o5j57K37
3686A67j03Po8M6k87K08R1j33k3q9K42j46J40K05j69jJ9l87K65m9n4K63j29j26
3710a11j47L43n45M74p4n1k7J85p6j00J49R4l21K05J06J05l51J55O2j54K08r2
3732C7O1r7J38j42N8P5m66K88OJ78J12l80M9j6J25j43OLJ68M9J96k08l5k24k33
3757c95L90K31l60K88p5P0n1j87J65J4k83K92j10p1l7J62j53l8J69j97K43k42
3779a75J44j07K26j73J62j39P7n4j34J93q1K80l2l44m8K14L16l41M4J03M9j84
3801dR4k93R8j1K55k9j01m6k01M49j75J2j12J60N8k09J8N2j50J13L98k24q2j95
3825a25R1o5mj57M55l58K11j15N5J51j79R9j42M42l56K23m21J72Q8j23op7M05
$$ y = [-153, 29, 185, -86, 293, 55, -118, -99, 15, 243, -46, -21, 30, -7, -53, 93, 17, 135, -37, 137, 152, 87, -70, 167, 64, 71, 3, 49, -238, -30, 61, -72, -95, -184, 58, -88, 52, 257, 88, 87, 106, -281, -16, -65, -119, 144, 15, -111, -258, 85, -460, 14, -60, -111, -138, 47, -29, -129, 20, 114, -207, -2, 104, 209, -142, 13, 75, -79, 129, 37, 98, 1, 139, -3, 55, 130, -336, -48, -42, 136, 248, -132, -83, -99, 26, -117, -111, -108, 60, 109, 305, 97, 62, -162, -395, -5, 226, -134, 154, 79, 149, 98, -89, 76, 90, -193, 99, -11, -82, -119, 43, -110, -148, 21, -176, 67, -175, -31, -138, 88, -85, 77, -62, 15, -39, -173, 20, -61, 219, 187, -157, -205, 9, 325, -16, 28, 131, 180, -4, 90, -203, -105, -116, 139, 110, 9, -37, -238, 211, 36, 48, -64, 96, 154, -55, -37, 15, -135, -22, 376, 152, 70, -125, -34, -99, -103, -260, 195, -163, 48, -67, -12, 139, -40, 59, -83, 359, 3, 226, -195, -23, 65, -58, -64, -141, 264]
3848B64J59n28K77l09k77Q8M34j05n2J03k10J82q9J46j9m6j14k3K01n0l41J29
3870a80K46K79j8r0k19j17j29J84j0J89k63L5J42r4M5j60J09k0j69M59k21pJ96
3893A87j48n5J14M1J97k11m1o0k19K86K7p0m8J09J5L6q1j2j46J2L1L1J35J8k95
3918a47J57NJ50j15J3j65N2K55l26L66l73J66M7P5n26M04M3K42l58J32l18J93
3940b8J19J65k38K74j22k32L15k44oj31J4K16j25oN7j51R3j38K57P7r4j74Q5m9
3964f6J25p4J98k27j20K20N0j24J55l3l5j01p3J09J58Lj39N7K0j48J2j87J53P4
3988GO0k15O7l7q9M51l6l33M53j72j20J21l04N9O0O5J1mL8%M2l15J07r6j8K66
4014F8j47J76J73m63K10K46l48r5R7L17r8j91J35j72K03L7k20J74j17m9R7K86
$$ y = [264, 423, -105, 172, -137, -414, -326, 108, 3, -49, 54, -156, 26, -63, 83, 64, 18, -96, -119, 82, 32, -309, -180, 66, 345, 327, 237, 18, -99, -228, -44, -54, 135, -128, -93, 49, -45, 0, -160, -51, -71, -240, 219, -2, -9, 187, 39, -16, 98, 139, 336, 125, 84, 24, -195, 91, 118, 48, 0, 109, 124, 160, 79, 67, -79, -67, -36, -5, 130, 148, -147, 10, 15, 165, 50, 63, -102, -50, 205, -121, 245, -128, 38, 85, 160, -366, 38, 81, 323, -35, 97, -221, -28, 91, 256, 18, 292, 170, -62, 253, 9, 3, -128, -114, 102, -23, -29, 28, -123, -30, -168, 89, 166, 72, -102, -17, -66, 59, -15, 183, -44, -164, 56, 106, -18, 137, 104, 69, -32, -105, 4, 162, 165, 26, 83, 103, -45, -33, -220, -67, 7, 67, -148, -81, -118, -207, 244, 208, -125, 328, 156, 36, 157, -147, -88, -28, 37, 48, 44, 82, 82, 124, -191, -84, -180, -198, 68, -79, 97, 270, -193, 17, 263, -85, -180, -83, 234, 136, -55, 80, -92, 111, 148, -72, 102, -15, -64, 33, 319]
4036C19j62k59J8K29l7Q9r2k47n8K05L9q4J30j28J50k0J2j47k07N63j77k2k17
4059a03K79j26j89n8J13J26j42M3K39j06k52K70p6L5k26K21Jp6M1m7J93p1k46
4082a57J58K25m55J96p4J96mk49K44l01K34m6J46nj37J76k51J08k39J31J86j5
4104F7j78L7K2L0o0L0J09r7J11j94J12p9J04j39K60m28L72q3j91O7j76K80J08
4127H4r0k27K91j8k2Ok3J70k93J61P4k50n2L30j21k19J56j29K95k89J04N0RO9
4151F6j97J81j9N1j31J83l83L07n3k09L07o5j0L7Rj70J53j92K62j5L7j15j86K09
4175E7k4R4m92M29oK3K2l8J9k8p7M1l21M12j08k87K83L2J61q1j32r0Q2q6Q5k3
4201e3J37j56K1R4O3k61K05O8P9j84L5PL4J6j47Q3r8M4l6j36K89j6k13J58l7N6
$$ y = [319, 157, -102, -84, 145, 108, 197, 105, -142, -200, 5, 44, -40, 90, -38, 112, 92, 104, -43, -250, 313, 136, 114, -103, 176, 50, -139, -197, -84, 42, -100, -57, 182, 76, -176, 94, 18, 53, -173, 48, 49, -27, 14, -33, 160, 89, -157, 1, 226, -229, -33, -107, 89, 85, -164, 80, -221, 13, -33, 113, 108, -29, 147, -104, 4, -235, -104, 82, 67, -111, -74, -52, -22, -82, -52, 57, -40, 71, -123, -11, -90, 14, -125, 135, -293, 79, -4, -195, -128, -304, -24, 84, -6, -233, 58, 40, 18, 24, 1, 171, -122, 39, 113, -137, -189, 141, 20, -199, -43, -172, 123, -166, -62, -12, -3, 66, -131, 50, 31, 82, -49, 134, -249, 58, 5, -204, 103, 38, 28, 65, 74, -96, 57, -135, 127, 112, 149, 34, -152, 57, 33, 127, -365, 64, 58, 81, 103, 65, 84, 56, -21, 20, -301, 111, 3, -284, -1, 31, 192, 111, -21, -111, -29, -115, -30, -53, 84, -72, -51, 43, 106, -155, 50, 118, 197, 13, 48, 55, 89, 105, -42, 41, -57, -13, -49, -185, 104, 88, -125, 33, -4, 52]
4227E2j16K81j54j32K97l51J20J19k19j04L18k73K18k32k13K82J43j74L32k54
4247f0K50m79L24n0r6R4J9J8k76L44qn9R5l02l8J78J63j89j75K09m3K11k5J39
4271B44n08L32P8j24j07P7j0L4J75j28j56j9n3J17J60R7l3k98L59j72o6Q7j56
4294g0n2Q3J99l36J22p5J02Q8m4j62L35r3j69m2Q8M5j6P6nk03J72Rj80R8j68L84
4320A86j88o5K30q6j89J64o4l1J08P3M9k74K09J0k02K35j45m9J97l06L3p9R5K26
4344A37j87q5J26k63M08k60o6O3L28l29K26j33n0K24j92j34J99J08R2k56j23K20
4366E3J13m8n4n6j00j23K15N0j1j52O0K45j95J90l11l7R3j24J02L7o2MK4J70P8
4391A61l5l8l1J23k83K21nJ05j87K4l62L61k70K02M5J19o4n9k27K22l2j69J25
$$ y = [52, -64, 217, 63, -69, 228, -123, -3, 116, -103, -207, 111, -162, 56, -176, -389, -107, 36, -138, 194, -60, 190, -289, 35, -15, -111, -17, 2, 20, -256, 88, 80, 21, 116, -186, -224, -46, 117, -72, -247, -38, -81, 130, 105, 244, -264, 68, 146, 22, -85, -8, -18, 16, 191, 63, -93, -112, -165, -48, 112, 209, 176, -122, 237, 65, -1, 86, -70, -122, -39, 160, -176, -54, -129, -27, 61, 17, -145, 190, 97, -72, -114, -26, 19, 3, 79, 74, -129, 43, 52, -128, -30, -198, 186, -2, -67, 163, 77, -112, 52, -12, -43, 65, 138, 187, -87, 122, 132, -70, 165, 20, -29, 168, -138, -105, -184, -89, 137, -50, -135, -9, -272, 136, -124, -190, -127, 201, -128, 98, -35, -85, 139, -53, -187, 12, 120, 212, -44, -167, 53, 166, 118, 64, 8, -92, -215, 0, 50, 39, -113, -53, 192, -3, 187, -124, -161, -68, -192, -90, -53, -115, -111, -87, 83, 161, 126, 88, 57, 180, -103, 118, 113, 218, 31, 55, -307, 54, -216, -14, 31, 150, 86, 27, -200, 22, -10, -179, -54]
4414e4J4n3J24j32j1r4O4L9N5j24Q3J12n6j6k85L91P5K57l93J52k76L71n05K32
4438c0p9J43j33K29j35J74l58K33M7P8j35j13L58k66Nn24O69j74O4mk25K82K9
4461A35l20J55J99j69j1kJ43k09O0o7Qk14K41M9r5L35k99K25l89P9J67l0k26K69
4485C4r5K84j09j28lOj25J53j0Q3j73Q7N2j8k48J49K32j50o6K84l35J07J38l5
4509A14k36J94N8k58Q8o9J39k03J43j01P1K57j72j52L88k13l79L34M2l5o9j1L01
4532B31m34L60m84J93J39j31J90p4J5P2k64J69j01o4J90k79K70M8n8pJ29O2k05
4555c3K08j41j34J17k48M4J15j0rL73k59l1k67O09l75K09k87J20M4n2j94O7J16
4578a8M6Q6L7m31J32j7J17L33n24J72K09j82M4Kk80L85j86j12K73k53j0K76j70
$$ y = [-54, -40, -93, 31, -101, -112, -206, -142, -103, -48, -172, -89, 23, -33, -49, -334, 57, 132, 389, -4, 148, -128, 243, -262, -30, -109, 34, -99, 130, -5, 169, -189, 44, 91, 169, 34, -79, 279, 13, 18, -506, 163, -11, 53, 49, -176, 106, 135, -185, -30, 169, 0, -11, -13, 130, -79, -19, -86, -78, -292, -51, -2, -97, 238, -61, 164, -225, -146, 21, -9, -235, 34, -61, 223, 114, -14, -17, -11, -136, 17, 7, 90, -83, 4, 56, 38, -210, -61, 171, 21, -45, 239, -96, 11, 149, 114, -122, 72, 130, -128, -40, -109, 30, -173, -30, -131, -60, 197, 25, -127, 261, 48, -331, 3, 45, 10, -59, -70, 231, -203, 157, -327, -134, 5, -126, 64, -10, 5, 77, -187, -18, -119, -183, 7, -272, -2, 46, -12, -19, 110, 172, -33, 175, 34, -100, 17, -231, -187, -72, -82, -91, 282, 23, -8, -275, 334, -41, 168, -119, 1, 45, -7, -201, -134, -18, 28, 114, 151, -280, -148, -165, -48, 285, -239, -67, 142, -40, 4, 6, -274, 111, -75, -187, 86, -167, -177, 99, -71]
4601g1k3k6j21J52K24m3k42L90l43j19M40j72Jo9l15L26L12l29O3p0LkR6q0L92
4626C74k22l33K44M4k02J65m0k9O7M1r3K2K3k5J42j92l1n3L6K4J46q4Jp5j81L37
4652A06pQ2j61LK04k72m9pJ58K15k18j17L5j81J21j7r3m8J15K92N4l42O4L27k57
4677Gj22r4J44N3O2j96J27j21M34j93j84l8J52l15R5L2J46P6l35M40m67L97j37
4700c7Lj04P3q6K73j16q9J91q7J03jl8jj91J24o5J33m9J75j07J78l98L31m50M6
4725a89J00J46n9Rj20J70J7k58J78J87j80k34L77J9k24J0J77J18n12J67Q2J95
4747A76j39RK41l61J05J66K2k55K17o2k20k3J65n2R4M5n50N57k33Q8Npj09K66
4771A45K04l27k1Kj67J01J15m5j10P7o3r2J10n5J30Mj8q5J29K6l4R0j7l91L28
$$ y = [-71, -94, -120, -241, -89, 135, 92, -150, 240, -103, -222, 218, 46, 47, -22, -337, -11, 301, -28, 35, -35, -32, -34, 62, -18, 374, 152, -181, 63, 107, -95, 70, 30, 1, 68, 109, 16, 38, 61, 36, 178, -14, -45, -98, -62, -38, 108, 24, 25, -50, -231, 106, 99, 181, 20, 23, 227, -45, -94, -101, 57, 272, 54, -63, -28, -209, -88, -105, -198, -246, -131, 161, 215, -127, -63, 264, 7, -115, -209, -65, -12, 50, -146, -19, -140, 294, 101, -83, -121, 31, -284, -189, -157, -11, 65, -270, 170, -297, 100, -37, -34, -138, -65, -151, 122, 6, -83, 108, 21, 124, 123, 85, 84, -107, 17, -48, 85, 36, 211, 104, 282, -116, 215, -235, -189, -89, 57, -2, 7, -113, 57, 74, -184, -6, 181, 1, -233, 144, 163, -61, -51, 126, 244, -268, -101, -19, 176, 37, 46, 287, -74, 31, 197, 219, -36, 181, 119, -101, -124, 41, -11, 83, 128, -422, 135, -98, -10, -5, -12, -121, 145, 349, 22, 1, 3, -164, -63, 52, 7, -103, -26, -89, -181, -71, -126, 4, 8, -10, -95, 34, 60, 26, 116, 99, -292, 36]
4796C6k6L17k80j30J20r5J14j45J04m9LQ5r4j85J53L8L6J84Mj55p8j4J86j30J3
4821A2J27r8j91N2r2M95k71J15k46J14j02K48l76j37L41j94O11l89J52j91Q8j66
4843i8J12o5K40j26J1o5N7j22qM30k19K1j88K38p2k93p3J37J65q8oL59k50j36
4867c9j18pJ64k1J00k40K69j25l40L77k6p8M3Q6J3r0J68n4Q9lk94O1M5n1K52O0
4893B41k55L12k66j23j77M3J46K98j13J21q8m9j5k3n6o8K69q0j62Pj1o4K05j58
4917f6O2j07k8M9L40j99lM8l38K37P6j07r8J70n2J07l0k83L77l03J91p9l7K43
4941A70L9o7l89L44J09k60N2l7l54K62M9K14k38N06l59J71k15r6J03J61j89Pr6
4964a13n8J48k3L7K30k44J26k18J15r3K57k44J57K43m96l2P6J68j45p6N37l53
$$ y = [36, 10, 327, 47, -83, 37, -58, 56, -89, 15, -34, -31, 54, -40, -225, -72, -34, 2, 186, 190, 35, -43, -57, 129, -1, 12, 139, 41, -150, -98, -190, 305, 34, 149, -97, 17, -85, 163, -213, -350, -9, -203, 408, 19, 171, -20, 68, -98, 14, -51, 189, 63, 74, 9, 66, -56, -64, 366, 147, 168, -20, 218, 146, -147, -220, -83, 82, -6, -12, 347, 97, -39, -157, -164, 0, -21, 79, -161, 108, -17, -357, 20, -6, -84, -41, 45, 58, -32, 136, 82, 171, 168, -126, -65, -20, -71, 181, 241, -14, 298, 32, -91, -268, -225, -79, 219, 106, 227, 139, 90, 75, 52, -4, -72, 197, 117, -45, -38, -49, -113, 92, -66, -4, -111, -139, -90, 250, 51, 48, 96, -242, -5, 71, -36, -134, 36, -16, 91, 61, -222, 155, -148, 43, -36, -73, 170, 209, 142, -247, 97, 206, -54, -2, -39, -393, -131, -82, 132, -106, 400, 41, 212, -3, -99, 4, 165, -24, -17, -113, -171, -23, -46, -9, 221, -23, 103, -115, 0, -93, 164, -80, 77, 320, -176, -208, -132, 36, -109, -185, 352, -1]
4986ao3j8k1K98j66J41m56N06j45Mj77k2J80k35L65m46J99K14k19l1J93k21J35
5009A4l4j83K86j06M1R1k14K05k81J61K92n06K01o1j0J97K1O0j51l77N05k09l9
5032i7R8m8O1RK1K58n72K54k44L59J1M2m7J19o4N0l20J81J4J55k76k8K14j84M0
5057Fj31K88j5j02k35m3MK75P2J44m8qj85L99l64j19M1o5N0q9K55j28Qkk0j60
5083a72L42k89K16k97l9Q3K63J4l13K16J40k4j73J45j6j91q3L51j17k09K48j08
5105a3k5Q8j89K74k50J49L0j06R0n2j28R1Pl9L69j12m68J37J55m5j24J16LJ96
5129A54k00j9M7J74j27J19j00r7M4J4J24j44j38K95j59l8J67k69k1L97k78n1K1
5152h5m7K91l47K04J14l26K55Q0p6J1j20Q8J43k44J21o1J0M0O0j58L6l9k8j38
$$ y = [-1, -64, -82, -103, 195, 29, 170, -286, 220, 75, 79, -98, -120, 60, -175, 190, -256, -57, 157, -62, -93, 100, -121, 14, -20, -203, 83, -23, 18, 109, -105, 100, -181, -20, 272, -234, -33, -94, -104, 93, 114, 174, 23, -354, 151, -58, -97, 1, -47, 14, 23, 44, 302, -270, -16, -260, 99, 110, 152, 105, 224, 160, 210, -110, 71, 85, 240, -36, -64, 150, -34, 6, -125, 163, 148, 46, -189, -232, -228, 47, 119, 263, 215, 207, 22, 421, 57, -62, -21, -86, -36, -125, 130, 2, 10, 8, -12, -172, 170, -119, 97, -200, -239, -156, 107, 121, -192, 24, 164, 140, -33, 112, 96, -95, -178, 173, 56, -153, 95, -13, -38, 50, -139, 135, -115, 34, 64, -42, 48, -4, -132, -41, -34, -73, 296, 184, -284, -147, 8, -37, -161, -45, -42, 154, -46, -65, -18, 156, 29, 148, 48, -49, -5, 9, 133, -11, -149, 146, -13, -51, 116, -153, -174, 223, -55, -106, -85, -132, 159, -188, 16, 130, -196, 59, 139, 63, 74, -46, 42, 185, -59, 62, 1, 11, 51, 111, -47, -11, -50, -78, -216]
5176b16k62N75k59J78j01n8R1J27j26l7j82J04J85j41K03l55K34J33J2J88m26
5197a33j65L88j08J20k32J37K3M9j5j51J29q6L54l63o2K09q4j85L95l89mJ71J49
5220A47J49k76Lk45J92p6L16j98P1R1m71L19l8J24k12J22j81K59p4J51r7O3k87
5243a48K13P8j30j61M4J32j07K8N7m1L4j02J26K5j65J65j10K37l12K40j55j75
5265b27K96n4q9L16j71k74P7P1n8J83r8K31m36J96J20k81K73k23J96O6P3j04J10
5288A93j20k0l6J40l57J22Q9K67n46K67J58j12o2K08po4j29J36j13l6K18k67J36
5311F5k38J3J70N9J83k20k16L85J03m19k59J55K03J8r7K55m33L21j20j72J98Q2
5333C6K14m44J49J24N5r5k36M97k87J73j33o0Q6N8j47Ljn5N7k29K36J81k15K31
$$ y = [-216, -478, 97, -162, 16, -85, -143, -52, 75, -51, -88, -270, -166, 19, -122, 81, -274, -40, 93, 105, 293, -133, -298, 90, -18, 102, -130, 7, 30, 79, 64, -87, 42, -44, 310, -53, -115, 94, 10, -175, 220, -169, -173, -2, 147, 296, 20, 23, -222, -30, -106, 210, 12, 83, 174, -297, 22, -16, 108, -104, 18, -163, 96, 22, 173, 76, 139, -148, 65, 143, 13, -148, -104, 28, -79, -51, 6, -35, -1, -103, 23, 48, -117, 48, -62, 175, -137, 103, -52, -227, 69, 15, -74, 242, 71, -203, -126, -55, -113, 70, -28, 203, -233, -37, 83, -198, 75, -148, 48, 114, 187, 83, 193, 73, 53, 17, 157, -200, -78, 11, 278, -268, -1, 157, 45, -17, 191, 184, 120, -9, 127, 14, -22, 196, -71, 65, -173, -160, 10, 69, 252, 32, -184, 201, 304, -115, -374, -219, -16, 2, -95, 160, -273, 48, -72, -244, -46, 36, 250, -194, -45, 79, 134, 39, -197, 300, 13, 186, 53, -7, 79, 137, -10, -7, -8, -63, -6, -235, 1, 182, -33, 198]
5357A98j92J40j7m60L98q8N1j65K47l06O2j6J73j90R9L50k73l3L1o7N8Q5j2j61
5381h8K89m00K86L9k19q5J91R1j45K27j17O0r9K7j09J7N7K45l79m0q2K72j2m39
5405d13N12j97LK67m30J83m1j5K22j71L26l52J43L6K74k25k28K13j42J58k44L77
5427B56k24o3q3O1j0L30k37m5J5J78k28r9J10K3J22j70K24l45J94r7J11q7jJ95
5451A30j74mJ58%k16j53L15p6oP3j00j45L06j64M1j97J68k0K33l56J51N9J31j84
5475c0j5N8j41J96m8l1j15K82k48R9M8n0J68k59L6OO1k3K81l19L0J85j62j57q9
5500b37L42j14m1L4j66K8L4rJ14N5J30l02J98k05R0j35L45n7o0M7n6J25m1j75
5524e6J96m25J90J73K5p9kp8M16k90o1l7q0P6j12Nj03O6J54O0j23j6p2K22k1P8
$$ y = [198, 6, 146, 129, -331, 67, -21, 30, -135, 112, -194, -132, -148, 25, -165, -66, 284, 11, -22, 9, -58, 0, 85, 73, -88, 201, -199, 87, 126, -93, -178, 13, 104, -41, 186, 69, 129, 30, 57, -52, -35, 22, 267, -112, -152, -234, 38, 26, -413, 99, -98, -95, 172, -258, -75, -116, -131, 91, -80, 246, -106, 37, 73, 347, 122, -106, 107, -35, 123, -121, 256, 32, -31, -114, -53, -63, 267, 30, -15, 0, 178, -50, -149, -39, -16, 106, -64, 160, -185, 9, -88, 23, -64, -65, 130, -44, -48, 110, 110, -106, -259, 56, -20, -26, 47, -53, -198, 108, -56, -15, -212, -44, -64, 169, -187, -36, 23, 154, -30, -45, 13, -128, 68, 20, -11, -126, 156, -92, 7, 55, 5, 173, -86, -50, -44, 17, -6, 275, -44, -14, 171, 9, -148, -237, 105, -9, -50, -16, -182, -154, -120, -129, -15, 40, 170, -132, 66, -139, -49, -184, 161, 104, 44, 91, 35, 160, 119, -56, 140, -285, -95, 78, 103, 24, 22, -56, 360, 70, 9, -28, -108, -32, -144, -139, -242, -176, -22, 38, -85, -101, -173, 49, 28, 106]
5550A06l82L54J2l30L88n7M7j54r3Q2M2l0N0k07J31O8K44l65j93K06m1L75k95
5573d2K80j37m26M53j63Q5R8j24j8J97P4k30j14J04q4J56j84p3J74J67k17j99
5595b23K41L17m04j06O8n9K15k67QJ14p3P9Q4r3K13k06O4K64j42r2k54P7J62p
5619b0k3J28O9k66L60J23k82k19n1L28m6j80J2O2j42O9J65L4l33K09J34k04K7
5642d6k0M26p12K92J96J8k37J21m5K14j72j15l3J57k17L04R9k66L1j90K11j07
5664i1J15k3l8K26l56J55j09r6K39j06n1j78L05Oj21m0J29J20k79J66K3j46K94
5687A44j37j51m2J91R3j12R7L6p5PK02m28J55j30K07n2oK58j71j88J92J27j50
5710F7J16m1j95j24K73n6J12j98J80j74J20r6M1mj33K8P6j5O0J13M2l39l2l6O2
$$ y = [106, -276, 78, 90, -240, 148, 91, 138, -16, -109, -27, 15, -15, 35, -172, -41, 27, 271, -94, -287, -81, -122, 253, -42, 238, 101, -325, 128, -35, 50, 148, 24, 6, 203, 277, 47, -67, 37, -47, 109, -75, -148, 26, 193, -24, -223, 18, 335, -69, -175, -107, -166, 49, -218, -210, -96, -169, -90, -6, -99, 114, -92, -28, 236, 94, 2, -252, -175, -13, -20, -43, 85, 154, -112, 248, 371, 89, -130, -181, 147, 101, -79, -67, -5, -147, -78, 87, 121, -212, -3, 131, -73, -46, -66, 360, -352, -60, 136, 154, -83, 38, -7, 207, 35, -80, -113, 44, -173, 131, 230, -36, -5, -195, 16, -91, 24, 1, -37, 189, -167, -12, -121, -217, 22, -84, -135, -313, -8, -2, -123, -163, -34, 86, -193, -27, -4, -150, 144, 7, -144, -186, 5, 98, -14, 83, 119, 44, 51, 253, -175, -20, -150, 57, 5, -1, 257, 86, -102, 90, 217, 67, 183, 142, -53, -177, 96, 40, 152, -46, 134, -40, 80, -16, 25, 21, -112, -84, -8, -23, 37, 150, 192, -147, -179, -215, -153]
5735a53K40j88J79M1k06P3L6J75oj86l6R1l68J85K46j29j21L15k31m3O8j23J71
5758C0%r5J51K19j80k18RJ36M8o8j07Q6J86k16J15J8j28L3l9O5k14M0J31l0J57
5783A29p7j79L9J42R3l6k97J90K08k95K99m1%j96P0L1r7j33R1L23k01j62K6J50
5807G7n8%o4K46k38l8N1K37k86K13m05K76J55k33L39l04l3R9M5p3m4mJ79k71J72
5832C8K17k61Qp2K9K70l10N6l44M33k47K07N9o1k58L18j78J01p5K45o9k70n6K31
5856A1nk78N67j81l48p9L59Q5j36O9j01P1m4q1j05J60j51L70p8j51L7j26K10k81
5880b06J82JkO0J22n1k29J92k21l4L30l24K63j48J97o8J42j74N7j49K14k61K32
5903A25j07j25O1K55m80K42O8l2j5n3M1k63J71J1J60j77P5o3P4m7k94N67j47j42
$$ y = [-153, 87, -101, 78, 119, -87, -14, 22, 197, 191, 5, -31, 60, -308, -123, 123, -6, -127, 188, -43, -86, -18, -141, 30, 30, -65, 86, 305, 125, -93, -84, 52, 100, 32, -75, 11, 197, -19, 96, 114, -14, 19, -20, 45, -169, -129, 2, -28, 129, 52, -127, -88, 54, 147, 111, -186, 4, 212, -83, 216, 175, 175, -21, 49, 80, -17, -150, -59, 264, 63, -99, -73, 77, 19, 19, -45, 201, -37, -75, -24, 213, -73, 140, -265, 11, 166, -67, 272, -32, -65, 34, 79, 6, -38, -42, 137, -134, 38, 255, -6, 2, -70, -41, 229, -81, -25, -369, 64, -183, 24, 83, 22, -236, 82, -96, 5, -70, 175, 106, -164, -220, 11, 6, -272, 295, 114, -234, -313, 46, 131, -5, 64, -37, 34, -10, -91, -196, -36, -187, 183, 105, -46, -9, -135, 75, -206, -24, -23, -25, 35, 157, 106, -123, 69, -152, -186, 144, -180, 83, -65, 132, 64, 206, 32, 89, -60, 154, -107, 125, 18, -107, -46, 209, -271, -29, 39, 7, -8, -61, -20, -283, -112, -101, 59, -118, -43, -106, -32, -79, -373, 194, 47, -95]
5927i5J40j32J26j37q7K14k5q5N8k96K81k10J55P6K6j40L05j50j25J8m0J11P5
5950F3k16K14p9q1J17Q7j06K5P9K4r6k10j38L15J46r5m9pj74j6Q2J4K47j66L4
5975A4m5O4m5O4j83L01l85M09j54k71ORM27k38Q0k30K36J04j09j50L9K04k16N5
5999a4L78m14r4J41o3j39K5L73k43L15k68K46k75R5j08J74j50l29M69j27m4l7
6021h9p3L28q5K9j02j76K97j8j08n1J1j54J23j3j31K84L0R7j87J26j10J18k67
6044a21R1r7J23J10N2l48O8MJ81o0J5O1p3K1o8M1l1K67j97J18j63k71L65K5r3
6069B0j6q8m1J87K0j09q8J23p2L4%M9O4j53OJ3k21J55P2n5K61l40K86k66K70J25
6095B36m69J55Q8L3J08k09M3J25ol3L9j7Kq7j80L6kM60j71K4j5l69M45j44j23
$$ y = [-95, 45, -87, 39, -98, -185, 29, 4, -81, -23, -319, -38, -248, -93, -17, 9, -131, 174, 24, -101, -83, -123, -12, 63, -153, 61, -18, -99, 18, 105, -1, 24, 103, 127, 31, -179, -317, -2, 144, 49, 0, -7, -181, -197, -115, -101, 146, -20, 14, -31, 33, -12, 52, -131, 170, -215, 194, 40, -231, -225, -216, 211, -27, 53, -177, 59, 163, 54, -96, -57, 147, -69, -14, 364, -50, -144, -3, -66, -205, -180, 193, -50, 265, -3, 243, -32, 63, -45, 129, -21, -350, 119, -8, -52, -89, -162, 166, 81, 110, 8, -168, 129, 111, 3, -48, -37, -191, -68, -81, -212, 72, 102, 199, 12, 138, 28, 146, -121, -30, -127, -4, 106, 158, -190, -122, -118, 63, 3, 18, 79, 6, 27, -41, 0, -31, 236, 39, 157, -6, -277, 88, 113, 20, 4, -84, -125, 62, 82, -27, -115, 8, -64, -30, -30, 19, 83, -70, -64, -51, -272, -117, -45, -100, 161, -179, 107, -159, 111, 236, -233, -78, 10, 43, 151, -58, -15, 110, 104, 71, 110, 93, 95, 8, -172, -136, -138, 322, 151, 175, 160, -209, 236, 92, -31]
6120c1k40L66q3J5q3K70l93Q5K27j33j55K45N6r7o1j58P7J25j31Q0k6q3m4L82
6144B10k48J84j27L3j32J12j57O5R9k15q1p5N73k77J44j08j63P1K04j74JP2j77
6167a66o5k5J73O5j31J32M1L1K70l42o9L72k01j98J56m3P1j90R6k00K20Q5Rk02
6191a11J61l6j07K15l38J34N1j73J82J35j6j83J55j68j06K71k1J56k66j01M6M0
6213h0O5J49Oj63j35L1P8J30K53l20J9n3j98M03l29L42j85R4k15K27k14J83K5
6236A13j66K75j65K2j36Q7P8k47L10k76k00J89J46l24K26K3j09J11K36r3q8m1
6258b9K4K10k26J26M4k36j41K61q3O2O9q5j28j28j0K76J62m5j82J17J49k13OJ06
6282A06j70J1l9K33j56Q1K42l90J06j93L95n59J06J17J95k15K71K9l51R7J40k20
$$ y = [-31, -271, 95, 12, 27, -56, 214, -179, -94, 133, 0, -155, 90, 146, 49, -12, -170, -93, 32, -99, -19, -45, -128, -172, 210, -38, 146, 19, 52, -80, 32, -125, -60, 39, -176, -257, -332, 241, -36, 108, 0, -163, -92, 112, -62, -61, 11, -166, -231, -256, -83, -18, -149, -17, 24, 55, 325, -17, -86, 286, 85, -113, 43, 0, 71, -119, -23, -223, -3, 82, 91, -111, 50, 14, -93, 122, -216, -82, -31, -204, -22, 113, 97, -86, 69, -99, -205, 66, 45, 201, -65, -166, -120, -80, -15, 134, 140, -23, -158, -127, -49, 81, 334, 14, 33, -20, -218, 185, -144, 198, 13, 107, -108, 119, -95, 88, 113, -53, 222, 57, 79, -57, 30, 108, -139, 171, -105, -305, -116, 30, -294, -68, -45, -154, -43, 193, 100, 12, -29, -5, 205, -21, 105, 149, -87, -228, 33, -50, 12, 81, -4, -132, -260, -270, 6, 168, 123, -59, 58, 207, -6, 0, 106, -64, -53, -92, 141, -15, 66, 308, -82, 24, -169, 226, -333, -227, -110, 85, -130, 141, 170, -181, -84, 56, -164]
6304a64L11Q2j58N7Q9l01m4K41k42J77k95K02J52j28j83L43k27M4J95k07L4j91
6326b13K1NK75j13k56L11j69K65j31k39L49k94J60K85n70L37j17n1mJ37K24j37
6348G5O0l15K13k06N3L16j69j69l4O1J31jK8m6M6J62r8m3J1m4K3m2r5j77M25k32
6374f7O2J39p5o9j63R2N5K81J7m64J82J71j59k8L5m9J99k63J92q4K29m3j43J50
6398A97o5n9j16J12J14j50q1j17K15Q4l33P2K6L03pk89M2J95K3q8j08j4j9n7J50
6423C0P5j24kM4J71l82L85j43j90J62jJ93k94k6J79k26P4m3m2K71j00r5j95R4
6447a85K80r8j78j5J47J01M6k80J54O4K6j80m0J30J66k07P2k8n2K36j42q8K25
6470A54K11n15J73k98K65r1R4nJ07j52O0K7j59l8R8O4n7J2j20M2J96o7j71K46
$$ y = [-164, 147, 229, 71, 128, 217, -84, -128, 113, -129, 48, -247, -45, 107, -21, -204, 139, -88, -44, 151, -56, -22, -213, -192, -187, 88, -25, -281, 30, -139, 126, -5, -244, 105, -189, -29, 256, -314, 23, -94, -145, -149, -12, 212, 75, 135, -180, 33, -173, -120, 196, 27, -142, -176, -115, 16, 15, 43, -3, 43, 205, 107, 64, 75, 31, 54, 12, -83, -260, 165, -67, -5, 134, 59, -10, -173, -81, -26, 255, 272, -192, -10, 161, 2, -26, 9, -40, 159, -104, 88, 4, 233, 190, 47, 197, 132, 73, -43, 69, 183, 33, -48, -165, 50, 134, -199, -127, -101, 202, 195, -94, -52, 143, 166, 78, -30, -44, -63, -120, 30, 105, -19, -21, 23, 194, -188, 197, 54, -136, 26, 25, 218, -76, -102, 77, -149, -75, -118, -160, 111, 11, -84, -279, -185, 95, -3, -181, -196, -49, 52, 98, -182, -28, 36, 62, -118, -158, -28, 138, -69, 3, -25, -77, 159, 17, -71, 154, 365, -150, 23, -275, -10, -101, -7, -12, 95, -57, 3, 30, -129, -167, -69, -5, -62, -50, -170, -128, 68, 1, -170, 76]
6494G6j99K95j78l69J09L99j60J2PJ26j14p9k08O7j7K67J19l18Q3K37l03J17p8
6517a09K82k11o9K25p2m5j17o3o5J10K69k77j12J88j8P2Q3r9O1m2K9O8j03K8J68
6542A81n4k59J94k1K6o2k8P4J54m80K04J78Q3j76j6k08L40k24K33k05j60J34N4
6565c8K4Ko5J9J35j50K6j63N9O0r6J62J55j52R8m2j72J02J3K35o3p4j38K38k60
6590h5K44k55J13m9J70l95m0J63JJ04p0r2K10j18n4K35o6j10J68jl83J52J35n
6614b8j9M7j43J43J91k74mK51l07J34o4M5N2J9j17m3M23k48m2n3j76L37j68L5
6638ij57K10q8R8j68K49k03M4K6o7J12J8j57K09j30P4j28K75j45o4K02j23j01
6661b3L55k28L0j07L9j17r9Q9N5J08M7k34J03j74L4R0P9m36M45o7L1k50L22j13
$$ y = [76, -123, 172, -6, -375, -266, 133, -27, -15, -8, 118, 4, -75, -283, -216, -233, 34, 153, -165, -82, 155, -148, -31, -109, 173, -38, -107, 118, 46, 1, -116, -179, -244, -134, 135, -142, -254, -66, -84, -12, 71, -28, 33, -9, 20, 88, -15, 13, 181, 127, -132, 62, 41, 67, 5, -23, 51, 205, -275, -71, 107, 190, 14, -2, -210, 130, -94, 139, -66, -226, -92, -38, -14, -12, -77, -58, 77, -73, -47, -210, -151, -91, -187, -25, 130, -22, 76, 34, -138, -36, -23, 212, 149, 75, -63, 175, -85, 159, -96, 17, -32, 138, -257, -297, -134, -133, -29, -99, -191, 19, -99, -153, 82, 16, -94, 74, 73, -310, -158, -23, -28, -47, 0, -143, 0, 191, -83, -87, 164, -143, -9, -73, -28, 24, 43, -74, -117, 306, 58, 16, -37, -213, 124, -44, -9, -166, 44, -44, 54, -114, 135, -68, -24, 2, -65, 47, 65, -92, 117, -13, 61, -67, 208, 63, -1, 201, 78, -23, 332, 104, 134, 27, 66, -51, -150, -61, -6, 102, 149, -85, 18, -156, -122, -32, 47, -389, 56, -11, 20, -230, 92, -21]
6685b1K36m93K05J01n4o2J49o7J34j79n3M21m53l9J60N1L8j29K4J7j83J84q5M9
6709d9r9j16L41l2Q8P7j35l86M62l98K01K8o7M6J99k1N5j86o8q0K15l0K91n52
6733b16L70K23m11L6j84K18j68%pK07l22L20l69M67j57o6K51m02P0L1J02O5j40
6756h2q5J66q4K18l5J34m11L12m45K98ko2J29j91K86K25l62j48K08J05j34n5j61
6779a76K58q8j90J95J48j48k5NK50l71L0L2L50m51J98k0R1J18k46q1J31j77K71
6802A04J08j12J12l08L85n95L10J44M0j53rK66m60J05J43j72L21k49j09K11m10
6823c28L66J28j92J04j59q8L19j25k1r7K0L7j96J29J10Q4k04J73j80n5K68J65
6845B58j16l50%L53j58P0k83M28j90O8k59J37L68j28p7J11j35qk94J61Q2j80Q6
$$ y = [-21, 215, -278, -73, 28, -26, -88, 61, -6, 128, -51, -104, 317, -136, -175, -15, 36, 74, -55, -31, -14, -197, -13, -98, -49, -148, -264, 77, 45, 133, 210, 75, -311, 151, -247, -46, -18, -85, -39, 160, 139, 194, 8, -60, -140, 75, 45, 336, -216, 154, 377, -34, 2, -182, 36, -132, -132, -139, 68, -254, 66, -303, 164, 7, -59, 192, -210, -140, -109, -7, 58, -82, -167, -1, -85, 133, 98, 232, -179, 133, -312, -14, -16, -78, 51, -140, 146, 371, 9, -139, 69, 174, 40, -15, -176, 82, -6, -196, -1, 147, -1, -26, -21, 229, -142, -112, -80, 270, -181, 17, -3, 88, 206, -40, -121, 10, -167, 104, 212, 100, 212, -96, 289, -306, 4, 148, 188, 35, 26, 292, -168, -63, 80, -92, 229, -20, -129, 82, -328, 38, 166, -26, 78, -81, -169, 150, 25, 4, -93, -73, -36, -232, -103, 7, 91, -113, 60, -120, -175, 93, 258, 142, -208, -208, 145, -13, 57, -226, 202, 12, 80, -179, -42, 326, 198, 121, 232, 97, 89, -205, -44, 38, -142, -56]
6868e6l81L20J46n3n6l9J35J62k48J57k39J47j10K7J6J22l12N06l69k42L70j04
6890a01M08m24K07j49J00Q8j12NJ21j67j65K36m2j10O5R7r0mL86k41j58pJ46J0
6914I9j38j85J77J10K17j44k30J30k54L61J30k91J12k78Q4p8J54J77k8l60K44
6935Il06M01j77J42pNK53k56K3P0k82K72l0K76j76k68P6q8L8K54j39j90J55J62
6959B17p0K20k59R4k27m4L81l60j42M21j35k97K25k5O8k18K37J3j97L08k18L4
6981B6j3j39KJ12j23K67k34P9R8N4k84l0K67O7j25kJ6j90J72O5m1J2jj29K88l14
7007a00qL7K67m3O9j00j07K64j54J6l58L50k54K7K36o7k88P1J23Q5j98K02N7O2
7031A89k36j40K84k50J11P4p7J2J32R8N6j76j84o6K92j21j20J40J14l2j75K3K24
$$ y = [-56, -437, -117, 29, -24, -80, -119, 16, 178, -70, 87, -152, -5, -115, -88, -72, 50, -262, 244, -125, -367, 3, -101, 307, -117, 90, -59, 41, 129, 17, 22, 143, -24, -189, 47, 5, -105, -40, 57, -33, -37, 349, 108, -50, -57, 89, 99, -39, -224, -47, 63, 280, 136, -94, 36, -218, 143, 273, -18, 94, -184, -100, -178, -24, 153, 125, -235, 9, -297, 104, -73, 69, 62, 67, 320, 64, 87, 157, -125, 147, 117, 393, 217, -51, 25, -63, -25, 229, 90, -100, 55, 217, 147, 367, 108, 202, -25, -69, 312, -48, -190, 231, 96, -201, 24, -1, 67, -151, 86, 99, -98, 210, -8, 26, 13, -126, -124, -12, -135, 132, -102, -23, 75, 129, -155, -185, 82, 149, 24, 22, 38, -152, 20, 85, 44, 56, 55, -74, 214, -100, -108, -71, 196, 153, 222, 122, 15, 279, 125, 141, -217, 133, -121, -94, 142, 75, -213, -142, -19, 66, -132, 70, 127, 189, -47, -187, 97, -153, -42, 32, -45, -33, 99, 197, 253, 77, -107, -173, 119, -2, -122, 18, 132, 100, -75, -52, 172]
7054A72j71O0q0K6K91q6k72J15mk47J57lj04L20J21j40p0n5k92N00j53j04J28
7077A09R9m9l8l9j33Q1j13L18j76Kk2j40k3J43K7R3k77L7J68J80j42j15n1k8N1
7102c8o9J88N1lj28K23l61j17K17L4r4K82PLk43l6K14l04K74j37K73k86J03J1
7126F4L6l1J04j61J68l32L38j54l69L40J60n3k95L29j01K18j9j95J12m4j54n5
7148i4J90k08J54J01L7k2j75R4q2N7O9J2j14p1r4J12j80K96p7J06l32L45j1m3
7172G0k1J11k19L13l46K5M2r4J42J5O9n5m5j83J12m9J54O1j11O1J23k07J43M6
7196A57k77J35n4j3R3K0k5m5k7m3J28l05K13K13l23n8K83J45j1j13j03n3J8K97
7220B52j82O6k04N5K37j97Q4o0r1k5R6j66r1Q0K19m09K78J00j63J86l8r1j9R8
$$ y = [172, 1, 61, -19, 7, 298, 212, -60, 55, 51, -196, -39, -42, -146, 174, 295, 155, 85, 30, -262, 238, 85, -19, 109, 208, 159, 121, 82, -51, 30, -83, 235, 59, 61, 39, -101, -124, 19, 46, 139, -138, -101, 67, 247, 105, -10, -61, -89, -38, -107, 81, 132, 129, 1, 224, -137, -254, -37, -3, -97, 185, 192, 195, -48, -84, 130, -174, 100, -37, 236, -50, 53, 64, 100, 69, 173, 12, 180, -152, 186, 32, -337, 3, 163, 110, -185, 144, 43, 261, 242, 47, 159, 115, -39, -94, 96, -112, 42, 143, 180, 158, -17, 77, -5, 52, 121, 133, 19, -52, -146, -34, -214, 82, 5, 111, -221, 124, 113, 70, 49, 160, -59, 254, -92, -67, -25, -119, 23, 38, 107, 52, 7, -176, -64, -113, 41, 102, -9, 52, 175, -32, 111, 157, -120, 15, -39, -52, 41, 61, 36, -9, -36, -79, 49, -256, -43, 170, -153, -211, 72, 217, 206, 93, -10, -63, -45, 252, 70, 136, -68, -13, 224, 27, 111, 51, -40, -65, 31, -135, -226, -146, 73, -336, -58, 42, -121, 65, 27, -64, -83, 15]
7244A5k39K47j78K57J14j00j49o7J51j41n3L26n2r5K71l15J65j83K70j08l24J85
7266cl1o6K11m8K5J22m8k21m7R8kj5J00qJ54l25m1rJ74j36l5RO9P3K14l38K36
7293A12l68K04r1K04L5p3L3j5k43K27p1j51N08j63k07R3J98k88m8M5J12o1J15
7316A07j98J0R7o4K47k44J2q6L6J09LK4o6Qj37K63j37r4K2Jq2J87j39l4P6J27
7342D8l2l1K8J8j51J19N1j85K56j42j93K20Q9Mj28j18L82l65J30J19j84O5q4J98
7366A14k37M2J37j50J36J1k65N2K33J06j27j08p8o9K95l62J99K3m5%J27o3J85
7389A56k86J48k68K24j00R2K70k53o5K11j13j19J46n7l8j49J19N3m7M63m77N5
7411c5K55l96O6K48k92L9J16J21k75R8N6j03K07j85L19k52j38M00k25r8j4J99
$$ y = [15, -224, 23, -155, 102, 216, 116, -33, -100, 51, -90, -143, 183, 131, 36, 307, -8, 157, -26, 244, 136, -188, -3, -34, -100, 111, 63, 88, 210, 162, -59, -106, -8, -10, -25, 75, 67, 221, -104, -145, -154, 20, -116, -151, -142, -73, 0, 214, -124, 112, -256, -52, -143, 61, 96, 23, 56, 41, -202, 25, -46, -197, 311, 148, -59, 34, 232, -56, -104, -59, 53, -8, 107, -91, -81, 16, -48, 199, -45, -33, -119, -83, 26, 29, 53, -13, -5, -142, 121, -16, -110, -88, -87, -169, 18, -121, -155, -79, 48, 16, -15, 13, 31, -120, -1, 50, -135, 121, -21, -214, 6, 95, 99, -29, -147, 235, -130, 0, 119, -65, 0, -84, 114, -123, -81, 56, -94, 42, 53, -212, -160, 73, 179, 52, -56, -134, -203, 92, -270, -71, -48, -93, -93, 34, -29, 156, -130, 18, -250, -26, -126, -34, 236, -17, -82, 129, 16, -103, 43, -14, -52, -201, -82, -29, -76, 387, -90, -35, 220, -176, -110, 138, -154, -115, 1, 122, -153, -55, 1, -102, 105, -80, 239, -13, -151, 249, 24, -74, -88, 111]
7433A11j60K21r1o3Qj62K60j42J01k27K54k25K30l92K00J19k4j44K29k07j85K69
7455b0O4Q4l33J24J62R9r1j97LK51K9j12J0k85L7L2K12M7k92M46n18J55J54R3
7479A54k56N3lj91O3K43j7K45k34n5j76K94l23R4J8M0q6j41K50n5J00P8L7k07
7503g5%K15k47j1LK05m69K88K4j44K67J5J81l08j9M0O6jj88J69Q8k01OJ92k32
7528a36J44J34J00l91j09K16J06m6j53J75j70K24k02r4O9N8M8k15K37j4Q9j47
7550g7k22J82J25K49k48n4j52k01K70r5L61m62L03m5Q1j1j04k14M13j24K76k14
7572C7k21Q0J84j71J86K9j63K70j67j52j8L01o9Ql0q0M9O7k32K0j32J56j28k4
7596b00K76l5k63N5J69j28J14J03K2J01k42J94j79J0l4N8O2M8m18K22j5L6o0J46
$$ y = [111, -49, 172, 81, 18, 26, -136, 124, -18, 83, -144, 110, -115, 115, -277, -77, 42, 18, -126, 103, -104, -289, -20, 44, 128, -205, -81, 81, 180, 89, -108, -105, 146, 175, 63, 73, -212, -175, -143, 69, 116, -176, 270, -248, -93, 61, 154, -102, -49, -52, -243, -180, 63, 46, 291, 57, 2, -174, 120, -203, -109, -91, -51, -137, -278, -28, -83, 17, 95, 132, -75, -75, 140, -107, -118, -115, 90, -379, -91, -67, -211, 56, 71, 252, -56, -75, -35, 31, 30, -158, 11, 99, -102, -96, 96, -136, 8, 142, 242, -149, -258, -42, 64, 18, -135, 40, -130, 94, -108, -202, -133, -75, -27, -242, -5, -19, 70, -77, -299, -117, 8, 257, 9, -45, -197, -398, -128, -223, 138, -324, -21, -66, 15, 4, -100, -314, 99, -25, 251, 37, -184, -104, 80, -91, 95, 124, -39, 231, 64, -88, -106, 195, 126, 134, 104, 24, 73, 140, -92, -72, -204, -48, -176, -200, 76, 41, -222, -167, 2, -126, -12, 91, 113, 214, -28, 166, -13, -3, -37, 21, 83, 131, -287, -65, -80, -44, -104, 42]
7620D2o3J34j35m1k8J69r1J30J7j01o6K40j20k05K58k52L5K04K04k77J04j84m1
7643f7J09j7p9J64l9Q3j62q9N9k4N0k32L08j1n5j49J92j60N4M9K74k82J9k07p1
7668b83n8M13J8k86L27r7j49J08K12j40J94j37m4n0j36J83m3R0R7j81K08n57N68
7691B57l45J33l3op9J46j05k3m0M03j28q4J27l07j36K15K76q1l66J31P6k6j8K81
7715B68j67MM7m87L56p5J08o0q5J09j40P3K09o0n2l41N43k62m2j7j37J67p8M7
7739g2K68r9pk57K88kj33j4M5p2O4J24nj49K4J92k46P5J78k16J11p6j02L15r4
7764A40k60l2K02N2k2N8k6k59l0K61k60L63k89K42l44K08j08j4K42o8k24L16k65
7787a17J40Q0j4j06J21O4k46K39j86j17l4L19j65J51j36J85j16J39k10%J3R4k82
$$ y = [42, -21, 113, -22, -63, -91, 78, -13, 117, 134, 33, -33, 207, 87, -118, 140, -112, -77, 127, 331, 54, 158, -26, -67, 42, 25, -54, 110, 71, 154, -8, -97, -38, -62, -12, -244, 64, 53, -2, -151, 41, -119, -65, -16, 258, -24, -5, -212, -283, -341, 72, 90, -196, 131, 34, -115, -7, 205, 65, 259, 122, 78, 28, -108, 75, 32, 122, 219, 38, 246, -311, 257, -88, 45, 12, 6, -73, 73, -32, -55, -95, 308, 180, 96, 223, -84, -220, -5, 271, 190, -176, -45, 31, 5, -13, 268, 101, 105, 152, -335, 21, -54, 54, -6, -91, 18, -122, -49, 160, 100, 48, -293, 250, -12, -54, -71, -208, -41, -119, -72, 196, 97, 90, -167, 121, 119, -14, -28, 17, -55, 9, 133, 128, -21, 3, 195, -51, 24, 202, -14, 97, 21, -81, 234, 140, -120, -152, 50, 102, 80, 138, 112, -147, -177, 84, -176, 187, -102, 140, -204, 4, -104, -118, 124, 56, -168, 148, -117, 23, 103, 89, -17, 104, 168, -78, 161, -25, -142, -176, 143, -22, 129, -7, 178, 62, 201, -9, -9, 4, 98, -184]
7810a84J56r1j2J49K02k90J70M2n8l05J47J58L9k59J00N4l16K55j63J31J76M8
7832A49q2j71K22j03Rj39L24k81k21J61L9J02q9j89M0L1P7K39K0L2j05j47P4O6
7856E8m0J0k39L22l30P6K6K32J36r1j14K6j55J22J85k19J35k55K66p2kj99l1J53
7880@n5O8m8M0L1nq0L1N2M8j34J71j50K91j54j8Q8l25J66k39L18j36L13m66l2
7905b25L04l05K78r8j1K5Q1N3j28N2n0q1J88n2N9l4p0L14l17p4J18l88L36Q1j45
7930h9J54O9j29j14J80J29k42Qo6M00j29m00N23l24P0J33l5j5j07m6K10j50P3
7953A03k89K93l75J79qJ51Lk05L02k22J03j5q0K64n9j03J46p8J23m37P9J5R7K95
7977B82j03j25p7L14l46mj23J20J75R8n2r5m3j2o3q0J5J69M2P2j56j56K41%k21
$$ y = [-184, -28, -119, -131, 18, 220, -70, 100, 142, 84, -221, -74, 84, 123, -136, -36, 18, -298, -43, -206, -75, 101, 149, 67, -104, 118, 15, 24, -115, 209, -72, -293, -132, -93, 9, -80, -269, -229, -198, -121, 118, 138, 170, 65, -82, -8, 58, 18, 28, -211, 111, -219, -143, -117, 115, 251, 160, 46, 72, -83, 39, 224, 5, 140, -115, 151, 79, 77, -122, -153, 0, -55, 13, -35, 5, 36, 31, -49, -18, 34, 82, -52, 119, -31, 260, 106, 88, 176, -149, 17, -222, 96, -40, 273, -193, -225, 79, -226, 52, -46, -57, -32, 49, 102, -26, 26, -24, -105, 83, 31, 90, 56, -14, 300, -17, -91, 27, -361, -25, 56, -89, 65, 134, 5, -109, 71, 200, -42, -34, -100, 300, 171, -229, 294, -30, 40, 173, 138, 123, 16, -30, 180, 30, 103, -186, 107, -268, -89, -97, 54, 57, -148, 154, -68, 35, 20, -60, 204, 145, 42, 188, 110, 233, -204, -125, -110, -13, 282, 179, 54, -23, 291, -55, -59, -182, -62, 113, 211, 159, 64, 21, 9, -54, -134, -119, 50, 92, 164, 8, -148, 93, 93, -128]
8002a28k9k0J57j55K73L23l05k72J24J61j83M3J2m3k47L09m6p0K05k23m1J00j9
8025g4J45l5LK7j44J79p2K3j89L01k2j61r0K11K3J9m5J47k93K5N5k82O1J68J21
8050A01k78K76j58Q1M0j30k8K62j65K01K82k86l9j92P6k77J85j68J46J22j97O8
8072g8Q6P9L1k33J5n9O9l16L56O4j58j03M78r8l31K54J75k00k79L84l04M98m36
8095a06K5j46J56j26J53Q2L3J80q4m8J35n4k65M4J93k25q0J35J75k32K24n0m3
8118G6N7J35j13k07K68k53K02m59L56k86K00J09r7K08m31M17j36J02k2p0N1J64
8140B71l5o07K64J81J07oM6j40K88m11O4P6k92K47j13q4J89j01J1O9m6K45j75
8163D8K24l38J39j4o2L6K2J38J0j70l05J65K54k8j83J12j27k9n2J11J6L4O9j55
$$ y = [-128, -157, -177, -20, -175, 98, 421, 116, -156, -32, 129, -54, -11, 1, -42, -289, 20, -26, -96, 109, -114, -155, -55, -74, 71, 36, 39, 66, -78, 101, 29, 52, -137, 164, 142, -19, -109, 102, 125, 144, 99, 246, -47, -22, 33, -249, -188, -20, 101, -177, 99, -59, 22, 62, -68, -96, 166, 1, 202, 484, 198, 159, -33, 43, -234, -49, -217, -71, 51, -146, -78, 8, 87, 118, -115, -100, -159, -90, -406, -50, 14, -144, -247, 231, 133, -198, 56, 231, 31, -248, 136, -168, 330, -106, -81, -227, -71, -197, -44, 38, 71, 251, 167, 119, 254, 200, -65, -21, 172, -53, -133, 2, 177, -55, 169, 119, 76, 133, 268, 155, -52, 216, -37, 165, -294, 62, -224, -24, 85, -12, 196, -235, 182, 46, 148, 126, 56, 107, 271, 236, -371, -107, 74, 181, 175, 221, 81, 369, -42, 22, 98, -194, 53, -60, -144, 45, -56, -45, 24, -22, 223, 48, 272, -66, 73, 59, -3, 33, 55, 193, 203, 33, -272, -107, 147, 119, -64, 48, -79, -108, -160, -49, -33, 1, 70, -85]
8187h5pN7N0j18
$$ y = [-85, -92, -35, 15, -103]
8191a03
$$ Imaginary data points
##PAGE= N=2
##DATA TABLE= (X++(I..I)), XYDATA
0@%%%%%%%%%%%qJ6j6J6j6J7k5L2l2M0n0N8o9P8r0J06j22J41j61J84k09K34k64
34a40K97l34L76m19M65n19N78o41P08p79Q60r51J049j155J271j398J540j700J874
53I82k067K288k541K831l166L562m037M616n342O279p539R316j1991J6432k4990
68a5367M6682j88755k74786P53855j13316n60483N06865K43350o58477O2050M62240
79B63858l33147j72198M94557j4196l51775J69908J12996k99723j1721K57280
89A15839l6661j47798J44164O7890k67282j2411K64372j33762j33119L14380l6274
100A39338l80408J70294J90300l51583P0729M51744k35428k47713L69796j06910
110G0159m26537K94612K19084l17152J23716K92410k64146j36498K23466q2757
$$ y = [0, 0, 0, 0, 0, 0, 0, 0, 0, 0, 0, 0, -8, 8, -8, 8, -8, 9, -16, 16, -16, 24, -26, 32, -37, 41, -49, 57, -65, 76, -85, 99, -110, 124, -140, 157, -177, 199, -220, 245, -274, 304, -337, 371, -408, 452, -499, 550, -605, 666, -732, 808, -892, 982, -1085, 1203, -1338, 1493, -1673, 1889, -2148, 2468, -2874, 3405, -4134, 5182, -6809, 9623, -15367, 31315, -157440, -432226, 321629, 208313, -352170, 154695, 398045, -260432, -198382, 263858, -69289, -241487, 253070, 238874, -112901, 57007, 170003, -129720, -141441, 115839, 79178, -68620, 75544, 143434, -123848, -136259, 128113, -5649, -138768, 175612, 139338, -241070, -70776, 119524, -232059, -161330, 290414, 54986, -192727, 177069, 70159, -356378, -61766, 157318, -159834, -36118, 256292, -7854, -144352, 79114, -3643]
120c643j43366J97085N4329j45228N9019M0879j11322K7681Q0782k1389k608K1465
132E3684j9035n7248k7424O1912R656m5007Q3625L8685j33430M245R9572j10499
144d1264n3230J67061m0418j48094J41503M4351j77626R5781J20695j67775k732
155f1748J17124j27549l9986J49048k9648m9947J18270k9034j22788O7776J5223
166F741r8132Q9222Q6432r1485J0293O0665q2892l5595P4365J8162k7348J6530
178B6958K5466m3615o0191K9294M7500k6103P344P6331l1099j02140L5570K5489
190A0804r3018M9299J09096p0558j6799P4276p9286n8622P9036j4987m0191Q2730
202C1780N970q1270M5030K8518q9629L5021Q2119p5509j4648Q1504n0053n4929
$$ y = [-3643, -147009, 50076, 104405, -40823, 18196, 59075, -52247, -24566, 56216, 34827, 32219, 53684, 34649, -22599, -50023, 11889, 21545, -23462, 60163, 98848, -34582, -30337, 69235, -41264, -94494, 72567, 32149, -115945, 25558, 69909, -107717, -11936, 108759, -59016, -61748, 55376, -72173, -112159, 36889, 7241, -42706, 75564, 46530, -76258, -8482, 6741, -91391, -2169, 84263, -7222, 3071, 63736, -19156, -54751, 19614, 37776, 10428, 26958, 52424, 8809, -51382, -22088, 25412, -691, 6653, 82984, 51885, -50255, -14685, 10804, -82214, -32915, 76181, 5623, -11176, 63100, -16186, -74808, 4228, -10759, -50950, 31780, 37750, -43520, 1510, 30028, -59601, -24580, 57539, -17970, -32618, 48886, -1167, -56096]
214e6096O5805J5397m7689J9190L9788k7745k9176K6048J0957k8311j115K5915
226A2968k579k3767J6144K7685k7997p172K9249l3601j7570L8584j9665p461N3679
239C8497j9805m0258M0862p972o5619L9877N5258n9237j13P5491n3706o0452O5832
252H655L686n4603M3393M1117l9554j6941K1371j2566k4025J9366K2736l302L882
265A3215p72j1366o257q994P62J3319Q515M807p908p11O152k9054o981L9759j0820
280C666k5220L9158J1451n2481J432M1960l0355k7420N6912Q652m7241K4116K1379
293B6009m1391m230K4556o198k829J5090M701n677o61p796j0111R807Q4j0636
307i282K0005J0017k1155q60J0369j0361j4085Q052K0376j1498j6204K1404R0
$$ y = [-56096, 9709, 25106, -22583, -3393, 36395, 8650, -20526, 5522, 16479, -11832, -12947, 12968, 10389, -13378, 2766, 30451, 2454, -4718, 24531, -9070, -26640, 11944, -7721, -15182, 38497, 18692, -21566, 19296, 11324, -54295, -14418, 40840, -18397, -18510, 56981, 3275, -57177, 8655, 12341, -42262, 1131, 42248, 2694, -14247, 7124, -5442, -29467, -10101, 12635, 9333, 13215, 12443, 1077, -5180, -14174, -13412, -93, 8422, 13229, 5321, 4610, 10762, -18292, -25273, 14486, 3666, -21554, 17604, 29055, -23426, -21994, 19966, -10389, -37809, 19103, 27755, -19486, 4630, 26009, -15382, -19612, 4944, -1254, -4083, 11007, 15708, 10031, 9370, 1574, -8537, 1270, 1354, -9282, 10723, 20740, -415, -1275, 9094, -1267, -15352, -7300, 13076, 1578, -14626, 6778, 6868]
320F868l1262P620K5256j0953j1439K1920O223l0318k168J7489j3550r28K0359
333E117L425K264j772j1625K226l103j3350R269K1333l079r560J7403L566l1179
347i065J178K1257j4722p563K1200N055j3938o609J0379J762j6660N592J7466
360A5332j0333j3342O261L963j3386m242J9423M718j2388N438K400j1883r038
373a7077l095J0650M920q291J4371J4022j7750r339J1971m115j6984R160K0249
386H692p666l854J8051k862j1265J168l46K910r22l858J2495L608j3807J591R893
401A3828n498r069R804R378j5558q507Q510n167j0126N602J4374M364j3189N7
415a197P102k3467j3525K0640M058p247J4354J1541j2480j2389L334j570m619
$$ y = [6868, -24394, -16774, 8482, -2471, -13910, 8010, 14233, -16085, -18253, -764, -14314, -15242, 5117, 8542, 10806, 9034, -2591, -365, -3468, -16818, -7549, 13784, 10705, 1145, 18548, 22114, -9065, -7887, 13370, -1352, -8915, 12285, 17340, 3402, -3207, 7172, 8934, -7726, -2134, 15332, 4999, -8343, -2082, 1881, -11505, -15747, 3676, 8394, -3994, 1444, 3844, -8039, -17077, -20172, -9522, -4602, -12893, 1478, 15500, -2250, -11589, 382, -3733, -20717, -11557, 8692, 1026, -2828, 15223, 12361, 1096, 2264, 1918, 4828, 3906, 48, 12543, 16151, 2344, 3935, 13828, 8330, -739, 9065, 18443, 2885, -5622, 2888, -2279, -12405, -6803, 7571, 11935, -1254, -1197, 5905, -17562, -31087, -10447, -6389, -13636, 718, 12259, -221, -12610, -9276, -10846, -15465]
428a5465P652N704O166K171j2453M368J1665j4577J353K1211p690j5445P874O282
442H816j0853r17J8363M108j1948J67L119o859j0885K313J5516n071j1327J6335
456A0877J491j9629O360R101j1276o003K763j061k346J435N031P323J315j2191
470f810l775P159j5397n567K6819K141j2507J2618J883j7281j449Q615N886J432
484C767K78L168j297j0573n647J6083J0911j0453Q551J1486k5669j4123J4508
497I90m02j406J3746R115l773j6038j0101L832k702o174J4541J6083j5554j4848
511a2691J3198m540k0049J9049J5704j5150k105L436r049j985K098P716J4734
524A0366m311j1720N892K46j9386O719K7565q315j2233J9204l748k1939Q028J2602
$$ y = [-15465, -7813, -2109, 4057, 6228, -6225, -1857, 9808, -4769, -3416, 17795, 10105, -5340, 2534, 8816, -2037, -2954, 15409, 19517, 7569, 7736, 10855, 3996, -6889, -4576, 10940, 5869, -5458, 10877, 12368, -7261, -901, 8200, -3076, -9079, -6316, -7377, -9723, -8288, -3257, 4066, 5381, -6810, -10585, -3426, -18823, -24390, 2429, 4570, -7937, 4681, 6564, -10717, -12166, -3551, 2335, 3767, 4045, 7213, 5916, -4657, -10304, 5779, 16690, 6237, 14788, 26274, 605, -13518, 990, 588, -818, 12928, 22043, 18270, 2232, -7869, -4037, -6739, -12913, 1628, 17711, 2157, -12691, 507, -4033, -24082, -5033, 10671, -4479, -6584, -3148, -12197, -14182, -12084, -4368, 10366, 6055, -5665, 227, 473, -18913, -12194, 15371, 7056, -5177, 14027, 10279, -11660, -3632, 8970]
538H970p65j895j026L043o012j3890R368J8590o771o721J2040n957k6284M378
552a2932J7930o233L340J3556p368j0476q933n225J3629L392o423J6270L384k8901
566a4990m777J9940p065q196K7431O851k6853k186O585j1437K238J4251J0304
579A2096L402j3414p932O794r772o877K3577J2944j6058k615R046j4495j1909
592a5213J6268J0815l183r38l140j362q460j1738J8573J5142j7938J278J5734
605A5838k1531j8599K1333R874j3947Q616J3602j7483j1866P163P23M594N098
618C415j174P129p636j8661J0100J1453r641O083J6728r777j8380M762N147o784
632g236O534J2243Q09p404j1884J57P030r840N216K3564r321j7707R040j459j5720
$$ y = [8970, 8205, 6310, 5284, 8327, 2315, -11575, -2207, 16383, 9612, 2891, 14931, 8974, -17310, -12932, 4998, -1235, 2105, 15661, 8293, -2183, -11116, -16341, -2712, 680, -5743, 10527, 13911, -14990, -19767, 173, -6892, -15088, 12343, 19194, -7659, -9845, -3260, -14697, -12459, 1792, 12096, 15498, 2084, -5848, 946, -8826, -15703, 7874, 20818, 4760, 2145, 11191, -3304, -15213, 1055, 11870, 8687, 7749, 4609, 3247, -5213, -16951, 1622, 16764, -1174, 104, 15838, -5693, -24292, -2959, 6915, -7032, 1584, 15186, -2297, -14163, -7000, -6277, -1683, 3415, 2241, 9370, 1734, -16927, -6827, 4626, -5015, 1068, 17796, 8019, -10361, -5599, -452, -7236, -702, 11541, 12350, 4946, -6938, -6781, 249, -9591, -4375, 19189, 9868, -7839, 1201, -258, -15978]
647a5978Q623J7671k109n624J972o109o955R74J385J2304P354j3883J662O347
661G634j9621l010K2093M48r170R197K115j6455n198J0423L134n07L952J259k354
676C940j0553n989J3460J741q063J2975M176j7543k803P249k366n17Q374L541
690G622m624n945l838K155M191l873O314J1534j3745r880J2882m659j0087J5946
704C993Q156j0739j499L187n680m330O165N200K221k60n146L1k83q293N055J2109
720I887o207l268N825n697p300K814M513J969j441n64R81l938o671K325R109k855
736e18n232J0078j969j4866O427P764p263L177P233l301l683p87K32K514J736
751A542n58L234K794q151k992R998k548n813J1120J932j1123L47L104k543j982
$$ y = [-15978, -7355, 10316, 8207, 2583, 4555, -1554, -8509, -7535, -6150, 6154, 13508, -375, 1287, 7634, -11987, -14997, 7096, 7544, -1626, 7571, 9686, -6769, -11967, -1544, 1590, 1083, 5035, 6294, 3940, -6613, -12602, 858, 2599, -5464, 7511, 11687, -5856, -8659, -1410, -3776, -4293, 4081, 7622, 2998, -2947, -6785, -4630, -439, -4312, 2002, 13536, -209, -10089, 2793, -1866, -11953, 3993, 12149, 1410, -89, 3098, -2582, -6912, -747, 4453, 6674, 6414, 1268, 1299, 1016, -7277, -2222, 9887, 3680, 412, 6237, 540, -6760, -3946, 567, 2536, 1095, 531, 1512, -2426, -9097, -6772, 2337, -518, -5750, 4328, 2359, -12507, -6080, 1684, -5579, -2402, 4831, 1530, -2153, -2940, -2708, -194, 1542, 984, 4218, 7012, -1139, -4131, 5867, 3319, -2494, 8626, 10558, -565, -218, 2886, 343, -1639]
766a639L654N567k473o207J100J403n437j868P731K593q608K035N193q475j834
781g265O874j296r85J772k262P41j093l494M309M900l745j860O797k346r034O494
797a493O160q328K264Q155l768l258K601J457j079k797K020L535l142k010M307
812D624J956m466j453M967k633o290M046J977l379O06N62R73j515m990K927L514
828A426o488q96O147j837o993M268N903o778o55Q605l051n834L496P61j419L55
844b990K200M731J94m123K604J779n040j806N800J995n027L145N685n734l149
859B64L472m8k601j023K427K653n947r45N678k822m833L994K903n318k531M446
875b31j410n220L779K742k084J608o19j00P68n401K32N749l110j651O549K497
$$ y = [-1639, 2015, 7582, 5109, -1098, 2, 1405, -4032, -5900, 1831, 4424, -4184, -2149, 3044, -5431, -7265, -391, -1687, -2672, -900, -3162, -2421, -3514, -7008, -2699, 2201, -1544, -3404, 3393, 1047, -7987, -1493, 4667, -3661, -1397, 6758, 2990, -268, 2333, 3790, 2711, -86, 1934, 5469, 2327, 317, 4624, 6580, 2114, 661, 5628, 2995, -3295, 751, 2728, -651, -45, 517, 1490, -25, -5015, -2088, 1426, -5062, -5958, 189, -1648, -8641, -4373, 1530, -5248, -5903, 2702, -349, -6183, -2687, -1926, -3345, -2990, -790, 3941, 4135, 12, 2616, 4395, -645, -2451, 3349, 5344, 317, 3462, 9147, 3413, 264, 3736, 3688, 1087, 64, 2491, 5144, -803, -1748, 3930, 1108, -3725, 269, 3172, -2146, -4677, -231, -1641, -6861, -3082, -340, -2424, -816, -1435, -1535, -767, -6168, -5936, -187, -3297, -4948, 1601, 4098]
891D098n777k46N212l710m667N440K448k688J155K603P99k963k342M527m78n141
907a730L387L962l877k412L739N20l819M69L785j794k139q43r04M57k844m00P471
924C028j565n158N208k04q469J43N415j320k477O032L147n433q08J783j727k17
940b622R1L173L133m747K63M839l327k642M720J771l235q62K353j279k827J684
956D86K481L87j437r92K653k057o037M238L223o372J224N855k926l153K907J417
972A897l926j571J830n4p31R79J705L236l187l565M084j579n661N040N019l641
988a25l46L350j950m504P15M148N19o01R89R93k640n407K400N314l111J178O968
1005G890m403o784J775N13j957K372L913J862k227l192j541M35j369j245O777
$$ y = [4098, -1679, -1925, 3287, -423, -5090, 350, 2798, 110, 1265, 3868, 4667, 1704, -638, 3889, 3411, -1730, 1657, 5619, 1742, -670, 3069, 3589, -230, 239, 4024, 2230, 91, -752, -1656, -1199, -4043, -4443, 3028, 1463, -3695, 1513, 1309, -7160, -7017, -1602, -2922, -5399, 633, 3780, -1653, -2461, -678, -2405, -2622, -2531, 642, 3775, -972, -709, 4130, 803, -1839, 2881, 4652, 1417, 555, 2908, 1629, -1198, 486, 2967, 3354, 1917, 925, 3578, 1521, -4516, -278, 2945, -3427, -2203, 3652, 726, -2427, 480, 1897, -2029, -3600, -1770, -1824, -2555, -1576, 129, 3365, 178, -3387, 697, -882, -6543, -1503, 3516, -125, -471, 2879, 929, -3575, -2860, 1288, 1807, 1206, 2195, 3188, 548, -4859, -2459, 2855, -256, 922, 7890, 3487, -3297, -1522, -1009, -2966, -594, 3319, 5181, 2954, -238, -1779, -1344, -2713, -3958, 2819]
1020B819K204p090J417L322p104p84O853J64k573J557P33k924k663K299L057j14
1036A173j242O15K063l971k575O224r4m417L785R95m284N4J803J014N16j287j68
1053B04L74k752k219M702L165m289J094M041p113m016O950N98j811M298J057l597
1069F86l211j415J715K402P24L135K423l942o095J532P48k862M688O648l490k965
1085G21j52l184j640J266L187M244j732l315M49j538m878K556P442j117k993L657
1101B973k361p362K615L489j59K616J143n84j295m010o90L954r2r93L020J486
1117C750m814o12M657k044j247L454j004l467j04J25K217J537j350K416O6n723
1133b143j094L423m80j114L738J559n582j140K086j958J495K874j57K8l387m188
$$ y = [2819, 5023, -2067, -650, 2672, -4432, -5216, 1637, 1801, -772, 785, 1518, -1406, -4069, -1770, 1287, 1173, -69, 546, 2609, -1362, -3937, 2287, 2193, -2224, 1561, 2556, -1728, -1674, 129, 1143, 1659, 372, 204, 578, -2174, -4393, 309, 3474, -815, 279, 4320, -2793, -6809, 141, 739, -1072, 3226, 4283, 686, -2525, -3940, -2225, 177, 901, 4036, 6459, 2517, -3578, -2046, -1298, -4160, 528, 7176, 3686, 721, 569, -2615, -4255, -2989, 198, 4442, 2710, -605, -156, -1694, -6572, -4016, 3426, 2309, -684, 2973, 612, -6750, -4135, -646, -805, 1811, 2954, 2370, 1075, -2935, -3625, 329, 237, -756, 2264, 3750, -1064, -1676, 2981, 937, -310, 3144, 2140, -1327, -1431, -1306, 911, 2448, 1098, 3514, 3580, -2143, -3237, 186, -294, -1408, 2330, 3889, -1693, -2833, -747, -2705, -1210, 1664, 1507, 1535, -1852, -6040]
1149f040K510J198r70N531L860m452l975O08k716k946N853N025j57N81m45l260
1165B05k149j612K301N272j607l69K769l494m358K593L477j059N25K194k706m149
1181b167l12K71J204K218J16J903J14o628n63K393k671J30M660Q3k981Q12K195
1198G77k134n83J763q44j126o33o8L368L35q90M069n42n430N71J641j678O41L843
1216C080Q92k150q00J21q23L81M1J769J715m248j875K492j908j129N940J637l149
1233A986j186o24l594k387J886L614J568R46J0p84l219m181K004L158k190K109
1249h84M012l287k629J789M59j186J122K526l82j932j053O30J090l46R78L925
1265D832p56m312K131L0m119R10L349l58m10J266P70k053j474J37J14j345j378
$$ y = [-6040, -3530, -2332, -3302, 2229, 6089, 1637, -2338, -1730, -4446, -7392, -1539, 3486, 3329, 3910, 3465, 205, -1944, -3556, -1255, 4017, 2410, 2041, 4810, 1316, -3042, -449, 3028, 1969, 2494, 4688, 1982, -2167, -2479, -2208, -1004, 1214, 1330, 3233, 3347, -3281, -3844, -1451, -4122, -3992, 668, 751, -2230, -1418, 777, -1357, -1940, -177, -1021, -2147, -2780, -2848, 520, 855, -35, 4034, 3492, -1938, -1367, 274, -1404, -763, 3080, 3972, 1822, 1022, 1143, 320, 701, 742, 2511, 4226, -22, -1897, 595, -1313, -2442, 3498, 5135, 1986, 800, 176, -3418, -5805, -3919, -305, 1263, 2209, 2219, 1435, -1784, -5965, -3961, -803, -2993, -884, 3128, -159, -2788, -999, -540, -1726, -604, 1922, 1540, -392, -1445, -815, 275, -71, 907, 4832, 4076, -236, 1895, 1925, -2194, -1284, 2065, 1707, 1297, 2563, 3333, 1280, -194, -57, 57, -1288, -2666]
1282b666J536K360j744j62L313k464l386J391Kj935J418K098P64r33q14N81N7
1299e84j266L23K413N66k819P60J673k728J57M169l18p59P62p90j752k379J149
1316a423K294P59J82J626M06k884k955J461R1k279L048K902k303n04O25j151j294
1333a399l28J325P25j349j11J074m20j618Q42K428j273j665K919q70l245J453
1349a512J005p86O60J328J025l86j272K36J7j950j06K147J456j615J085K330k682
1366I80j825J600r18m31M86J119J230j330r37P06o71k003J198J912p75j839J814
1383C16J84l162J265J970j038K68J000m43n45j566k21J815m88Q5K087Q62k118
1400B71p94J019j195j786K312J950j337K68N01k20j860o81J604P02j360R18J884
$$ y = [-2666, -1130, 1230, -514, -676, 2637, 173, -3213, -1822, -1820, -3755, -2337, -239, 525, -408, -1222, -641, -584, -1850, -1527, 886, 1452, -1367, -607, 1066, -1662, -1505, 2664, 2346, 1587, 2349, 1559, -193, -2572, -1423, 871, 1630, 1812, 3438, 3844, 960, -1995, -534, -443, -2722, 326, 3228, 925, 421, 1046, -105, -1399, -1727, -402, 323, -1026, -1137, -63, -483, -2101, -1259, 1169, -104, -1769, 1150, 280, -2965, -1512, -507, -1293, -633, 695, 1720, 1334, 62, 298, 315, -1635, -1741, 406, 1862, 247, 1332, 3662, 980, -845, 755, -163, -594, -108, 1011, 2241, 911, -26, 680, 9, -1994, -796, 1116, 341, -1498, 316, 500, -2662, -1397, 573, -465, -197, 803, 360, -185, -1751, -1972, -157, -645, -560, 1527, 2389, 271, -523, 496, -699, -2485, -173, 1777, 440, 708, 1209, 989, -871, -1552, 52, 754, -606, 312, 2196]
1417B196j872j857J359N97j681R29K230j197j134N12k05p10k84M54J912p3j486
1434c10J465J87k762pJ555m3r76J599J186k232m62Q87p31l91M38J217N12q89p59
1453e16J491j543j620J838J303o55r5J414j064k030M93K59R5O13O56P14j64j996
1471h07J34R38j996J33L297l69j634R63O9j786m65J563P08n89N78K79k81j195
1489d60r48J872P28j731J605J396k458q71O01mj078J047J448m41q26J05K85p54
1507d84j088K71J664j187o64K415k94k074J347L54j293k81J086M06n97M20P53
1524G54j85k80p80Q55P78j320M15J482j603j243J812m82k96J276P80l20j658m27
1542d42l00m92K04J026J866J8j841M27m33k773Q76J847m56O68P58p84r86n27M04
$$ y = [2196, 324, -1533, -174, 423, -1258, -329, 1901, 704, -430, 82, -123, -833, -1117, -663, 1249, 1176, -310, 1155, 1342, -1420, -1427, 128, 85, -891, 708, 1894, -338, -800, 87, -644, -1035, -597, 620, 1132, 243, -516, 975, -568, -2188, -350, 953, 298, 203, 1617, 553, -1477, -984, -725, -630, -17, 639, 1353, 1189, -807, -673, 265, -1731, -1598, 1699, 1330, -304, 659, 728, -1058, -1523, 40, 748, 159, 737, 1016, 735, -460, -1408, 464, 1192, -539, 1066, 2462, 4, -867, -266, -270, -1348, -301, 1147, 706, -120, -15, 270, -484, -1572, -1301, 363, -824, -1488, 927, 633, -1441, -94, 260, -1033, -1314, -228, 178, -419, 1, 754, 569, 289, -491, 364, 1142, -178, 237, 1719, 116, -1127, 685, 203, -93, 1183, 1963, 1643, -15, -442, -742, -1234, -1030, -4, 1862, 1880, 39, 466, 33, -2740, -1864, -17, -473, 195, 953, 169, -817, -1344, -940]
1561i40N13J13J59J56L30j344r10J976m3m82J901L45k104l30J51p7m1Q53J320
1580A546J71j061K47j10n47n05O10R56j366q5J710o95r58J434j67r36r65k8l9
1599g88O6o9J351L11r95r93N72m14j430J719J321j503N3P03q80l04N60Q47J122
1618A249o37q27l6j071l79J682J790j43j22N78j239k376Q70M94L28R74Q14j82
1636A767o33j723j92R57l75K96J221l76k265K99R74m92l8J821n16j290k39n03
1654a307l35K01M05J771K50j660M36K21j190k38J368O30j399R31N81j309P0J241
1672F67L47j31o20o21K83l13k74K262L64j278J62K57j536q68J432Q00n42O32j34
1691H89j202l05l28R85Q32o29J08K97j835q83J259P86m94J039Q90j542j500L55
$$ y = [-940, -427, -314, -155, 1, 331, -1013, -1923, 53, 10, -472, 1429, 1774, -330, -660, -509, -586, -627, 226, 1546, 1717, 656, 903, 793, 246, -259, 351, 1307, -59, -144, 1566, 871, -87, 1347, 1180, 244, -721, -749, -788, -722, -791, 560, 871, -124, -1117, -545, -959, -2389, -670, 651, -852, -799, -96, -976, -1280, -720, 127, 1249, 612, -215, -251, -1322, -1701, -19, 1771, 1628, 1506, 2084, 845, -1531, -661, -167, 161, 1135, 1949, 1767, 1134, -589, -781, 176, -199, 97, 1318, 942, -1323, -1024, -50, -542, -580, 1241, 725, -565, -804, -1307, -1642, -1441, -1036, 735, 985, -675, -239, -18, -1208, -1446, -78, 552, -847, 84, 665, -644, -574, 667, 1014, 883, 263, -358, -75, -388, -662, 1600, 1964, 686, 848, 1105, -431, -1299, 133, 933, 391, 1023, 889, -313, -618, -946, 39, 871, 242, 350, 647, -1188, -2071, -812, -26, -520, 519, 1409, -133, -1633, -1278]
1709a278L8j28J131P65N08n21j185L11j40o17J005J459n44p04J66j4o88K40J301
1728A105J21n41j31l05n6p02N9J727m86q21N19l57j003q0J188l92n72Q83n9r99
1748i02L30N42J96J2m17n5J34q97PJ608k47n27Q60l47j131r7P09J25K45K88K84
1769G20l05m78o64R79N53r18Q32L84j310l62L59r9JR59M09q34n16N5M8k04r0N82
1791A01J070p75r12O07m25r10J033R53q93Q8M7q7n71MJ037m29J93l04M17k65p84
1812h05N46Q04o08j20R02l13p88K70N16l24nJ01J43l60j97K05L47j41m57P06J37
1833E59j278L71J249r93j92O67j80m73j25K16K23k7J81N2P0o33p9O75k52m05R52
1854E78J15p34n4J34k14J2J99O0M82n88j45K98k44l40N82K23q09Q8Q28p68q39
$$ y = [-1278, -1240, -1368, -237, 528, 1036, 515, -670, -359, -499, -1116, -111, 1348, 804, 100, 266, 252, -436, -196, 1105, 1226, 685, 554, 249, 193, -509, -450, 1277, 791, -30, 489, 132, -871, -951, 237, -155, -727, 156, 97, -902, -572, -30, 166, 178, -239, -294, -160, -1057, -1050, 558, 311, -216, 644, 297, -834, -931, -222, -97, 148, 436, 720, 415, -63, -727, 252, 805, -113, 719, 1103, -207, -569, -210, -309, -308, 651, 1060, 226, -290, -235, -187, -391, -481, 101, 1171, 396, -516, 91, -334, -1244, -211, 742, -151, -63, -16, -103, -674, -670, 367, -62, 131, -173, 244, -21, -805, -259, 545, -63, -183, 719, 406, -382, -112, 404, 80, 75, 176, 319, -41, -238, -33, 314, 173, -284, 422, 559, -719, -348, 901, -92, -284, 383, 203, -270, -395, -179, 44, 17, 198, 250, 320, -313, -392, 283, 31, -374, 578, 693, -41, -95, 39, -175, -163, 36, 96, 578, -10, -155, 143, -101, -441, 141, 364, -445, -357, 471, -297, -1136]
1875a136J079K66m62Q3K85K33n41N3Q4K57l53j47O51K13j010L81L10m70p4O83
1895C85j69l15J95M32j09m51j61M05q1o85O97L61n82j97O52k32o91P40J49m97
1915a54m3L63j74k17n5j68P41m61k99P88n15m28K63M17m62j66O96p5o50P38J06
1936B45n37J87q9N10N0m45N19J75n29j85L52L12p51K67P90r07k9K29j24P2k23
1957a11J82J99o49p9N31K11n41K31J13l12l23Q8N05o94M20L34k22k67k52K67L45
1978b4m53J6O96m62k51P06q3l99K18N04j39m48L17L18m10p8J22Q2J9j04J36P7
2000C60m74J19R23q97n7M17R4q01J0P29m65k1n2L54j41m74j12O89l72n01M05K08
2022e9n96J48O34l97l63N56M38o41m39O25J4R9k63L40J40k69j90Q73o87j01R15
$$ y = [-1136, -57, 209, -253, -170, 115, 348, -193, -140, -56, 201, -152, -299, 352, 565, -445, -64, 246, -224, -298, 385, 216, -99, 96, 528, 419, -32, -193, 212, 131, -554, 143, 504, -78, -275, 377, 145, -546, 194, 343, -154, -197, 166, -8, -225, -280, -448, 293, -168, -467, 321, -194, -622, -359, 58, -404, -570, 126, 51, -599, 139, 245, -292, -105, -194, 316, 366, -79, 440, 615, 86, -99, 253, 565, -186, 81, 871, -36, -65, 164, 40, 112, -111, 71, 270, -379, -458, 73, 284, -257, -26, 87, -225, -548, -460, 45, -649, -229, 105, -117, -384, -636, -369, -24, -477, -461, 235, -227, -478, 228, 145, -254, -36, 468, 329, -119, 198, 516, 106, 28, 150, 232, 251, 147, 283, 360, -114, 5, 928, 31, -26, 391, 485, -316, -306, 423, -42, -63, -115, 239, 98, -376, -488, 201, -171, -672, -267, -59, -655, -507, 127, -270, -633, -77, 361, -280, -719, -94, -80, 19, -244, 96, 236, -33, -223, 650, -37, -138, 777]
2043G77rm72j70J88j19q3J86K94P1n08j79J98k05o67P26N82q44o6M02l56m22L73
2065c03L76j21j97M62k62l69q8L52M31l50j94M44k47n12L19K67N9J05J99J1m52
2086g0j05O26l93j02L27J78p9n75K36K36j21m8O00k41r25K32L16j39O4N02J49
2107F68n08l22m8J37j99K6M83J8n58k82Q53p49j87O84J81l83l9J5r0l20O56L14
2129C50J28j96n19M27m73k55Q95L5k98M83jp16K37k97K26M08q8J52J4l21m92K5
2151b76L15r1R0L93m18o14M83n5l27M39J60K00n05j75J52n6q1L81J57j42l61M65
2173A34K31o88L72L79o53J92J82j42j57l7M86K49k17m14m3J01l29K50M40om84
2194a54K87k27j37r9L87K52k68K58k07k46l37NP70J81j40m2J31q18j7L81o0l8
$$ y = [777, 768, 296, 126, 314, 195, 112, 298, 592, 663, 155, -24, 174, -31, -698, 28, 610, -234, -300, 102, -254, -676, -303, 73, -48, -245, 217, -45, -414, -502, -150, 281, -69, -263, 181, -66, -578, -259, 8, 67, 172, 371, 382, -70, -175, 451, 58, -44, 283, 461, 382, -193, 43, 279, 158, 110, 710, 469, -456, -224, 92, -47, 17, 519, 668, 160, -162, -210, -73, -272, -246, 237, 255, -303, -585, 268, -481, -668, 16, 197, -186, -225, -210, -300, -620, 36, 350, 478, 282, -237, 190, -283, -538, 357, 392, 94, 577, 576, -140, 97, -200, 26, 434, 346, 498, 512, 191, -301, -276, 39, -52, 38, 431, 13, -601, -118, -173, -500, -61, 99, 299, -206, -381, -229, -285, -366, 15, 172, 30, -331, 134, 365, -323, 49, 428, -225, -33, 149, 7, -150, -187, 299, 548, 331, -83, -126, -25, -354, -104, 336, 330, -154, 133, -94, -231, -330, 57, 309, 41, 299, 92, -154, -491, -486, 284, 465, 325, 283, 414, -404, -421, -40, -100, -138]
2216a38M07K03k92n81k5K86J68j11L38M07j019K76j57m5j27O38K93k64l24M7N8
2237C8m67M08Q7K56j59m78M88l09k59N64J35j94l68K23j9l60N30K33j18k24k01
2258a94J5J88k24K16N80j92p07N40k56m29K56M87M1l51L00n2o05j37L83M92m1
2279C10Q2j18k16l58k91M31O8K4N25j26m76l23k0Q5K66J52K48l47L13k89J1l5
2301h4j34L66L38p02J75j23j12O1L93K17l03r7L73k20m24M32j96M03n94L88L63
2322E20m43k39L48k23N8j50J32j19m3L46o2O0k25k89J82j95J12K87R8l45l26P39
2344B23l83j21L66oj39L98k14j54j56q0L28J93j36K0K61j58n04L16J84n05M95
2365B28OK47j81m48R5r7p9K10o2K27j42J2J09m07j85P26m14j37K49p8k12j55J71
$$ y = [-138, 269, 472, 180, -401, -426, -140, 28, -83, 255, 662, -357, -81, -238, -283, -410, 228, 521, 257, -67, -20, 38, -429, -21, 66, 322, 163, -315, 173, -136, -395, 169, 304, 110, -258, -35, -54, -414, 116, 349, 231, 7, -194, -179, 9, -215, 1, 581, 389, -318, 222, -34, -463, -207, 280, 321, -30, 270, 218, -387, -524, -141, 351, 310, 392, 274, 58, -300, -591, -160, -92, -68, 457, 331, -145, -468, -488, -403, -137, 15, 263, -84, 229, -60, -49, -84, -218, 148, 486, -216, -41, -164, -276, -215, 178, 395, 92, -5, 368, 148, -276, 156, -40, 363, -231, 157, 520, 77, -162, 186, -37, 21, -129, 3, -116, -159, 187, 125, 185, -40, -329, -147, -342, -230, 57, 155, -190, -516, 223, -160, -281, 85, 79, -60, 338, 124, -30, -186, -266, 62, 255, 119, 139, 400, 242, -262, 54, 238, -267, 228, 234, 481, 300, -148, -53, -150, -229, -19, -81, 146, 4, 16, 125, -282, -467, 259, -155, -292, -43, -121, -333, -488, -317]
2388c17L28J12k78P2K68l04pK61l02p6J59L16q4m17R18m67j84l00M10L0j21N7
2410G4J89j10k4k16K84j49j00J23J32j42J60j54j63j5O0q5Q1q0n2l8j74J18K05
2433g6K8l63M06J09k82j06K13j1l48L02J1L53n4l11K32r4k35J5L69L5N6O4K11
2456E24m38P8N3k99l5M37K7k08pm4Pj85o9L32n7l30Q6J05k37P5J91K08k42k2J3
2481c7l5l21M1O5Q1p3L64K90k98j31m7k24J70k03M48k3J27nN8k39J39J44K66m34
2505A23l59N24k03j27K06J19r4l86K76J76k47p0j84j13L5K32Q2J45k75L42L8l10
2527g0l33Q2L23j87J76J92k9k82L1J96l97p8M83pn2M7j1q8k29O7M97k42k91M03
2551B01q3j71M5M4R9j34J3L14k77j2N5k73J43N1O5N8J15m43K54J28n50P7J02K47
$$ y = [-317, 11, 123, -155, -83, 185, -119, -126, 135, -167, -243, -84, 232, 148, -269, 649, 182, -2, -302, 108, 138, 17, 74, 263, 153, 129, -87, 197, 48, -52, 71, 203, 61, 221, 67, -96, -111, -51, -136, -55, -135, -187, -225, -399, -281, -76, -48, -411, -5, 104, -178, -284, -71, -82, -430, -128, -117, 236, 182, -129, 103, 9, -226, -211, 158, 193, 249, 313, 524, 86, 164, 217, -82, -117, 320, 347, 139, 132, 88, 95, -90, -159, 173, 116, -214, -128, -23, -260, -185, 6, 214, -28, -50, -37, -72, -393, -352, -287, -206, -279, 85, 375, 77, -54, -101, -325, -155, -358, 90, 67, 194, 189, 247, 8, 147, 291, 557, 123, -236, 288, 85, -42, 164, 283, 189, -197, 79, 255, 8, -62, -246, -359, -324, -92, -10, 135, -140, 202, 240, -70, -403, -321, 2, -185, -9, 183, 154, -128, -97, 99, -298, -376, 107, 100, 48, 95, 84, -4, -233, -166, 331, 89, -202, 201, 118, -53, -8, 36, 135, 1, 14, 328, 51, 39, 94, -179, -36, 15, 80, 138, 253, -190, 64, 192, -358, -281, -179, 68]
2575F8j05K15J47l56j96k8kK29j54K67J78l55l3K51l49j62M19J58l5k6L4k56J65
2598G4j55R2K1J33q5J08j08o3jn4j02L03Q3l5k12J19l02j66L07K65l88K66k8q3
2622a1O0n9l6J26N4j91K78j69p7m4K45l40J32j9L23j17m79L64K87k45Mm80P37
2645C43m58l5N27l91q8q8K17P8j2oK02l68K87k82N0l13P7J43K91j35J95l73q4
2668b23N9Q2J34j18P9K99j95j64j07r5Q4K37qK82l60P6M2k68Q4J67J94j91j25
2691c5j55K7k1J82N3O6l25m5J94j33j9j9M53k56J1J91j80L31m50L04j6j7j68m1
2715f8M01k26o7K37l04j32K1O2m1K94J15k6Pm0k4j6L1k56J56j24K04j16l14K0
2739b06j7P1L17r0q7j32Q7k82ML61k28O1L93L8m29j8J07k17J31M6K71m2k25J47
$$ y = [68, -37, 178, 325, -31, -227, -255, -257, -28, -182, 85, 263, -92, -125, 126, -223, -385, 34, 192, 157, 131, 165, -91, 74, -81, 11, 32, 165, 80, 188, 80, 17, 16, -38, -140, 163, 246, 211, -1, 118, -184, -350, -43, 222, -166, 100, 72, -11, 49, -10, -46, 80, 134, -57, 221, 52, -25, -69, 176, -164, -32, -51, 272, 155, -324, 40, 327, 82, 86, -394, 343, -115, -150, 377, -14, -102, -190, 27, 105, 93, 87, 289, -79, 208, -74, -24, -337, -260, -117, 174, 39, 234, -139, -223, -164, -82, 52, -66, 13, 312, 117, -47, -154, -249, -165, 72, 64, 346, -14, 62, 104, -164, -80, 87, 281, 90, -35, -190, -163, -184, -2, 51, 117, -208, -253, -59, -192, -211, -230, 223, -33, -22, 169, -11, 320, -130, 174, 158, 141, -27, -68, 333, 107, 40, 277, -27, -159, -138, -76, -117, 177, 292, 266, 273, 233, 209, 193, 224, -32, 124, 0, 204, 88, -226, -206, -223, -152, 165, 75, -12, -144, -57, -339, -335, 26, -202, -141, 252, 290, -139, -157, -50, -267, -136, -90, 181, 139, -86, 61]
2763F1m2Lj43P4P3K44q7o1j42m77P29qP5m1k16J05j36N7j15k4J24j97N2K01l5
2788G4k58l9l3K71n2K43o65Q76l65j10j96J46j3r5Q7N7J09J32l35J74p2p8J33
2811iK68m36M87n7q4p8q8m5ML66j84N6n41Q15m77J0L4m4J12J0j47L14m87K1J5
2836a65j04N36k09M5Q4k29k83J14q3K81k97J98K98j64k17R2J20j53K97J54k18
2857I7j59l06L45o9J05l7K79m20K48P6l38K6J33M88m65j4L1R0j1J09k07kR0P7
2881A66j47m1J84j46J87k06k22K14j11r7L35J36j06k38j30J44P3k24L49jk1j76
2903g8K56k51j20K14M9j14L7J29k60k3J90r2K9K84q6J7j89k58K43O0j58rK60o8
2927F2j2K7j45J53k53J56OqL0l85M37j44qpJ61J83m48L79k09j09J90r9k0K60J90
$$ y = [61, 19, 22, -121, -47, 26, 270, 183, 122, -20, -497, 232, 224, 299, 258, 42, 147, 11, 68, -47, -71, 53, -144, -92, 109, 74, -184, -223, -256, 15, -37, 206, -459, 417, 52, -58, -254, -108, -121, -216, -129, -72, 37, 169, -166, 8, -64, -142, -9, 259, -177, 310, 253, 169, 91, 3, -42, -38, 328, 144, 200, -341, 474, -3, 7, 41, -3, 109, 119, -28, 286, -201, -180, -165, -269, 267, 58, 103, 187, -42, -325, -211, -294, -13, -310, -112, 186, 22, -195, -103, 17, -136, 161, 315, 97, -62, -368, -23, -92, 13, -24, 255, -165, 83, 159, -179, -153, -20, 468, 3, -11, 20, 110, 99, 208, 1, -1, 89, 166, 19, -22, 162, 16, 203, -3, -225, -11, -122, -219, 116, 252, 146, -92, -222, -78, -5, -229, 120, 119, 98, -78, 178, -73, -193, 21, 70, -44, -7, 122, -138, -161, 29, -63, -34, 250, 164, 181, -8, -266, -23, 37, -121, -130, 130, 62, 50, 77, -68, 85, -168, -12, -6, -14, 16, -369, 68, -76, -84, -91, 70, 253, -195, 184, -25, -134, 56, -43, -63, 197, 387]
2952C87l64J32j33O8m9k28K53N7J07l62K04o3J00o2K65o01K38K1N8k0j78J25R1
2975D6J10j62K8p7J60j42K23j18k21mP1j44L63j28K02k02m8K8j6J20k10N12k16
2998A75j58J9k21J7J06K24qk82R6L49j51k91K13P9j60J49K48l21k75L73j14l3
3020C4j7j46L04j56k08J49Q2J86k21m9J45Jkk75L77m84J27L0P2j70k4M43l57L13
3044A54j5K6j68R9J25j50j13L76j20o3p3j94M9j3L58k57J96k78R0j27j06K83k34
3067a55L51k8k56j79J27L2K51J1k30q2M85m06K8M8P6J00l64M14k14o9l5K31K64
3090D00k86k31K19J08j48n2j0r0k2L72K0l20k55L60q9m8Q0o7L72m53j41L41J95
3113B55k26J59o8L7k92L99k64K08k01K23j64k41Q1rm3o2R0J42J7L4j94K60O3l14
$$ y = [387, 23, 155, 22, 90, 41, -187, 66, 123, 230, -132, 72, 9, 109, 47, 312, -289, -51, -30, 28, 8, -170, -45, 46, 156, -6, 22, -55, 105, -37, 186, 68, -153, -157, -86, -230, 133, 5, 207, 5, -43, -15, -31, 89, -121, 391, 175, 17, 36, -185, -168, -62, 162, 154, -128, -32, 317, 166, -125, 88, 167, 7, 156, 404, 83, -192, 181, 67, 34, 17, -129, 175, 19, -189, -40, 42, 228, 7, -42, 103, 104, 102, -173, 204, -280, -153, -123, -51, -221, -245, 198, -159, 154, 139, 165, -3, 96, 221, 71, -42, 334, 214, 151, 78, -116, -67, -80, 278, 21, 217, -61, 29, -98, -204, 79, -155, 196, 168, -88, -267, -140, -108, 143, 154, -76, -158, 327, -79, -51, -3, 73, 173, -191, 223, 9, -60, -95, 136, 400, 114, -117, 102, 210, 62, 10, 0, -90, -112, 260, 280, -40, -295, 65, -24, -72, 8, -59, 313, -140, -281, 60, 255, 29, 188, 120, 157, -135, 264, 0, 208, 7, 230, 66, -175, -94, -103, -146, -208, -118, 24, 41, 75, -119, 141, 204, -110]
3137a10L74k07j91K46k0n4j26K0O7P0r8J58q5l30M11L3p5j57K0j59OL37j78QJ90
$$ y = [-110, 264, 57, -134, 112, 92, 38, -88, -68, -1, 69, -29, 129, 44, -286, 125, 158, 83, -74, -54, -213, -207, 130, -48, -40, 150]
$$ [...]
8191a8
##END NTUPLES=NMR FID
##END=
