##TITLE=1H_13-2021
 CDcl3,8 sc, 
 12.03.2021
##JCAMPDX= 6.0         $$ Bruker NMR JCAMP-DX V2.0
##DATA TYPE= NMR FID
##DATA CLASS= NTUPLES
##ORIGIN= UXNMR, Bruker Analytische Messtechnik GmbH
##OWNER= root
$$ XWIN-NMR		Version 3.5
$$ Fri Mar 12 10:47:43 2021 Russian Standard Time (UT+4h)  she@DPX200
##.OBSERVE FREQUENCY= 200.131506
##.OBSERVE NUCLEUS= ^1H
##.DELAY= (6, 6)
##.ACQUISITION MODE= SIMULTANEOUS
##.ACQUISITION SCHEME= undefined
##.AVERAGES= 8
##.DIGITISER RES= 18
##SPECTROMETER/DATA SYSTEM= spect
##.PULSE SEQUENCE= zg30
##.SOLVENT NAME= D2O
##.SHIFT REFERENCE= (INTERNAL, D2O, 0, 15.7039)
##AUDIT TRAIL= $$ (NUMBER, WHEN, WHO, WHERE, WHAT)
$$ ##TITLE= Audit trail, XWIN-NMR		Version 3.5
$$ ##JCAMPDX= 5.01
$$ ##ORIGIN= Bruker BioSpin GmbH
$$ ##OWNER= she
$$ F:/spectra/data/she/nmr/H-F/1/audita.txt
$$ ##AUDIT TRAIL=  $$ (NUMBER, WHEN, WHO, WHERE, WHAT)
(   1,<2021-03-12 10:46:37.32 +0400>,<she>,<DPX200>,
      <created by zg, POWCHK disabled, PULCHK disabled
       configuration hash MD5:
       00 E9 B6 7A A2 85 ED C7 34 08 36 98 17 FE 4E 26
       data hash MD5: 16K
       89 09 C6 FF 7F 54 6A 84 F9 7C 30 08 DD DC 14 58>)
$$ ##END=
$$ 
$$ hash MD5
$$ 69 5B F5 97 15 17 05 F4 7E 85 6A D5 CD 27 81 A1
##$RELAX= 
##$RELAX= 
##$RELAX= 
##$RELAX= 
##$RELAX= 
##$RELAX= 
$$ Bruker specific parameters
$$ --------------------------
##$DU= <F:/spectra>
##$EXPNO= 1
##$NAME= <H-F>
##$PROCNO= 1
##$TYPE= <nmr>
##$USER= <she>
##$AMP= (0..31)
100 100 100 100 100 100 100 100 100 100 100 100 100 100 100 100 100 100 
100 100 100 100 100 100 100 100 100 100 100 100 100 100 
##$AQSEQ= 0
##$AQ_mod= 1
##$AUNM= <au_zg>
##$AUTOPOS= <>
##$BF1= 200.13
##$BF2= 200.13
##$BF3= 200.13
##$BF4= 200.13
##$BF5= 200.13
##$BF6= 200.13
##$BF7= 200.13
##$BF8= 200.13
##$BYTORDA= 1
##$CFDGTYP= 0
##$CFRGTYP= 5
##$CHEMSTR= <none>
##$CNST= (0..31)
1 1 145 1 1 1 1 1 1 1 1 1 1 1 1 1 1 1 1 1 1 1 1 1 1 1 1 1 1 1 1 1 
##$CPDPRG= <>
##$CPDPRG1= <>
##$CPDPRG2= <>
##$CPDPRG3= <>
##$CPDPRG4= <mlev>
##$CPDPRG5= <mlev>
##$CPDPRG6= <mlev>
##$CPDPRG7= <mlev>
##$CPDPRG8= <mlev>
##$CPDPRGB= <>
##$CPDPRGT= <>
##$D= (0..31)
0 1.2 0 0 0 0 0 0 0 0.06 0 0.03 0 0 0 0 0.0002 0 0 0 0 0 0 0 0 0 0 0 0 
0 0 0 
##$DATE= 1615531596
##$DBL= (0..7)
120 120 120 120 120 120 120 120 
##$DBP= (0..7)
150 150 150 150 150 150 150 150 
##$DBP07= 0
##$DBPNAM0= <>
##$DBPNAM1= <>
##$DBPNAM2= <>
##$DBPNAM3= <>
##$DBPNAM4= <>
##$DBPNAM5= <>
##$DBPNAM6= <>
##$DBPNAM7= <>
##$DBPOAL= (0..7)
0.5 0.5 0.5 0.5 0.5 0.5 0.5 0.5 
##$DBPOFFS= (0..7)
0 0 0 0 0 0 0 0 
##$DE= 6
##$DECBNUC= <off>
##$DECIM= 32
##$DECNUC= <off>
##$DECSTAT= 4
##$DIGMOD= 1
##$DIGTYP= 9
##$DL= (0..7)
0 120 120 120 120 120 120 120 
##$DP= (0..7)
150 150 150 150 150 150 150 150 
##$DP07= 0
##$DPNAME0= <>
##$DPNAME1= <>
##$DPNAME2= <>
##$DPNAME3= <>
##$DPNAME4= <>
##$DPNAME5= <>
##$DPNAME6= <>
##$DPNAME7= <>
##$DPOAL= (0..7)
0.5 0.5 0.5 0.5 0.5 0.5 0.5 0.5 
##$DPOFFS= (0..7)
0 0 0 0 0 0 0 0 
##$DQDMODE= 0
##$DR= 18
##$DS= 0
##$DSLIST= <SSSSSSSSSSSSSSS>
$$ [...]
##$SUBNAM2= <"">
##$SUBNAM3= <"">
##$SUBNAM4= <"">
##$SUBNAM5= <"">
##$SUBNAM6= <"">
##$SUBNAM7= <"">
##$SUBNAM8= <"">
##$SUBNAM9= <"">
##$SW= 16.9725357007746
##$SWIBOX= (0..15)
0 0 2 0 0 0 0 0 0 0 0 0 0 0 0 0 
##$SW_h= 3396.73913043478
##$TD= 16384
##$TD0= 1
##$TE= 0
##$TE2= 300
##$TE3= 300
##$TEG= 300
##$TL= (0..7)
0 120 120 120 120 120 120 120 
##$TP= (0..7)
150 150 150 150 150 150 150 150 
##$TP07= 0
##$TPNAME0= <>
##$TPNAME1= <>
##$TPNAME2= <>
##$TPNAME3= <>
##$TPNAME4= <>
##$TPNAME5= <>
##$TPNAME6= <>
##$TPNAME7= <>
##$TPOAL= (0..7)
0.5 0.5 0.5 0.5 0.5 0.5 0.5 0.5 
##$TPOFFS= (0..7)
0 0 0 0 0 0 0 0 
##$TUNHIN= 0
##$TUNHOUT= 0
##$TUNXOUT= 0
##$USERA1= <user>
##$USERA2= <user>
##$USERA3= <user>
##$USERA4= <user>
##$USERA5= <user>
##$V9= 5
##$VALIST= <valist>
##$VCLIST= <CCCCCCCCCCCCCCC>
##$VD= 0
##$VDLIST= <DDDDDDDDDDDDDDD>
##$VPLIST= <PPPPPPPPPPPPPPP>
##$VTLIST= <TTTTTTTTTTTTTTT>
##$WBST= 1024
##$WBSW= 4
##$XGAIN= (0..3)
0 0 0 0 
##$XL= 0
##$YL= 0
##$YMAX_a= 298400
##$YMIN_a= -349507
##$ZGOPTNS= <>
##$ZL1= 120
##$ZL2= 120
##$ZL3= 120
##$ZL4= 120
##$ABSF1= 10
##$ABSF2= 0
##$ABSG= 5
##$ABSL= 3
##$ALPHA= 0
##$AQORDER= 0
##$ASSFAC= 0
##$ASSFACI= 0
##$ASSFACX= 0
##$ASSWID= 0
##$AUNMP= <proc_1d>
##$AZFE= 0.1
##$AZFW= 0.1
##$BCFW= 1
##$BC_mod= 2
##$BYTORDP= 1
##$COROFFS= 0
##$CY= 11.3945322036743
##$DATMOD= 1
##$DC= 2
##$DFILT= <>
##$DTYPP= 0
##$F1P= 15.9154993809931
##$F2P= -4.1035820241983
##$FCOR= 0.5
##$FTSIZE= 0
##$FT_mod= 4
##$GAMMA= 1
##$GB= 0.15
##$INTBC= 1
##$INTSCL= 1
##$ISEN= 128
##$LB= 0.24
##$LEV0= 0
##$LPBIN= 0
##$MAXI= 10000
##$MC2= 0
##$MEAN= 0
##$ME_mod= 0
##$MI= 1.114404
##$NCOEF= 0
##$NC_proc= 0
##$NLEV= 6
##$NOISF1= 3.799351
##$NOISF2= 2.8
##$NSP= 1
##$NTH_PI= 0
##$NZP= 0
##$OFFSET= 15.70392
##$PC= 1
##$PHC0= -11275.43
##$PHC1= 10.80094
##$PH_mod= 1
##$PKNL= yes
##$PPARMOD= 0
##$PSCAL= 0
##$PSIGN= 0
##$REVERSE= no
##$SF= 200.130013532006
##$SI= 16384
##$SIGF1= 3
##$SIGF2= 2
##$SINO= 400
##$SIOLD= 16384
##$SREGLST= <1H.CDCl3>
##$SSB= 0
##$STSI= 0
##$STSR= 0
##$SW_p= 3612.71676300578
##$SYMM= 0
##$S_DEV= 0
##$TDeff= 0
##$TDoff= 0
##$TI= <>
##$TILT= no
##$TM1= 0
##$TM2= 0
##$TOPLEV= 0
##$USERP1= <user>
##$USERP2= <user>
##$USERP3= <user>
##$USERP4= <user>
##$USERP5= <user>
##$WDW= 1
##$XDIM= 8192
##$YMAX_p= 0
##$YMIN_p= 0
$$ End of Bruker specific parameters
$$ ---------------------------------
##NTUPLES= NMR FID
##VAR_NAME=  TIME,          FID/REAL,        FID/IMAG
##SYMBOL=    X,             R,               I
##VAR_TYPE=  INDEPENDENT,   DEPENDENT,       DEPENDENT
##VAR_FORM=  AFFN,          ASDF,            ASDF
##VAR_DIM=   8192,          8192,            8192
##UNITS=     SECONDS,       ARBITRARY UNITS, ARBITRARY UNITS
##FACTOR=    0.0002944,     1,               1
##FIRST=     0,             0,               0
##LAST=      2.4114304,     0,               0
##MIN=       0,             -349507,         0
##MAX=       2.4114304,     298400,          0
$$ Real data points
##PAGE= N=1
##DATA TABLE= (X++(R..R)), XYDATA
$$ [...]
1256F70j175N22P02j280J090j473K144j584OJ624k790K680p89j808L108k277k2
$$ 670 -505 17 719 -561 529 -944 1200 -384 -378 1246 -1544 1136 347 -1461 1647 -630 -652
1273f52K400l562K900n87j934L262l200K147n00j235K074j947J495o63q73K058
$$ -652 1748 -1814 1086 499 -1435 1827 -1373 774 274 -961 1113 -834 661 -2 -875 1183
1289A183k011J168M25k853M178k869J53K471m552M728k225j105L173m093L390
$$ 1183 -828 340 765 -2088 2090 -779 -626 1845 -2707 2021 -204 -1309 1864 -2229 1161
1304A161o07k318L466l219J772J277m031M477l240R98K323n121N191l006J53K948
$$ 1161 554 -1764 1702 -1517 255 1532 -2499 1978 -1262 -264 2059 -3062 2129 -877 -724 2224
1320B224m912M000j153j464L529m399K835L07l011M776n129K981J050m431O060
$$ 2224 -2688 1312 159 -1305 2224 -2175 660 967 -2044 2732 -2397 584 1634 -2797 3263
1335C263n603K300K500n695O084l819n99N040o547M567n63l869O758o292K959
$$ 3263 -2340 -40 2460 -3235 2849 -970 -1569 3471 -3076 1491 928 -2941 3817 -2475 484
1350D84J103m616O407n411K187J442m375N757m460R44K840n570O287l838j140
$$ 484 1587 -3029 3378 -2033 154 1596 -2779 2978 -1482 -538 2302 -3268 3019 -819 -1959
1365a959N685p919O859k248l829Q000q357N133M40n984Q233o243J602L617p288
$$ -1959 3726 -4193 2666 418 -3411 4589 -3768 1365 1805 -4179 4054 -2189 -587 3030 -4258
1380d258P232l546j331N437p533O482k542k173N756p432O142j881l064O432p293
$$ -4258 2974 -572 -1903 3534 -3999 2483 -59 -2232 3524 -3908 2234 353 -2711 3721 -3572
1395c572M941L87n781Q308p107K623L913r093R658n645o08O850j0095Q101k383
$$ -3572 1369 1756 -4025 4283 -2824 -201 3712 -5381 4277 -1368 -1976 4874 -5221 2880 497
1410D97l663P772q481M869J248n972P685o537K467L105o862P452n840K075L386
$$ 497 -3166 4606 -3875 994 2242 -3730 3955 -2582 -115 2990 -3872 3580 -2260 -185 3201
1425C201p360P705n474J170M716q662P724l460k093P830j0345O648M23o415J0189
$$ 3201 -4159 3546 -1928 -758 3958 -4704 3020 -440 -2533 5297 -5048 1600 2023 -4392 5797
1440E797r963L805M312q779R206o561P4O711q424O089k735k316P334p619M150
$$ 5797 -4166 -361 3951 -4828 4378 -2183 -2109 4602 -3822 2267 -468 -2784 4550 -3069 1081
1455A081j026k895P619q093M107l72l605Q544q762L134K252n789Q980p482k78
$$ 1081 55 -2840 4779 -3314 793 421 -3184 5360 -3402 -268 1984 -3805 5175 -2307 -2585
1470b585O504p978Q183m802l631R264q190N788k271n017R589o822L005j85n553
$$ -2585 3919 -4059 4124 -678 -4309 4955 -3235 2553 282 -4735 4854 -1968 1037 852 -4701
1485d701R394n453R1K377o565R509m375k633M750o839Q651l180m555N856n563
$$ -4701 4693 -760 -669 1708 -4857 4652 277 -2356 2394 -4445 4206 1026 -3529 2327 -3236
1500c236O453j433o183O532l898L948N7p501P648l066J998J262q469Q516k257
$$ -3236 3217 1784 -4399 2133 -1765 2183 2240 -5261 2387 -679 1319 2581 -5888 2628 371
1515C71r3K248q397Q128l88k976L434p529O688K098o269M656o234N158L878q434
$$ 371 278 2526 -5871 2257 1869 -1107 2327 -5202 1486 3584 -2685 1971 -4263 895 4773 -3661
1531c661M788l913L175M651q790L396n11J001M389p906J834K130k73L537p530
$$ -3661 1127 -2786 389 5040 -3750 -354 -865 136 4525 -3381 -1547 583 310 3847 -3683
1546c683K089K900q68K941p725L239L274k144L028p356K703N620m909K853m948
$$ -3683 -1594 1306 438 3379 -4346 -1107 2167 23 3051 -4305 -1602 4018 -891 1962 -2986
1561b986K23Q467o846J191j377j688Q741o114j548J350j135O203m086l463K551
$$ -2986 -2763 5704 -1142 49 -1328 -3016 5725 -389 -1937 -587 -1722 4481 395 -3068 -517
1576e17L43L808l676l187L182M30L346m919k104M298p49L254n086k178N914j581
$$ -517 -174 3634 -42 -3229 -47 383 3729 -1190 -3294 1004 255 3509 -1577 -3755 2159 578
1592E78J508l111l255P158j400j406m45l717P077p69l449O15k400N690k50m291
$$ 578 2086 -1025 -4280 2878 1478 72 -373 -4090 2987 2218 -1231 -616 -3016 2674 2424 -1867
1608a867O34l75L947j3m729J068P76K836l62m876K021R45K275r66m620K827J049
$$ -1867 -1233 -1608 2339 2326 -2403 -1335 -559 2277 1915 -2961 -940 5 2280 1314 -3306 -479 570
1625E70J465j263m134L224J670l42o55l818L293K469k326J21l173L044K749l243
$$ 570 2035 772 -3362 -138 1532 1190 535 -3283 10 2479 153 274 -2899 145 2894 -349
1641c49j00j593K453K323l078r36J27J829J712l069p94Q52J476J439l610O2J081
$$ -349 -449 -2042 411 2734 -344 -1280 -1153 676 2388 -681 -1475 -623 853 2292 -1318 -1256 -175
1658a75J064J140l778N41J608M73N00k879L0K551k58j23j931j81K898q73k70j712
$$ -175 889 2029 -1749 -1208 400 873 1373 -1506 -1476 1075 817 694 -1237 -1418 1480 607 337 -1375
1676a375M38K502j194m36j208P02K100j187r43j17K56K047j481j123Q00j74J887
$$ -1375 -937 1565 371 -65 -1273 -571 1529 342 -601 -718 -462 1585 104 -1019 -219 -393 1494
1693A494j561r91R28P8J267j455p40J014J70O33j059r07J590k11K36n39j156J971
$$ 1494 -67 -1058 -130 -52 1215 -240 -980 34 204 837 -222 -1129 461 250 486 -53 -1209 762
1711G62o66K05k99j035J817n25k33q8n97J203j37p15L80o50J118j31r78R51j034
$$ 762 96 301 2 -1033 784 259 26 -62 -659 544 407 -308 72 -578 540 409 -569 382 -652
1730f52J263l57q67J042q95R35j48r26R94n08O5N88j261J083l13l94J092j566
$$ -652 611 254 -613 429 -466 469 321 -605 389 -119 -54 534 -727 356 43 -351 741 -825
1748h25J287m58m50J119j312R93k92n73J068r22M28K82j133J464r37k1Q73j529
$$ -825 462 4 -446 673 -639 354 62 -511 557 -365 63 345 -788 676 -261 -282 591 -938
1766i38J678r20j52Q30j275J433o57m74R89j067R18l1j185J567j185O94L24j685
$$ -938 740 -180 -332 498 -777 656 -1 -475 514 -553 365 334 -851 716 -469 225 549 -1136
1784a136K008j246L98O49j835J845p10k69J003j613J329M8j125J493j704J144
$$ -1136 872 -374 24 673 -1162 683 -27 -296 707 -906 423 471 -654 839 -865 279
1800B79M07j532J714j673R74O02j612J496j176N29R00j860J368n75k25J534k280
$$ 279 686 -846 868 -805 169 771 -841 655 -521 8 908 -952 416 -159 -384 1150 -1130
1817a130J500j89q37J959k450J337K27j192J870j944O55J046j728J723j219l29
$$ -1130 370 181 -656 1303 -1147 190 417 -775 1095 -849 -194 852 -876 847 -372 -701
1833g01J883k152J601p82p78K245k306J396l52r55K128j950Q03L13j381K107j541
$$ -701 1182 -970 631 -151 -929 1316 -990 406 54 -901 1227 -723 80 393 -988 1119 -422
1850d22J7J216j946K217j305l82J644k247K161j062o45J832k000J474k55j381
$$ -422 -405 811 -1135 1082 -223 -605 1039 -1208 953 -109 -754 1078 -922 552 297 -1084
1866a084K201j836Q67N90k130K594j773M07J187k430K489j274k74J585k308J813
$$ -1084 1117 -719 148 738 -1392 1202 -571 -164 1023 -1407 1082 -192 -466 1119 -1189 624
1882F24k68j213J944j984J082N55j798K141j877Q31P55j907K185j672N02J020
$$ 624 356 -857 1087 -897 185 740 -1058 1083 -794 37 792 -1115 1070 -602 -100 920
1898I20j978J878j147j35J622k339J718l48j205K495k703J529K61j729K530k285
$$ 920 -1058 820 -327 -462 1160 -1179 539 191 -1014 1481 -1222 307 568 -1161 1369 -916
1914i16P81R94j947K076j390k38J762k102J574o01p95J971k153J516m50r17K065
$$ -916 -135 859 -1088 988 -402 -640 1122 -980 594 -7 -802 1169 -984 532 82 -835 1230
1931A230k099J163j8j193K092j825M68R10j868K253j410l83J897k400K024q34
$$ 1230 -869 294 276 -917 1175 -650 -182 728 -1140 1113 -297 -680 1217 -1183 841 7
1947Gr48K166k057J218j29j172J975j510M61M80j426J938j252L2Q33j663K112
$$ 7 -941 1225 -832 386 257 -915 1060 -450 11 491 -935 1003 -249 -217 616 -1047 1065
1964A065j338j94J198j725J998j070o80J650j710J305r8j578K115j378N36O00
$$ 1065 -273 -467 731 -994 1004 -66 -746 904 -806 499 401 -1177 938 -440 96 696
1980F96k029K192r76m3P81j737J718m09m49O32j276J330Lr01Q55j264J395K4j353
$$ 696 -1333 859 -117 -160 621 -1116 602 193 -256 376 -900 430 433 -468 387 -877 518 542 -811
1999h11J411j482J401K05j792J614j028O60P92k229J528j14l14J210k203J100
$$ -811 600 -882 519 724 -1068 546 -482 178 970 -1259 269 155 -159 1051 -1152 -52
2015e2O89r78J165j776P70R16q94N41j139O51Q96q33J80p80N68J042j347N21p71
$$ -52 637 -341 824 -952 -182 734 -160 381 -758 -107 789 -44 136 -644 -76 966 -381 140 -631
2034f31N78J295j941P32m48L94J347k024L21N31l58J324j637k95J391o65Q84j247
$$ -631 -53 1242 -699 33 -415 -21 1326 -698 -377 154 -204 1120 -517 -812 579 -86 798 -449
2052d49m96J664o00M13j096k12J458m19o7p53o8J447n63l26l35k58J689q90m26
$$ -449 -945 719 119 532 -564 -776 682 263 196 -557 -625 822 259 -67 -402 -660 1029 139 -287
2071b87k7k67J727j069o00L28j26J310q64r20P22MR14o72j218J200m5N29n04j276
$$ -287 -314 -581 1146 77 -523 -195 -321 989 125 -795 -73 -69 845 173 -1045 155 110 639 135 -1141
2091a141J430R5P2m90r02J237L23m24l77o21J134L87p73j22n75J266J23r42O6
$$ -1141 289 384 456 -34 -936 301 624 200 -177 -798 336 723 -50 -172 -747 519 642 -300 -234
2110b34l39J213qj073J21L9P99J15j247L01L00M13K54j467N57M40K26jj269O72
$$ -234 -573 640 632 -441 -320 -281 518 633 -614 -313 -13 400 654 -813 -256 184 410 409 -860 -188
2130a88N44o1j18r50O09P01l66j57o65N00Q52o51o1n77N76P00q18k7l32O62M46
$$ -188 356 295 177 -773 -164 537 171 14 -651 -151 701 50 -11 -588 -12 688 -130 -157 -489 173 619
2151F19p38j87L8M14M13q08k03M35Q9N34j029oN44K2L55q22j3N42J7J00o74L3
$$ 619 -119 -306 -268 146 559 -249 -452 -17 72 606 -423 -429 115 137 492 -330 -343 199 216 316 -358 -325
2173c25O79j95n5l47q3Q44m88L4k84j17Q59n21l7j16k1O01l24l16J98o2M13k85
$$ -325 354 159 104 -243 -326 518 30 64 -220 -337 522 1 -36 -152 -173 428 104 -212 -14 -76 337 52
2195E2m10M76j95M68l78k65L64k01M38m21j85L43o3J09p5m03N97k43j7J52n29
$$ 52 -358 118 -77 391 13 -252 112 -89 349 -72 -257 86 23 132 57 -346 251 8 -9 143 -386
2216c86O70k75m5J31m03M88j71o5P2k24L08kk80L85m06K81L0m19O11m79K38P5
$$ -386 284 9 -36 95 -308 180 9 -56 16 -208 100 98 -182 203 -203 78 108 -311 300 -179 59 134
2238A34l99N22l47O6J85l68L86j54k81N62m73K41j5k66N20m91K92p7k92N48l95
$$ 134 -265 257 -90 -24 161 -207 179 25 -256 306 -167 74 59 -207 313 -178 114 37 -255 293 -102
2259a02J54L3l74N66k79j19K87m63N72j68l58N20o40O58j77l86N23m94M16kn20
$$ -102 52 85 -289 277 -2 -121 166 -297 275 107 -251 269 -371 287 110 -276 247 -247 169 167 -353
2280c53N03j69K6K76o54N12r8o1K22o12O05j31r0J58n40O18r8k18K89n26M46J89
$$ -353 150 -19 7 283 -371 141 43 -18 204 -408 197 66 -24 134 -406 212 114 -104 185 -341 105 294
2302B94n74N16n46L12L99p95N57l64J63M30o79K57N6o9L63n95K55J48k00M22o76
$$ 294 -280 236 -310 2 401 -394 163 -201 -38 392 -287 -30 26 -43 320 -275 -20 128 -72 350 -326
2323c26K78K28l23N22o77J98L44l67L83m51M9M44m41K68j84k38P28o34L20r6l39
$$ -326 -48 180 -143 379 -298 -100 244 -123 260 -191 -142 302 -139 129 -55 -293 435 -199 121 25 -314
2344c14P82o51K02K1k56O21m77q0L28m38N53k69k63M81m91N16k34l63O66o22M87
$$ -314 468 -183 19 40 -216 405 -72 -152 176 -262 291 22 -241 240 -251 265 31 -332 334 -288 199
2365A99j30l96O07m18K21J55n97N60k18q3L51o73O71k51j41L83n89N42j16j87
$$ 199 69 -327 280 -138 83 238 -359 201 -17 -100 251 -422 249 -2 -143 240 -349 193 77 -110
2385a10K77m29M14Jm09N43n07J74L19o17O45m52Q6M28o81N52k73j00M55o06M10
$$ -110 167 -262 152 153 -256 287 -220 -46 273 -344 301 -151 -65 363 -318 234 -39 -139 316 -290 120
2406A20n8k20M98n42K08J54m70O90o46K53K66n33N53m34P4L49m38L42k31j62N30
$$ 120 62 -158 340 -202 6 160 -310 380 -266 -13 253 -280 273 -161 -87 262 -176 166 -65 -227 303
2427C03n14K31K7l05N94n15K51J7l84O05m77K07P8m21N62l03r2L87m72M59k08
$$ 303 -211 20 47 -258 336 -179 72 89 -295 310 -167 40 118 -303 259 -44 -136 251 -221 238 30
2448C0l05N87o23M71r7l30N46m86L08l5l60N27l34L7K41m49N00k05j26K80m42
$$ 30 -275 312 -311 160 63 -267 279 -207 101 66 -294 233 -101 -64 177 -272 228 23 -103 177 -265
2469b65N01j83j69K48l41M50j89k61M22l49K14N1m46N87l32N8K30n55O53l14o3
$$ -265 236 53 -116 132 -209 241 52 -209 213 -136 78 129 -317 270 -62 -4 226 -329 324 10 -53
2490e3K54m93M29l9j70J94l07K29J32l89L43l13K58K00n54L94k47K49L5m49M03
$$ -53 201 -292 137 98 -72 122 -185 44 176 -213 130 -183 75 275 -279 115 -132 117 152 -297 106
2511A06j49R3J43m73L11Jn8K39n13L86P7k71L44o56M50K00l36K16l30K45K89m71
$$ 106 -43 50 193 -280 31 32 -26 213 -300 86 163 -108 236 -420 30 230 -106 110 -220 25 314 -157
2533a57J30p3K9L38m66J57NO1K55m65J64j9L7L04n49J33K60j64K55m39p0N07j96
$$ -157 -27 -100 -71 267 -199 -42 -37 24 279 -186 -22 -41 -4 300 -249 -116 144 -20 235 -204 -274 233 37
2556C7R2k91r5N62l00J11l26J32M15l43L7k09R5M99m51p1O5j55O17m46k31K77
$$ 37 129 -162 -257 305 5 116 -210 -78 337 -6 31 -178 -83 416 -35 -106 -41 -196 421 -25 -256 21
2578B1j43M74l50k85K52J26J03k77j70K67Q5J16k53l24M96p7J20k75l22P01j98
$$ 21 -122 352 2 -283 -31 95 198 -79 -249 18 103 219 -34 -358 138 61 181 -94 -416 285 87
2599H7o6p4l04N72%l44K4n8L62Nl20j9p0M94j28l15J48j52M49j36m14K91j6R5
$$ 87 21 -53 -357 215 215 -129 -105 -163 199 204 -116 -135 -205 289 161 -154 -6 -158 291 155 -259 32 16 111
2623A11J17n19K57J51Kk8l74K64J69K7j52l00L39M0Nr1l37M23J63l45M7j41J86
$$ 111 228 -291 -34 117 119 91 -283 -19 150 177 25 -275 64 104 109 18 -319 104 267 -78 -31 -172 14
2646A4L74n96J56o3J20K42l71M3J0K23M0l42J04qJ14J82m43R4K29j70K68m53P4
$$ 14 388 -208 -52 -115 5 247 -124 -81 -71 152 192 -150 -46 -54 60 242 -201 -107 122 -48 220 -233 -159
2669a59L12j97J20k21L6K64k2j55n0L8J55r8k8j10L3L20l51J09k9m7L14l22j5
$$ -159 153 -44 76 -145 -109 155 133 -22 -72 -34 121 23 -5 -115 -82 238 -113 -4 -33 -80 234 -88 -103
2692a03J37q0J83j10j47J80q0J25r6r8J61j76K52j49j17K27k13J94r2r3K28j55
$$ -103 34 -46 137 27 -120 60 -20 105 9 -89 72 -104 148 -1 -118 109 -104 90 -2 -95 133 -22
2714b2J3R8k50K46j25q3K59k14J59p8o0J46j61Q8r2J16L0j07L0M4j00J92k18M7
$$ -22 -9 89 -161 85 -40 -123 136 -78 81 3 -57 89 -72 16 -76 40 70 -37 -7 37 -63 129 -89 -42
2738d2Q1k07L62l05P5J18j04J55k01JJ84j51R0l0k62L58o9o4Q8k46L27j54K4p3
$$ -42 39 -168 194 -111 -36 82 -22 133 -68 -67 117 -34 56 26 -236 122 53 -11 77 -169 158 4 28 -45
2762d5p2L01j72n2O0r9K17l2k72K20j43K82j34k42K28j24K66j15j96J72j33K24
$$ -45 -117 184 12 -40 20 -79 138 106 -166 54 -89 193 59 -183 45 -79 187 72 -124 48 -85 139
2784A39l8k91K74j4n2O7k85K42J09j95R4k60K77O1j53l0m9J62P2j63O7j70K25
$$ 139 101 -190 84 70 18 85 -200 42 151 -44 50 -210 67 128 -25 -55 -104 58 130 -33 34 -136 89
2807H9R1l40J99j22N4L04n12K75n4L0J61l34N1K21j26J26j64r0K45p4Q6k62O8
$$ 89 180 -160 39 -83 -29 275 -237 38 -16 14 175 -159 -108 113 -13 113 -51 -141 104 30 116 -146 -78
2830g8K21k19K02l39J96K22l09J73j32n6L64k84l0R4j84M46l34l4J13j66K96j95
$$ -78 143 -76 126 -213 -17 205 -104 69 -63 -119 245 -39 -69 25 -159 287 -47 -81 32 -134 162 -33
2852c3j5M7o7K10j10k15K79j43R5M9k66L22j75P8r3j32K80j58J48j62n5K79j93
$$ -33 -48 -1 -68 142 32 -183 96 -47 48 97 -169 153 -22 56 -37 -169 111 -47 101 -61 -116 163 -30
2875c0L3P4l15M29j24k22L44m29L46K0k96K69k39K21O4l07J97o5M2J18k15J12
$$ -30 3 77 -238 191 67 -155 189 -240 106 126 -170 99 -140 81 145 -162 35 -30 12 130 -85 27
2897B7o7l4K06k97K55j20M6Q0k73K26p6l0J75j90O2J05j50J98k43pL63m33L68
$$ 27 -40 -74 132 -165 90 -30 16 96 -177 49 -27 -57 118 -72 -10 95 -55 143 -100 -107 256 -177 191
2920A91l02K6L06l96L16j75p9L16k73J03Q6k30K77j64n7J79k38K71j65K1J1j07
$$ 191 -111 -85 221 -175 141 -34 -113 203 -70 33 119 -111 166 2 -55 124 -114 157 -8 13 24 -83
2942h3J97j89N7N4j25J94q1j96K91k62L17j06k95L72k06J21Pk56L57j47n2J05
$$ -83 114 -75 -18 36 -89 105 24 -172 119 -143 174 68 -227 145 -61 60 67 -189 168 21 -31 74
2964G4j85J87nk06K46k46K17K7k69K57k14K02m9j06R3n9R2l9q7P6q3N8J53l09
$$ 74 -111 76 71 -135 111 -135 82 109 -160 97 -117 85 36 -70 23 -36 56 17 -70 6 -77 -19 134 -175
2988a75K49q9nJ97m46L95o6j31K26k46R5J32k09R4p1O5J12j62L1k9J05J2k06K06
$$ -175 74 -15 -20 177 -269 126 60 -71 155 -91 4 136 -73 21 -50 15 127 -35 -4 -33 72 84 -122 84
3012H4j50J31lj87J94n7k7J55k74J02J84k39K44k04l0K26j87J29k20J23Q4r4L0
$$ 84 -66 65 62 -125 69 12 -15 140 -134 -32 152 -87 157 -47 -77 149 -38 91 -129 -6 78 -16 14
3035A4j06Q2J74k42LJ0m0L11k77n7J60j23J56j08p7J09L8P9j18K2K7J2O0k21k8
$$ 14 -92 -10 164 -78 -75 -65 -105 206 -71 -128 32 -91 65 -43 -120 -11 27 106 -12 10 37 49 109 -112 -140
3060a40K80k44J95j44j47M04j94jm7p1J85K9k04K9R8Q2o5j36P2oK19k33q7J61
$$ -140 140 -104 91 -53 -200 204 10 9 -38 -109 76 105 -99 -70 28 110 45 -91 -19 -25 194 -39 -126 35
3084C5r3L03k16k09K45QJ6l6k35J64J88j41n4j05J55K5O5k04o4K60j28N1n7j79
$$ 35 -58 245 29 -180 65 73 89 53 -182 -18 170 29 -25 -130 25 50 115 -89 -153 107 -21 30 -27 -206
3108b06L34m7j63J42j40J27J51l69J10O2qJ13j53o8J36J07q7j14L8M0J61q7k40
$$ -206 128 81 -82 60 -80 47 198 -171 -61 1 -7 106 -47 -115 21 128 41 -73 -35 5 166 79 -161
3131a61J38J20j22J23k58M8K26j37O2r9j4J90o3j31Q1RL4n8q5O9O9J30k84J50
$$ -161 -23 97 -25 98 -160 -112 114 -23 39 -60 -74 116 53 -78 3 12 46 -12 -97 -28 41 171 -113 37
3155C7l2p5K20k52N5J06m1L2L2j69J18ojj0j03J11N8J2j55M8P3o3M0p1J0O9l3
$$ 37 5 -70 150 -102 -47 59 18 50 82 -87 31 25 24 14 -89 22 80 92 -63 -15 58 -5 35 -36 -26 43 10
3182A0m6L6q0J20Lj96K46j88P2Q4j24M9j9P0l8j7M3l4n6J17j30J20l1l6J33j49
$$ 10 -36 0 -80 40 43 -153 93 -95 -23 61 -63 -14 -33 37 -1 -18 25 -9 -65 52 -78 42 11 -25 108 -41
3208d1J42j20m9O6k7pP0j0l8Q6n6j0k2M1p1N7m6o7K14j65O4pj02J74q3l0J29j05
$$ -41 101 -19 -68 -2 -29 -36 34 24 -14 72 16 6 -16 25 -46 11 -35 -102 112 -53 11 4 -98 76 -7 -37 92 -13
3236a3M7J6j77J85m2nN9j71P5L8N4o4k5M2pQ4j21q5J76m0j3M7k52L08Lk01J47
$$ -13 34 50 -127 58 16 11 70 -101 -26 12 66 2 -23 19 12 96 -25 -110 66 26 13 60 -192 116 119 -82 65
3263F5j70J14Q7j71NJ0J40pj17%k4J16J03k38M3Q7l5J45l38J70P0mJ3j33J4J27
$$ 65 -105 9 96 -75 -70 -60 80 73 -44 -44 -68 48 151 -87 -44 43 8 153 -185 -15 55 51 64 -69 -55 72
3289G2j7j5r1M5J64j48Kj02L6K56k33O6o1o1K59j69o7oO5J12q6j41J12j7J80j90
$$ 72 55 40 -51 -6 158 10 12 -90 -54 202 -31 35 -26 -87 172 3 -64 -70 -5 107 21 -120 -8 -25 155 -35
3315c5j0J1K5J64k10m1J13M6R7j84q2K43l4n3o6j78L10j12J8o9m1J78m0j0r0o8
$$ -35 -45 -34 -9 155 -55 -96 17 63 160 -24 -106 137 103 50 -16 -194 116 4 22 -47 -88 90 50 40 -50 -118
3341a18J81K7j12J0j13K29k0j57O0n9J68k5j69Q0l2J40n2j80J57q3J22K7k52J97
$$ -118 63 90 -22 -12 -125 104 84 -73 -13 -72 96 71 -98 -18 -50 90 38 -142 15 -68 54 81 -171 26
3365B6M0m6L9k29J99Q9j81P7j52J19J02m3n0n0Q1J09j60L6l4M2J46k14J07r7M4
$$ 26 66 20 59 -170 29 118 -63 14 -138 -19 83 40 -10 -60 21 130 -30 6 -28 14 160 -54 53 -44 0
3390@J24j63O3r6P4J02r0m4O1n4R8j30J7J01j14K27k81M4J58j86J20n9l2J64r2
$$ 0 124 -39 24 -72 2 104 14 -30 31 -23 75 -55 -38 63 -51 176 -105 -61 97 -89 31 -28 -60 104 12
3415A2J2Rr7J12m5J0l9rJ00p6L5q4l1J73j42P1k3j30K34l8j58J56j79K03K1j67
$$ 12 24 33 -64 48 3 13 -26 -35 65 -11 24 -60 -91 82 -60 11 -12 -142 92 54 -104 52 -127 76 97 -70
3441g0J33r0N5L5q9L0j0L4nn6K4L5J7j4q8O8J8l1Q6j86J36n8N8k6n1N2kK2Qj18
$$ -70 63 -27 28 63 -26 4 -6 28 23 -33 -9 26 43 29 -59 9 27 -4 82 -104 32 -26 32 6 -45 7 5 27 35 -83
3471h3M2J05j24J14p7J6R4j71J29m3kP3o0j03J32j3n4N5l8j6O2j7m7L4J3L6J7
$$ -83 -41 64 -60 54 -23 -7 87 -84 45 2 0 73 13 -90 42 29 -25 30 -8 -24 38 21 -26 8 21 57 74
3498G4r1J4%RP9j21k1Q5p1L0l1l6J11kn4K8n7J35m9l6m1P4M1o4kj6P1l8k1m1K0
$$ 74 -17 -3 -3 6 85 -36 -57 28 -43 -13 -44 -80 31 29 -25 3 -54 81 32 -4 -45 29 70 6 4 -12 59 21 0 -41 -21
3529b1K2M7n4m8R9p2J6Qo8J26k4j9m9K2P4l1j1Qp6O0Ko2P5j12M6Q3k1n0R7j06
$$ -21 1 48 -6 -54 45 -27 -11 -3 -71 55 31 12 -37 -15 59 28 17 25 -51 9 11 -51 24 -88 -42 41 20 -30 67 -39
3559c9K8M9j09J51p8k3K0n3K6N0Lj11P7L0Kk0n2N3L8n9j4N0J0Om1k3K7J7J1l5
$$ -39 -11 38 -71 80 2 -21 -1 -54 -28 22 25 -86 -9 21 23 3 -49 4 42 -17 -31 19 29 35 -6 -29 -2 15 26 -9
3589in1J3N7Jj4m3N8l2K9j5j5P3k4Kl2p1J32pk4n9J0L4P1j11j7M1L8Jo7M9n1J10
$$ -9 -60 -47 10 11 -3 -46 12 -20 9 -6 -21 52 28 30 -2 -73 59 52 28 -31 -21 13 84 -27 -44 -3 35 36 -31 18 -33 77
3621G7q6o2L6M6J4o3M5J9L1n1kk5j9N5j4K0o1O6M2o6j2j2P5k9M6o3Qo9O2n2O0
$$ 77 -9 -71 -35 11 25 -38 7 26 57 6 4 -21 -40 15 1 21 -40 26 68 2 -10 -22 53 24 70 7 15 -54 8 -44 16
3652A6l4k0M3q7O7N5l6M0k1m2L9l8LoON2q0N7l5J8m5k1Q2p0N1L1Ll8N0o0N6l5
$$ 16 -18 -38 5 -82 -15 40 4 44 23 -19 20 -18 -15 -21 -15 37 -43 14 -21 -3 -48 -69 13 -57 -6 25 28 -10 40 -20 36 1
3684A%j4j5Q8r5J0N9j5Rj3Pk3k9M7RN4m6l3ol6J21j9q4L6Qo1J16j63Q8N9o8J7
$$ 1 1 -13 -28 60 -35 -25 34 19 28 15 22 -1 -30 17 26 80 34 1 -5 -41 80 61 -23 13 21 -40 76 -87 1 60 -8 9
3716Il5j8J02m8k7L6k7L2pJ0j0p7R2m7L3j5l3P9n8k3M0k7J10j05l0O1JK4r4O6
$$ 9 -26 -44 58 10 -17 19 -8 24 17 27 17 -60 32 -15 18 3 -30 49 -9 -32 8 -19 91 -14 -44 17 18 42 -52 14
3746A4L4m5K1j12J6J23r2J14n9n6J48p9%j9o6J62o6q8L8m0J24%o6p6M3N9k4J6
$$ 14 48 3 24 -88 -72 51 -41 73 14 -42 106 27 27 8 -58 104 38 -50 -12 -52 72 72 6 -70 -27 32 8 24
3774B4o5K5J06m1j23J09j07J29L7j78J08k9L4J2j23pQ3R8j07o2L8P1J2l2j01R0
$$ 24 -41 -16 90 49 -74 35 -72 57 94 -84 24 -5 29 41 -82 -89 -6 92 -15 -77 -39 32 44 12 -89 1
3800AM6o3P6j32Q6J25j31op3O8R1r9n3J4M9J00r3k0m6J24O7k00J10r4O5P3k01
$$ 1 47 -16 60 -72 14 139 8 2 -71 -3 88 -11 -64 -50 -1 99 6 -14 -60 64 131 -69 41 -53 12 85 -116
3827a16N3J23o2N3q6r8K28q3j6K0j8OL7Kj34J08RL4J0j36K3J49j77O4L9j42K45
$$ -116 -63 60 -2 51 -35 -133 95 12 -4 16 -2 4 41 43 -91 17 26 60 70 -66 -43 106 -71 -7 32 -110 135
3854A35j24o2P8o5P2k6q3K3M9M2rn6l7Q8M6p2p7J68j34R1m3j18K13m6n7M5j28
$$ 135 11 -51 27 -38 34 8 -75 -52 -3 39 30 -26 -63 25 71 -1 -78 90 -44 47 4 -114 99 53 -4 41 -87
3881h7Q3Q0q1K1j01O4M7j5K1r4J58o7k6L4j11Q2L2j08J6L4K5M7r9j9N7nM1l3j8
$$ -87 -4 76 -5 16 -85 -21 26 11 32 -62 96 29 3 37 -74 8 40 -68 -52 -18 7 54 -45 -64 -7 -12 29 -4 -22
3910b2m0J26j3q3K5j1O7Qq3lQ7q6O7q7J2J32q6j4K9r3P9L6q2J8L6n4Q8p0l3O9
$$ -22 -62 64 51 -32 -7 -18 49 57 -26 -29 58 -28 39 -48 -36 96 10 -4 25 -68 11 47 -35 -17 19 -35 53 -17 -50 19
3940A9L4n2j8J7lO6o3L9k2j3J6j0l1k4L7J2k6J6l7K1L1m8n8R3lN6l9o6M1N2l9
$$ 19 53 1 -17 0 -3 63 0 39 17 4 20 10 -21 -45 -8 4 -22 -6 -43 -22 9 -39 -97 -4 -7 49 10 -56 -15 37 -2
3971bK6l9MP8l6l5K3n0L3m4P4j6K8o4K1k8j7R7n9L8m2M9k7M6j6n3O1l6LJ9m6k4
$$ -2 24 -15 -11 67 31 -4 19 -31 2 -42 32 16 44 -20 1 -27 -44 53 -6 32 -10 39 12 58 42 -11 50 14 17 36 -10 -34
4003c4J05o6M2o7J2O7p4N6n8N7j0J3m0mj0L9k0Pk9N2Jn4qK3K2j3k4rL3j7J4qJ5
$$ -34 71 5 47 -20 -8 59 -15 41 -17 40 30 43 3 -1 -11 28 8 15 -14 38 39 -15 -23 0 22 9 -15 -24 9 -8 6 -2 13
4036A3j1L5l9NJ6M4q6M4n0n2J64j07OK6m6R1n4nJ2M0m6K0m1QJ0K1n3K1P3r0Q6
$$ 13 2 37 -2 3 19 63 -23 21 -29 -81 83 -24 -18 8 -38 53 -1 -6 6 46 0 20 -21 -13 -3 18 -35 -14 59 -31 55
4067E5n7pPj4K9o7j6J29o6K3lp0J24p4Lk4%Q3p6N9j1m6R0q8M6%q6N7k0l5P6j5
$$ 55 -2 -9 -2 -16 13 -54 -70 59 -7 16 13 -57 67 -7 -4 -28 -28 55 -21 38 27 -19 71 -17 29 29 -57 0 -20 -55 21 6
4099FM3l5p7N5k6N6k1q0Q2k9O8o5J6J8j6n6O1LM2n4m8J38j23Q4p9M0jo5J03p5
$$ 6 49 14 -63 -8 -34 22 1 -79 3 -26 42 -23 -7 11 -5 -61 0 3 45 -9 -57 81 -42 42 -37 3 2 -63 40 -35
4129c5L6N2r9L6k4m1Q8L7q0Q3j28J09o1J6K6k0L7l0M1r1N6J7nn0N7n5J02q5MQ4
$$ -35 1 53 -46 -10 -34 -75 13 50 -30 53 -75 34 -27 -11 15 -5 32 2 43 -48 8 25 20 -30 27 -28 74 -11 -7 77
4159G7j50R9J7q2N4j8L1j1k2J8L4m3J5j6J8lm6J03j07P7q1M6K1k8MQp6Q2qm1J6
$$ 77 -73 26 43 -39 15 -3 28 17 -5 13 47 4 19 3 21 18 -28 75 -32 45 -36 10 31 3 7 15 -61 21 13 -28 -12
4190a2k0N2k5OM2j51J66J9j26R0j15J37o1n9J06p4j3J12j09jP2J2J1q5M7j7QM6
$$ -12 -32 20 -5 1 43 -108 58 77 -49 41 -74 63 2 -57 49 -25 -38 74 -35 -36 36 48 59 -26 21 4 12 58
4218E8j02M4p0N6K7o4J23k5r0R4j59P9Q6r6JJ5L5O9n1Oq4R3k1j8L0r7O4N4j38
$$ 58 -44 0 -70 -14 13 -51 72 47 -43 51 -108 -29 57 -39 -38 -23 12 81 30 36 -48 45 24 6 36 -61 3 57 -81
4247h1O7j2l2J65j73L6O0m5N6j4m3j5J02l7p2j7R6k3O6j73N6J40j93K14k23k1
$$ -81 -14 -26 -58 107 -66 -30 30 -15 41 27 -16 -31 71 34 -38 -55 41 18 84 -89 -33 107 -86 128 -95 -116
4273a16K73j65j1L8p0J13J7n4q8P6K3m5M2j31KK02j72M8N0j27K86j86j00J87j12
$$ -116 157 -8 -19 19 -51 62 79 25 -63 13 36 -9 33 -98 -96 106 -66 -18 32 -95 191 5 -95 92 -20
4298b0J10kk14J73N3n2K2j30L1M4M2j51MJ52n0N0q9n9J49Rq6L1j26J27J13j72
$$ -20 90 88 -126 47 100 48 70 -60 -29 15 57 -94 -90 62 12 62 -27 -86 63 72 -14 17 -109 18 131 -41
4324d1Q0m2P4n1l8o7L0J53o2p3Kj8J57ok37J44N8m8O5j81N9J40p3k0l9j1R5K1
$$ -41 39 -3 71 20 -18 -85 -55 98 36 -37 -35 -53 104 98 -139 5 63 15 80 -101 -42 98 25 5 -34 -45 50 71
4352G1j30jO1M2k1L1j31Q8J9j39J42j08L8J58j61L9J2m0M9N4j98P6P6K2L0j11
$$ 71 -59 -60 1 43 22 53 -78 10 29 -110 32 -76 -38 120 -41 -2 10 -30 19 73 -125 -49 27 49 79 -32
4378c2M2J2N4j75J00j5K6O9r8p5J32Nl0k3j13K10J6q8o4M8L1KJ3j18K8J01Jm1
$$ -32 10 22 76 -99 1 -14 12 81 -17 -92 40 45 15 -8 -121 89 105 17 -47 1 32 34 47 -71 -43 58 59 18
4406A8m1NP2J0j04JK0K5P0j19m4Q2N1r0L6o1R7qn7K8p1J01K2k5p2L6PPk1m5J09
$$ 18 -23 -18 54 64 -40 -39 -19 6 76 -43 -87 -5 46 -44 -8 -69 28 20 -37 -9 -80 21 43 18 -54 -18 -11 -4 -25 -70 39
4437C9n0J32j36j0L9L9l2o8P5q5J36o5m3m6O3P6l1q8Q4L3o5P7j10L2O0q7R3j46
$$ 39 -11 121 -15 -25 14 53 21 -47 28 -57 79 14 -29 -75 -12 64 33 -55 29 62 -3 74 -36 -4 56 -31 62 -84
4465h4J00M1o7L9o1O4m0K1m9L4m1Q4o5M9LoL2r0N5J5l7R9j15j4P0K0Oq3q4J50
$$ -84 16 57 -10 29 -32 32 -8 13 -36 -2 -43 41 -24 25 28 22 54 -36 19 34 -3 96 -19 -33 37 57 63 -20 -104 46
4495D6j05J01p9n7J43j41J51q3m9J27om5k4k5J07l2mjr9J30r0LK1m0J33j36K5
$$ 46 -59 42 -37 -94 49 -92 59 -24 -73 54 48 3 -21 -46 61 29 25 24 -75 55 -35 -32 -11 -51 82 -54 -29
4522b9K8n9J56j19l8M8k8K2O0j19R2kJ8Rj01R7l8J7l5k5N2M%M2p4M0M1n4M1j16
$$ -29 -1 -60 96 -23 -61 -13 -41 -19 41 -78 14 12 30 39 -62 35 -3 14 -21 -46 6 10 10 52 -22 18 59 5 46 -70
4552g0Q7kp3R3o9N7L1q3L1n8R8Qn0J8m5K3O5j37J15l1k3P7j13J42q1NN5j16J9
$$ -70 17 15 -58 35 -34 23 54 -29 2 -56 42 50 0 18 -27 -4 61 -76 39 8 -15 62 -51 91 10 15 70 -46 -27
4581b7K9m0O6q5N2M8q4O8q2K6N0qO6j26R5o2l7M6qN0j3o0N8m8K9J9j08J07j9J5
$$ -27 2 -38 28 -57 -5 43 -41 27 -55 -29 21 13 79 -47 48 -14 -51 -5 -13 37 24 -36 22 -26 3 22 -86 21 2 17
4611A7O6j39O7M9n8O6p9%N1r0R3o7j2J33j84J18m6L4N4j48J82j07L8K4j11J34
$$ 17 83 -56 11 60 2 68 -11 -11 40 -50 43 -24 -36 97 -87 31 -15 19 73 -75 107 0 38 62 -49 85
4637H5j01n1J70j57N9M6j03J20j04L4M5j19J38p4kL6n1N8p2P0K6j23Q9k8k6Q5
$$ 85 -16 -67 103 -54 5 51 -52 68 -36 -2 43 -76 62 -12 -14 22 -29 29 -43 27 53 -70 19 -9 -35 50
4663E0j46J33oj57K38j58Q4po0O8k3N7k3p5Q1j09J4J21j23J43j13RK5j53J72m2
$$ 50 -96 37 31 -126 112 -46 38 31 -29 39 16 73 50 -25 56 -53 -39 82 -41 102 -11 -2 23 -130 42 0
4689@L5M8j64J19m1J2P6r9j1J31j86J17j20O9Q7j56J08j29J08J10j82J25n3m6
$$ 0 35 83 -81 38 -3 9 85 -14 -25 106 -80 37 -83 -14 73 -83 25 -104 4 114 -68 57 4 -42
4713d2K12j87J6M9q9J55j41k1N8p0J94k54N6N3LR9j91P7R0o4M8o1j32L11k10K9
$$ -42 170 -17 -1 48 -41 114 -27 -48 10 -60 134 -120 -64 -11 -8 91 -100 -23 67 3 51 -10 -142 169 -41 -12
4739a2K0j38K31j08K4k4l6J22l5q3o1P8J11m5r7J13j79K66r4j38J53j17J35k7
$$ -12 8 -130 101 -7 17 -7 -43 79 44 -39 -100 -22 89 44 -53 60 -119 147 53 -85 68 -49 86 59
4763E9r9K3N3N5r3o7Q1N0j1j1j89K78j87J26k0k20K89o1r4N1j01J13J49k45M0
$$ 59 -40 -17 36 91 -2 -69 12 62 51 40 -149 129 -58 68 48 -172 117 56 -38 13 -88 25 174 -71 -31
4788c1K1J3J83k35J1K6J00o3o7M5m2J14K8j94P0j0P8J04k45K1J91j72J43j77j
$$ -31 -10 3 186 -49 -38 -12 88 25 -42 3 -39 75 103 -91 -21 -31 47 151 -94 -73 118 -54 89 -88 -89
4813h9J61k0j1j43Q6M8Or2q0P9J57r4o2l7L0K15j46j05J4N5J50j26r1N4R4k2m6
$$ -89 72 52 41 -102 -16 32 38 -54 -134 -55 102 8 -54 -91 -61 154 8 -97 -83 -28 122 -4 -95 -41 53 31 -15
4840a5j22P1O7O7k3n7L4K0R3j88l8J31J3l4l8j9P0P1j03K2r4R9J02j70Rk0P6M8
$$ -15 -137 -66 1 68 45 -12 22 42 135 -53 -91 40 53 19 -19 -38 32 103 0 22 -72 27 129 -41 -32 -52 24 72
4868G2r2o7N1J32Kj22m6J01N1l1j34MJ65k7L9j44j6J00K1l6l2l1R3Oj06J0q0J80
$$ 72 -20 -87 -36 96 98 -24 -70 31 82 51 -83 -79 86 59 98 -46 -62 38 59 23 -9 -40 53 59 -47 -37 -117 63
4896F3n9N8r0l6J39m0j1o9L0J00pj32R3n5P1O2k74J93nj8O5j73P5L9N7n9l8j2
$$ 63 4 62 -28 -64 75 35 24 -45 -15 85 78 -54 39 -16 55 117 -157 36 31 13 78 -95 -20 19 76 17 -21 -33
4924c3Q6J4p5qM6J01j34J5j27K11l0q5J10j95J26O5j02J8m8N3J67j77q3J33j46
$$ -33 53 67 -8 -16 30 131 -3 12 -115 96 66 -19 91 -104 22 87 -15 3 -45 8 175 -2 -85 48 -98
4949i8K22j63l2O1K1N2q8m8N2N5Jm9l5R4r3J29j39oJ09j25J95j57l2J56j19P3
$$ -98 124 -39 -71 -10 11 63 -25 -73 -21 34 35 -14 -49 45 -48 81 -58 -64 45 -80 115 -42 -74 82 -37 36
4975C6r1J3J20l5j13J14q9J69j12m5R6j36J76j12k0OKJ14p7q9Q3j1J8K0j34J31
$$ 36 -55 -42 78 43 -70 44 -45 124 12 -33 63 -73 103 -9 -29 -23 -21 93 16 -73 10 -1 17 37 -97 34
5001C4n5O2K6j61K09j54R4Oj43J40o3K1J8j32Q3P6q2P1j22M6R4j30R4j32J32l4
$$ 34 -21 41 67 -94 115 -39 55 61 -82 58 -5 16 34 -98 -15 61 -21 50 -72 -26 68 -62 32 -100 32 -2
5027bj0K2j20J76m2q6M9J4N2rj03M7LK0R8j70J09n2J0M9j30R1Nj3N0o4J3L8j00
$$ -2 -12 10 -110 66 24 -62 -13 1 53 44 -59 -12 -9 11 109 -61 48 -4 6 55 -75 16 21 8 58 -6 7 45 -55
5056e5J15j70R8N2n8N3q7Q5l5m9J01l3NM5p1K5k6k7J13j60J29o3jJ14j53O1QJ4
$$ -55 60 -110 -12 40 -18 35 -52 33 -2 -51 50 17 22 67 -4 21 -5 -32 81 -79 50 -13 -14 100 -53 8 16 30
5084C0L5j18J11Qj37J40p7j1J5kP1m9n2J31j95J58o5k1J04j21P6o2K0N5j03L0
$$ 30 65 -53 58 66 -71 69 -8 -19 -4 -6 65 16 -36 95 -100 58 -7 -28 76 -45 31 -31 -11 44 -59 -29
5110b9P2r1J43j45K0K3n6J32j22Q6j3l7P6p4J3O7o9M0l4l7J01j34R0Lp8K04k47
$$ -29 43 -48 95 -50 -30 -7 -63 69 -53 33 20 -17 59 -15 -2 65 -4 36 2 -35 66 -68 22 25 -53 151 -96
5137i6J55q8nQ4j26R5k8r8J69j17K1J13j54J48r3k7J79k24J37n2p8K02j64J19
$$ -96 59 -29 -34 50 -76 19 -9 -107 62 -55 -34 79 -75 73 -20 -47 132 -92 45 -7 -85 117 -47 72
5161G2m6m3N5r9O4L4j03K10j58kQ8j37J80j65NJ83j82J12q5OR1j37M8Qq4J90k05
$$ 72 26 -17 38 -61 3 37 -66 144 -14 -16 72 -65 115 -50 -45 138 -44 68 -17 -11 80 -57 -9 -1 -85 105 -100
5188a00P3O7j79K38j44O1j5k9J67j95K1J33j38J01o8q5J78j76J53p0n7J72j90
$$ -100 -27 40 -139 99 -45 16 1 -28 139 -56 -35 98 -40 61 -7 -92 86 -90 63 -7 -64 108 -82
5211h2J07k0o0J58j61O2K1r5J43p9r4J59j80J99q7p8J95j92J50o4m0J09p7M1n
$$ -82 25 5 -55 103 -58 4 25 -70 73 -6 -100 59 -121 78 -9 -87 108 -84 66 2 -38 71 -6 35 30
5236C0p5P7RK8Pj76J67q9K1N1j38K05j13o1J06r6O1P1r7jK8L7J05j94O5j08J75
$$ 30 -45 32 41 69 76 -100 67 -22 -1 50 -88 117 4 -57 49 -47 14 85 -12 -13 15 52 157 -37 28 -80 95
5263I5j0j35Q2j00J65o0o3j6O5k4M7j60P7J04j20J11j70J18K8n0Q7j58N1N6j8
$$ 95 85 -50 32 -68 97 37 -26 -42 23 -1 46 -114 -37 67 -53 58 -112 6 34 -16 71 -87 -36 20 2
5288Bj6l9qJ60j05l4K8j1J42j25l8N4n6J44j93R0l2Q6Qlq4O2L3l0pj53K09k3j4
$$ 2 -14 -53 -61 99 -6 -40 -12 -23 119 -6 -44 10 -46 98 -95 -5 -37 49 57 54 -30 32 65 35 28 -125 84 61 47
5317D7j3j20J22M4r3Jp7J74pq8n2J6P5N3r4k3Q1O1p2p2j6M5M0K0j03rJ30n5J04
$$ 47 34 -86 36 80 -13 -12 -89 85 78 -10 -62 -46 29 82 -12 -35 46 107 35 -37 -53 -8 32 52 -51 -60 70 15 119
5346A19j58K4R9j23Q4j06j3J59l8n4k3o1K24o5j42P1p9J32J9j29L7l0J05l6o1
$$ 119 -39 -15 84 -39 45 -61 -74 85 47 -7 -30 -91 133 68 -74 -3 -82 50 69 -60 -23 -53 52 16 -45
5371d5J9OR1o7q3Q5J3K0j8j04J90j47Q9lj79J71l7M6j5j26R2J27j04j3j20J40
$$ -45 -26 -20 71 4 -79 6 19 39 21 -83 107 -40 49 46 -133 38 1 47 32 -94 -2 125 21 8 -112 28
5397B8N8j47J59j58J40Pr1k4p3J85j4r8k5L9N9M5r1o0O7J7K2q7L3J8MO5j52M1
$$ 28 86 -61 98 -60 80 87 -4 -28 -101 84 70 -28 -53 -14 45 90 -1 -61 6 23 45 -42 -9 9 13 78 -74 -33
5425c3J12p3M5q0k5J27q5K6l8m8J37j38J36j15K9Q6o6Pp2L6R1l1o5Qk0J50j29
$$ -33 79 6 51 -29 -54 73 -12 14 -24 -72 65 -73 63 -52 -23 63 -3 4 -68 -32 59 28 -37 -29 -49 101 -28
5452b8n9J64j01J11p1j08J36l7K6n1k5O5RN1k4j13J51j10O4l0j36J82o1j2Qm4
$$ -28 -87 77 -24 87 16 -92 44 7 33 -18 -43 22 31 82 58 -55 96 -14 50 20 -116 66 5 -7 1 -43
5478d3J06qj5k5m8O8l2JL0j02P8K5r9Q8r1J52j03M7J5q5Q0k7n8M4j3M9Oj22J27
$$ -43 63 55 40 15 -33 35 3 4 34 -68 10 35 -64 24 -67 85 -18 29 44 -41 39 12 -46 -2 -15 34 40 -82 45
5507D5m9K5kn9N8l5KL7q8R5k0J9l4k7K1K0k9J2jK9K1l1L4n7k5N2l7J6n3M8L5m9
$$ 45 -4 21 19 -40 18 -17 -15 22 -66 29 9 28 -6 -33 -12 8 -21 -9 -10 19 40 9 43 -14 -39 13 -24 -8 -61 -13 22 -27
5539b7N1m5M6Op3M9nJ2M4j36J17J0ml0k6J4pK1K2j02L3J21j75J31j16L2J09j44
$$ -27 24 -21 25 31 -42 7 2 14 58 -78 39 49 45 15 -11 3 -4 17 39 -63 -30 91 -84 47 -69 -37 72 -72
5567g2J49j30L9N9j22J12p2L7k8K0nJl1M9n4Q6J2j02J46k01J05k0J0P5j10P8l5
$$ -72 77 -53 -14 45 -77 35 -37 0 -28 -8 -13 -12 -43 6 -48 38 50 -52 94 -107 -2 -22 -12 63 -47 31 -4
5594dj8N1n3M7N1j20R0m3l1J21j22P8n5K9J03j81P4l7K4R0j25L0L5j12J41r4m
$$ -4 -22 29 -24 23 74 -46 44 1 -30 91 -31 47 -8 21 124 -57 17 -20 4 94 -31 -1 34 -78 63 -31 -35
5621c5J38j60J67j75R5K8q0N9m5lP0r6J4N3j09J58j15OJ51k34J94j08j3J13j52
$$ -35 103 -57 110 -65 30 58 -22 37 -8 -11 59 -37 -23 30 -79 79 -36 -30 121 -113 81 -27 -40 73 -79
5646g9J59j15k0J15r3P3J5j29J27r0M8K9j09J51j25R0M1j52J25r5L2M3q6P2M2
$$ -79 80 -35 -55 60 -33 40 55 -74 53 -37 11 40 -69 82 -43 47 88 -64 61 -34 -2 41 -45 27 69
5671F9j29J19j07Q3M4j35J89j59N1L7j06R3j21P6Rp0L5L0j4O2j01R0m7l7J63k06
$$ 69 -60 59 -48 35 79 -56 133 -26 25 62 -44 49 -72 4 13 -57 -22 8 -6 56 -45 45 -2 -39 124 -82
5697h2J93j01k2Q6q1O6kj31J01Mm2P1j68J81o2J8nj31J92p6KNl1L9J7p1M0k7j9
$$ -82 111 10 -12 74 -7 59 57 -74 27 31 -11 60 -108 73 11 29 24 -107 85 9 11 16 -15 24 41 -30 10 -17 -36
5726c6Q9j15O5k4K1R0j38R4n5j0L5m2L7L2MN7j45m7J29q6Q4q0J5M6l4O9r3P9p
$$ -36 53 -62 3 -21 0 90 -48 46 -9 -19 16 -26 11 43 47 104 -41 -88 41 -45 39 -41 -26 20 -14 55 -38 41 34
5755C4l3k6M6nL6m7m0P7n6J0K9o3jK0P5o5kL6o1J04m5j32J33j6PLr1J01K4k0m
$$ 34 1 -25 21 16 52 5 -35 42 -14 -4 25 -38 -39 -19 56 -9 -11 25 -36 68 23 -109 24 8 15 18 -73 28 52 32 28
5786B8n8Q9j5n3Ro3J12po0N5p5N4R4j51J01r4Q7Mq1M9JK8k8o9mR5%n2Jk4O1j8
$$ 28 -30 59 44 -9 0 -63 49 42 -18 37 -38 16 110 -41 60 -34 53 57 -24 25 26 54 26 -43 -47 48 48 -4 -3 -27 34 16
5818A6k2o3P0K1JL6j27K0J38j4p0j2k0J51r6n0K6p8K18j73K0K1k1N1K4j57R9Q
$$ 16 -6 -69 1 22 23 59 -68 -48 90 76 6 -6 -26 125 29 -21 5 -73 145 -28 -8 13 -8 43 67 -90 9 17
5846A7L6n8o8R9pM3n0r3J23mK1q9%J02o4m6N5l6Q5L8j28O6o6P1k0p5J07j63J52
$$ 17 53 -5 -73 26 19 62 12 -81 42 38 59 -30 -30 72 8 -38 17 -19 66 104 -24 42 -24 47 27 -48 59 -104 48
5875D8m7r2Q8m1J09jj22L7N6o7J31k09J44Lk4Pj25J33J1J5n5m9O7M8r2J09j39
$$ 48 1 -91 -3 -44 65 64 -58 -21 35 -32 99 -110 34 37 13 20 -105 28 39 54 -1 -50 17 65 -27 82 -57
5902e7P2R2j41P3j20J05O9r7J9l4M4J0n1O6p0K8K7k8L0l7l0J14j72P5M0p3J24
$$ -57 15 107 -34 39 -81 24 93 -4 15 -19 25 35 -16 50 -20 8 35 7 37 0 -30 84 -88 -13 27 -46 78
5929G8j14L6O4mk0p5rQ3m4K0kk6L4M2l3o1QJ07j31M8J9l3J06o6j07K7qR1k4j16
$$ 78 -36 0 64 60 40 -35 -44 39 -5 15 13 -13 21 63 30 -31 -23 84 -47 1 20 -13 93 27 -80 -53 -61 30 6 -110
5959a10J45q9J40j37QJ06q0N5m2J1J5Rl8K3o0N8JL3k9r4R7l5M4k2nK1j5M7l4p5
$$ -110 35 -54 86 -51 -43 63 -17 38 -4 7 22 31 -7 16 -44 14 15 48 19 -75 22 -13 31 9 4 25 10 57 23 -52
5989e2J10k0o8P4l3L6j7q7P9n7J09p6j5K2k8M0j4k4J9M2J6Oj00K3N8k3L9q4Q6
$$ -52 58 38 -30 44 11 47 30 -57 22 -35 74 -2 -17 5 -23 17 3 -21 -2 40 56 62 -38 -15 43 20 59 -25 61
6018F1q9K4Nm9J31j35K2O5oJ1j3p5O4o2Q1K1p6J05j14N7lk3L4j02J12k8j5K4k6
$$ 61 -28 -4 1 -48 83 -52 -30 35 29 40 27 -48 16 -46 35 56 -20 85 -29 28 25 2 36 -66 46 18 3 27 1
6047AjO4j02K3nqJ08j14R4k1p5Q3j07O9J3qO2n9K1M3r2L0k7lR0j33J66j23L1J9
$$ 1 0 64 -38 -15 -20 -28 80 -34 60 39 -36 47 -60 9 22 14 76 17 38 81 -11 19 -8 -11 79 -54 112 -11 20 39
6077C9j40J81j25O5L0lm7M7j07J07o5jP8j20J79j38K3L5q9M5m4J4M5l4K8K4o0
$$ 39 -101 80 -45 20 50 47 0 47 -60 47 -18 -19 59 -61 118 -20 3 38 -51 -6 -50 -36 9 -25 3 27 -33
6104c3J00j29P1Lo3J30j19R1m7m0O5m8K7K6l0M9n5lQ6j30K3M8p7J71j33P3l4p5
$$ -33 67 -62 9 12 -51 79 -40 51 4 -36 29 -19 8 34 4 53 -2 -5 81 -49 -26 22 -55 116 -17 56 22 -53
6132e3J02p4L9qJ2K8k7o3J15p7O0l1n2Q3j15Q1k7j7O5o2M5k2qO5q3k6J13j32J18
$$ -53 49 -25 14 6 18 46 19 -44 71 -6 54 23 -29 54 -61 20 -7 -24 41 -21 24 2 -6 59 -24 -50 63 -69 49
6161D9p2j5R0q9J03m0k5J4j0P7q3j5N5n8M1k2m8J21m1n3O3j81J98j02K9O4q8L4
$$ 49 -23 -38 52 -37 66 26 1 15 5 82 -1 -16 39 -19 22 0 -48 73 32 -21 42 -139 59 -43 -14 50 -38 -4
6189dNj9L0m0P3k2k4PK8n2P9j50J33j12Q8J7q0L1P1l9k4K4qM0o1N2p1K3K8o6Q9
$$ -4 1 -18 12 -28 45 23 -1 6 34 -18 61 -89 44 -68 20 37 -43 -12 59 20 -4 20 12 52 -9 43 -28 -5 23 -43 46
6220D6q6L6J04j22J1M9l4L6o8%O9m5P3m6o5N9k6P2r0J7j9L0M8m8k4M7k5M3Mj31
$$ 46 -40 -4 100 -22 -11 38 4 40 -28 -28 41 -4 69 23 -42 17 -9 63 -27 -10 -29 1 49 1 -23 24 -1 42 46 -85
6250h5J60r4J19n2j52J20J2k6kj5J3N3k6Mo2R6n6p4Q1RJ1j2o2J12j24Q8j9j4j3
$$ -85 75 -19 100 48 -104 16 28 2 0 -15 -2 51 25 29 -33 63 7 -67 14 23 34 22 -40 72 -52 36 17 3 -10
6279a0L3n4L1m4N1K3%M0n2JL2o3P2r9O8J7p5mNP3k0k1k3Qk3Q7j23R6mj1K3r2M8
$$ -10 23 -31 0 -44 7 30 30 70 18 19 51 -12 60 -39 29 46 -29 -33 -28 45 25 4 -19 -11 -34 53 -70 26 22 11 34 -58 -10
6312a0k2N7K5r8O3N8o7J1ko8J07q8Q9l9j8N5l3k2rj1M5j4p3K1K5J09o2l0m6j1
$$ -10 -32 25 50 -48 15 73 6 17 15 -53 54 -34 55 16 -2 53 20 -2 -11 -22 23 9 -64 -43 -18 91 29 -1 -47 -58
6342e8J52j12J9N0r3J25p8p1O9N1l2j1n6Q6Mk5J4l3M8p4P6n5n0N8J4K4Ro7M1N9
$$ -58 94 -18 1 51 -42 83 5 -66 3 54 22 11 -45 41 45 20 34 1 49 -25 51 -4 -54 4 18 42 51 -16 25 84
6372H4j01P3r7R0Nn8N0q5O4J6n8j4L6PN6j10oJ3L5N3p8N2nm0N0r5O9ON3o6m4O5
$$ 84 -17 56 -41 49 54 -4 46 -39 25 41 -17 -31 5 12 68 -42 -48 -35 0 53 -25 27 22 -18 32 -63 6 12 65 -1 -45 20
6404B0N7j7n5K8m0R4r3K9m7K4K0p0O6l9M9J8Mq5M5J0nQj4k9L1M4q4P3j4K1L1j28
$$ 20 77 60 5 33 -7 87 -6 23 -24 0 20 -50 16 -23 26 44 48 -37 8 18 13 21 7 -22 9 53 -31 42 28 49 80 -48
6436d8O3o7Q9k1mp7R4j7lRq0J13j10R3l1p5P6k9N0k0M4k3J3p2P0mj4om5J04j05
$$ -48 15 -52 37 16 12 -65 29 12 9 18 -62 51 -59 34 3 -72 4 -25 25 5 49 26 39 -33 37 33 19 13 -32 72 -33
6467c3R7q4M3Km2J01p5j1K2n4J1L5J2LJ7l7L5n6L2n3M4K7q3O8l8O0j6o9J07j4
$$ -33 64 -20 23 25 -17 84 9 -2 20 -34 -23 12 24 27 44 7 42 -14 18 -35 9 36 -47 21 -17 43 27 -42 65 51
6497E1r6O0m6K9Mp9J20j36J30p3N6Lm4M6o4K3P4m8M2j8n7Q9j2j0L0j28J30j08
$$ 51 -45 15 -31 -2 2 -77 43 -93 37 -36 20 23 -21 25 -39 -16 58 10 52 34 -23 66 54 44 74 -54 76 -32
6525c2K0N9j19P9o2N5L6p7O5J6l8M8j16O7K4j05J46j10O7ql1Q1n5k7M6o1P4qq4
$$ -32 -12 47 -72 7 -55 0 36 -41 24 40 2 50 -66 1 25 -80 66 -44 23 15 -16 65 10 -17 29 -32 42 34 -50
6554e0P7j7K9l3l6R3j18P1J8n4P0q2J2N6r3N7l0M0L2n4J4K5o5J05j14N7J4m9N1
$$ -50 27 10 39 6 -30 63 -55 16 34 -20 50 -32 -20 36 -57 0 -30 10 42 -12 2 27 -38 67 -47 10 24 -25 26
6583B6p9Q1j4JN4p6j4J05j10N1k9oO5j16J06k7JL9o1P7n6l1M8M8r8O8q3L8j1r
$$ 26 -53 28 14 15 69 -7 -21 84 -26 25 -4 -10 55 -61 45 18 19 58 -3 74 18 -13 35 83 -15 53 -30 8 -3 -12
6613a2O8r9J14n8KN0r4J7qk6Q7r0L9J20j32P5o4JN4r1J30j00K6N3n6K0j0k2P5
$$ -12 56 -43 71 13 15 65 -29 -12 -20 -46 41 -49 -10 110 -22 53 -11 -10 44 -47 83 -17 9 62 6 26 16 -6 69
6642F9q6j2Q7j21R7l8J6n5J1J01o9m4Q0m9M1k3ML7r3L4O1o2Q3q1L2K5j09J13j8
$$ 69 -17 -29 58 -63 34 -4 12 -43 -32 69 0 -44 36 -13 28 5 9 46 -47 -13 48 -14 69 -12 20 45 -64 49 31
6671C1l7J4k3L1mjL7o0L1L1l5L8r1J5Q7r8Q0q1J9Q9j14K9JNO9j06K2OJ2Q4j27
$$ 31 -6 8 -15 16 12 11 48 -12 19 50 15 53 -38 -23 64 -34 46 -35 -16 73 -41 -12 -11 -6 63 -43 -21 -15 -3 81 -46
6702d6P0m3l3J35j20O3m9M8K1m3kM6n0O7mp1M2k8N1o2k8P6n4N3p6J9N4p8L4Nl
$$ -46 24 -19 -52 83 -37 26 -23 25 46 3 1 47 -3 64 60 -11 31 3 54 -8 -36 40 -14 39 -37 -18 36 -42 -8 -3 -6
6733fJ2L7q9J12r8J06n4o9N0j7O2k1lJ3l1M5j13N4Q9r5L3K9j10Q9j1j3J9l2N4
$$ -6 6 43 -46 66 -32 74 20 -49 1 -16 46 25 22 35 4 49 -64 -10 79 -16 17 46 -64 25 14 1 20 -12 42
6762D2l2J3rJ5p8Q4k2j7K1K5K8q9O4q3J0N8l4K6l5J5K1l3jN9q8R5j6o5N3L5l7
$$ 42 10 23 14 29 -49 35 13 -4 17 42 70 -19 45 -38 -28 30 -4 22 -13 2 23 -10 -11 48 -40 55 39 -26 27 62 25
6793B5m7N0j6m5N2j16R0J07q6k5L6r1P7k0K9j1m8R7o7L1o4P6l8n5J42o0L1l2n
$$ 25 -22 28 12 -33 19 -97 -7 100 14 -11 25 -66 11 -9 20 9 -39 58 -9 22 -42 34 -4 -59 83 23 54 22 17
6822A7n0N7pJ5n1m2R0m4L3L6m0K4L5j11M5pM6Mj2n1L4J05j14mP0j05Q0m3n5P7
$$ 17 -33 24 17 32 -19 -61 29 -15 18 54 14 38 73 -38 7 0 46 50 38 -13 21 126 12 8 78 -27 53 10 -45 32
6852C2j07O7K4omL3m5N7j9m1jM9o4k3M7l8R7n1l5R1l7lJ0n1M1N8p5rJ8j6M8m1
$$ 32 -75 -8 16 10 6 39 -6 51 32 -9 -10 39 -25 -48 -1 -39 58 7 -28 63 26 23 33 -18 23 81 6 -3 15 -1 47 6
6884Fl0K3O8m4n6K5M0RKp2%K4L3j2m0L0J7l2L3m9O2m3P7q0J0K2jJ2l2k5L2M6l7
$$ 6 -24 -1 67 23 -33 -8 32 41 43 -29 -29 -5 28 16 -24 6 23 -9 24 -25 37 -6 71 -9 1 23 22 34 2 -23 9 55 18
6917A8J0m4j8O4p0P4m9qK2l1M6J4k3J6J9p2K5M3Pj6l0Ok4P3j18J15n5M8l7jL4
$$ 18 28 -16 -34 30 -40 34 -15 -23 -1 -32 14 28 5 21 40 -32 -7 36 43 27 -3 3 -21 52 -66 49 -6 42 5 4 38
6948C8j5Kq1P9qj5JR0j23J2R7j11Q3p4J4R1o6K9o6j4L2N8j9J0o9R7q3L2J4n0R9
$$ 38 23 25 -56 23 15 0 1 91 -32 -20 77 -34 49 -25 -11 80 14 43 -23 -37 -5 53 34 44 -25 72 -11 21 35 -15 84
6979H4j23J8P5r9M1PK1o7J09m7J6o9P5l9n2J00m5P4j14L5j2k9Q7m6n6R6m1L2K1
$$ 84 -39 -21 54 -45 -4 3 24 -43 66 19 35 -34 41 2 -50 50 5 79 -35 0 -12 -41 46 0 -56 40 -1 31 52
7008E2q4O0k8K8J7n7O8m4J1qnJ5Qo1Q9m1MnLL7q4NL5qO0q7NK5mL4m0RL6o7L0O3
$$ 52 -32 28 0 28 45 -12 56 12 23 15 10 25 33 -28 61 20 24 19 22 59 -25 -20 15 7 67 -20 -15 10 6 40 0 9 45 -22 8 71
7044G1q7L7p2J09pk5O5j69P0M8k3N6n8k2K2j2N1rn6R3j21Q1q9Q1O5j65J09o0j5
$$ 71 -16 21 -51 58 51 26 91 -78 -8 40 17 73 15 -7 15 3 54 45 -11 82 -39 42 -47 34 99 -66 43 -17 -32
7073c2R4j11L5N1o5N7j4qL6o6Q7j18M0O2r9N3L5m3J9KK1j0m2J7o6R3j1r4J54j14
$$ -32 62 -49 -14 37 -28 29 15 7 43 -23 64 -54 -14 48 -51 2 37 -6 13 15 36 26 -16 1 -65 28 17 -77 77 -37
7103c7O5j9%L3o9QO0k0Nrm9O6j8j4QJ0J9r3M8mLK3q3K3N4j0J0K1l5M1o3l7J16
$$ -37 28 9 9 42 -27 -19 41 21 26 17 -32 34 16 2 10 20 39 -54 -6 -10 -7 16 -67 -44 10 0 10 31 -4 37 -26 -63 53
7136E3r6P2m1N8m8j3M0m3N0l1L1j7M1j5K5j11Q3l3j7O2j22J29n8j2M0o4L8jl0
$$ 53 -43 29 -12 46 -2 -15 25 -18 32 1 32 15 56 41 66 -45 38 5 -12 50 -72 57 -1 -13 27 -37 1 0 -30
7165c0NK3l7P5l5j3J8j6Q0j33P7k7L9L1j13Q9m3pO6k5j6R4j10J8o5J20oq1J00
$$ -30 -25 -2 -39 36 1 -12 6 -10 70 -63 14 -13 26 57 -56 33 -10 -17 49 24 8 102 -8 10 -55 65 59 -22 78
7194G8j06L0M9o7K0L9p2R7m6j2k3L0L4o1K6k2j2J01q4jK4p5J41m8l7N7r6N8M1
$$ 78 -28 2 51 -16 4 43 -29 68 22 10 -13 17 51 -10 16 -6 -18 83 -1 -2 22 -53 88 40 3 60 -36 22 63
7223F3l1J7l6j8N2p4M4lK8k5Kj0M6q4M7k8O6k1m9L9o6Q8Oj08Q6k2LP3j10K1kl9
$$ 63 32 49 13 -5 47 -27 17 14 42 17 19 9 55 -29 18 -10 56 35 -14 25 -41 47 53 -55 31 9 12 85 -25 -4 -6 -45
7255d5K1J3N5L1q4N0p1J10q5M6j0k3OJ3m7J5O2r0J12q8M9J9r1O7j7L0o4M1J1k6
$$ -45 -24 -11 44 75 -9 41 -30 80 -5 41 31 8 14 27 -20 -5 57 -33 79 -9 40 59 -32 35 18 48 -16 25 36 10
7285A0M7j3k0ml0QM9p0P2p6J1J30r8jK6k5J5l8N1l9j6J1K8m2K3oL2j7Mj8o7J42
$$ 10 57 44 24 20 -10 -2 47 -23 49 -27 -16 114 16 15 41 16 31 -7 44 5 -11 0 28 -14 9 3 35 18 22 4 -63 79
7317G9p1K5Nm0K8o6K9K6qk1K5l0J2lL7j7LK1j1N9k4n5M3l5l2JlM3N0q0J3j4Q2
$$ 79 8 33 38 -2 26 -40 -11 15 7 -14 11 -19 -7 -10 27 10 13 34 23 82 58 3 46 11 -21 -20 -23 20 70 -10 3 -11 71
7350G1p9M8Ln3P1k3k1nk6Q0l6k2J5j7QK2m3OK2Ll3l7Q2J2J8n4rK5n6M4L7oo5L8
$$ 71 -8 40 43 -10 61 38 17 12 -14 66 30 8 23 6 14 36 -7 -1 21 24 -9 -46 36 48 66 12 3 28 -28 16 53 47 -18 20
7384B0m7N1l9L3L0p7L9J3J2j4m1N8l3PL4j2o3N1OK6k4JJr5J33m4Mn6N0Ql8k3J2
$$ 20 -27 24 -15 18 48 -29 10 23 35 21 -20 38 5 12 46 34 -29 22 28 54 30 31 32 -63 70 26 30 -26 24 32 -6 -29 -17
7417a7K5j4M0m2Q0p4J8K7n9J03j11R1q8L5J8o5j3R0m9N7l5J0j5p3J02n1k5R8p0
$$ -17 8 -6 34 -8 72 -2 16 43 -16 87 -24 67 -21 14 32 -33 -46 44 -5 52 17 27 12 -61 41 -10 -35 63 -7
7446gM2n2pK0O8j3kn9K0M9m1rm8Q0o8J0L9o4J19n8k6N1ll2lK1k9qk3N7r4M4MM9
$$ -7 35 -17 -24 -4 64 51 49 -10 10 59 18 9 -39 41 -27 -17 22 -42 77 19 -7 44 41 9 6 27 -2 -10 -33 24 -70 -26 -22 27
7480B7j1l9O5l7M6j4q7J46p3o6P7o2N4K9j6K0r3N0l0L2j5K9J7j0k2j3mK3Lk8L8
$$ 27 16 -23 42 5 51 37 -50 96 23 -43 34 -28 26 55 39 59 -34 16 -14 18 3 32 49 39 17 4 0 23 26 -2 36
7511C6m7L3K0q2Q1j0l9Kj5N9J6m0K6m9K4jlM7j01N9K2q8J07n1MM1n7J4Pl9L8l2
$$ 36 -11 22 42 -40 41 31 -8 -6 -21 38 54 14 40 -9 15 14 11 58 -43 16 38 -50 57 6 10 51 -6 8 15 -24 14 -18
7543a8M1Kl5N2J9l7K7p9M3ok5M3p2J05o4LL6nlJ2Qj7p9O6K2n4R4j18L3j2J7P0
$$ -18 23 25 -10 42 61 24 51 -28 15 9 -16 27 -45 60 -4 -1 35 30 27 39 47 30 -49 17 39 -15 79 -39 -6 -18 -1 69
7575F9j30N1M5k5j5K9m7K2J8p8J21o0N9m7j8qKM7l5J0L4j5J4Kl7O2j22J48l9r5
$$ 69 -61 -10 35 10 -5 24 -23 -1 17 -61 60 0 59 12 -6 -14 -12 35 0 10 44 29 43 45 8 70 -52 96 57 -38
7605c8N8k5L8k7L4po7O6j6j6J3NkK5m0N2l1n5Q1o0K5l3N3J3k1K1l8qO1o9K4J8
$$ -38 20 -5 33 6 40 33 -34 32 16 0 13 18 16 41 1 53 22 -33 48 -12 13 -20 33 46 25 46 8 0 61 -8 16 34
7637C4n9M3m6P8l4j3P4q6J2M9l4Ol4M6l3l6M3L2m8O1m6M3Mo2L3j9M4nn4J2LL0
$$ 34 -25 18 -28 50 16 3 77 -9 3 52 18 24 -10 36 3 -33 10 42 -6 55 9 52 56 -6 27 8 52 47 -7 5 8 38
7669C8K9r3J6O1m5J7k6J9l6oJ04r1O2k7n2O8o5O0O2q9%Ok8J05l9nq0NN8j3Rj02
$$ 38 67 -26 -10 51 6 23 -3 16 -20 -26 78 -13 49 22 -30 38 -27 33 95 6 6 12 -16 89 50 45 -35 -30 28 15 24 -78
7701g8N3N6k5n1M7mN1o0k9Q9o9L6M3n6J9m1Q8o1KJ8l9K7K4n6J2M2o0M8n9N6Qn3
$$ -78 -25 31 6 -45 2 -2 49 -11 -40 49 -20 16 59 3 22 -19 69 8 10 28 -11 16 40 -16 -4 38 -22 26 -33 23 31 -22
7733b2O5o6R5q5K4jQL8m3k5OK5k2J6m8J32j17K6Oj6K4j4rJ8n0N4M9o6K6l6P4l8
$$ -22 43 -23 72 -13 11 10 18 56 13 -12 -6 19 -3 13 -35 97 -20 6 12 -4 20 6 -3 15 -35 19 68 2 28 -8 66 28
7765B8n2R2p4M4j3j2L4p7N7J6l8J4L1l9P5j30J2N8mL3q6L%j1N2m0K5pON3j08O3
$$ 28 -24 68 -6 38 25 13 47 -30 27 43 5 19 50 11 86 -44 -32 26 22 55 -31 -28 -28 -39 13 -27 -2 -9 -3 50 -58 5
7797Ek7j1L9k5k3R5jn3n2N1N1n4J8k5L7K1p1j3M6J9Rj9k4Ql4P7m2oK7K3m8k1J9
$$ 5 -22 -33 6 -19 -42 53 52 -1 -53 -2 49 -5 13 -12 25 46 -25 -38 8 27 36 17 -7 1 -33 44 2 -4 23 46 -2 -23 -4
7830dL0J8O3n6r5P0l9P1q3J2O8m1L6m2%jJPom4J6L7n6M4k6K2j2j0R6m2L5l7k2
$$ -4 26 44 107 51 -44 26 -13 58 -25 -13 55 14 50 8 8 7 8 15 9 -35 -19 18 -38 6 -20 2 -10 -20 76 34 69 32 10
7863A0J4Ml1O2m7K7o4OJ2kPJ9j6K5j8L3j3l3pj7M2l8N6n8M0J4J7j2J5k3j0J4j8
$$ 10 24 28 -3 59 12 39 -25 -19 -7 -9 -2 17 1 26 8 41 28 -5 -12 -29 13 -25 31 -27 13 27 44 32 47 24 14 28 10
7896A0K1j2m0N9j9Pj2j8K0L0j5N3q4O3o4J0%j1M3o8L3m1M9mj1KL1J8n4j4rJ22
$$ 10 31 19 -21 38 19 26 14 -4 16 46 31 84 0 63 -1 9 9 -2 41 -27 6 -35 14 10 -1 1 32 50 -4 -18 -27 95
7928I5j03K7k7j9J0K7j2J6N1j8n3k8O1Lj1j0k2O1q3M7Jj01J68j03L2jKJ0k2ML1
$$ 95 -8 19 -8 -27 -17 10 -2 14 65 47 -6 -34 27 30 19 9 -13 48 -35 12 13 -88 80 -23 9 8 10 20 -2 2 33
7959C3k2NJ6m9N0p9O5l3K9rk1Q7r0R8o6l3O3j2m1N8n5j5K9k7N5l7j5NJ6j9oL4
$$ 33 11 16 32 -17 33 -46 19 -14 15 6 -15 72 -18 80 14 -19 44 32 -9 49 -6 -21 8 -19 36 -1 -16 -11 5 -14 -20 14
7991A4nj6j2K8K1m9n9N3L5n6O1m1K6J2l3L4n4N3j7j6K2k1oN6m1j1K3j1km7L2P2
$$ 14 9 -7 -19 9 30 -19 -78 -25 10 -46 15 -26 0 12 -21 13 -41 12 -5 -21 1 -20 -26 30 -11 -22 1 -10 -12 -59 -27 45
8023D5n4L7n8L5L5r0P5j3qJ0nK6K8p9O7l8K4m7J9M0p4K6M0q2O6j7rN0n6M4J4o5
$$ 45 -9 28 -30 5 40 -50 25 12 4 14 9 35 63 -16 51 13 37 -10 9 49 -25 1 41 -41 25 8 -1 49 -7 37 51 -14
8055a4R5q8J3ooL6l4M3k4Oj6L2n0L0k8PJ6%Q0p2J0n4j6R2rj6k1KkpK7Mn1l2N7
$$ -14 81 -7 6 0 -6 30 -4 39 15 21 5 37 -13 17 -11 -4 12 12 92 20 30 -24 -40 52 43 27 6 8 6 -1 26 30 -21 -53 4
8090Dj00J00m1J51j05npJ0J7oj0L4l7jrl4Q9q0N9j2J6km2LM2m5O9n1m4M0m2K0
$$ 4 -96 4 -37 114 9 4 -3 7 24 18 8 42 5 4 -5 -39 50 -30 29 17 33 31 -11 -8 34 -11 58 7 -37 3 -39 -19
8122a9M8o5J07n4O2k9j18J28r1P5k9OnK8oj6n4M0k2NM2q4P0J2J2Jr1N8k4kJ6M
$$ -19 29 -36 71 17 79 50 -68 60 -31 44 15 21 16 44 38 22 -32 8 -14 -9 33 -51 19 31 43 44 -47 11 -13 -15 1 5
8154EJ3N2q9J4K7rJ0l3K2lj0N9o2L1rrL4p4R3o9J7LKJ3K5p8K9j9pL9L4%o5l0Q3
$$ 5 18 70 -19 -5 22 13 23 -10 12 9 -1 58 -4 27 18 9 43 -31 62 -7 10 13 15 28 53 -25 4 -15 -22 17 51 51 -14 -44 39
8189C9P2m5
$$ 39 111 66
8191F6
$$ Imaginary data points
##PAGE= N=2
##DATA TABLE= (X++(I..I)), XYDATA
0@%%%%%%%%%qJ6j6J6k4L8m6N6p2Q8j05J29j59J89k22K59l01L53m13M79n52O32
$$ 0 0 0 0 0 0 0 0 0 0 -8 8 -8 8 -16 22 -24 32 -40 48 -57 72 -87 102 -120 139 -162 191 -222 257 -295 337
31C37p21Q20r31J055j192J341j505J687j887K104k338K595k879L189l526L895
$$ 337 -384 436 -495 560 -632 709 -796 891 -996 1108 -1230 1365 -1514 1675 -1851 2044
47B044m297M736n217N744o325O970p684Q477r366J0366j1505J2814j4333J6125
$$ 2044 -2253 2483 -2734 3010 -3315 3655 -4029 4448 -4918 5448 -6057 6757 -7576 8549
61H549j8276K0911k4225K8543l4432M2999n6787Q3783k19521L83510j31150k61165
$$ 8549 -9727 11184 -13041 15502 -18930 24069 -32718 51065 -168456 215054 83904 -177261
73a77261M30564n63120L47238K10647m10464J81020n7616j5698K22539j87328
$$ -177261 253303 -309817 37421 248068 -162396 18624 -38992 -54690 167849 -19479
83a9479o6890K0148J78627q3661n9461M9485j84448L17559m4723k94248K81869
$$ -19479 -86369 -66221 112406 28745 -30716 18769 -165679 151880 107157 -187091 94778
94I4778j92601J34159J54368m00432K24938K2198o3191J80062l15659J39775R0318
$$ 94778 -97823 36336 190704 -209728 15210 37408 -25783 154279 -161380 -21605 68713
105F8713q7304J38767k84309J54989J12779j68443J88447k62531P4433K50708
$$ 68713 -18591 120176 -164133 -9144 103635 -64808 123639 -138892 -64459 186249
115A86249k79447J38111p4394r2301L02826k00658m4984P3435n5392J33523p0695
$$ 186249 -93198 44913 -29481 -121782 181044 -19614 -64598 8837 -46555 86968 16273
126A6273n8907j9630R5593N6428j62514R9559p8926K0950K07035k98324R1453
$$ 16273 -42634 -62264 33329 89757 -72757 26802 -52124 -31174 175861 -122463 -31010
137c1010J08990j93612K76073j95089j12593K89404k02929R7052R172j90977K21574
$$ -31010 77980 -115632 160441 -34648 -147241 142163 -60766 36286 45458 -145519 76055
148G6055l8156o2566L6407p8930J00491L204l5025l0818k2722J25062q1072Q702
$$ 76055 37899 -24667 11740 -67190 33301 36505 1480 -29338 -52060 73002 -8070 632
160F32k4q3471J79307r2503n4174Q7524j05677J26460j5828j18330J02985n1173
$$ 632 608 -82863 96444 3941 -50233 37291 -68386 58074 42246 -76084 26901 -24272
172b4272N3082J1963j09727Q9082l1726L9754K073j03870J06761l7797J4760K8480
$$ -24272 28810 40773 -68954 20128 -11598 28156 30229 -73641 33120 -4677 10083 38563
184C8563j15613J03592j418m6989O1687r5086N5845M7883p6795M6172m7904K7091
$$ 38563 -77050 26542 25124 -21865 39822 -55264 581 48464 -28331 17841 -30063 -2972
196b972M1302n4792K1170l2913L9098J8703n2481L1362l1619K8287L4383p6044
$$ -2972 38330 -16462 4708 -28205 10893 29596 -22885 8477 -23142 5145 39528 -36516
208c6516M2652q345j0759N8322p9908K7724K3269l3602M8287n0086L557L2807
$$ -36516 6136 -2209 -12968 45354 -34554 -6830 16439 -17163 31124 -18962 -15405 17402
220A7402k4201K1713k6484k738L1316k2471J5929k0302m937L7206l2145J7286
$$ 17402 -6799 14914 -11570 -14308 17008 -5463 10466 -9836 -14773 22433 -9712 7574
232G574j4222p660L7747l2708R779j34j2966K9560j8488o928J4266j4767J9528
$$ 7574 -6648 -14308 23439 -9269 510 376 -12590 16970 -1518 -8446 5820 -8947 10581
245A0581q322j2483J7159j4306J6869q316r740J3809q523R781o424o061R294k920
$$ 10581 2259 -10224 6935 -7371 9498 1182 -8558 5251 -3272 6509 85 -5976 3318 398
259C98J807J8r520J2141l174l836O809j1534J1417l798k123L936o483O232j209
$$ 398 2205 2223 -7297 4844 1670 -2166 4643 -6891 4526 728 -1395 2541 -3942 2290 1081
274A081j953P88J21j697M703m408L50J170r02L061n161M146k880K393p86j223
$$ 1081 -872 -84 37 -1660 3043 -1365 -1015 155 -747 2314 -2847 1299 -1581 812 26 -1197
290a197J359r67J952l317L439k600J941j620R14Q54k273K261j615J550j941K671
$$ -1197 162 -805 1147 -2170 1269 -1331 610 -1010 -96 758 -1515 746 -869 681 -1260 1411
306A411l498L289j046j968L896m146L737k992J539N70j414L05J267j566O71J422
$$ 1411 -2087 1202 156 -1812 2084 -2062 1675 -1317 222 792 -622 -317 950 -616 55 1477
322A477m400O422n589L007j62k817N650o262L734L07l131L170o16k851N522n821
$$ 1477 -2923 3499 -2090 917 755 -2062 3588 -2674 1060 1367 -1764 1406 790 -2061 3461 -2360
338b360L015K030o968R967j0016N880J635q411J0315p500K183L719p988P452k212
$$ -2360 655 2685 -4283 5684 -4332 1548 3183 -5228 5087 -2413 -230 3489 -4499 2953 741
353G41m782J0412j2680Q658J207j1504J6739j5669Q283K835j2293J5852j3244
$$ 741 -4041 6371 -6309 2349 3556 -7948 8791 -6878 1405 4240 -8053 7799 -5445
366e445M311Q076j6155J4651o266n750J7991k2198J4011l11j2283K2926k5424
$$ -5445 -1134 6942 -9213 5438 -828 -6578 11413 -10785 3226 2915 -9368 13558 -11866
379a1866J3865L924j6504K3078k1338O775J1837k0977K1585j5429j996K2713l0134
$$ -11866 1999 5923 -10581 12497 -8841 -2066 9771 -11206 10379 -5050 -7046 15667 -14467
392a4467K4349j1220j1225L3358l5589K0831l402j7137L5711l2784J1123Q490
$$ -14467 9882 -1338 -12563 20795 -14794 6037 2635 -14502 21209 -11575 -452 8038
404H038k4558L7546k8574j436K4591l4959L9711k4200j2653L8404m1554L5555
$$ 8038 -16520 21026 -7548 -8984 15607 -19352 20359 -3841 -16494 21910 -19644 15911
416A5911j3250k6012M6372l4345J6177M139l3419M3073k1385J693R524l2410M5145
$$ 15911 2661 -23351 23021 -11324 4853 8992 -24427 18646 -2739 -1046 8478 -23932 21213
429B1213k5192K113J1714l9488N9331l4415o797L2377n7352O4355j7005m4707
$$ 21213 -3979 -1866 9848 -29640 29691 -4724 -11521 20856 -36496 27859 10854 -33853
441c3853O4724n8197L4888K4499p7146O6508k6840j571L9004o7986M2966j826
$$ -33853 30871 -27326 7562 32061 -45085 21423 -5417 -6988 32016 -35970 6996 5170
453E170q385K2835m9245L6581k131n775K0550n7474N1514j129k7791M5024p1915
$$ 5170 -3215 19620 -29625 6956 4825 -950 19600 -37874 13640 12511 -15280 29744 -42171
466d2171N0409K2094n9365N6130n8336K9371M2513p2339M8561l5752J0466N7137
$$ -42171 8238 30332 -29033 27097 -31239 -1868 40645 -31694 16867 -18885 -8419 48718
478D8718q5927M6202j2767j6410P9110r9289L3347K6960m9986Q2999p7392o800
$$ 48718 -37209 8993 -3774 -20184 58926 -40363 -7016 19944 -30042 52957 -24435 -31235
490c1235O6192n2097M1795l1404k6909N7753k0253R363l3608O402L5572l0030
$$ -31235 34957 -17140 24655 -6749 -33658 24095 3842 13205 -20403 -14001 21571 -8459
502h459M0378o9691J8806P2834r0429O6836m3198m0375J33599j07037J0272M6591
$$ -8459 31919 -37772 -18966 53868 -36561 30275 -12923 -53298 80301 -26736 -16464 30127
514C0127r2345J21145m4797o9124Q7464n9862N2082L35p1689N4699r564K5341
$$ 30127 -62218 58927 14130 -54994 32470 -27392 24690 25025 -46664 8035 -1529 23812
526B3812j9816l7581M2553j5420L9262l4437m6714P8808l8490K6051m424p7094
$$ 23812 3996 -33585 8968 -6452 32810 -1627 -48341 30467 -8023 18028 13604 -63490
538f3490R9422k6439j3981K1519p3058Q5513q183l5775K7137o1749P9817k419
$$ -63490 35932 9493 -4488 17031 -56027 29486 21303 -14472 12665 -49084 30733 28314
550B8314n9907N2328o5477O7318K5035j01638P3544l9030J9721N8166j09340M5041
$$ 28314 -31593 20735 -44742 22576 47611 -54027 19517 -19513 208 58374 -50966 -5925
562e925J8538j7415M2593o7447R122L6056k193L785n1631L2969Q194M698J6840
$$ -5925 12613 -4802 37791 -29656 -20534 15522 13329 17114 -34517 -1548 6646 11344 28184
575B8184q5237O6241J6987m3056N4714q8091L7874O9709q6903M4240l1661j4018
$$ 28184 -57053 9188 26175 -16881 37833 -50258 -12384 57325 -29578 14662 -16999 -31017
587c1017R1398p4885q66J4312j8128O2389m9567j2952J3308J654M3419n5245l77
$$ -31017 60381 -14504 -15370 -1058 -19186 43203 -6364 -19316 -6008 -4354 39065 -16180 -16557
600a6557J7249q121M9457o0962q723M6993l0050M3487m2947k8250O5971k9386
$$ -16557 692 -7429 42028 -18934 -27657 19336 -10714 32773 -10174 -38424 27547 -1839
612a839J8505k3477k7798O0128j9830K078j7190k0346N9040k3686o983k747k6680
$$ -1839 16666 -6811 -34609 25519 5689 7767 -9423 -29769 29271 5585 -1398 -4145 -30825
625c0825O4237k5057k3318J7966k9263N5356j5620l7787K7752j7647L4995n547
$$ -30825 33412 8355 -14963 3003 -26260 29096 13476 -24311 3441 -14206 20789 15242
637A5242m2224K8342n219J9307j921m2543L2752k004R118J395m2484L5546K825
$$ 15242 -26982 1360 -3859 15448 13527 -29016 3736 1732 10850 12245 -30239 5307 8132
650H132k781L203l5078L0755R510j3297M176k6981K6466J3551k2965Q293k1984
$$ 8132 5351 8554 -26524 4231 13741 444 4620 -22361 4105 17656 -5309 2984 -19000
663a9000K3600J5239l0305J1562j4668J7111J6688l2424Q223j206P189J5557k8932
$$ -19000 4600 19839 -10466 1096 -13572 3539 20227 -12197 -3974 -5180 2009 17566 -11366
676a1366M059P735J206J3663k8296O146J1504m671J3084k5328M189J6894q607
$$ -11366 -7307 428 1634 15297 -12999 -6853 4651 -20 13064 -12264 -8075 8819 212
689B12O701j4364k292K0116p639k420m866k759J6348n910l660o383M045J2791
$$ 212 6913 -7451 -9743 10373 2734 314 -4552 -7311 9037 3127 -533 -6916 -2871 9920
703I920j1229K312o924K209J6032j4531j969M937n679J4212p131j1939J3297m628
$$ 9920 -1309 1003 -5921 -3712 12320 -2211 -4180 757 -4922 9290 2159 -9780 3517 -1111
717a111N073q14j0819P675L355m13m613q34J520K970K564p557j150P564l100R28
$$ -1111 3962 3148 -7671 4 3359 2946 -1667 -2501 -981 1989 4553 -3004 -4154 3410 310 1238
733A238k4q153J0978j432n119M113n294M468L044n349r82L409j245J774o20m082
$$ 1238 1214 -6939 4039 2607 -2512 1601 -3693 775 3819 -1530 -2512 897 -348 1426 806 -3276
749c276L075K583k670j180K416l723N176j033n036N212k348J021J127k883L20
$$ -3276 -201 2382 -288 -1468 948 -2775 2401 1368 -3668 1544 -804 217 1344 -1539 -1219
764a219K892k176K66O61k003K383j93r68q64K777k765J537J263m310M784k152
$$ -1219 1673 -503 -237 424 -1579 804 611 -357 -1221 1556 -1209 328 1591 -2719 2065 -87
780h7q39K228k023M31J605k221J289L03j763K450k375K032j458O51M45k109L821
$$ -87 -926 1302 -721 -290 1315 -906 383 686 -1077 1373 -1002 1030 -428 223 668 -1441 2380
797B380l829J662J183l299L341q77k631M406l505P70K726n520N795l648N03K671
$$ 2380 -1449 213 1396 -1903 1438 561 -2070 2336 -1169 -399 2327 -3193 2602 -1046 -543 2128
813B128n118N158k938K24K148m025L848j194k219N042o255M038J367o689R064
$$ 2128 -2990 2168 -770 -546 1602 -2423 1425 231 -1988 3054 -3201 837 2204 -4485 4579
828D579p737K872L602q051Q464n400P0N261p534N709j213l889P538p770M499O00
$$ 4579 -3158 -286 3316 -4735 3729 -1671 -1601 3660 -3874 1835 622 -3267 4271 -3499 1000 1600
844A600n764R485r765N730Q50p273J1097r780L545M305r883J0981o407k227J0328
$$ 1600 -4164 5321 -4444 1286 2136 -5137 5960 -3820 -275 4030 -5853 5128 -1279 -3506 6822
859F822j3685J0775k256q218J5076j4730Q149J664j0698J4579j1444L603N210
$$ 6822 -6863 3912 1656 -6562 8514 -6216 1933 3597 -7101 7478 -3966 -363 4847
872D847j1763J2838p482j439R425j3811J2882n982m190J2664j6487J4232n279
$$ 4847 -6916 5922 -1560 -2999 6426 -7385 5497 -485 -4675 7989 -8498 5734 455
885D55p142J6099j7542J1465L72j3231J9359j5340M321R227k0142K1257j0931
$$ 455 -6687 9412 -8130 3335 3707 -9524 9835 -5505 -1184 8043 -12099 9158 -1773
898a773l908J6146k2173J8101m570r528J6959j7767J1864O75j2268J6055j4047
$$ -1773 -5681 10465 -11708 6393 1823 -7705 9254 -8513 3351 4026 -8242 7813 -6234
911f234P782M053j5488J8576j4935P078P008k1147K4061j5839K493J4588k7767
$$ -6234 1548 5601 -9887 8689 -6246 832 7840 -13307 10754 -5085 -2592 11996 -15771
924a5771K4340p092j0405K3528k8169J5743P248k2501K5813k1055N236J5648k4056
$$ -15771 8569 1477 -8928 14600 -13569 2174 9422 -13079 12734 -8321 -3085 12563 -11493
937a1493J9277j2325J351J4016j9732J4198r255J694J3945k2725J6519p329l898
$$ -11493 7784 -4541 -3190 10826 -8906 5292 -3963 -2269 11676 -11049 5470 -1859 -5757
950e757K2114l0726J7832N94j4873K9539l1754J0295J3574k3467K7613k2124k317
$$ -5757 16357 -14369 3463 4057 -10816 18723 -13031 -2736 10838 -12629 14984 -7140 -9457
963i457K4550k5806J9588j0737j1428L0207k5226J2036k486j5328L0609k1657
$$ -9457 15093 -10713 8875 -1862 -13290 16917 -8309 3727 1241 -14087 16522 -5135
975e135M118L422j4379K6477j6944k011P526j3292K4574j6814m549J2617j7044
$$ -5135 -1017 2405 -11974 14503 -2441 -4452 3074 -10218 14356 -2458 -7007 5610 -11434
988a1434K8065j9865q377K3181k4810K8294j3513k1104L5479k3987J3460L624
$$ -11434 16631 -3234 -11611 11570 -13240 15054 1541 -19563 15916 -8071 5389 9013
1000I013l2287L6513j1317n661J3947k9688K7703o59j2916J0450j9316K2068j048
$$ 9013 -23274 13239 1922 -3739 10208 -19480 8223 7564 -5352 5098 -14218 7850 6802
1013F802j1569P648j6395K3577k110j7985J5758j8343K0741M781k9505K2906j3591
$$ 6802 -4767 2881 -13514 10063 7953 -10032 5726 -12617 8124 12905 -16600 6306 -7285
1026g285J1260J1490l3900K1743l868J888J2765l1687J8083M502o119J4129l0811
$$ -7285 3975 15465 -18435 3308 -560 1328 14093 -17594 489 4991 -1128 13001 -17810
1039a7810J6767J1984j6234J7173k7847J1984K0254k3060J2978j6774M868K3005
$$ -17810 -1043 10941 -5293 11880 -15967 -3983 16271 -6789 6189 -10585 -5717 17288
1051A7288k2130M359o124K304K0674k1255J808k016K445J9936k5487M351J890
$$ 17288 -4842 -483 -6607 -4303 16371 -4884 -3076 -5092 -2647 17289 -8198 -3847 -1957
1064a957j356K1389k7375J560J1684p380J8407k1768n431K0838j0396J2123j5547
$$ -1957 -3313 18076 -9299 -7739 3945 -3435 14972 -6796 -12227 8611 -1785 10338 -5209
1077e209q600K5388j1932O754j0878r269K7125j2020j33l747j0425K6186q643
$$ -5209 -13809 11579 -353 6401 -4477 -13746 13379 1359 1226 -2521 -12946 13240 4597
1090D597r806M507r148K0987m645j4618O413l899J6386o767j2074O060j680J5322
$$ 4597 -5209 -702 -9850 11137 6492 -8126 -1713 -5612 10774 4007 -8067 -2007 -3687 11635
1104A1635r552j2471J1367l325J1834n833j8194J8304k602L472N18k0472J8572
$$ 11635 2083 -10388 979 -2346 9488 3655 -14539 3765 1163 4635 5153 -15319 3253
1117C253K457m542J694j5117J4318O127q711N58r426J1312P754j2678J759n763
$$ 3253 5710 1168 2862 -12255 2063 8190 -521 37 -9389 1923 9677 -3001 -1242 -7005
1131g005R032Q070j4757J833j468P115N601j2997K11K263O313J919j1570J736
$$ -7005 2027 10097 -4660 -2827 -4295 2820 8421 -4576 -4365 -2102 4211 6130 -5440 -3704
1145c704K963M589K764j5001N983M846j569O253j5589M626J0148o339L340q098
$$ -3704 -741 3848 6612 -8389 -2406 2440 871 7124 -8465 -3839 6309 -30 3310 -4788
1159d788o15J2557n128l472j198q98R203l001m886j749L370O360n833j003k819
$$ -4788 -5403 7154 2026 -1446 -2644 -3542 5661 2660 -2226 -3975 -605 5755 -78 -1081 -3900
1174c900L495P333q247j781K360j3O345n492n647O617l27K529l164m925N277J615
$$ -3900 -405 6928 -1319 -3100 -740 -753 5592 100 -5547 1070 743 3272 108 -4817 460 2075
1190B075O32m686r72L703P49J092m869j267O226j377j048n45l981P012l92m072
$$ 2075 2707 -1979 -2951 752 1501 2593 -2276 -3543 2683 1306 258 -287 -4268 2744 2352 -1720
1206a720J462k130L986P31l447r08J722J901p34j447j139J071L091j883k802K727
$$ -1720 -258 -2388 1598 2329 -1118 -2026 -304 1597 863 -584 -1723 -652 2439 556 -2246 481
1222D81j602K862j81m787L927m00J94M39k699J159K014r20q15l81L88J072j52
$$ 481 -1121 1741 1560 -3227 700 300 494 933 -1766 -607 1407 487 -328 -709 -321 751 599
1239E99o14j781L129j143n76J742l717L567j17k352K199j577L03K012k601P37
$$ 599 -15 -1796 1333 190 -386 1356 -2361 1206 1089 -1263 936 -641 -338 1674 -927 -190
1255a90O99j116J708j740Q06m05M23N71k066K610k144P27J447l011K507k68k137
$$ -190 509 -607 1101 -639 167 -238 185 756 -1310 1300 -844 -117 1330 -1681 826 558 -1579
1272a579L214k338LK425l849L361j336p48K189k866K374r79k53J006j839J997
$$ -1579 1635 -703 -700 1725 -2124 1237 -99 -847 1342 -1524 850 -129 -382 624 -1215 782
1288G82p21r40K129k897K250M70l291M287l743J696J756m339M363k709L91K457
$$ 782 61 -879 1250 -1647 603 1073 -2218 2069 -1674 22 1778 -2561 1802 -907 -516 1941
1304A941m132L176p83j486L525m202K310P67l088M753m886K238J515m029M957
$$ 1941 -2191 985 202 -1284 2241 -1961 349 1116 -1972 2781 -2105 133 1648 -2381 2576
1319B576m069J057K486m056L699k162p55L713m624L575j337k027N193n998M073
$$ 2576 -1493 -436 2050 -2006 1693 -469 -1224 2489 -2135 1440 103 -1924 3269 -2729 1344
1334A344p27l251O324o216K965J270m945O493m327m37M554o470N559j858k872
$$ 1344 617 -2634 3690 -2526 439 1709 -3236 3257 -1070 -1507 3047 -3423 2136 278 -2594
1349b594N995o374M490q88l272N648n477L483l0l699N638m994K333J839n932P235
$$ -2594 3401 -2973 1517 629 -2643 3005 -2472 1011 981 -2718 2920 -2074 259 2098 -3834 3401
1365C401m983L67M913q524Q120l684k129O880q597O038m81m819P497o765K700
$$ 3401 -1582 -1215 3698 -4826 3294 -390 -2519 4361 -4236 1802 1321 -3498 3999 -2766 -66
1380f6K845o632P198m994P40M156p183O982m365K21M503p351O695l328j353O006
$$ -66 2779 -3853 3345 -1649 -909 3247 -3936 3046 -1319 -1098 3405 -3946 2749 -579 -1932 4074
1396D074q080N914p67m810Q767q910M209K828q239R961p469J195N695r140Q115
$$ 4074 -4006 1908 1141 -3669 5098 -3812 397 3225 -5014 4947 -2522 -1327 4368 -4772 3343
1411C343l838k168P214q299N242m78m343P771p579L756Q31m823P807p718L729
$$ 3343 -495 -2663 4551 -3748 1494 1016 -3327 4444 -3135 621 1452 -3371 4436 -3282 447
1426D47J446n591Q206p379K095M135p807Q575n731j270Q208j0252P757k401n160
$$ 447 1893 -3698 4508 -2871 -776 3359 -4448 4127 -1604 -2874 5334 -4918 2839 438 -4722
1441d722J0767r838M389J441o952R897o713K51M257o811P645m034k090N488o450
$$ -4722 6045 -3793 596 2037 -4915 4982 -1731 -1480 2777 -4034 3611 -423 -2513 2975 -3475
1456c475O889l752k599O408p052P018l475l920Q224p326N179o48o887J0181o312
$$ -3475 3414 -338 -2937 3471 -3581 3437 -38 -3958 4266 -3060 2119 1471 -5416 4765 -1547
1471a547J369L288r187J0477m269k066N327q744Q802k085m239N769p120O758l
$$ -1547 -178 3110 -6077 4400 131 -1935 3392 -5352 3450 1365 -2874 2895 -4225 2533 2530
1486B530o476O607n710M571K049q626P559m270K446L334r514P368k086J50L735
$$ 2530 -3946 2661 -3049 1522 3571 -5055 2504 -1766 680 4014 -5500 1868 -218 -68 3667
1501C667q845O070O02k332M115q161N262K502m677M848p726M790L859o504M914
$$ 3667 -5178 892 1494 -838 3277 -4884 378 2880 -1797 3051 -4675 115 3974 -2530 2384
1516B384o301L590N217p921M162l493J272O839r016K964k00j188P713r435J792
$$ 2384 -3917 -327 4890 -3031 1131 -2362 -1090 5749 -3267 -303 -503 -1691 6022 -3413 -1621
1531a621K588k566O836q100J32M854k846M340n726j407O422k831K171m239j373
$$ -1621 967 -1599 5237 -2863 -2731 2123 -723 3617 -2109 -3516 2906 75 2246 -1993 -3366
1546c366O903l431J597m088n40P311m669J247l006j060Q385n512q14P09l184Q914
$$ -3366 3537 106 1703 -2385 -2925 4386 -283 964 -2042 -3102 5283 -229 -1043 -334 -3518 5396
1562E396m719m131M428l669P042k861o075N440j435L425j521n787M627J023Q33
$$ 5396 677 -3454 974 -2695 4347 1486 -4589 851 -584 2841 1320 -4467 160 1183 2016
1577B016j565m528M519J161K26k147m069O168l58k03j633m135P103n58k335N1
$$ 2016 451 -4077 442 1603 1829 -318 -4387 1781 1423 1220 -413 -4548 2555 1997 -338 -287
1593b87l631O186R66n365J837k349M283K116o730K140m32K834J672o207J491J493
$$ -287 -3918 2268 3234 -2131 -294 -2643 1640 3756 -2974 -834 -1266 1568 3240 -2967 -1476 17
1609A7J635O70n077J020K772M89J87m718J626L173n35p6m451K549K870j192m06
$$ 17 1652 2322 -2755 -1735 1037 1526 1713 -3005 -1379 1794 1259 1183 -3268 -719 2151 959 553
1626E53l581K634L218k417o12k090J800L941l768n52n66J004L885m096q93P46
$$ 553 -3028 -394 2824 407 -205 -2295 -495 3446 -322 -874 -1440 -436 3449 -647 -1540 -794
1642g94R59K640l343j501J739J114J168k694j437K420N95Q63k907q71K934j52
$$ -794 165 2805 -538 -2039 -300 814 1982 -712 -2149 271 866 1729 -1178 -2049 885 733
1658G33O28k739n25L193m37k70j810m66L147m25j346n70m86K955o04j710n1k24
$$ 733 1361 -1378 -1903 1290 853 583 -1227 -1693 1454 1029 -317 -887 -1373 1582 978 -732 -783 -1007
1676a007K747j187j408J49K02K091j170j624P53M10J270p92k026J635J26P24n36
$$ -1007 1740 553 -855 -706 -504 1587 417 -1207 -454 -44 1226 434 -1592 43 169 893 357
1693C57j962J826J28L99p90j204J521K91j38n06j001J464L31q01J89j182J622
$$ 357 -1605 221 349 748 -42 -1246 275 566 428 -78 -1079 385 716 -85 104 -1078 544
1710E44K29j164O20j156J472J44j225N61m93Q00K87j140M55o7K59O29j579R92
$$ 544 773 -391 229 -927 545 689 -536 25 -468 332 619 -521 -66 -133 126 755 -824 168
1728A68k75Q1P54j660J183k91r9P45j347Q25K39o81Q61r75K89P81j318J313j011
$$ 168 -107 -26 728 -932 251 -40 -139 606 -741 84 323 -358 503 -472 -183 598 -720 593 -418
1747d18K29Q00j401J367q49P9P41j201J010l02m80J019j162P66K18j230J532j233
$$ -418 -189 611 -790 577 -272 -193 548 -653 357 55 -425 594 -568 198 416 -814 718 -515
1765e15O15M89j441J537j098N41L47j288J245n08q5Q54j551J175rq13J435j858
$$ -515 100 589 -852 685 -413 128 475 -813 432 -76 -161 693 -858 317 308 -505 930 -928
1783i28J189K52j253J642j717R50O23j497J304j010J75J279j802J117l81m64J747
$$ -928 261 513 -740 902 -815 135 758 -739 565 -445 -270 1009 -793 324 -57 -521 1226
1800A226k110J071l3p09J746k109R86K18q82J594j622L18R25j372J661j343k34
$$ 1226 -884 187 154 -555 1191 -918 68 286 -596 998 -624 -306 619 -753 908 -435 -669
1817f69J679j995J832j202m50J986k098J433n03r76K172j782N85N02j639K221
$$ -669 1010 -985 847 -355 -805 1181 -917 516 13 -963 1209 -573 12 514 -1125 1096
1833A096j363j30J250k095K355j309m27J540k015J969q06q23J692j775J334n2
$$ 1096 -267 -397 853 -1242 1113 -196 -623 917 -1098 871 65 -758 934 -841 493 441
1849D41j493K120j709P51O61k054K413j669M80R43k187K210j120j12J283k146
$$ 441 -1052 1068 -641 110 771 -1283 1130 -539 -59 884 -1303 907 -213 -325 958 -1188
1865a188J861m07j053K018k329J390L86j847K497k279R64Q99k165K303j603J58
$$ -1188 673 266 -787 1231 -1098 292 678 -1169 1328 -951 13 912 -1253 1050 -553 -395
1881c95J508k241J724o24p75K023k255J378j04j222K199k156J166J46j339K137
$$ -395 1113 -1128 596 -28 -803 1220 -1035 343 239 -983 1216 -940 226 372 -967 1170
1897A170j970P43O39j571K088j581j0J513k286K277j152p80K337k698J942m32
$$ 1170 -800 -57 582 -989 1099 -482 -492 1021 -1265 1012 -140 -920 1417 -1281 661 229
1913B29j346K424k119J004L36j682K225j357o4J177j923K072j116l86J443k013
$$ 229 -1117 1307 -812 192 528 -1154 1071 -286 -350 827 -1096 976 -140 -526 917 -1096
1929a096J982r45o10J651j915J545m15j211K173j873Q86M84j970K464j581K05
$$ -1096 886 -59 -669 982 -933 612 197 -1014 1159 -714 172 656 -1314 1150 -431 -226
1945b26J187k380K382j016n11J423j879J640k78j079J530j553J054K58j510J828
$$ -226 961 -1419 963 -53 -564 859 -1020 620 342 -737 793 -760 294 552 -958 870
1961H70j505Q74L84j802K081j473P10O02k018K006q50k04J253k135J633O6j265
$$ 870 -635 239 623 -1179 902 -571 139 741 -1277 729 -121 -325 928 -1207 426 492 -773
1978g73J788k077J193O51j632J558j435P91P43j507R95o72L50Q47j482Q54m00
$$ -773 1015 -1062 131 782 -850 708 -727 64 807 -700 295 -377 -27 820 -662 192 -208
1995b08J04J154k048J231j97k56J372k322J254L09q23J428j898M74J346j440J244
$$ -208 -104 1050 -998 233 36 -220 1152 -1170 84 393 -430 998 -900 -426 920 -520 724
2012G24j269j48J968j753P85o01l89J924j494J87j90j28J318j058k27J60p6J283
$$ 724 -545 -693 1275 -478 307 -294 -683 1241 -253 -66 -256 -384 934 -124 -351 -191 -267 1016
2030A016j307j86M81l28J561j694j69J017q04J505j489n59J590p52P34o84j137
$$ 1016 -291 -477 4 -324 1237 -457 -626 391 -413 1092 -397 -956 634 -118 616 -68 -1205
2047a205K049o29j16r3j198J983m11m96r7o37J623l18p58Kk40J308k86j076M20
$$ -1205 844 215 99 6 -1192 791 380 -116 -213 -850 773 455 -303 -301 -541 767 481 -595 -175
2066a75k26J237l69j343Q91k91J079l69j489J063kO56l58j373J036M08L8j45j388
$$ -175 -401 836 467 -876 15 -276 803 434 -1055 8 6 662 304 -1069 -33 375 413 268 -1120
2085a120J242N72n85J32j287J253N71q36K4q06J005P11j008k02j66P63O68j287
$$ -1120 122 694 109 241 -1046 207 778 -58 -34 -840 165 876 -132 -334 -500 263 931 -356
2103c56p3Q1O90N59j416K16R2N96L56j404K90M14K85K55j227J24Q75o2J35j077
$$ -356 -429 -348 342 901 -515 -299 -207 389 745 -659 -369 45 330 585 -642 -518 357 295 430 -647
2123f47J87J042m05O5r87L88R94m99j56o00L91R39n43m57r4J58J004p16m91K20
$$ -647 -460 582 177 242 -745 -357 637 138 -18 -618 -227 712 169 -288 -382 -224 780 64 -427 -207
2143b07J11Q85r20k84L12J96N40p60l41M35K67K43o23m64Q63j48K54n51m11R76
$$ -207 -96 789 -131 -415 -103 93 633 -127 -468 -33 234 477 -146 -610 253 105 359 -192 -603 373
2163C73k55R7m76j73P92p1k21l20j69P96r4m24L3k77Q03k31m25K15k84P38k82
$$ 373 118 215 -261 -434 358 287 66 -254 -423 373 279 -145 -112 -389 414 183 -242 -27 -311 427 145
2184A45m32K70j61N63j97n36L20L1J44P3o45M98j1J1O6o10O62j61J14r0m22N71
$$ 145 -287 -17 -178 385 188 -348 -28 3 147 220 -425 73 62 73 139 -471 191 30 144 54 -368 203
2206B03r9j86J97l77M20L2m14M37n11L46K16n88N26l49K57P1m13L66j95R3J63
$$ 203 104 -82 115 -262 158 190 -224 213 -298 48 264 -324 202 -147 110 181 -232 134 -61 32 195
2227A95l94K50K3k24M20n33M28j21k75M85m61L12L1l33M20l18N0J73l08L12r4
$$ 195 -199 51 74 -150 270 -263 165 44 -231 254 -207 105 136 -197 223 -95 -45 128 -180 132 38
2248C8j60L64n60N10j16k22L37m83N60k14j63K67l77L81L2m91M11k43P8L35o77
$$ 38 -122 242 -318 192 76 -146 191 -292 268 54 -109 158 -219 162 194 -297 114 -129 -51 284 -393
2269c93N98l09N9L70p71N48l0o7K73o08L29J77l04L53n03J89L95m70L84m54J63
$$ -393 205 -104 -45 325 -446 102 72 5 278 -330 -1 176 -128 225 -278 -89 306 -164 220 -234 -71
2290g1M39n47L41m22K67L12n39L06j94k2N84p12J79J78l26P42q34K40K89m46O64
$$ -71 368 -179 162 -260 7 319 -220 86 -108 -130 454 -258 -79 99 -227 515 -319 -79 210 -236 428
2311D28o34L4L42l11L57k56k05N17l74K54k05k09O72n95L34j93l08P34n32J36
$$ 428 -206 -172 170 -141 216 -40 -245 272 -102 152 -53 -262 410 -185 149 -44 -352 382 -150 -14
2331a4P0m13P21l66j07K43m62O54k85l53N26n84P00k88l84N86m93M65q8m57N72
$$ -14 56 -357 364 -2 -109 134 -328 326 41 -312 214 -370 330 42 -342 244 -249 216 128 -329 243
2352B43l62J41J91o25O30k91K4L02o87O75k39r8L69p32O17o1k89M33n68L70K01
$$ 243 -119 22 213 -412 218 -73 -49 253 -434 241 2 -96 273 -459 158 97 -192 241 -327 43 244
2373B44n57N17l91K06L04o56N78m03J35K89n40N05l24J7L91n90M02k2l45O82o96
$$ 244 -313 204 -187 19 323 -333 245 -158 -23 266 -274 231 -93 -76 315 -275 127 105 -240 442 -254
2394b54K25K66n66P58p22K57K92n14N25l76l5L96m37L12j27k49N59n63L61m3m00
$$ -254 -29 237 -329 429 -293 -36 256 -258 267 -109 -144 252 -185 127 0 -249 310 -253 108 65 -335
2415c35P04n77L04j5l89O26m06m9K61m07N03k52j34M36n75N26j79k95M95n16M94
$$ -335 369 -208 96 81 -308 318 -88 -137 124 -283 220 -32 -166 270 -305 221 42 -253 242 -274 220
2436B20j81k80N03m42K92L5m48O07m16R6K87o58O75l19l8K78o05O27k49j65M50
$$ 220 39 -241 262 -180 112 147 -301 306 -110 -14 273 -385 290 -29 -67 211 -394 233 -16 -181 269
2457B69n34L89L3m10M77l54J23K28n08N01l08J48J58n09M77k96J21K10n39M77
$$ 269 -265 124 157 -253 224 -130 -7 221 -287 214 -94 54 212 -297 180 -116 5 215 -324 153
2477A53j23j11L44o20M36R4m55N67o04K98K84n38M61l41J63K37m96L55j54j5L96
$$ 153 30 -81 263 -357 79 173 -282 285 -319 -21 263 -275 186 -155 8 245 -251 104 -50 -65 331
2498C31n80K18J12j46L78o13K87R1j51L13m94K24J63k29K54l54J03L32l71K45
$$ 331 -249 -31 81 -65 313 -300 -13 78 -73 240 -254 -30 133 -96 158 -196 -93 239 -132 113
2518A13k57K8N38n98K85k31l5N75n95J82K0j69M64l61k29L24j49M16l91k42M70
$$ 113 -144 -116 422 -176 109 -122 -157 418 -177 5 25 -144 320 -41 -270 54 -95 321 -70 -312 158
2539A58j87L60m78o9L81j92K65l65j09M66k06Q2j96k21O31j80j94L6k85O00k50
$$ 158 -29 331 -147 -216 165 -27 238 -127 -236 230 24 106 -90 -311 320 140 -54 -18 -303 297 47
2560D7j47L5j12M50k25j67J9k8M25k73l80M37j65L01n4o40N63p5J40l6n05M02
$$ 47 -100 -65 -177 273 48 -119 -100 -128 297 24 -356 81 -84 217 163 -477 86 11 151 115 -390 12
2582A2J64p2j58k06L19J31j21j08l32N35J7k02P5m23N81ol95J89k13L93J38m60
$$ 12 176 104 -54 -260 59 190 69 -39 -371 164 181 -21 54 -369 212 206 -189 0 -213 180 318 -142
2604a42qJ08K25J05n01O1J44J38J54o52L40QJ90L6n81K85K55r0N4l70Q4M11k25
$$ -142 -150 -42 183 288 -213 -152 -8 130 284 -368 -28 -20 170 206 -375 -90 165 75 129 -241 -157 254 29
2627B9rk81J73L62k15l5k95K78K33k89K0j84K24L11m02k0L2LL87l96j15J84N1
$$ 29 20 -261 -88 274 59 24 -271 7 240 -49 -29 -213 11 322 -80 -100 -68 -65 322 -74 -189 -5 46
2650D6J55k99j08J72J44L5l29P1J62j0J22l21l2M05k20N7j61j32N23k50l7p3n9
$$ 46 201 -98 -206 -34 110 145 -184 -113 49 39 161 -160 -192 213 -7 50 -111 -243 280 30 -7 -80 -139
2673a39K62J6j92j2N1J44p3j37M1p4L36k53j24J93j22L00k14j69K16m2N6Mj68
$$ -139 123 139 -53 -65 -14 130 57 -80 -39 -113 223 -30 -154 39 -83 217 3 -166 50 8 64 68 -100
2696a00J80j9l5jj46K60j36L9k3j83K85j22k7J33k45K11nk19K66j70K5J59l04
$$ -100 80 61 26 25 -121 139 3 42 19 -164 121 -1 -28 105 -140 71 66 -153 113 -57 -32 127 -177
2719a77L10j78jJ21k00J69j18R0l4j7Q5j13rJ28j37J94j17j36K39j71K14q2k01
$$ -177 133 -45 -46 75 -125 44 -74 16 -18 -35 50 -63 -72 56 -81 113 -4 -140 99 -72 142 60 -141
2742a41K96k22R5l0k01L24q9j12J31k01J98R4k31K09k76L29r5j98J61j18J99m8
$$ -141 155 -67 28 -2 -203 121 32 -80 51 -150 48 142 -89 120 -156 173 78 -120 41 -77 122 74
2764G4j65R4m5P1L1k43K00NO1K7l69K46L0O4J6l56L26J1o8K8k32J59K33k30P1
$$ 74 -91 3 -42 29 60 -183 17 22 83 110 -259 -13 17 81 97 -259 67 78 10 38 -194 -35 198 -32 39
2789C9j90J08L15m10R1nP4J95k94L7n1J47J10k89P4QL2K26m24J23J30j98M05m39
$$ 39 -151 -43 272 -138 -47 -52 22 217 -77 -40 -91 56 166 -123 -49 -41 -9 217 -207 -84 46 -152 253 -186
2813a86N3L11k64K18j73j83L60j09Nk9j61L04j21j8p3o2L71l00Q3j4j24L55k32
$$ -186 -133 178 -86 132 -41 -224 136 27 32 3 -158 146 25 7 -66 -128 243 -57 26 12 -112 243 11
2836A1p2N2j07L10r6l20K87j48K45l4m01M00k01J73m2k80K66k2MQ1l43K74P3j77
$$ 11 -61 -9 -116 194 98 -222 65 -83 162 128 -273 127 -74 99 57 -223 43 21 25 106 -237 37 110 -67
2860f7J63k37J10J00p4P5k83L19q6k7M2j90K37k1j80J95k34J80K09m44L07k18
$$ -67 96 -141 -31 69 -5 70 -213 106 20 -7 35 -155 82 61 -119 76 -158 22 231 -213 94 -124
2882a24M3L53m92K81n3j31K83k77J16km1J43j69QJ54j63J82k17P2J34k03K36k36
$$ -124 -81 272 -220 61 8 -123 160 -117 -1 -3 -44 99 -70 -62 92 -71 111 -106 -34 100 -103 133 -103
2905a03O3K19k75K42j68p0K54k20J08m0j38L23l18J56Rk71M52k90O3P8k33K98
$$ -103 -40 179 -96 146 -22 -92 162 -58 50 10 -128 195 -123 33 42 -229 223 -67 -4 74 -159 139
2927A39j09j61K57k43J24Q7k74K84j68P5N9k44K27j68K07o6j29J96j78Q0R6k55
$$ 139 30 -131 126 -117 7 94 -180 104 -64 11 70 -174 53 -115 92 26 -103 93 -85 -5 91 -164
2949a64K13j0r9J96l55L19m1j26J96k51J68K6k49K61j63N9J33k67K52j60J6K49
$$ -164 49 39 -60 136 -219 100 59 -67 129 -122 46 72 -177 84 -79 -20 113 -154 98 -62 -46 203
2971B03l73J98k5q0K06k81J75QpK4j46J10M3k2P7k29J24J58k89L11k99P8J97k80
$$ 203 -170 28 3 -77 129 -152 23 31 24 48 -98 12 55 33 110 -119 5 163 -126 185 -114 -36 161 -119
2995a19K22j33n3K51k53M0J42j21J15j11q2J23m9J50j89N1Jr1K80l22J29Q5j31
$$ -119 103 -30 -83 168 -85 -45 97 -24 91 -20 -102 21 -28 122 -67 -16 -15 -106 174 -148 -19 66 -65
3018f5J67j20j23L09k41P1M8j56K79k37NK2j0K08k58J25n6o8K68k14j02J93r6
$$ -65 102 -18 -141 168 -73 -2 46 -110 169 -68 -63 -41 -51 157 -101 24 -32 -100 168 -46 -148 45 -51
3041e1J85n8k86L48j78P9o7j12J86nM7j72j3J65k9L3j33j32L79j48j53J79k77
$$ -51 134 76 -210 138 -40 39 -28 -140 46 41 88 -84 -97 68 39 72 -61 -193 186 38 -115 64 -213
3064b13L76n3j86J25j10R3O8k27KK29m5L0k19J11K8J15j43j63K29m3Q7k5k77K26
$$ -213 163 110 -76 49 -61 32 100 -127 -125 104 59 89 -130 -19 9 124 -19 -182 47 4 91 66 -211 15
3088A5O4p7N5j19k1K54k16j7o9J57R0j20n4j66L30L0j86Q9j35J23J29l15R0P7
$$ 15 79 2 57 -62 -83 171 -45 -62 -131 26 116 -4 -58 -224 106 136 -50 39 -96 27 156 -159 -69 8
3112Hr2K58k74n7K55j19J07j42m5Q5J69j37r3J4j8J97o1j69O5J30j03R8j65m1
$$ 8 -84 174 -100 -157 98 -21 86 -56 -101 -16 153 16 -77 -63 -81 116 55 -114 -49 81 -22 76 -89 -130
3136a30L24j98o6Q9l6J08J4k20J06O0nl9m9L1qJ89k64PJ21j09K42j69j53K06n1
$$ -130 194 -4 -70 19 -17 91 105 -115 -9 51 46 7 -42 -11 -19 170 -94 -87 34 -75 167 -2 -155 51 0
3161@qL7j50J44P8k40J72r1N6j7R0j14k5J74j74R4p3j1J54r1p7J05l0k0J32k23
$$ 0 -8 29 -121 23 101 -139 33 -58 -2 -19 71 -43 -68 106 -68 26 -47 -58 96 5 -72 33 3 -17 115 -108
3187a08J49j6n1J51j65M9K0%k7rJ0K8m3K7p8L6J17j47P5q2J03K1j56J09n5J0N9
$$ -108 41 25 -26 125 -40 9 29 29 2 -7 3 31 -12 15 -63 -27 90 -57 18 -64 39 60 -96 13 -42 -32 27
3214B7JlL9o3k0N9j9k7p1P8m7J15m5j55J70j20J56rj97J61l8k1J11j36m2J92j20
$$ 27 28 25 64 1 -19 40 21 -6 -77 1 -46 69 24 -131 39 -81 75 66 -131 30 -8 -29 82 -54 -96 96 -24
3241b4M0o1RR5o8Nj00K05j03L2k8j86J84R2j80J11m1KK23l19J08j6kJ34j95k3
$$ -24 16 -45 -36 59 -9 -4 -104 101 -2 30 2 -184 0 92 -88 23 -18 -16 207 -112 -4 -20 -22 112 -83 -106
3267a06J09M8k8j8j37R4J09K7j82PJ64j10J34j97K0J89j27N5o1m1J15%j01l1m2
$$ -106 3 51 23 5 -132 -38 71 98 -84 -77 87 -23 111 -86 -66 123 -4 51 -10 -51 64 64 -37 -68 -110
3292a10K53n9j03k9n0K49j81k0P0r5K50j45j31J04J1P2n5j64J60J9M4j19j27J98
$$ -110 143 84 -19 -48 -98 151 -30 -50 20 -75 175 30 -101 3 14 86 31 -133 27 46 90 -29 -156 42
3316D2rQ6j29j35J96j3ml5j58J70Q5j25O4j93J96J20k35J10k04K06L2r7mKJ27
$$ 42 33 119 -10 -145 51 38 34 -1 -159 11 96 -29 35 -158 38 158 -77 33 -171 35 67 -30 -34 -32 95
3341I5j4j89N3J2P3R7k51J46k2M6M0j88P6M5M4Lj85J16L2J3Q9k52J03J70k01J16
$$ 95 81 -108 -55 -43 30 127 -124 22 0 46 86 -102 -26 19 63 66 -119 -3 29 42 131 -121 -18 152 -49 67
3367F7j41KK37k00J12j07oJ11n9o4%O5Q6r9k5j2l1J90j56m3J18n8J43j64l8J17
$$ 67 -74 -72 165 -35 77 -30 -36 75 16 -48 -48 17 103 4 -21 -33 -64 126 -30 -73 45 -13 130 -34 -72 45
3393D5q8J41j31K2K6oM8m7p4K30j68M6k5j68K54j45O6K8j83J53K6j17Q9q6O2R8
$$ 45 -43 98 -33 -11 15 9 57 10 -64 166 -2 44 19 -149 105 -40 26 54 -129 24 50 -67 22 -64 -2 96
3419I6k07J08n6R1j5m6J5p2K25r0r3R5j16J32k1j15P2poK06k99R5N4o6Q8j11M8
$$ 96 -111 -3 -59 32 17 -29 -14 -86 139 49 -44 51 -65 67 46 -69 3 -4 -10 196 -103 -8 46 -20 68 -43 5
3446EK7J1p1Pk7R3l1Mn4qQ7j17J13p8M7N1n8M9r4MQ1p1L1lqQ8j09L4m8k6J78j46
$$ 5 32 43 -28 -21 -48 45 14 18 -36 -44 43 -74 39 -39 8 59 1 50 -44 -40 41 -30 1 -2 -10 78 -31 3 -45 -71 107 -39
3478c9j0L8k7J01r1k2K4O1l4R1j13LKl6N8p8J45j16P7m2l6J11q9K0J1p6J21r7
$$ -39 -49 -11 -38 63 -28 -50 -26 35 1 92 -21 -18 -16 -52 6 -72 73 -43 34 -8 -44 67 -22 -2 9 -67 54 -43
3506d3k4M8l1Q8N6j33P4o3L9O0j50J04nK8q6KL8K1j8j1l2O8J9o8M8r4R2j7jpn1
$$ -43 -67 -19 -50 38 94 -39 35 -28 11 71 -79 25 20 48 -38 -36 2 23 5 -6 -38 30 49 -19 29 -65 27 10 9 2 -49
3537d9Q8k6k4l1L9jJ8rMJOlj31J06J7k9O8q7k3J35m9l2P0j35Q2L4l0l7K7k0J5
$$ -49 39 13 -11 -42 -3 -4 14 5 9 10 16 13 -118 -12 5 -24 44 -43 -66 69 20 -12 58 -77 5 39 9 -28 -1 -21 -6
3568fJl8P3N7q1J8m7L1nQlJ3r0Q6mn3O1L6l1kL2m5K3m4orOP7q6P9l8o4R2q1M3
$$ -6 -5 -43 30 87 6 24 -23 8 3 11 8 21 -69 17 13 -40 21 57 26 24 56 11 34 -10 -16 -25 -19 58 -28 51 13 -51 41 -40 3
3603Cj3M8K1o5j4M5j7Jl0n5P0O8m7n0J4O6J9K8j63P9k6K8j6k2K6M8n4n4N4m8J34
$$ 3 -10 38 59 -6 -20 25 8 9 -21 -76 -6 62 15 -35 -21 45 64 92 -71 8 -18 10 -6 -28 -2 46 -8 -62 -8 -56 78
3634G8o4j6n2O4rK1j3J2P%q3L8M3j1J6o6K5L4k0J3J5p7P5m6M2J0n9M3J5l3Qq2
$$ 78 14 -2 -54 10 1 22 9 21 28 28 -55 -17 26 15 31 -35 -10 24 4 17 32 -45 30 -16 26 36 -23 20 35 2 10 -72
3666g2Q0L8k4Kl4kjO1p6RO5r2O2J7l7O7p7K4L4k3l1L3j10J94j04k5N9o3K4m8J7
$$ -72 8 46 22 24 -10 -12 -13 48 -28 -19 46 -46 16 33 -4 63 -14 10 44 21 -10 23 -87 107 3 -22 37 -26 -2 -50 -33
3697c3L4j2K6j5M4m8j0M3p1N5Oj09J56m7n9Q4n6J3ml1M0j3k7Qj8O7l2l0R0m2P6
$$ -33 1 -11 15 0 44 -4 -14 29 -42 13 19 -90 66 19 -40 44 -12 1 -3 -34 6 -7 -34 -26 -44 23 -9 -39 51 9 85
3728H5j49N2K6p0Q5n4OJ7k6L7K1j10Q1J2J6l9l6P6l6Q0k3j18J17k9j9J2p1J06
$$ 85 -64 -12 14 -56 29 -25 -19 -2 -28 9 30 -80 1 13 29 -10 -46 30 -6 74 51 -67 50 21 2 14 -57 49
3756D9L9j12RJ8K4J25k47Q5j5O4Km6orP2j8p3jL8J0N0j50R1L1o1O3j18J1J04n1
$$ 49 88 -24 -15 3 27 152 -95 -10 -25 39 41 -5 -11 -20 52 34 -39 -40 -2 8 58 -92 -1 30 -31 32 -86 -75 29 -22
3786b2L0r3P1P9k5p2NK0N7k8m1k7P4O7j43M9p2L5J57j34J9m5J9J01j13l2O8lL0
$$ -22 8 -85 -14 65 40 -32 -27 -7 50 22 -19 -46 28 95 -48 1 -71 -36 121 -13 6 -39 -20 81 -32 -64 4 1 31
3815C1m2pMj9P1r0MO2k9R4j41l6J66o7M9k2j14J59m2q3oR8%L3p0o9L3J14k0p5
$$ 31 -11 -18 -14 -33 38 -52 -48 14 -15 79 -62 -98 68 1 50 28 -86 73 31 -52 -58 40 40 73 3 -66 -33 81 61 -14
3845a4m9mJ66q6m8N5j36J54P0j95J11jk3N9j12L0K9M3n0l6L3K3M5r3jj1N7KK5
$$ -14 -63 -67 99 13 -35 20 -116 38 108 -87 24 23 0 59 -53 -23 6 49 -1 -37 -4 19 64 -29 -30 -41 16 18 43
3874D3o2J22k0q1j6r9J50K9o7m1K8l9P2p4O9o9Q3J13j78N9q7P5J2m6J4J7kK7n5
$$ 43 -19 103 83 2 -14 -113 37 66 -1 -42 -14 -53 19 -55 14 -55 28 141 -37 22 -65 10 22 -24 -10 7 5 32 -23
3903b3m0J23p3O1m9mK7n4Q4j04N3R0j11O0q9jJ25k5n5O0r3O7M9j00N3o6LO6o6
$$ -23 -63 60 -13 48 -1 -5 22 -32 52 -52 1 91 -20 40 -49 -50 75 50 -5 55 -38 29 78 -22 31 -35 -32 34 -32
3932c2j9O8j4K8n0q2P5M2k7o5R4n4M7M2j28P8NK9j0q8N2L6j6RJ5p5Q2k1J6p9m
$$ -32 -51 17 3 31 -19 -101 -26 16 -11 -76 18 -36 11 53 -75 3 8 37 27 -61 -9 27 11 20 35 -40 42 21 37 -42 -46
3963d6M8J6jk1jj3M2p2Q5n4O9Rj36P3K0M4l4n2K5J9N3j40M7K1MJ6k1PR%l8Rk2
$$ -46 2 18 17 -4 -5 -18 24 -48 37 -17 52 61 -75 -2 18 62 28 -24 1 20 73 -67 -20 1 5 21 0 7 16 16 -22 -13 -35
3996c5Q8J0n1L1k2N%%q0L0M3L0p7NMo5J04j1k1K6j5L1j07N5K3QL6o9kL4j4j7J1
$$ -35 53 63 12 43 21 26 26 26 -54 -24 19 49 -28 -23 -19 -84 20 9 -12 14 -1 30 -77 -22 1 9 45 -24 -26 8 -6 -23 -12
4029a2l6R1m4M4r1K2P8l8Oj25J31M7r0pM8n1Q2j1j04O8qK1Lj7rL0n1L4j1n6JP2
$$ -12 -48 43 -1 43 -48 -26 52 14 20 -105 26 73 -17 -24 24 -27 55 44 -60 8 0 21 24 7 -2 28 -23 11 0 -56 -55 17
4061A7Lo0O5o3M8on0P9m6J9o3L6O5l5k8L6LnJ2p5N6J3qj6l7K7j3N4m9RR0j21L9
$$ 17 20 -40 25 -38 10 4 -46 33 -13 6 -57 -21 44 9 -19 17 20 15 27 -48 8 21 13 -3 -40 -13 -26 28 -21 -12 78 -43 -4
4094dk3m5M9L7p7P9r7M2L1kM1j13P2J6K1n8L4oL9o7j6P2l8K9q2J06K7p5M6n0K1
$$ -4 -27 -72 -23 14 -63 16 -81 -39 -8 -10 31 -82 -10 6 27 -31 3 -3 36 -31 -47 25 -13 16 -66 40 67 -8 38 -12 9
4125IKMJ6m5j7L5knj6QN7m7N5m7oN8p4J0k3NQ8p9Qj6N1%l2j5j9M3P2q9K5l3M3
$$ 9 11 15 31 -14 -31 4 2 -3 -19 -11 46 -1 54 7 1 59 -15 -5 -28 -23 65 -14 -6 -22 29 29 -3 -18 -37 6 78 -11 14 -19 24
4160B4K9r6P3jj23J67j05N5rn1L3Rm0N7q5J22q7QO1j37J43l1o1Q8l7J7j4JN7p6
$$ 24 53 -43 30 29 -94 73 -32 23 14 -37 -4 5 -35 22 -63 59 -28 -20 41 -96 47 16 -45 43 6 23 9 10 67 -9
4190iJ8pK3Rp5M7L8j37J65q0J9O8j69J06L5p2Q5q2o3J62q6J2l8O1rJ7l2j26J39
$$ -9 9 2 25 34 -41 6 44 -93 72 -8 11 79 -90 16 51 -21 64 -18 -81 81 -5 7 -31 30 21 38 6 -120 19
4219A9Nm1P5j33P8P0j12N8K1j35K18j63L0O9n4O2j21K5rP1L3j33L8L0k0J37j73
$$ 19 24 -17 58 -75 3 73 -39 19 40 -95 123 -40 -10 59 5 67 -54 -29 -38 33 66 -67 -29 1 -19 118 -55
4246e5j0P2k0K4l2j32J99k6K1n2jN6j5mj37J26O3o8J5j02l7K64j63k6J02j89K91
$$ -55 -65 7 -13 11 -21 -153 46 20 41 -11 -12 44 29 25 -112 14 77 9 24 -78 -115 149 -14 -40 62 -127 164
4273A64r7j24Q1nL3J6j19ON9M7n1p0J13q7J73j09j04J91k10J99n0j82J40Q0j51
$$ 164 67 -57 24 19 52 68 -51 -45 14 61 10 -60 53 -34 139 30 -74 117 -93 106 56 -126 14 94 -57
4298e7O0r7R0J47j75Qo8J12O1p9k3m7J57j06L5j3j29K11Jj50P3pk9J91k15mK9
$$ -57 3 -94 -4 143 -32 -24 -92 20 81 2 -21 -68 89 -17 18 5 -124 87 88 -62 11 4 -25 166 -49 -53 -24
4325b4N8K0j01L0j4J15j06q0O7K7P9J2j67K1J75j58Q9j22NK06j15n1j6N4K2N6
$$ -24 34 54 -47 -17 -31 84 -22 -102 -35 -8 71 83 -84 -63 112 -46 43 -79 -74 132 17 -34 -50 4 26 82
4351H2q0j18J51N6l1k8q5J8J76k12O3Nj15K46j67j01J55rRN0j85Q9J16o0l1j4
$$ 82 2 -116 35 91 60 32 -53 -35 141 -71 -8 -3 -118 128 -39 -140 15 6 15 65 -120 -31 85 25 -6 -20
4377b0j8P4m0o4m2J72k9L6j05%N8J8k1m9l3J20Q4k23K9K1P7j2o9j0K4R0q5j4j4
$$ -20 -38 36 -4 -68 -110 62 33 69 -36 -36 22 40 19 -30 -63 57 141 -82 -53 -32 45 33 -36 -46 -22 68 -17 -31 -45
4406d5QP1N0j03l1L8J1M1r4m0J14L6o4j2m1R3Q8j90O9l8Q6Po5K2j0M5j3n6l9N3
$$ -45 -37 34 84 -19 -50 -12 -1 40 -54 -94 20 56 -8 -20 -61 32 120 -70 -1 -39 47 54 -11 11 1 46 33 -23 -62 -9
4436iJ9L7p9kO6J1lj87J19P1n7K2n7O4k2L6Pp7MR9n5L0o7n1K06j05J5n6PQ5q7
$$ -9 10 47 -32 -34 32 43 40 -147 -28 43 -14 8 -49 15 -7 29 36 -41 -37 62 7 37 -30 -81 125 20 35 -21 -14 71 -16
4467a6N9p4pR8m4k8MJL0Pl4L1k9P3p9p3J04o1Q3l0p0O6j5lL6q9N3K1l3K7j25J62
$$ -16 43 -31 -38 60 16 -12 -8 -7 23 30 -4 27 -2 71 -8 -81 23 -38 45 15 -55 11 -4 -7 29 -60 -7 14 -19 8 -117 45
4499D5k7l9R6j69J26k2o2P0kMK8o6M3l2O8lj01R2o0J35p7n3j0m5R2k4o2N0N0q8
$$ 45 18 -21 75 -94 32 10 -52 18 16 20 48 -18 25 -7 61 58 -43 49 -11 124 47 -6 -16 -61 31 7 -55 -5 45 -43
4529d3J38j34O4O1p7L4r5R2Kk9J4p7Q1l8J7L2m5J2O5o1k0l0j2J27j17R4p9J9O6
$$ -43 95 -39 25 86 9 43 -52 40 42 13 27 -50 31 -7 10 42 -3 9 74 13 -7 -37 -49 78 -39 55 -24 -5 61
4558F1j61Q2j5OQ1q9M8Kk6R2r8oJ01r2N5j44J14L2m6P6r5L5O8j04K3j6j2P6r2
$$ 61 -100 -18 -33 -27 54 -35 13 15 -11 81 -17 -23 78 -14 41 -103 11 43 -3 73 -22 13 81 -23 0 -16 -28 48 -44
4587d4J5J7PQ0j13M7k5m2J22j19Q2k6J5K6k2mk3j7O6Pj06J38j48J18j23N2L7l1
$$ -44 -29 -12 -5 75 -38 9 -16 -58 64 -55 27 1 16 42 20 16 -7 -24 42 49 -57 81 -67 51 -72 -20 17 -14
4615a4N1o4J4O2p1J9M1o1O1q2O5M3j14R5o4K9M1j44J33j14N3QK5K6oj3M1p5J6
$$ -14 37 -27 -13 49 -22 -3 38 -23 38 -44 21 64 -50 45 -19 10 51 -93 40 -74 -21 -13 12 38 32 19 60 -15 1
4644AO3j40J44q9O2o0mN7j00P5Qn3N2n1J1Lp0J53q4l6J10j62J76p8j5J01o0j8
$$ 1 64 -76 68 -21 41 -19 -23 34 -66 9 17 -36 16 -35 -24 -21 -91 62 -22 -58 52 -110 66 -12 -27 74 14 -4
4672dnLJ2qpO4j11J33j74J37K5j05J85k11K8J54j70J24j08KP1q3K8O3n7J18q6
$$ -4 -9 -6 6 -2 -9 55 -56 77 -97 40 65 -40 145 -66 -38 116 -54 70 -38 -36 35 -48 -20 43 -14 104 18
4699A8J6k1n5J57k24J35j9o7J42j12jR0j52J87j00o4J42j32J01n2l8J21j40J45
$$ 18 34 13 -42 115 -109 26 7 -60 82 -30 -31 59 -93 94 -6 -70 72 -60 41 -11 -49 72 -68 77
4723G7j31K4J04j30J35p2j13J18l7J6M7j97K04J5j16J25j68K08n2j10O3n0J27
$$ 77 -54 -30 74 -56 79 7 -106 12 -25 -9 38 -159 45 60 -56 69 -99 109 57 -53 10 -40 87
4746H7q1q5M5L6O6kj60J24m4M7L0j66J49o3L3M3j40J03Q1o5l2o5J5R6m7Kj79K16
$$ 87 6 -79 -34 2 68 66 -94 30 -14 33 63 -103 46 -17 16 59 -81 22 103 38 6 -59 -44 52 5 7 -172 44
4774D4N0j38J15k54K12P9k34J13k0%J24j70l6J32o3J63j60lN9J4K5j46P7J0N1
$$ 44 94 -44 71 -183 29 108 -126 -13 -33 -33 91 -79 -115 17 -46 117 -43 -46 13 27 52 -94 -17 -7 44
4799D4N8k57J49M8j3L6q0j11K49j05m4k3o7K81j31qp5L3R2J0j18k2Q0J0M3r7k5
$$ 44 102 -155 -6 42 29 65 -15 -126 123 18 -26 -49 -116 165 34 26 -49 -16 76 86 -32 -54 26 36 79 -18 -43
4826d3L9P8o5j05R3pJ31j41k3P4M6k2n9n0j0J78n7p1q4J45l0Mkj51J76Kk1j16
$$ -43 -4 74 9 -96 -3 -10 121 -20 -43 31 77 55 -4 -54 -64 114 57 -14 -98 47 17 21 19 -132 44 46 25 -91
4854i1J7Q6Q5j31l0N3%J36j44q4P1O9nr3k4J07O4p8o3o5J17M7l0l6j49K49o3N1
$$ -91 -74 12 97 -34 -64 -11 -11 125 -19 -103 -32 37 32 -61 -85 22 86 8 -55 -120 -3 44 14 -22 -171 78 15 66
4882F6j24l1J32L2r4o5P3K3M5j41J5K2P4L8j08M9m5J26n2j19O6mJ25n3j25M9Q6
$$ 66 -58 -89 43 75 -19 -84 -11 12 57 -84 -69 -47 27 65 -43 6 -39 87 35 -84 -18 -22 103 50 -75 -26 60
4909F0o6Q1k09J17J50j26M5j50P2J00r5M7q0qJ86p2j12M3o6J75m0p2j4J6J16j60
$$ 60 -6 75 -134 -17 133 7 52 -98 -26 74 -21 26 -54 -62 124 52 -60 -17 -83 92 52 -20 -34 -18 98 -62
4935f2M8k3KJ38j10p4J27p6M9K8j87J87n1O8m9j20J26j0K9q3K8M4nk2n3n2J76
$$ -62 -14 -37 -35 103 -7 -81 46 -30 19 47 -140 47 -4 64 15 -105 21 11 40 -43 -15 29 24 2 -51 -103 73
4962G3n8m3P9k37K44q6rO2j45J69l6p2J01j25R0L9j54J70j50J12L7j95J93r4P6
$$ 73 15 -28 51 -186 58 -28 -37 25 -120 49 13 -59 42 -83 7 46 -108 62 -88 24 61 -134 59 -35 41
4987D1K5j24Q5k6M6j2n2L0K1q4P2j05O7L2p2Q8j11J08j4m8R1j53J21M9p9j4l1
$$ 41 66 -58 27 1 47 35 -17 13 34 -50 22 -83 -16 16 -56 32 -79 29 15 -33 58 -95 26 75 -4 -18 -49
5014d9rJ53j14j2KmJ34j82J12l8J8N0j30Q6n5M9K1j04K7P7l1P0n6k5O5j13J30
$$ -49 -58 95 -19 -31 -29 -33 101 -81 31 -7 11 61 -69 17 -38 11 32 -72 -45 32 1 71 15 -10 55 -58 72
5041G2q9K8N1j52J46j34P2R9j11K5k7m8J22n6K6m0jJ12j55N6j2n3J70j63P2j9
$$ 72 -17 11 62 -90 56 -78 -6 93 -18 7 -20 -68 54 -2 24 -16 -17 95 -60 -4 -16 -69 101 -62 10 -9
5067iNN4o7k3J02n8K2k9p5J25q4J38j79L4P4r1J26j17jO7r2N1k9L7N4p1K2N1q3
$$ -9 -4 50 -17 -40 62 4 26 -3 -78 47 -37 101 -78 -44 30 -61 65 -52 -53 14 -78 -27 -56 -19 35 -36 -14 37 -46
5096d6J68j39j9L8o8J38j31J36o8j2L4o1nR0j35R5J6j10J91k00J11q8J3Q4n0K
$$ -46 122 -17 -36 2 -66 72 -59 77 9 -3 31 -30 -35 55 -80 15 31 -79 112 -88 23 -65 -52 32 -18 -16
5122a6m3M4P9q1K9Rk9O2o4l4N6j09J70j23kJ14j64K22j99O5J19j35O1Pj04Q8o7
$$ -16 -59 -15 64 -17 12 21 -8 54 -10 -44 12 -97 73 -50 -52 62 -102 120 -79 -14 105 -30 31 38 -66 22 -45
5149d5L2N7j44K12j57J14lj55J35j39O6O4q5J01q0mN4j09R5J2j26J68j59J31j2
$$ -45 -13 44 -100 112 -45 69 66 -89 46 -93 -27 37 -48 53 -27 -31 23 -86 9 21 -105 63 -96 35 23
5174B3j24K15j75N5L2q1J17j15j7R2p0J37o1j10K33k22K11j46r3K20j95R6Qj22
$$ 23 -101 114 -61 -6 26 -55 62 -53 -70 22 -48 89 28 -82 151 -71 140 -6 -99 121 -74 22 30 -92
5198i2J90j36KJ07j33J14o7l7J67j76J55q7k2O2j72K19r7nP4o4J7N7j87K07j52
$$ -92 98 -38 -36 71 -62 52 -15 -52 115 -61 94 7 -15 47 -125 94 -3 -8 66 2 19 76 -111 96 -56
5223e6R4J3j70J88l7l6P4j95J41Ro3P8q0L7M1o8L9o2Q6L8p3Q6j58R0L0j24P3o0
$$ -56 38 51 -119 69 32 -4 70 -125 16 25 -38 40 -40 -3 38 -30 9 -53 33 71 -2 84 -74 16 46 -78 -5 -65
5251f5Q7O6k07L1N8NR6j39Q2nl4J04k10J04mM9N4j84R0J09o1qp5m4J82r2pqp1
$$ -65 22 88 -119 -88 -30 -25 71 -68 14 9 -25 79 -131 -27 -31 18 72 -112 -22 87 26 18 -57 -101 81 -11 -18 -26 -97
5280i7J72q7l9K6MJ05r7k6J9MJ01q8n4K7mJ02o2j04J44m4Q9p7o2L8N6kr4lP9O2
$$ -97 75 -12 -51 -25 -21 84 -13 -39 -20 -16 85 -3 -57 -30 -34 68 6 -98 46 2 91 14 -48 -10 46 44 -50 -53 26 88
5310H8r1Oj09J51L8j34L4q0J42ll2n3N0rR6j04r0R4K1K4o7l3P2J1K0j17M1N0R6
$$ 88 -3 3 -106 45 83 -51 -17 -97 45 42 10 -43 7 -2 94 -10 -100 -6 15 39 -28 -61 11 22 42 -75 -34 16 112
5339A12j40j05L2J55j9pp8m5J85n0j8n1p9J90o0k1m7L5R0l5j26K2J05qM6j68Q7
$$ 112 -28 -133 -101 54 35 28 -50 -95 90 40 22 -29 -108 82 22 1 -46 -11 79 44 -82 -60 45 37 83 -85 2
5366BL1K6j3p6LM5O1j37o4J43K6J7m5j09J38K0q0N7j30J25K7r5O0p0M5J36k16
$$ 2 33 59 46 -30 -27 18 79 -58 -122 21 47 64 19 -90 48 68 -12 45 -85 40 67 -28 32 -38 7 143 -73
5393g3L4M3J6J27j52l8L3MQ7j61L6NO4mo3L4mL9J1p9l3J19m1jj16J3J96j33J37
$$ -73 -39 4 20 147 -5 -43 -10 -6 81 -80 -44 -39 25 21 -42 -8 -12 27 38 -41 -74 45 4 3 -113 -100 96 -37 100
5422A00k26J15J17n4m6j5l7J12k2j19R6r6K00r9m9Mr3J89jr7m5O5O9p7j03J57
$$ 100 -126 -11 106 52 6 -9 -46 66 44 -75 21 -75 125 26 -23 -19 -112 77 76 -21 -66 -1 68 -9 -112 45
5448D5o4J10q2r8J25n8M9Mj11R0Rj9J9j19J29Qk4j7m6R8O9j27K5p6Q5k2k4N8j03
$$ 45 -19 91 9 -89 36 -22 27 31 -80 10 19 0 19 -100 29 37 13 -4 -50 48 117 -10 15 -61 24 2 -22 36 -67
5477f7J39l7j9m0J6qM0q3M7L3j5L9j13P0m5L6N9j54J18q1K4M4m9j7N0MM6m8k4
$$ -67 72 35 16 -24 -8 -16 24 -59 -12 21 6 45 -68 2 -43 -7 52 -102 16 -65 -41 3 -46 -63 -13 -9 37 -11 -35
5506c5Q7j12Q7j07J04Lk8L9j05P5Rn5L2nN8Ln9n7M6j0J15j26J1J3n2J21j22L3
$$ -35 52 -60 27 -80 24 27 -1 38 -67 8 17 -38 -6 -11 47 50 -9 -66 -20 -30 85 -41 -30 -17 -69 52 -70 -37
5534c7kLK8Qk4N6p4N9%q1J00m9P0r2K3N0j38J40q8J3R5o6M9r2M0kl1R5%p9O0q4
$$ -37 -39 -36 -8 0 -24 32 -42 17 17 -64 36 -13 57 -35 -12 38 -100 40 -48 -35 60 -6 43 -49 -9 -11 -42 53 53 -26 34 -50
5566e0K2N1r5J04n5O5n1m5J09o6j5O2n0P2p5j5Q4j03J10j07J1J01j65J81n0p2
$$ -50 -28 23 -72 32 -23 42 -9 -54 55 -11 -26 36 -14 58 -17 -32 52 -51 59 -48 -37 64 -101 80 30 -42
5592d2P8k1k2M1o7R2o3j2J8q6K00o1p5R0j76J83j22M1K7j06J56q4j4P2n2Qjo8
$$ -42 36 15 -7 34 -33 59 -4 -16 2 -84 116 55 -20 70 -106 77 -45 -4 23 -83 73 -11 -25 47 -5 3 2 -66
5620f6J69j87R7Jq1J47j53Q1P4j24M7J5l1P2j14P3M2j16J35k03J64J2j47K29j81
$$ -66 103 -84 13 14 -67 80 -73 8 82 -42 5 20 -11 61 -53 20 62 -54 81 -122 42 54 -93 136 -45
5645d5R0jj10J56o2n9R1j24J02Jp6R8j24R8l2p8J50j61J84r4m4J29j60N8J42j80
$$ -45 45 44 -66 90 28 -31 60 -64 38 39 -37 61 -63 35 3 -75 75 -86 98 4 -40 89 -71 -13 129 -51
5671e1J12k7m5J17j95K03p9q0R9r6R7q9l3O3l9L3N3r8J13q6lJ16j62J36q3L2L2
$$ -51 61 34 -11 106 -89 114 35 -45 54 -42 55 -34 -67 -4 -43 -10 43 -55 58 -28 -31 85 -77 59 -24 8 40
5698D0j00R1n6j2R0p4N3L2r2N4o5O3J8j37J40j10Q0J5n4L4j00J38K0j22L4M3n2
$$ 40 -60 31 -25 -37 53 -21 32 64 -28 26 -39 24 42 -95 45 -65 15 30 -24 10 -90 48 68 -54 -20 23 -29
5725b9N4m3O4m3r2J86j94P5J03j25J14j22M7M2o5L1lm0J08p6L8rj1Q0j13K3J0
$$ -29 25 -18 46 3 -89 97 -97 -22 81 -44 70 -52 -5 37 -28 3 0 -40 68 -8 30 21 10 90 -23 0 10
5752A0k9P6p8MoJ8Q2n1n9M3m5Q6Mj06R9K3k8k4r5J02j5Ql0lK0P1n2mj05J42k1
$$ 10 -19 57 -21 -17 -23 -5 77 26 -33 10 -35 51 55 -51 48 71 43 19 -76 26 11 19 -11 -14 6 77 25 21 -84 58 37
5783C7p6R3n7J10r8n7O4k6O4N2j40J3L9m5P5o5k5R9o9M1o1M4J2K1r5K7o4J05N9
$$ 37 -39 54 -3 107 9 -48 16 -10 54 106 -34 -21 18 -27 48 -17 -42 57 -12 29 -32 12 24 45 -50 -23 -87 18 77
5812G7j13QL9J18r1k2m6l0J31j05K9j6m4Q2J5r8R7n3O3k4j00R8k5R8p7j08J30
$$ 77 -36 -28 11 129 38 16 -30 -60 71 -34 -5 -21 -65 17 32 -66 31 -22 41 17 -83 15 -10 88 11 -97 33
5839C3j1K5m6n3J1Q7m4K5m0K3K5p1Q3j31J44m6j2%j19J36Mo6L8j4J8N7j15O2N4
$$ 33 22 47 1 -52 -41 46 2 27 -13 10 35 -36 47 -84 60 14 2 2 -117 19 23 -43 -5 -19 -1 56 -59 3 57
5868E7o6R3j37K2%K9J01j81N0j8P8k6o0k2R3m4N2m9nR5j11R4n1K5J6n5P3q9j3
$$ 57 -9 84 -53 -31 -31 -2 99 -82 -32 -50 28 2 -58 -80 13 -31 21 -28 -33 62 -49 45 -6 19 35 -20 53 -36 -49
5897d9Q2k3o5M4oR0q2j5L6L2P6q8n3M2J6j8m7j6L1L4k7L0p0R0rjp3K8M2n8L6j2
$$ -49 33 10 -55 -11 -17 73 -9 -24 12 44 120 32 -21 21 37 19 -28 -44 -13 21 -6 24 -46 44 35 34 -39 -11 31 -27 9 -3
5929cj5Q3j2n0pq0Q2J2RJ2o5O1Ln4J5l3J08j02K7j7RJ04q6rj9M8K0L3j04K0K0
$$ -3 -18 65 53 3 -4 -84 -2 10 19 31 -34 27 30 -24 -9 -42 66 -36 -9 -26 -17 87 1 -8 -27 21 41 74 -30 -10 10
5960A0k5K4m3Q5p9P9o4k6R0p6M9J5l1M0j5r9O9n7J00l9j6M8p6N8k6n8P7n3N4O5
$$ 10 -15 9 -34 51 -28 51 -13 -39 51 -25 24 39 8 48 33 -66 3 -54 46 7 -9 39 -37 21 -5 -63 14 -39 15 80
5990H0j05J0j1OK7k2OJ9M5n1p9J32j26J11n7qK1J1j2J6q1rJ52r4M5p9M1K2l0O3
$$ 80 -25 -15 -26 -20 7 -15 -9 10 55 4 -75 57 -69 42 -15 -23 -2 9 -3 13 -68 -77 75 -19 26 -53 -12 10 -20 43
$$ [...]
8191C1
##END NTUPLES=NMR FID
##END=
