##TITLE=1H_120-2023
 CDCl3
 8 sc, 
 25.12.2023
##JCAMPDX= 6.0         $$ Bruker NMR JCAMP-DX V2.0
##DATA TYPE= NMR FID
##DATA CLASS= NTUPLES
##ORIGIN= UXNMR, Bruker Analytische Messtechnik GmbH
##OWNER= root
$$ XWIN-NMR		Version 3.5
$$ Mon Dec 25 14:11:36 2023 Russian Standard Time (UT+4h)  she@DPX200
##.OBSERVE FREQUENCY= 200.1313
##.OBSERVE NUCLEUS= ^1H
##.DELAY= (6, 6)
##.ACQUISITION MODE= SIMULTANEOUS
##.ACQUISITION SCHEME= undefined
##.AVERAGES= 8
##.DIGITISER RES= 18
##SPECTROMETER/DATA SYSTEM= spect
##.PULSE SEQUENCE= zg30
##.SOLVENT NAME= CDCl3
##.SHIFT REFERENCE= (INTERNAL, CDCl3, 0, 15.7039)
##AUDIT TRAIL= $$ (NUMBER, WHEN, WHO, WHERE, WHAT)
$$ ##TITLE= Audit trail, XWIN-NMR		Version 3.5
$$ ##JCAMPDX= 5.01
$$ ##ORIGIN= Bruker BioSpin GmbH
$$ ##OWNER= she
$$ F:/spectra/data/she/nmr/H-F/1/audita.txt
$$ ##AUDIT TRAIL=  $$ (NUMBER, WHEN, WHO, WHERE, WHAT)
(   1,<2023-12-25 14:10:27.31 +0400>,<she>,<DPX200>,
      <created by zg, POWCHK disabled, PULCHK disabled
       configuration hash MD5:
       00 E9 B6 7A A2 85 ED C7 34 08 36 98 17 FE 4E 26
       data hash MD5: 16K
       6B 07 22 F6 6E F3 E9 CC 60 58 75 E3 4F EF 2F 13>)
$$ ##END=
$$ 
$$ hash MD5
$$ 37 DD 0E 32 84 65 6B A7 32 82 F8 65 46 A5 50 37
##$RELAX= 
##$RELAX= 
##$RELAX= 
##$RELAX= 
##$RELAX= 
##$RELAX= 
$$ Bruker specific parameters
$$ --------------------------
##$DU= <F:/spectra>
##$EXPNO= 1
##$NAME= <H-F>
##$PROCNO= 1
##$TYPE= <nmr>
##$USER= <she>
##$AMP= (0..31)
100 100 100 100 100 100 100 100 100 100 100 100 100 100 100 100 100 100 
100 100 100 100 100 100 100 100 100 100 100 100 100 100 
##$AQSEQ= 0
##$AQ_mod= 1
##$AUNM= <au_zg>
##$AUTOPOS= <>
##$BF1= 200.13
##$BF2= 200.13
##$BF3= 200.13
##$BF4= 200.13
##$BF5= 200.13
##$BF6= 200.13
##$BF7= 200.13
##$BF8= 200.13
##$BYTORDA= 1
##$CFDGTYP= 0
##$CFRGTYP= 5
##$CHEMSTR= <none>
##$CNST= (0..31)
1 1 145 1 1 1 1 1 1 1 1 1 1 1 1 1 1 1 1 1 1 1 1 1 1 1 1 1 1 1 1 1 
##$CPDPRG= <>
##$CPDPRG1= <>
##$CPDPRG2= <>
##$CPDPRG3= <>
##$CPDPRG4= <mlev>
##$CPDPRG5= <mlev>
##$CPDPRG6= <mlev>
##$CPDPRG7= <mlev>
##$CPDPRG8= <mlev>
##$CPDPRGB= <>
##$CPDPRGT= <>
##$D= (0..31)
0 1.2 0 0 0 0 0 0 0 0.06 0 0.03 0 0 0 0 0.0002 0 0 0 0 0 0 0 0 0 0 0 0 
0 0 0 
##$DATE= 1703499026
##$DBL= (0..7)
120 120 120 120 120 120 120 120 
##$DBP= (0..7)
150 150 150 150 150 150 150 150 
##$DBP07= 0
##$DBPNAM0= <>
##$DBPNAM1= <>
##$DBPNAM2= <>
##$DBPNAM3= <>
##$DBPNAM4= <>
##$DBPNAM5= <>
##$DBPNAM6= <>
##$DBPNAM7= <>
##$DBPOAL= (0..7)
0.5 0.5 0.5 0.5 0.5 0.5 0.5 0.5 
##$DBPOFFS= (0..7)
0 0 0 0 0 0 0 0 
##$DE= 6
##$DECBNUC= <off>
##$DECIM= 32
##$DECNUC= <off>
##$DECSTAT= 4
##$DIGMOD= 1
##$DIGTYP= 9
##$DL= (0..7)
0 120 120 120 120 120 120 120 
##$DP= (0..7)
150 150 150 150 150 150 150 150 
##$DP07= 0
##$DPNAME0= <>
##$DPNAME1= <>
##$DPNAME2= <>
##$DPNAME3= <>
##$DPNAME4= <>
##$DPNAME5= <>
##$DPNAME6= <>
##$DPNAME7= <>
##$DPOAL= (0..7)
0.5 0.5 0.5 0.5 0.5 0.5 0.5 0.5 
##$DPOFFS= (0..7)
0 0 0 0 0 0 0 0 
##$DQDMODE= 0
##$DR= 18
##$DS= 0
##$DSLIST= <SSSSSSSSSSSSSSS>
$$ [...]
##$SUBNAM2= <"">
##$SUBNAM3= <"">
##$SUBNAM4= <"">
##$SUBNAM5= <"">
##$SUBNAM6= <"">
##$SUBNAM7= <"">
##$SUBNAM8= <"">
##$SUBNAM9= <"">
##$SW= 18.0517328524113
##$SWIBOX= (0..15)
0 0 2 0 0 0 0 0 0 0 0 0 0 0 0 0 
##$SW_h= 3612.71676300578
##$TD= 16384
##$TD0= 1
##$TE= 0
##$TE2= 300
##$TE3= 300
##$TEG= 300
##$TL= (0..7)
0 120 120 120 120 120 120 120 
##$TP= (0..7)
150 150 150 150 150 150 150 150 
##$TP07= 0
##$TPNAME0= <>
##$TPNAME1= <>
##$TPNAME2= <>
##$TPNAME3= <>
##$TPNAME4= <>
##$TPNAME5= <>
##$TPNAME6= <>
##$TPNAME7= <>
##$TPOAL= (0..7)
0.5 0.5 0.5 0.5 0.5 0.5 0.5 0.5 
##$TPOFFS= (0..7)
0 0 0 0 0 0 0 0 
##$TUNHIN= 0
##$TUNHOUT= 0
##$TUNXOUT= 0
##$USERA1= <user>
##$USERA2= <user>
##$USERA3= <user>
##$USERA4= <user>
##$USERA5= <user>
##$V9= 5
##$VALIST= <valist>
##$VCLIST= <CCCCCCCCCCCCCCC>
##$VD= 0
##$VDLIST= <DDDDDDDDDDDDDDD>
##$VPLIST= <PPPPPPPPPPPPPPP>
##$VTLIST= <TTTTTTTTTTTTTTT>
##$WBST= 1024
##$WBSW= 4
##$XGAIN= (0..3)
0 0 0 0 
##$XL= 0
##$YL= 0
##$YMAX_a= 751257
##$YMIN_a= -798951
##$ZGOPTNS= <>
##$ZL1= 120
##$ZL2= 120
##$ZL3= 120
##$ZL4= 120
##$ABSF1= 10
##$ABSF2= 0
##$ABSG= 5
##$ABSL= 3
##$ALPHA= 0
##$AQORDER= 0
##$ASSFAC= 0
##$ASSFACI= 0
##$ASSFACX= 0
##$ASSWID= 0
##$AUNMP= <proc_1d>
##$AZFE= 0.1
##$AZFW= 0.1
##$BCFW= 1
##$BC_mod= 2
##$BYTORDP= 1
##$COROFFS= 0
##$CY= 11.3945322036743
##$DATMOD= 1
##$DC= 2
##$DFILT= <>
##$DTYPP= 0
##$F1P= 15.7292609196834
##$F2P= 12.9074282941183
##$FCOR= 0.5
##$FTSIZE= 0
##$FT_mod= 4
##$GAMMA= 1
##$GB= 0.15
##$INTBC= 1
##$INTSCL= 1
##$ISEN= 128
##$LB= 0.24
##$LEV0= 0
##$LPBIN= 0
##$MAXI= 10000
##$MC2= 0
##$MEAN= 0
##$ME_mod= 0
##$MI= 1.114404
##$NCOEF= 0
##$NC_proc= 0
##$NLEV= 6
##$NOISF1= 3.799351
##$NOISF2= 2.8
##$NSP= 1
##$NTH_PI= 0
##$NZP= 0
##$OFFSET= 15.70392
##$PC= 1
##$PHC0= -24591.35
##$PHC1= 8.25273
##$PH_mod= 1
##$PKNL= yes
##$PPARMOD= 0
##$PSCAL= 0
##$PSIGN= 0
##$REVERSE= no
##$SF= 200.130013532006
##$SI= 16384
##$SIGF1= 3
##$SIGF2= 2
##$SINO= 400
##$SIOLD= 16384
##$SREGLST= <1H.CDCl3>
##$SSB= 0
##$STSI= 0
##$STSR= 0
##$SW_p= 3612.71676300578
##$SYMM= 0
##$S_DEV= 0
##$TDeff= 0
##$TDoff= 0
##$TI= <>
##$TILT= no
##$TM1= 0
##$TM2= 0
##$TOPLEV= 0
##$USERP1= <user>
##$USERP2= <user>
##$USERP3= <user>
##$USERP4= <user>
##$USERP5= <user>
##$WDW= 1
##$XDIM= 8192
##$YMAX_p= 0
##$YMIN_p= 0
$$ End of Bruker specific parameters
$$ ---------------------------------
##NTUPLES= NMR FID
##VAR_NAME=  TIME,          FID/REAL,        FID/IMAG
##SYMBOL=    X,             R,               I
##VAR_TYPE=  INDEPENDENT,   DEPENDENT,       DEPENDENT
##VAR_FORM=  AFFN,          ASDF,            ASDF
##VAR_DIM=   8192,          8192,            8192
##UNITS=     SECONDS,       ARBITRARY UNITS, ARBITRARY UNITS
##FACTOR=    0.0002768,     1,               1
##FIRST=     0,             0,               0
##LAST=      2.2672688,     0,               0
##MIN=       0,             -798951,         0
##MAX=       2.2672688,     751257,          0
$$ Real data points
##PAGE= N=1
##DATA TABLE= (X++(R..R)), XYDATA
0@%%%%%%%%%%Qj6J6j6J6k4L2l6M4n4O5p5Q8j04J20j40J63j87K16k48K80l15L55
$$ 0 0 0 0 0 0 0 0 0 0 0 8 -8 8 -8 8 -16 16 -20 24 -30 35 -40 48 -56 64 -76 87 -100 116 -132 148 -167 188
33A88m01M53n08N67o31P04p85Q71r63J064j177J302j436J580j739J916k112K324
$$ 188 -213 240 -268 299 -332 372 -413 458 -505 559 -618 684 -752 828 -911 1005 -1107 1217
51A217k558K824l123L458l839M274m781N385o110O991q096R534j1469J4204j8351
$$ 1217 -1341 1483 -1640 1818 -2021 2253 -2528 2857 -3253 3738 -4358 5176 -6293 7911 -10440
66a0440K5283l8772P3535l09498n39059J262092J03309j054198L67794N92782
$$ -10440 14843 -23929 49606 -259892 -798951 463141 566450 -487748 -119954 472828
76D72828o70423o3220P47595l46147o84900N41833L98931n27674k3887L41957
$$ 472828 -197595 -260815 486780 140633 -544267 -2434 396497 -131177 -155064 186893
86A86893l20944j09613M86696k9864m96212J07207M76198j81352m41033L42662
$$ 186893 -134051 -243664 243032 213168 -283044 -175837 300361 119009 -322024 20638
96B0638L34670n13598j10913N81640k14758n35566N20011M06456p25229k00320
$$ 20638 355308 -158290 -269203 312437 97679 -437887 82124 488580 -236649 -436969
106d36969P53998j04777n63230M48245J81745o51738K49593N83922n31669k67549
$$ -436969 317029 212252 -350978 97267 279012 -372726 -123133 460789 -70880 -338429
116c38429N79329j17480m37640M14734J94508n64364Q7277N61942l47725m15914
$$ -338429 240900 123420 -314220 100514 295022 -269342 -182065 379877 32152 -383762
126c83762M89880J81184m50387L2726K76787j58020j17852K12108N9904k54923
$$ -383762 106118 287302 -163085 -130359 146428 -11592 -129444 82664 142568 -112355
136a12355n8767K91162K6695k70097N5113J72761j38764l6627J94929q9038k08323
$$ -112355 -171122 120040 146735 -123362 -68249 104512 -34252 -70879 124050 35012 -173311
147a73311K08139J52949l16974l568L43473k08078k20923L66927k3122l85375
$$ -173311 34828 187777 -129197 -132765 210708 2630 -218293 148634 125512 -259863
157b59863K61163K72434l78721j05229L61752n5706k50250J96069R4622k71092
$$ -259863 1300 273734 -104987 -210216 151536 95830 -154420 41649 136271 -134821
167a34821P0912K29046j86769q9364J89381o3006j05355J29498J5182j15577K6645
$$ -134821 -63909 165137 -21632 -110996 78385 15379 -89976 39522 54704 -60873 -34228
178c4228R1674l2507r1080M4396Q9094n9437n6793O3594J8422o2977J4956Q7057
$$ -34228 57446 24939 -66141 -21745 67349 7912 -48881 14713 33135 -29842 -14886 72171
190G2171n9541j15942J25786Q5563j79678J3046J53139j22427n1304J59324o2984
$$ 72171 12630 -103312 22474 108037 -71641 -58595 94544 -27883 -79187 80137 17153
201A7153j18000J31504M6105j46990L0388J31684j00813o9759J53793l3241j43531
$$ 17153 -100847 30657 76762 -70228 -39840 91844 -8969 -78728 75065 41824 -101707
212a01707J29623O1539j55431L0627R6759p5277k2522O4927k0057m4882L3567
$$ -101707 27916 89455 -65976 -35349 61410 -13867 -36389 28538 8481 -36401 -2834
223b834L2374m3989r194N1063k2045k9974L5096J583j2553J198r039K3471q779
$$ -2834 29540 -14449 -23643 27420 5375 -24599 10497 12080 -473 725 -8314 15157 6378
236F378l2874M5270k322n3200M8639J4690o3597K9016M5338m8637k2596N5034
$$ 6378 -26496 18774 16452 -36748 11891 26581 -37016 -8000 37338 -11299 -33895 21139
248B1139L572o0780L1425M9662p2556J215Q0662o4935l2546Q8700l2260n8856
$$ 21139 24711 -36069 -4644 45018 -27538 -26323 54339 -10596 -43142 45558 13298 -45558
260d5558O1541J1919n4096J2497L8037k6939k7451M5800L455n3439L6089K8729
$$ -45558 15983 27902 -26194 -13697 24340 -2599 -30050 15750 19205 -34234 1855 30584
272C0584n4158J7345L3484l8810L369K5171j4238q626P00J5184J360k9491J2874
$$ 30584 -23574 -6229 27255 -11555 -8186 16985 2747 -5879 -5179 10005 11365 -18126 -5252
285e252J9505k2604L254R566j1857L728O238M549j1228j3254L6727k625m6654
$$ -5252 14253 -8351 -5097 4469 -7388 -3660 2578 7127 -4101 -17355 19372 16747 -29907
298b9907L7910J9626n1158K2023K7914m1395J004L3746j4427k9135K1264K7584
$$ -29907 8003 27629 -23529 -1506 26408 -14987 -13983 19763 5336 -23799 -2535 25049
310B5049m0342q994N5011l0838l4888O0300q773m8166L8584J5212l4222M516K1495
$$ 25049 -15293 -24287 30724 -114 -35002 25298 16525 -31641 6943 22155 -12067 -7551 13944
323A3944p944k1561J7147K0148l7986M79M2247l0494j9494L6310o227j8442Q133
$$ 13944 6000 -15561 1586 21734 -16252 -15773 26474 -4020 -23514 12796 6569 -11873 -3740
336c740Q136K196j6604O437K2517k8478j802L6442k7132j7649L5379l981k6635
$$ -3740 4396 6592 -10012 -3575 18942 -9536 -11338 25104 -2028 -19677 15702 11721 -14914
349a4914P705K2209j1102k7501K8803J5795m7456K0098L6754n0033J918M7199
$$ -14914 -7209 15000 3898 -23603 5200 20995 -26461 -6363 30391 -19642 -17724 29475
361B9475l0982k1450L5216M328k8117J028L1010j4270l0379L5977N953m2906K5291
$$ 29475 -1507 -22957 12259 16587 -11530 -10502 20508 6238 -24141 11836 17789 -25117 174
374A74J8537l5241R152J9241j4023n747M998J3160q751j8408K7355L491l1758
$$ 174 18711 -16530 -7378 11863 -2160 -7907 -2909 10251 1500 -16908 10447 13938 -17820
387a7820J9572J6084k4674J167J4605k480j3825J683K1340k0408j6791M1408j4333
$$ -17820 1752 17836 -6838 -5671 8934 6454 -7371 -5688 15652 -4756 -21547 19861 5528
400E528l8191M3363P659m2252J9175K2340k2143n583J9646R85k2932J2104K3859
$$ 5528 -32663 10700 18359 -23893 -4718 17622 -4521 -10104 9542 10527 -12405 -301 23558
413B3558l4419m673L9227k4917j8157L1400r177j4763J3158J60j645m991J471
$$ 23558 -10861 -15534 23693 -1224 -19381 12019 2842 -11921 1237 1397 -248 -5239 -3768
426c768J4361j5098l885K2260j3185r061J8596k758j1566j130J3298L049k8259
$$ -3768 10593 -4505 -8390 13870 685 -8376 10220 7462 -4104 -5234 8064 11113 -17146
439a7146J2676K5869l7415J182L7047l2238r098L7616j7216j9967K5478P588k3394
$$ -17146 -4470 21399 -16016 -14834 22213 -10025 -19123 18493 1277 -18690 6788 14376 -9018
452i018o96K7937j2800k7905L3779N233l9244K4740J6522l4159J2184J6203j7718
$$ -9018 -9714 18223 5423 -22482 11297 16530 -22714 2026 18548 -15611 -3427 12776 -4942
465d942P08N823J332j968r482J2137N745j6693N855Q304o774k859j139R302l659
$$ -4942 -4234 1589 2921 953 -8529 3608 9353 -7340 -1485 6819 45 -2814 -3953 5349 1690
480A690j3704K2559m842k7010L4308K979m3445K9362K1203m1689N684L2566j8065
$$ 1690 -12014 10545 5703 -21307 13001 15980 -27465 1897 23100 -18589 -12905 19661 1596
493A596j9292K5001J1550l4176O552L4832l2737j1297M1638k4314k1453L6828
$$ 1596 -17696 7305 18855 -15321 -8769 26063 -6674 -17971 23667 -647 -22100 14728
505A4728r463k1098J9018r46q592N153J688P79m501M120P122j0334L79N016k801
$$ 14728 5265 -15833 3185 2239 -6353 -1200 488 1267 -3234 886 8008 -2326 -1947 3069 268
520B68N234j0886M78K1314k3707o955L7973k4455k3906M0709o880l1126K4349
$$ 268 5502 -5384 -4906 16408 -7299 -14254 23719 -736 -24642 16067 9187 -21939 2410
533B410J0616k3825M299K1485j6555j7602L4676L23m1169K8809K0926m3529J5533
$$ 2410 13026 -10799 -6500 14985 -1570 -19172 15504 15827 -25342 3467 24393 -19136 -3603
546c603K7036l5978K920K5475j8810p486J2696N22n750o15N778m880k591J0177
$$ -3603 23433 -12545 -9625 15850 -2960 -10446 2250 2772 -2978 -3593 2185 -2695 -5286 4891
560D891q329M97J1498j6783P534J6707k6393P233K1975k8547M486K2834k7273
$$ 4891 -3438 -2941 8557 -8226 -692 16015 -10378 -3145 18830 -9717 -5231 17603 -9670
573i670k112K8461j4157j9467J9578J0646k6120K337L0863k5805j6166M2824j5176
$$ -9670 -11782 16679 2522 -16945 2633 13279 -12841 -10504 20359 -5446 -21612 21212 6036
586F036k9418L9432l971l1583K9048M638k8585J1831J3754j3560n157J0706j084
$$ 6036 -23382 16050 12079 -19504 9544 14182 -14403 -2572 11182 -2378 -7535 3171 2087
599B087j1781J1739M510j8964J3576P992k1036J5083O105k1142J8783K394k3812
$$ 2087 -9694 2045 6555 -12409 1167 9159 -11877 3206 9311 -11831 6952 9346 -14466
612a4466K0082O113k4084J1542J1556j5960j009J4019o695j5410J9518Q958l2425
$$ -14466 5616 11729 -12355 -813 10743 -5217 -6226 7793 1098 -14312 5206 14164 -18261
625a8261J3568K5974l4801N383L1997l2393m524L3708j9489j4595K1798k199j3845
$$ -18261 -4693 21281 -13520 -8137 23860 -8533 -13057 20651 1162 -13433 8365 6166 -7679
638g679Q540O309j5894l46K1968j4510j5306K6185o566j6597K3848q267j4250
$$ -7679 861 7170 -8724 -9070 12898 -1612 -16918 9267 2701 -13896 9952 1685 -12565
651a2565K4857p513j4960J8066l927r464J2220k122j1470M626J0395q955j0316
$$ -12565 12292 4779 -10181 7885 3958 -5506 6714 4592 -6878 -2252 8143 -812 -11128
664a1128J6996k575j8313K2390K45k6373K4126P269k7456J8230Q473k3994J2221
$$ -11128 5868 3293 -15020 7370 7615 -18758 5368 12637 -14819 3411 11884 -12110 111
677A11J3854j7260m194J4551j127j4387R348R340k1883O720J9431k4920J504K2106
$$ 111 13965 -3295 -7489 7062 5935 -8452 896 10236 -11647 -4927 14504 -10416 -8912 13194
691A3194k2108J807K1803k0746l945K0433p329p547P454N06n682J874Q767j0517
$$ 13194 -8914 -7107 14696 -6050 -9995 10438 3109 -4438 3016 3522 -2160 -286 8481 -2036
705b036o156J7014q322r913J6990j1518p094K3210j3375j1992K1198o221r341
$$ -2036 -8192 8822 500 -9413 7577 -3941 -11035 12175 -1200 -13192 8006 1785 -7556
718g556J4092m082p694Q074M092q045l434J2239n154j2877J9031l113k3075K3244
$$ -7556 6536 2454 -5240 2834 6926 -1119 -4553 7686 2532 -10345 8686 5573 -17502 5742
732E742N017k7188J6616J0150k1473R193J0798j2489j147R595L11r808M469R622
$$ 5742 10759 -16429 187 10337 -11136 -1943 8855 -3634 -4781 4814 5125 -4683 -214 9408
746I408j4224R25J5629j6078k678J6209j3411k12J1283j3400K989Q806r622L611
$$ 9408 -4816 -3891 11738 -4340 -7018 9191 -4220 -4432 6851 -6549 -3560 5246 -4376 -765
760g65L415o706M752L395l646l368L747P141j0440k245J5363j4417m493K1622
$$ -765 2650 -4056 696 4091 445 -2923 824 7965 -2475 -4720 10643 -3774 -8267 13355
774A3355j6507j0216K4415r583j3875J6719m34j0992N643P316o128p135J3208
$$ 13355 -3152 -13368 11047 1464 -12411 4308 3874 -7118 -1475 5841 -287 -7422 5786
787E786J874j7534J2326Q202j9886R776R253j7445O341P227j0246L032J027k225
$$ 5786 7660 -9874 2452 10654 -9232 544 9797 -7648 -1307 5920 -4326 -1294 -267 -2492
801b492M382m584J125L366l584L305j211j008N126o411L331N269j3747Q814Q197
$$ -2492 1890 -2694 -1569 1797 -1787 1518 307 -701 4425 -1986 1345 6614 -7133 1681 9878
816I878j9438P925J1528j7677L469J1211j0012k496P105J219p235O73J1979r906
$$ 9878 -9560 -1635 9893 -7784 -4315 6896 -3116 -5612 1493 2712 -4523 -3850 8129 -1777
830a777o906J9813q107j3983J9613l140j3808J2939j415q468O444J29k338j667
$$ -1777 -8683 11130 3023 -10960 8653 5513 -8295 4644 3229 -5239 1205 1334 -1004 -2671
844b671O87N045o071l58P631p364K100N891q290N060J904p848J0272l252r947
$$ -2671 -1984 3061 -3010 -3368 4263 -3101 -1001 4890 -3400 1660 3564 -4284 5988 2736 -7211
859g211J2961k738r626R667j935o252N177J544l522m169O659O066j4355M401J3992
$$ -7211 5750 3012 -6614 3053 1118 -5134 43 1587 -1935 -6104 555 6621 -7734 -3333 10659
874A0659j6172K355J4828j6031L49J4424j0851m080Q559j967l222j401M460j040
$$ 10659 -5513 -3158 11670 -4361 -4012 10412 -439 -4519 4040 2073 -1149 -2550 1910 870
888H70p218Q333K17r996J0306j1q810J0280k767n817J0103n369k639P805p320
$$ 870 -6348 1985 2202 -7794 2512 2501 -6309 3971 1204 -4613 5490 121 -2518 5287 -2033
903b033J084O262p097m44L497m88j461m016O886K3r875J1177M75j3934J4607K297
$$ -2033 -949 5313 -1784 -2228 1269 781 -680 -4696 2190 2213 -7662 3515 3990 -9944 4663 6960
919F960j6637J1804N383j2607N461M571n154j174K410K781o611L3Q838j0519o74
$$ 6960 -9677 2127 7510 -5097 364 4935 -219 -1393 1017 3798 -2813 -2780 6058 -4461 -5135
934e135J2822j1821k054J2821r068o59P585q188L523M704p318L191K060k724J567
$$ -5135 7687 -4134 -6188 6633 -2435 -3094 4491 -3697 -174 4530 -2788 403 2463 -261 1306
949A306j672J460j109k553O690n956m295J2839q472n702J5054r250o157J4818
$$ 1306 -366 1094 -15 -2568 4122 -1834 -6129 6710 -1762 -7464 7590 -1660 -7817 7001
963G001o331o341R457j698l756K584K571k714n115Q449R23j3372R639M911j4320
$$ 7001 670 -5671 3786 2088 -1668 916 3487 773 -4342 4107 5030 -8342 1297 6208 -8112
978h112R063L383j2392R913K264j0804P686K227n401K689M93J92p02n74L028n256
$$ -8112 951 4334 -8058 1855 4119 -6685 1001 3228 -2173 516 1009 1201 499 -75 2953 -2303
994b303J751N888j0694L551Q375j3358M679Q988j4317N023R146j1371K351P116
$$ -2303 -552 5336 -5358 -1807 6568 -6790 -2111 6877 -7440 -2417 6729 -4642 -2291 4825
1008D825n670r12M159J297m958p95Q548o844m777J2477q677n623J4835r273p687
$$ 4825 -845 -1757 2402 3699 -1259 -2054 6494 -350 -5127 7350 -1327 -6950 7885 -1388 -9075
1023i075J4977n895o741R501k455k983L743m8q76j062L853p59o589Q223P5j0968
$$ -9075 5902 7 -6734 2767 312 -2671 1072 1024 148 -914 2939 2180 -4409 3814 3889 -7079
1039g079J0532M97j1838J1730j201j1251J1958k21r821Q019J213n283K051K946
$$ -7079 3453 3950 -7888 3842 2641 -8610 3348 3127 -6694 1325 2538 -2745 -694 2252
1053B252j336l712N120K657j0682O377P296j5276O464R899j6111M543J0095j2855
$$ 2252 916 -2796 2324 4981 -5701 676 7972 -7304 -840 9059 -7052 -2509 7586 -5269
1067e269K376P467p831Q05M949j854l424J786N929o055k533J0258p493l752J2544
$$ -5269 -2893 4574 -3257 -2452 2497 643 -2781 -995 4934 -1121 -3654 6604 -889 -4641 7903
1082G903r377m366J3588r331m163J1431o848l235P171l151k196K915J068k443
$$ 7903 -1474 -5840 7748 -1583 -5746 5685 -1163 -4398 2773 -378 -2574 341 1409 -1034
1096a034j727P309l552p469J2336k206j1429J3495k057j2075J3620j651j1487
$$ -1034 -2761 4548 996 -6473 5863 3657 -7772 5723 3666 -8409 5211 3560 -7927
1109g927J0488Q26q281M060K840k783k564M852J856q114N550N152j1731O586P172
$$ -7927 2561 3387 -4894 -834 2006 -777 -3341 1511 3367 -4747 803 5955 -5776 810 7982
1124G982j4636O726P898j3426M488O263r388K956M082n556r9L396N33m568J377
$$ 7982 -6654 72 7970 -5456 -968 5295 -4093 -1137 2945 -2611 -2710 686 1219 -3349 -1972
1139a972O634p423n65J0855j0470j105J3178j1136k757J3084r527l586R985m958
$$ -1972 4662 -2761 -3326 7529 -2941 -4046 9132 -2004 -4761 8323 -1204 -4790 5195 237
1153B37m368M811N70l141o33N106l266m966J0333k825r434J2560j503j0228J1853
$$ 237 -4131 680 1250 -1891 -2524 2582 -684 -5650 4683 1858 -7576 4984 3481 -6747 5106
1168E106k166q639J0053j380p369O177J7l798M43K638m95m538M337K529q495O542
$$ 5106 2940 -5699 4354 2974 -4395 1782 1799 -1999 -1556 1082 587 -3951 386 2915 -5580 962
1184I62L845j1789Q278N760j3528O746O593j0866L911M485o820J358L468k079
$$ 962 4807 -6982 1296 7056 -6472 274 6867 -3999 -88 4397 -2423 -1065 2403 324
1198C24k980J989M183p067k35R367q687j649J1299q912j516J0591q475j335R126
$$ 324 -2656 -667 3516 -3551 -3786 5581 -3106 -4755 6544 -2368 -3884 6707 -1768 -3103 6023
1213F023o351k149N273j691j861M1J919j495k731N713l272n463J0359l294q426
$$ 6023 -328 -2477 2796 1105 -756 -715 1204 -291 -3022 2691 -581 -6044 4315 1021 -7405
1228g405J1727k614p627J0036k202o318P782j175m473K925J624j714l115L266
$$ -7405 4322 1708 -5919 4117 1915 -4403 3379 2204 -2269 656 2280 566 -2549 717
1242G17K300p567M247M040r618N802M510j0862O462M799r777N056L642n814K649
$$ 717 3017 -4550 -303 3737 -5881 -79 4431 -6431 31 4830 -4947 109 3751 -2063 586
1257E86J716k169J68K26J535l498j11N612p085n45R069q346j195R222q084p2P989
$$ 586 2302 133 301 527 2062 -1436 -1547 4065 -3020 -3565 5504 -2842 -4037 5185 -2899 -2971 5018
1274E018p536k37O636l470j613J924J231q25k843L996j421m731P563l117o770
$$ 5018 -2518 -2755 3881 411 -1202 722 1953 1128 -1715 2281 860 -3871 3692 575 -6195
1289f195J0024k844p399R251k019n218O994k014k837M002q24r94jJ512J139n318
$$ -6195 3829 985 -6414 2837 818 -4400 2594 580 -2257 1745 921 -73 -74 1438 2577 -2741
1305b741L092L529p705M202L137q637N674K887r108N488L374o772L246K053k391
$$ -2741 351 3880 -3825 377 3514 -5123 551 3438 -5670 -182 3192 -3580 -334 1719 -672
1320f72P98j06J580j665o63M053m902l61P355p614j361Q400o667j107O195o018
$$ -672 126 20 1600 -65 -728 3325 -1577 -1938 5417 -2197 -3558 4842 -1825 -2932 3263 -2755
1336b755R55M909n018K58K778n67r7j564K710Nl878N376j898n121P847l063n988
$$ -2755 -1800 3109 -1909 -1651 1127 560 463 -1101 1609 1614 -2264 3112 1214 -3907 3940 877 -5111
1353e111Q739k649n702O860j951l081L532j078k69O91J37J099l245K608L219o891
$$ -5111 3628 979 -4723 2137 186 -2895 637 -441 -710 -19 118 1217 -2028 580 3799 -3092
1369c092L320M292p631L678K862p137M821J417o495L829J248l249J569m32J126
$$ -3092 228 4520 -3111 567 3429 -3708 1113 2530 -3965 -136 1112 -2137 -568 -1000 126
1384A26j30j097K839k367m89N297n945R6P398p249p43O829o303O4M640n117O68
$$ 126 -4 -1101 1738 -629 -1118 4179 -1766 -1670 5728 -1521 -2264 4565 -1738 -1674 2966 -2151 -1483
1401a483K862k188n66N0K510o19l826N027j86m935O547j652n065P666k500n165
$$ -1483 1379 -809 -1375 -1325 1185 566 -3260 1767 1581 -3354 3193 1541 -3524 4142 1642 -3523
1417c523O415j965l419L641j443p74J121j177J226j226N66J714l844L505K722
$$ -3523 2892 927 -2492 1149 -294 -1068 53 -1124 102 -1124 -558 1156 -2688 817 3539
1432C539o974M189L311p061M500J153n862M689P92n371K843J121j310n18n13K929
$$ 3539 -3435 754 4065 -2996 1504 2657 -3205 1484 2276 -3095 -252 869 -441 -959 -1472 1457
1448A457k699p09M609m824J98O633o790k41O895n741k53N016m727N53K503k468
$$ 1457 -1242 -1951 2658 -2166 -1968 4665 -2125 -2366 4529 -1212 -1465 3551 -1176 -623 1880 -588
1464e88N17M6P3k55j834L198j035m227N757j178l760N970k734k871P087l490l246
$$ -588 -71 -25 48 -207 -2041 1157 122 -4105 1652 474 -3286 2684 -50 -2921 4166 676 -2570
1481b570N721k197k099K400j124l18m26O05N92l323L137J133o069N188K672p767
$$ -2570 3151 954 -1145 1255 131 -187 -613 -8 584 -2739 398 1531 -4538 650 3322 -4445
1497d445N059K384n708M128J079m620L249Q63k655N48M55P80k137n44L686l618
$$ -4445 614 2998 -2710 1418 2497 -2123 1126 1989 -666 -118 337 1117 -1020 -1564 2122 -1496
1513a496o08M702n305R06N784o441Q79N271n309J198L039l727J086J604j525k56
$$ -1496 -2104 2598 -2707 -1801 3983 -2458 -1579 3692 -1617 -419 2620 -1107 -21 1583 58 -198
1529a98m7J638j621k071M642k675l576O757l114l644P095l510k982O598k722k881
$$ -198 -245 1393 -228 -2299 2343 -332 -3908 2849 -265 -3909 3186 -324 -3306 3292 570 -2311
1545b311M140p47j492L90R71O74k771K020N98m700M364J277p118N132K180o660
$$ -2311 1829 1082 -410 -20 951 1625 -1146 874 1472 -3228 1136 2413 -4705 427 2607 -4053
1561d053M397R18m179L899N00l286K265Q93n43r87L15J979l070k6L654m953Q38
$$ -4053 344 1262 -2917 982 1482 -1804 461 1354 811 -176 139 2118 -952 -978 2676 -2277 -1439
1578a439M708o736J743N267o811J646M456m656Q13K877k043q0Q07Q58j790o97
$$ -1439 3269 -3467 -1724 3543 -3268 -1622 2834 -1822 -1009 1868 -175 -255 552 1410 -380 -1077
1594a077L988l129k683O643l753l593O362k950l066N730l293k008M527j530j659
$$ -1077 2911 -218 -2901 3742 -11 -3604 2758 -192 -3258 2472 -821 -2829 1698 168 -1491
1609a491J724K19K33j197J455P74l432L570m3m891N111J72o311N187M42n161M487
$$ -1491 233 452 685 -512 943 1717 -1715 1855 1812 -3079 2032 2204 -4107 1080 1522 -3639 848
1626H48n2l897L517O43k426R35J239N40k776J605L201n151J318M280o399J808
$$ 848 796 -3101 416 1059 -1367 -432 807 1347 -1429 176 3377 -1774 -456 3824 -2575 -767
1642g67M510o796J807M278n370M48L391k346j2O86L61j84q41K645k075j374M895
$$ -767 3743 -3053 -1246 3032 -2338 -1890 1501 -845 -857 -171 190 6 -835 1810 -265 -1639 3256
1659C256l222k679O020l148k793N432l641j509M811l294j446L128r25q80N9J453
$$ 3256 34 -2645 3375 227 -2566 2866 -775 -2284 2527 -767 -2213 915 -10 -890 -831 622
1675F22j94k012K879m1l643M482J50n661N802J22o065M863M92m288K977J15k196
$$ 622 428 -1584 1295 1254 -2389 2093 2243 -3418 2384 2506 -3559 1304 1796 -2492 485 600 -1596
1692a596J201M99k53j291J406K143m218J404M013n050J137L913n567K401L076
$$ -1596 -395 104 -149 -1440 -34 2109 -2109 -705 3308 -1742 -605 3308 -2259 142 3218
1707C218n576J839L007l921P42J162j050J40m62J582j407p36L559k818j366N426
$$ 3218 -2358 -519 2488 -1433 -691 471 -579 -439 -901 681 -726 -1462 2097 -721 -2087 3339
1723C339l788j988O074l589j914M654l222j042L465k197j064J310L83n64k020
$$ 3339 -449 -2437 3637 48 -1866 2788 -434 -1476 1989 -208 -1272 38 421 -143 -2163
1738b163K580K51l394L562N37m269M883j9n103N114K05m220L266j04k084J706
$$ -2163 417 668 -2726 836 1373 -2896 1987 1968 -3135 1979 2184 -2036 1230 1126 -958 748
1754G48p09n56QK55Q16k381J272K519m568J868L499m973K040K774m932K595K580
$$ 748 39 -517 -509 -254 562 -1819 -547 1972 -2596 -728 2771 -2202 -162 2612 -2320 275 2855
1771B855m712J557K326k157k58K55O68q99j237K676k066j091M200l092j702N635
$$ 2855 -1857 -300 2026 -131 -389 -134 534 -365 -1602 1074 -992 -2083 2117 -975 -2677 2958
1787B958l344j658M682l031o93L261k500o2J492n86k14r71J279J55l099K781M19
$$ 2958 -386 -2044 2638 -393 -1086 2175 -325 -387 1105 519 305 -666 613 768 -2331 450 869
1804H69l661L704k55l732M769n84l948M505l40k558K432o22m56M64n04N72j601
$$ 869 -2792 912 657 -3075 1694 1110 -2838 1667 1327 -1231 1201 579 123 587 83 655 -946
1821i46J041J309l426J479L150n124J605L103m446J870K178l882K230J607k535
$$ -946 95 1404 -2022 -543 2607 -2517 -912 2191 -2255 -385 1793 -2089 141 1748 -787
1836g87P82R75lo18r12J998j472j489L026k643r71M556l779j133M532l055r52
$$ -787 -5 970 967 349 -563 1435 -37 -1526 1500 -1143 -2114 2442 -1337 -2470 2062 -993 -1945
1853a945L604k162k2J732j469N22J02M27R2k196K423L13l969L574r7l728L975
$$ -1945 1659 -503 -525 1207 -262 260 362 789 881 -1315 1108 1421 -2548 1026 929 -2799 1176
1870A176p18l351M064r04k510K873mj016R51l34M58o31j9J493k630J156K124m305
$$ 1176 458 -2893 1171 267 -2243 630 626 -390 561 227 685 54 35 1528 -1102 54 2178 -2127
1888b127J825K585m561K046J938l767J982J060k666J691O24p80K44l58J439o94
$$ -2127 -302 2283 -2278 -232 1706 -2061 -79 981 -1685 6 630 -150 94 -264 1175 481
1904D81j773L221j725j596L708k936j077L973l371o61L252k317j80J390j258M92
$$ 481 -1292 1929 204 -1392 2316 -620 -1697 2276 -1095 -1756 1496 -821 -1001 389 -869 -377
1920c77M65k09K29p93J586m9k340L067l9l534L682p71k953L687j460k535L354
$$ -377 88 -121 108 -685 901 852 -1488 1579 1540 -1994 1688 917 -2036 1651 191 -2344 1010
1937A010q14j648J661l10l2j06r0J581k087Q54J809l471J756K448m398J805K207
$$ 1010 196 -1452 209 -101 -133 -239 -329 1252 -835 19 1828 -1643 113 2561 -1837 -32 2175
1954B175l755J522J108k464J585J06j316R52j44K85l03p92K535j498j224L553
$$ 2175 -1580 -58 1050 -1414 171 277 -1039 -87 -231 54 -249 -1041 1494 -4 -1228 2325
1970B325k580m34L306l462j29L533l531l8K242j897J72O93q11N84n47P76J14j941
$$ 2325 -255 -689 2617 -845 -974 2559 -972 -1010 1232 -665 -493 200 -611 -27 -574 202 316 -1625
1988a625K582J38l400L787l86l075L834r69k467L207j057j794J829p82k15l3l22
$$ -1625 957 1095 -2305 1482 1096 -1979 1855 886 -1581 1626 569 -1225 604 -178 -393 -426 -748
2005g48J126j283K60J860k618J314J924l574K262J821m059K390J100k989J899
$$ -748 378 -905 -645 1215 -1403 -89 1835 -1739 523 2344 -1715 675 1775 -1214 685
2020F85K19j914J315j64n16k2l67J387j412o15L013k189r74L612k754k47L581
$$ 685 904 -1010 305 141 -375 -397 -764 623 -789 -1404 1609 -580 -1554 2058 -696 -943 2638
2037B638l292J2K691k482J19J046p49L11p05K54L34j566J737k05k240L000m36
$$ 2638 -654 -642 2049 -433 -314 732 -17 294 -411 -157 177 -1389 348 143 -2097 903 467
2054D67k496L463p04k299L179j309j283K648j196j124J134n51M20r41L38J001
$$ 467 -2029 1434 730 -1569 1610 301 -982 1666 470 -654 480 -71 349 -592 -254 747
2070G47k184J222J571l303K254J287l774K401J660l282J747O74j600J184j39l75
$$ 747 -1437 -215 1356 -1947 307 1594 -2180 221 1881 -1401 346 1020 -580 604 465 90
2086I0L12n09N84p64q49K322k041n04K950k705k54L172k932M93K593k933P86J664
$$ 90 402 -107 477 -287 -1136 1186 -855 -1359 1591 -1114 -1368 1804 -1128 -635 1958 -975 -189 1475
2104A475j680M63r0j46O43j240J170l21j762K788j166k443L507j147k166L533
$$ 1475 -205 258 168 22 665 -575 595 274 -1488 1300 134 -2309 1198 51 -2115 1418
2120A418j262j748K971j610l36J612j094L74k21J69Q31k127P82J704k851J615
$$ 1418 156 -1592 1379 -231 -567 1045 -49 325 104 273 1104 -1023 -241 1463 -1388 227
2136B27R58l164K339Q41l182K202P75k248J725k86q08J233m10K24k10l70J489
$$ 227 1185 -1979 360 1201 -1981 221 996 -1252 473 187 -621 612 202 426 216 -154 1335
2153A335j883l25K745k953j70L068l175M89K386k896P55J744k241P82R30q96O10
$$ 1335 -548 -873 1872 -1081 -1251 1817 -1358 -869 1517 -1379 -624 1120 -1121 -339 591 -305 305
2170C05n17O99K79j419J717n83j931K949j388k262L621j622j729L024j509p41
$$ 305 -212 487 766 -653 1064 481 -1450 1499 111 -2151 1470 -152 -1881 1143 -366 -1107
2186a107J814j232J86Q93n90O45j177Q25R83k395J392J099k740K015L36l006K608
$$ -1107 707 -525 -339 554 -36 609 -568 257 1240 -1155 237 1336 -1404 611 947 -2059 549
2203E49L70k736K057N9j245J190k99j86N05o43J161j084n5K107k498J64K440k850
$$ 549 919 -1817 240 299 -946 244 -55 -241 264 -379 782 -302 -357 1750 -748 -584 1856 -994
2221i94J59K741l130Q60J547k679J271P86j227M57o5K25L59j133J666k50j640
$$ -994 -835 1906 -1224 -364 1183 -1496 -225 561 -666 -209 -274 -49 310 -823 843 593 -1047
2238a047K557j075j881L405j568j781K818j618q99J764j124q9R28j029M42k01
$$ -1047 1510 435 -1446 1959 391 -1390 1428 -190 -1089 675 -449 -538 390 -639 -197 -398
2254c98L95Q00j818J582O76k688K146N15k745K706m9k725K538l15j717J580m34
$$ -398 -3 797 -1021 561 1237 -1451 695 1210 -1535 1171 1122 -1603 935 620 -1097 483 49
2271D9o17M55k88M57l50k26J700j938L69K235k815N62K375k768P71J433k591J195
$$ 49 -568 -113 -401 56 -294 -520 1180 -758 -389 1846 -969 -407 1968 -800 -29 1404 -1187 8
2289HP82j872J243p3k98L40q78J310l74j403K228q81j277K844j726j136K864j769
$$ 8 790 -1082 161 88 -210 130 -748 562 188 -1215 1013 132 -1145 1699 -27 -1163 1701 -68
2307f8q36K116j263l77J221j301L04K67m58P20j573J393O02k428K173P22k805
$$ -68 -904 1212 -51 -428 793 -508 -204 63 -395 325 -1248 145 747 -1681 492 1214 -1591
2324a591K210N23k412K400o21j639J923m04o81L95l69M30l57m60J165j489K71
$$ -1591 619 1142 -1270 1130 509 -1130 793 389 -292 103 -266 164 -193 -653 512 -977 -706
2341g06J887k433P55K244k860Q81J871k479J053Q25j780J152L26r05K62l15O05
$$ -706 1181 -1252 -497 1747 -1113 -232 1639 -840 213 1038 -742 410 736 -169 93 -222 383
2358C83m34j040K000r89j253K103j198p71K621j692r41K565j434l61J532j304
$$ 383 -51 -1091 909 -80 -1333 770 -428 -1199 1422 -270 -1211 1354 -80 -441 1091 -213
2374b13M67K83n57Q32j290L99N26j859J568M93k365K306J55k300K121k88j299
$$ -213 254 537 -20 812 -478 -79 447 -1412 156 649 -1716 590 745 -1555 566 278 -1021
2391a021J927n20q00J145l22j89ln23J160j210k05J526j869M75J474k382R96J666
$$ -1021 906 386 -414 731 409 220 217 -306 854 -356 -561 965 -904 -429 1045 -1337 -341 1325
2409A325k724J246J047j665J061M18j088P14j60J59K04j187J462p13j294K143
$$ 1325 -1399 -153 894 -771 290 708 -380 334 174 333 537 -650 812 99 -1195 948
2425I48r60j368K297j504o36K268j789j51J623j012J29P18n32N91n03O1O98j685
$$ 948 -12 -1380 917 -587 -1223 1045 -744 -895 728 -284 -155 563 31 622 119 180 878 -807
2443h07J082M79k213J955J34k291J697K89j896K072n01r13J499n91l58N09l96
$$ -807 275 754 -1459 496 630 -1661 36 325 -1571 501 0 -913 586 -5 -363 146 -250
2460b50R29p88j26J370j715M35J301j990N59J523k355Q05J238j977Q81M62j189
$$ -250 679 -109 -235 1135 -580 -145 1156 -834 -275 1248 -1107 -302 936 -1041 -160 302 -887
2477h87J013l2k28M68p51J114m89q49J720j045j018K148j579m80K082j616l72
$$ -887 126 94 -134 334 -417 697 208 -641 1079 34 -984 1164 -415 -895 1187 -429 -801
2494h01J739j640J37R40o84K87l22L78M96j179J082L12j660J918k22j905K153
$$ -801 938 -702 -565 375 -309 -22 -344 34 530 -649 433 745 -915 1003 781 -1124 1029
2511A029m58j904J955m01j221J365n32o48Q63l59M81k48l01J226j447L49J538
$$ 1029 571 -1333 622 221 -1000 365 -167 -815 48 -311 170 -78 -379 847 -600 -251 1287
2528A287j916O24J322k288J217Q40k227J369M13j524J026m00l04N78m87N88j61
$$ 1287 -629 -5 1317 -971 246 1086 -1141 228 641 -883 143 -257 -561 17 -470 118 -43
2545d3p81J935j253m90K065j262r83K113j684nJ520j626L30O78j037K83K17k82
$$ -43 -824 1111 -142 -632 1433 171 -812 1301 -383 -388 1132 -494 -164 514 -523 -240 -23 -305
2563c05N54r29P18K39j148J107K95j558J890k22j682J805m47j073J528p81m45
$$ -305 249 -680 38 277 -871 236 531 -1027 863 641 -1041 764 317 -756 772 -9 -454
2580d54P58n52K01k19o3N34q19K29J327j813P24J097j663J070R70k109J176M70
$$ -454 304 -248 -47 -266 -329 205 -614 -385 942 -871 -147 950 -713 357 1327 -782 394 864
2598H64j508J030j12m07J87m44M98j03n80P88n62o20J900j559j49J799j169o27
$$ 864 -644 386 274 -133 54 -390 108 5 -575 213 -349 -969 931 -628 -777 1022 -147 -774
2616g74J627j101l6R07j067M91J75l95J64m77N05K97j113R00K36j393J589k32
$$ -774 853 -248 -284 623 -444 47 222 -173 -9 -486 19 316 -797 103 339 -1054 535 303
2634C03j450J995n79j020J585o81n96J026o49m1L57m44M08p16K52Q34j490P34
$$ 303 -1147 848 269 -751 834 153 -443 583 -66 -107 250 -194 214 -502 -250 584 -906 -172
2652a72R46j893J254M95j615J131N48j529J214n6q19Q19k62J48k2o23Q56m37n02
$$ -172 774 -1119 135 630 -985 146 694 -835 379 323 -496 323 61 209 187 -436 420 -17 -519
2671e19J056r42l71J791j555l06J775j385O3R64q36N27L04q26M88l8l5L14r51
$$ -519 537 -405 -776 1015 -540 -846 929 -456 -393 571 -265 262 566 -260 228 190 155 469 -482
2690d82O76K10j265J313k72j285J584m11j163J884q52o11J321q32J14M58l12K68
$$ -482 194 404 -861 452 180 -1105 479 68 -1095 789 -63 -674 647 -185 -71 387 75 343
2708C43j63j49O71j229O37P61j831J011P60j808Q45N20j520J343N1j050R01j09
$$ 343 180 31 702 -527 110 871 -960 51 811 -997 -152 368 -1152 191 242 -808 93 -16
2726a6L5L02n94Q67l37n90J067p68m20J521j633M1J574j759j26J276j184N81N95
$$ -16 19 321 -273 594 257 -333 734 -34 -454 1067 -566 -525 1049 -710 -836 440 -744 -163 432
2745D32r04N96L21n56K92m80O32r1q85J454j55j446J574p24j029J552o55q55J617
$$ 432 -472 124 445 -111 181 -299 333 242 -643 811 656 -790 784 60 -969 583 -72 -927 690
2764F90q26m49P75n61L11Q7k37P55o86J14Q32j388P93N93j678R57M58j381J326
$$ 690 -136 -585 190 -371 -60 27 -210 545 -141 -27 805 -583 210 803 -875 82 540 -841 485
2783D85j49j051R43k34n20Q29m81L51j16l58R64q14qJ148j354J01J365j624K54
$$ 485 336 -715 228 -6 -526 303 -178 173 57 -301 663 -151 -159 989 -365 -264 1101 -523 -269
2802b69J280j500O6O67q68O09N3l52M41n83N23J18n04R31l42r47J347n14q70J610
$$ -269 1011 -489 -423 244 -624 -15 38 -314 127 -456 67 185 -319 612 270 -677 670 156 -714 896
2822H96r97n72J463j042l61Q99n76K05k1l22P34o28n3R41j168Q57M03j511J218
$$ 896 -101 -673 790 -252 -613 286 -290 -85 -106 -428 306 -322 -375 566 -602 255 658 -853 365
2841C65L50j501J385j56j092J062l37n15N83l22k6r9j31P93n88j28J105j149J3
$$ 365 715 -786 599 443 -649 413 76 -439 144 -178 -204 -303 -434 359 -229 -357 748 -401 -388
2860c88J017j238K50J478j517M26P19j059K49L48m59K00l29K86K33q86Q39j99
$$ -388 629 -609 -359 1119 -398 28 747 -312 -63 285 -174 26 -303 -17 216 -670 169 -30
2878c0o57J125n8j060J551q75n63J445j063j95R61p44K33O9k18J37m62K14P00
$$ -30 -687 438 380 -680 871 -4 -567 878 -185 -380 581 -163 70 139 -79 58 -404 -190 510
2897E10j049O00L28j203J070J97j439J562n5j177J265m23l94N44l69J97mk19K07
$$ 510 -539 61 389 -814 256 453 -986 576 521 -656 609 186 -208 336 -33 164 160 -59 148
2916A48m39j71R48p84q4J168j431L67J056j558Q97O05j176M51R01j033K57O1L4
$$ 148 -291 -462 486 -298 -382 786 -645 -278 778 -780 117 722 -454 -3 898 -135 122 183 217
2935B17r9m70M62Q0q36R30n61n50J428p01o74J356n06o40J334q90J32O77p53L12
$$ 217 118 -352 110 190 -646 284 -277 -827 601 -100 -774 582 76 -564 770 -120 12 689 -64 248
2955B48k05K9L02p26K40N45j246Q18L15j184J133N3j316J451k29p38J065l37m57
$$ 248 43 72 374 -352 -112 433 -813 5 320 -864 269 322 -994 457 228 -510 555 218 -239
2974b39N34k32N3J49k17K74o16J10Q34j340K80J038j256L37J022j499P27M13q62
$$ -239 295 63 116 265 48 322 -294 -184 650 -690 -410 628 -628 -291 731 -768 -41 372 -490
2993d90N23J92k95L92o37N37L56r83R27m52o45J181p49n15J469j311PR76j008
$$ -490 33 225 -70 322 -315 222 578 -405 522 70 -575 606 -143 -658 811 -500 -493 483 -525
3012e25J48P83n07J1L09j56K20n58M50L66j085Q30L14j384J005Pj187J348k94
$$ -525 -377 406 -101 -90 219 63 283 -275 175 541 -544 286 600 -784 221 228 -959 389 95
3031I5r27J253m59m47Q26n96K46K39m00M82l86J20P43j252J70J097j492N23P32
$$ 95 -832 421 -38 -485 341 -255 -9 230 -170 312 -74 46 789 -463 -293 804 -688 -165 567
3050E67j250N41M74j061R19p1m42M48j92J73O6n75P53k35q74J499q58m69J450
$$ 567 -683 -142 332 -729 190 119 -323 125 -67 106 172 -403 350 115 -759 740 -118 -587 863
3069H63j126m03J375r97j42N70n74K74J27j46M63m86J48M17r76Q27L39j249R43
$$ 863 -263 -666 709 -288 -430 140 -434 -160 -33 -179 284 -202 -54 363 -613 214 553 -696 247
3088B47K79j136J167k33r06J095o14l31O38l81J42k7j54K67k36o0Q41o53j75J006
$$ 247 526 -610 557 324 -582 513 -101 -432 206 -175 -33 -60 -214 53 -183 -243 598 -55 -230 776
3108G76j143L72Q10j249P76J36q68M54J29o28L82p4l8J94l94O16j83p97J143m31
$$ 776 -367 5 815 -434 342 478 -390 64 193 -435 -53 -127 -165 29 -365 251 68 -729 414 -17
3128a7l22J079o94m08J103r61m4O86o68K99K80p01O66k97n04P99p08L33M13j063
$$ -17 -339 740 46 -362 741 -220 -264 422 -246 53 333 -368 298 1 -503 296 -412 -79 334 -729
3148g29J077l5r64J159j91q24J364n90n55Q15o44j31L04k71K85k00k79Q10q26
$$ -729 348 313 -651 508 317 -507 857 267 -288 527 -117 -248 56 -215 70 -130 -409 401 -425
3167d25K03P47j131N12Q02j124M95N64r08O20L3q91Q30q4l51L57n31L18n6q07
$$ -425 -222 525 -606 -94 708 -416 79 643 -265 355 388 -503 327 243 -108 249 -282 36 -20 -827
3187h27J226n88k04R48o28m41J363j184j39R87p84J57N71n93M23k08k42L95m58
$$ -827 399 -189 -393 555 -73 -514 849 -335 -474 513 -271 -114 457 -136 287 79 -163 232 -226
3206b26J19K39p32Q38k04o30P03j4o27J102n48m53J118p12k8M27k65Q6j35l13
$$ -226 -107 132 -600 238 34 -596 107 93 -534 568 20 -433 685 -27 -55 372 107 193 58 -255
3226b55O47n59j61N99p31M25O10j275N41P48j078P37k3p39O43pk69M23l80L24
$$ -255 392 -167 -328 271 -460 -35 575 -700 -159 589 -489 248 225 -514 129 122 -147 276 -104 220
3246B20p8n01Q02o78m19J168p81l16Q70o75N5Q99j075J82P43m07J58J45m50K35
$$ 220 142 -359 443 -235 -654 514 -267 -583 287 -388 -333 566 -509 -327 416 9 167 312 -138 97
3266I7N1j26L66n76N01O8j078J075k34q39J053l37l94J062o58l26P79o59K09p1
$$ 97 148 22 388 -188 313 381 -697 378 144 -695 358 21 -373 689 31 -295 484 -175 34 -37
3286c7j40M71k65L6N66r11J41N42q12N58K10q87N57K14q91R31j36m71M41k64J25
$$ -37 -177 294 29 65 631 -280 -139 403 -409 149 359 -528 29 243 -648 283 147 -324 117 -147 -22
3307b2K15k46J68j54l15Q56n91k01R29j000j2R74j291N25P86j185L91L24m56K89
$$ -22 193 -53 115 -39 -354 502 -89 -290 639 -361 -373 601 -690 -165 621 -564 -173 151 -305 -16
3327a6L6k2M32p24N50j9o15P81Qj025J046l16n37P70n04k17O99o71lM52l01N18
$$ -16 20 -2 430 -294 256 237 -378 403 411 -614 432 116 -421 349 -155 -372 327 -344 -347 105 -196 322
3349C22l16j69O89o90J57N39q64M21M36j149P50J05r34Q14l0m03M46k12M6J23
$$ 322 6 -163 526 -164 -7 532 -332 89 525 -624 126 231 -703 111 81 -322 124 -88 -42 81
3369H1k37J59n2j51N98m39l89R92o46j92J026j132Q1P82j078M22M05o25N37k32
$$ 81 -156 3 -49 -200 398 -41 -430 562 -84 -276 750 -382 -301 481 -597 -175 230 -395 142 -90
3389i0j53M43n45N22J0n41P11n3n62P95k79p01J139o39l81P06p64J77K21k74K83
$$ -90 -243 200 -345 177 187 -354 357 304 -258 537 258 -443 696 57 -324 382 -382 -205 16 -258 25
3410B5k24N0J84j53M8N32j103N34L30q59R48K57j082Q14Q3q90P89j21l72M26m84
$$ 25 -199 -149 35 -118 -70 462 -641 -107 223 -636 312 569 -513 301 384 -506 283 162 -210 216 -268
3431b68O9M12p93P30j13m95Q81n95q6R75r84K31N77p08M23J01p44N44k5l29L05
$$ -268 -199 213 -580 150 37 -458 423 -172 -258 717 -267 -36 541 -167 256 357 -387 157 132 -197 108
3452A08l38J31L35q54P30l0o84J066m04n60J137p96j94R50n59K0L87n88M7L32
$$ 108 -230 -99 236 -618 112 82 -602 464 60 -500 637 -159 -353 597 38 58 445 -143 -96 236
3472B36l76K67k95l6N95o78J88O48j008N53K01o82O79N7q41J026l03k12L10k77
$$ 236 -140 127 -168 -204 391 -287 -99 549 -459 94 295 -387 292 349 -492 534 231 19 329 52
3492E2j44J99m55L75j8m14N92n78J9R96j012J84O52q96M67N77p76K91K31l55K01
$$ 52 -92 107 -348 27 9 -405 187 -391 -372 624 -388 -204 448 -448 19 596 -180 111 342 -13 188
3513A88j82O0J08n66O09j78n34P19m97j43O92l58m07J135p33l6L35k47N3K92m68
$$ 188 6 66 174 -392 217 39 -495 224 -273 -416 276 -82 -489 646 -87 -123 212 -35 18 310 -158
3534a58J70m7o2N02p69L97K37p76L46M46p67P88r5o34O23j52l74M96m2j80P7p7
$$ -158 12 -35 -97 405 -364 33 270 -506 -160 286 -481 307 212 -422 201 49 -325 171 129 -51 26 -51
3556e1K97k55n9M58m01r0O83q48m4Q04o76p6N93p00L68K48n84N82j77k18L72m35
$$ -51 246 -9 -68 390 -11 -101 582 -266 -310 494 -182 -258 335 -365 3 251 -333 249 72 -146 226 -209
3578b09M09J0o05P03l38m98P36n24k31P88m50q6O80n72K36Lk40O04k29l60M63
$$ -209 200 210 -395 308 -30 -528 208 -316 -547 241 -209 -295 385 -187 49 52 -188 416 187 -173 290
3599B90m31K67J60p73M29N36p28L38k1n61Q08m40j96M82l07P8J76k19J84k2k61
$$ 290 -141 126 286 -487 -58 478 -250 88 67 -494 314 -126 -322 160 -147 -69 107 -112 72 50 -211
3620b11N44l21m6O00q77K89M51o90K14L21p49O33J01p25N75o1l68O25o40M34J94
$$ -211 333 12 -34 566 -311 -22 429 -261 -47 274 -475 158 259 -466 109 48 -320 305 -335 99 293
3641B93o69P80k76m10P46k42n56O26o83J93O30p04J34L87m89J38R3k65N10k97
$$ 293 -376 404 128 -282 464 222 -334 292 -391 -198 432 -272 -138 249 -240 -102 -9 -274 236 -61
3661f1j1L80o29N53n0n12N68R0p20P78l14n18P32l21j08N37o72K33J09l22M70
$$ -61 -72 308 -321 232 182 -330 238 328 -392 386 72 -446 286 -35 -143 394 -278 -45 64 -258 212
3682B12j72k45M84l62M2M01n41K82K73o31K71K62n55K14J29k63K57k04J07N3l09
$$ 212 40 -205 279 -83 -41 360 -181 101 374 -257 14 276 -279 -65 64 -199 58 -146 -39 14 -295
3703b95L67M7n49Q30k76m36O67n56J26N13n62o4O15o26J21K54j60K81m06N5M27
$$ -295 72 119 -430 400 124 -312 355 -201 -75 438 -124 -188 427 -199 -78 176 16 297 -109 -54 373
3724C73n76J49M4l77N54P2o07N26m4k63L14j32j33N18n53J18L17l79K6P2k95K97
$$ 373 -203 -54 -10 -387 167 239 -368 158 114 -149 165 33 -100 418 -135 -17 300 -79 -53 19 -276 21
3746B1l09q6Q55o12k6N70o92K94M14m78J68J10k97K00o8l00M50k20J35J55o72
$$ 21 -288 -374 481 -131 -157 413 -279 15 429 -49 119 229 -68 132 64 -236 214 -6 129 284 -388
3767c88O36k34m68P00k80n9M26k47k31O49p24L87L72n57N2p2R0J30l10J74K21
$$ -388 248 14 -454 246 -34 -93 333 86 -145 504 -220 167 539 -18 34 -38 52 182 -128 46 267
3788B67q38N30K60o80M13L39o47N91j73k88M82k90J03J28k69K41m9l93O54l87
$$ 267 -571 -41 219 -461 -48 291 -356 235 62 -226 256 -34 69 197 -72 169 120 -273 381 -6
3808fm6L22m96N0L63n75K41L81p11N61L4m25L31l7qK71l29J15J72m52L92p6j93
$$ -6 -52 270 -226 -176 187 -388 -147 234 -477 84 118 -307 24 -13 -21 250 -79 36 208 -244 148 72 -121
3831a21L12l46k98O92m36O4K64l99L46oj55K48j57m4L9j90M40n8o54O06k0n39
$$ -121 191 -155 -453 239 -197 -133 131 -268 78 72 -83 165 8 -36 3 -187 253 195 -459 147 127 -412
3853d12L96j7m17O23j30l95P19m06j91M61l55J18K34k89J75j84j0L98n11N9M69
$$ -412 -16 -33 -450 173 43 -352 367 -39 -230 231 -124 -6 228 -61 114 -70 -80 318 -193 -134 335
3874C35p55L70L72p91N10J28l75M55j95j30L17l21J86M9j63K02q8k10N88o98j99
$$ 335 -420 -50 322 -469 41 169 -206 249 54 -76 241 -80 106 155 -8 194 106 -104 484 -214 -413
3895d13R47q91J76N21o01L5L19m69M21J23l45K40R4k15K25m16L50K60n51M05l9
$$ -413 534 -357 -181 340 -261 -226 93 -376 45 168 -177 63 157 -58 167 -249 101 361 -190 215 176
3916A76o07P06l67l82Q93m23m22N62m49L60J08l52L63j28k63M37l59P6K64n82
$$ 176 -431 275 -92 -474 419 -4 -426 136 -313 47 155 -197 166 38 -225 212 -147 -71 193 -389
3936c89L11M56n80K02J99l68K57Q0o14M23l2P0J99n28O86l78l48N05q7l81P39
$$ -389 -78 378 -202 0 199 -169 88 168 -446 -23 -55 15 214 -314 372 -6 -354 151 64 -317 422
3957D22p84K92N89n11j35K87n31L04N7p1K81j48r9n2j39N13J1n76L91M56r91P74
$$ 422 -362 -70 519 8 -127 160 -371 -67 -10 -81 200 52 -47 -99 -238 275 286 -290 101 557 -434 340
3979C40m62l31P72k20l24L77m09p5M12m33M39o4l47N35l52l7M53m53K2M01n50
$$ 340 -122 -453 319 99 -225 152 -257 -332 80 -353 86 22 -325 210 -142 -179 274 -179 -157 244 -306
4000c06J97L18n90O99l51K5R7J4j28Rj43r2M47n81O52k31l45N47k98l8M67n97
$$ -306 -109 209 -381 318 -33 -8 89 103 -25 -16 -159 -251 196 -385 267 36 -309 238 -60 -98 369 -228
4022b28K17M82n32NJ80k04J80r9k22L55k89j12M45o13L80J55n70P01j37n46Q46
$$ -228 -11 471 -61 -56 124 -80 100 1 -221 134 -155 -267 178 -435 -55 100 -470 231 94 -452 394
4043C94l69j22N04o13J1N00l61J36j27mK42k33j66M65n45K90J46m42K78M62o26
$$ 394 25 -97 407 -206 -195 305 -56 80 -47 -51 191 -42 -208 257 -288 2 148 -294 -16 446 -180
4064a80K76J81m17N19l21J1J64l35j36L99n05O04l23l95O73k82k06Q86q29j06
$$ -180 96 277 -140 379 58 69 233 -102 -238 161 -344 260 -63 -458 215 -67 -273 613 -216 -322
4084c22Q83p00K72J53m96N11q8k10J19k32K7M23m08K36M6o83P70k27m52P16k59
$$ -322 561 -139 133 286 -210 301 213 3 122 -110 -83 340 -68 168 214 -469 301 74 -378 338 79
4105G9m29P29m12lL78l40J43rl81M03l01l5M98o58K71K67q14N26K67k93L94o5
$$ 79 -350 379 -33 -36 342 2 145 136 -245 158 -143 -178 320 -338 -67 200 -614 -88 179 -114 280 215
4127B15n71N44j89j46M33k90N4l8k30L08j37%L65m76j41N07l47j09M31m00K27
$$ 215 -356 188 -1 -147 286 -4 50 12 -218 90 -47 -47 318 -158 -299 208 -139 -248 183 -217 10
4148A0J99m69L23J67l14K69l87J79P1o4O0K53n03M12J1o96P30j39l09M25l32k93
$$ 10 209 -260 63 230 -84 185 -202 -23 48 -16 44 297 -206 206 217 -479 251 112 -197 228 -104 -397
4170c97N09j70j49M09k34K19k70o9M34l55mK60k82M7M32o82N28J4o18N39n3n00
$$ -397 112 -58 -207 202 -32 187 -83 -152 282 -73 -77 183 -99 -52 380 -302 226 240 -378 161 108 -392
4192c92M76j97N2M26m31pJ04k88M41j53k51N47m90M3N54o54K05J21m38K65K47
$$ -392 84 -113 -61 365 -66 -73 31 -257 184 31 -220 327 -163 -120 434 -220 -15 106 -332 -67 180
4213A80l59O5J03j39K88l97J82J28m74P59j44l57O88l90n97P54k38j60L05l47
$$ 180 -179 -114 -11 -150 138 -259 -77 51 -423 336 192 -165 523 133 -464 290 52 -108 197 -150
4233a50K81Ll12J62r2l7K27r7K4L25n07K50K25o05L89K83n07M67k58k81N02k77
$$ -150 131 134 -178 -16 -108 -145 82 -15 9 334 -173 77 302 -303 86 369 -138 329 71 -210 292 15
4255A5L2q4o7J23P0l60M61j37j97L80m55J81M01o30Q8L17m36J58L43l96J44K1
$$ 15 47 -37 -104 19 89 -271 190 53 -144 236 -219 -38 363 -267 -179 138 -298 -140 203 -193 -49 -28
4277b8j57L99l52j04N38o06K38P3m11N42J1m54N34n3m24O52n09R2J87m64M63p5
$$ -28 -185 214 -138 -242 296 -310 -72 1 -410 132 143 -311 223 170 -254 398 -111 -19 168 -296 167 92
4299I2k74J64J2l7K48n12K30L92p29L27L48o48K74L31n26M65l91J62kj37J19J9
$$ 92 -182 -18 -6 -43 205 -307 -77 315 -414 -87 261 -387 -113 218 -308 157 -234 -72 -74 -211 -92 -73
4321g3j65K31j2j70L12l08j15M88j45o8N33o36K81J40m60M04j94l4J10q4j33K77
$$ -73 -238 -7 -19 -189 123 -185 -300 188 43 -25 508 -128 153 293 -167 237 43 9 119 35 -98 179
4343A79m65L31J11n26N93k09m53O30k35j45N20l35q2L12l81J32J93l15L33k63
$$ 179 -286 45 156 -370 223 14 -439 191 -44 -189 331 -4 -86 226 -155 -23 170 -145 188 -75
4363g5K1K09l26K70K08n62R8L75o98N68om78O44j8l80M41k51k10L34k80K25L2
$$ -75 -54 155 -171 99 307 -255 -157 218 -480 88 82 -396 248 230 -150 291 40 -170 164 -116 109 141
4385A41n79N66l10j22N09n08K16L17n38K68M04m44nM59o44L16J1j73L52m08J62
$$ 141 -438 128 -182 -304 205 -303 -87 230 -308 -40 364 -80 -85 374 -270 46 57 -116 236 -172 -10
4406a0J04l58M77j41n63O56j42k94O56n59j16L93k36J09M89o59J47J97l23R2O8
$$ -10 94 -264 213 72 -491 165 23 -271 385 -174 -290 103 -133 -24 465 -194 -47 150 -173 -81 -13
4427a3P1J79m34K59P3m67L32J42m82O83m10j31L40j09k96N24l27J72K23n87L98
$$ -13 58 237 -197 62 135 -332 0 142 -340 343 -67 -198 142 33 -263 261 -66 106 329 -258 140
4448A40m4l25M17l91Q7L19m35O4M69o34R9M52l61L15j33l01M21j34l5J64l05M02
$$ 140 96 -229 188 -203 -116 203 -232 -168 301 -333 -234 218 -143 172 39 -262 159 25 -10 154 -151 251
4470B51O2o31P66k65l69O19n42j40L55m42K86J12j47J27o2q7J25j75K13K94l40
$$ 251 313 -318 448 183 -186 433 -109 -249 106 -336 -50 62 -85 42 -20 -107 18 -157 56 350 10
4491A0J12J18o42N12J79l79J53R7m45M88k34l10N29k31r0K76l77L39mk45L48Q0
$$ 10 122 240 -402 110 289 -90 63 160 -285 203 -31 -341 188 -43 -133 143 -234 105 101 -144 204 284
4513B84m38L60k78l09N88m50J27M27o11K58o8j05m5m2L90O7k39n3J88m05P08l18
$$ 284 -154 206 -72 -381 207 -243 -116 311 -300 -42 -110 -215 -260 -302 88 155 -84 -137 51 -354 354 36
4535C6l80O06k48j92K65k43O2M36o44M63k78j13K05n7k51M22k82q3N48n35O97
$$ 36 -344 262 14 -178 87 -156 -94 342 -302 161 -117 -230 -25 -82 -333 89 -193 -276 272 -263 434
4556D34k43m00J73qk10L10J44m02K60m7j63OK4K14j74j74N91n50K76K89l82q2
$$ 434 191 -209 -36 -44 -254 56 200 -202 58 11 -152 -146 -122 92 -82 -256 335 -215 61 350 -32 -114
4578a14J92k61R4K77n00L01K17n13N45l96k8J76j41J2j3o4K93Q4o07O47j86l29
$$ -114 78 -183 -89 188 -312 -11 206 -307 238 -158 -186 -10 -151 -139 -152 -216 77 161 -446 201 15 -314
4600c14L68Qj73L90l95k2K38R7j91J80n23O38n11J86J11m54K92K23m32L65l8k62
$$ -314 54 62 -111 279 -116 -138 100 197 6 186 -337 301 -210 -24 87 -367 -75 148 -284 81 43 -219
4622b19N41k92l42N90k49q8L31n00K81J27j52Q3j31k19N52k50k47L88m64K7M39
$$ -219 322 30 -312 278 29 -59 272 -228 53 180 28 111 -20 -239 313 63 -184 204 -260 -233 206
4643B06m28K82K61o55L59J14j96J29q4J5K76n17M33J03n11L53k64k48O57m55j45
$$ 206 -222 60 321 -334 25 139 -57 72 -12 3 279 -238 195 298 -213 140 -124 -372 285 -170 -315
4664c15N10k64N8J32k41L28R0m18L07O4m88L79l11K03J88l71M00n3o26M07K3k84
$$ -315 195 -69 -11 121 -120 208 298 -120 187 251 -237 142 -169 34 222 -149 251 198 -428 -21 2 -282
4686b82O17m44L8L30k11k9M2k48J61M8l04M73l11O2M16n14J10K88n40K97M0j79
$$ -282 335 -109 -71 259 48 19 61 -187 -26 22 -282 191 -120 -58 358 -156 -46 242 -298 -1 39 -140
4708a40Q0J14r4J01j76K83K6j98K92k70r7L50k92l03O00l53k63M96j44k04M80
$$ -140 -60 54 -40 61 -115 168 194 -4 288 18 -79 271 -21 -324 276 -77 -340 156 12 -192 288
4729B88k94L0Nj11J01N8j25M85o15K89K27n48K66J70n54L80l1j62L27j97m5J37
$$ 288 -6 24 29 -82 19 77 -48 437 -178 111 338 -210 56 226 -328 52 21 -141 186 -11 -56 81
4751H1j29J41j09j65M79j27k88K20k66m0N83l13j25M77n99R2L09l55K78J3l88
$$ 81 -48 93 -16 -181 298 171 -117 103 -163 -203 380 67 -58 419 -180 -88 221 -134 144 157 -231
4772b31L96j00l85O19o13M28K67n38J02J66l09M64l21j66P51o91k0L93l30J67
$$ -231 165 65 -320 299 -314 114 381 -157 -55 111 -198 266 -55 -221 530 -161 -181 212 -118 49
4792D9J17o9j50N7j32J6l7J95J61l77J96J87n47L41J5l61L52K48n13M10j32KJ27
$$ 49 166 97 -53 4 -128 -112 -149 46 207 -170 26 213 -334 7 22 -339 13 261 -252 158 26 28 155
4815A55k31K33j59j39J96J14k74L64l72J08M29p59J81M00l11j4Nk19J56K73k85
$$ 155 -76 157 -2 -141 55 169 -105 259 -113 -5 424 -335 -154 246 -65 -79 -74 -293 -137 136 -149
4836a49L72m48L12K7k40K96j03k72N43k94j56K58r6l00N28m35Q3L33n22K85J04
$$ -149 223 -225 87 114 -126 170 67 -205 338 44 -112 146 50 -250 278 -157 -74 259 -263 22 126
4857A26j76L25l54r0M07l65R4J60m57N99Ml89L81j66j35N29m31n47O18j66J40
$$ 126 -50 275 -79 -169 238 -127 -33 127 -330 269 273 -116 265 99 -36 493 62 -485 133 -33 107
4878A07j72k73O08k10j01J73k82j76N16m18J08M65m07L85M2n14K06m9r7L16j14
$$ 107 -65 -338 270 60 -41 132 -150 -326 190 -228 -120 345 -62 323 365 -149 57 8 -89 227 113
4899A13k8R9l83L27l4l79L27J9m95P15l98j38M73k90O2L49m28n0K86j42R4p6q5
$$ 113 85 184 -199 128 94 -285 42 61 -434 281 -117 -255 218 -72 -10 339 -89 -139 147 5 99 23 -62
4922f2J71m10J93K08k90L20M0m11M28l6m08L54j5q7L77k40j24jj82K51k46M5L24
$$ -62 109 -301 -108 100 -190 130 170 -241 187 151 -257 97 82 -5 372 132 8 7 -175 76 -170 -125 199
4945A99m10J64J79k05n8L79l45J61J52o35O51o5m03M09m9k43K11l40N97k55l97
$$ 199 -211 -47 132 -73 -131 248 -97 64 216 -419 232 167 -236 173 124 -119 92 -248 349 94 -303
4966c03N48j11l95L57j16j84M14l14k7M48k63O1m9k27L12j52j84L60k51k9L66
$$ -303 245 134 -261 96 -20 -204 210 -104 -131 317 54 115 66 -161 151 -1 -185 175 -76 -105 261
4987B61l71P7K7j79L78j61l70L84K1k59J70n5Q1R1k61J88j71j1L90l43KK90l16
$$ 261 -110 -33 -6 -185 193 32 -338 46 67 -192 -22 -77 4 95 -166 22 -149 -160 230 -113 -111 179 -137
5010a37Q2L08n61M44P4m99K88L0k10J33k9J04L23l08j55L47k28J50k85r8M36j70
$$ -137 -55 253 -308 136 210 -289 -1 29 -181 -48 -77 27 350 42 -113 234 6 156 -129 -227 209 39
5032C9j26K43j90k5L54o24K59L00l61K32k3k02K21j08P0J48k65J09J42l44K22
$$ 39 -87 156 -34 -59 295 -329 -70 230 -131 101 78 -124 97 -11 59 207 -58 51 193 -151 71
5053G1K1k71K74K51o54N30l21j67L33j97m6K73j85L12j88j04L22l47J6L92o42
$$ 71 92 -179 95 346 -308 222 -99 -266 67 -130 -176 97 -88 224 36 -68 254 -93 -77 315 -327
5074c27K27L31l40J77J2l83K16R5k60L49j63J00J76m00M33j70j67N29n48r7M37
$$ -327 -100 231 -109 68 80 -303 -87 8 -252 97 -66 34 210 -190 243 73 -94 435 -113 -210 227
5095B27k99k9K97k91J86L53m54n8J49k78K24qk32M81k39j17J62j66K21q7n11O68
$$ 227 -72 -101 196 -95 91 444 -10 -68 81 -197 27 19 -213 268 29 -88 74 -92 129 42 -469 199
5117A99k48q6J76k86K39L45m85m4J41J23J97k26k49L34j94o3O18o47p0M85n60
$$ 199 -49 -135 41 -245 -6 339 -146 -190 -49 74 271 45 -204 130 -64 -127 491 -156 -226 259 -301
5138c01L44K68m99L46l7m09P92m05k59K97m19L05O3l79N75k50k49O30k64j97M73
$$ -301 43 311 -188 158 121 -288 504 99 -160 137 -282 23 86 -293 282 32 -217 413 149 -48 425
5159D25o45J88L07m25R9J03l71K23R8l1K2k18L78n6l37M29j77j92J68J23j96J73
$$ 425 -220 -32 275 -150 -51 52 -319 -96 2 -29 -7 -225 153 97 -240 189 12 -180 -12 111 -85 88
5181H8k54o5N36m70J84J54l95L56R9l56J89o2k16N53m59OL43m95L20P9l87K17
$$ 88 -166 -231 305 -165 19 173 -222 134 233 -123 66 4 -212 341 -118 -112 231 -264 56 135 -252 -35
5203c5J74l38M19m5j06J98k53J32j82m1J60j38o8K07rk62L67k71L9K71l10J41
$$ -35 139 -199 220 175 69 267 14 146 -36 -77 83 -55 -123 84 75 -187 180 -91 -52 219 -91 50
5225E0J74m17K32n4m4L12m04J72K43m60K26J08n15N04J56o63O79j74k38K89k30
$$ 50 224 -193 39 -15 -59 253 -151 21 264 -196 30 138 -377 127 283 -380 299 125 -113 176 -54
5246e4rJ05j46O8J12j63L21l27j13L49m30K00J55k15M08m2m79K57K62n09L36K2
$$ -54 -63 42 -104 -36 76 -87 234 -93 -206 143 -287 -87 68 -147 261 219 -260 -3 259 -250 86 108
5268A08l46N75l42K1J5l40M59l00J01rn1j65M69m92Q5N47m73K44J31l22J47J18
$$ 108 -238 337 -5 16 31 -309 150 -150 -49 -58 -109 -274 195 -297 -212 335 -138 106 237 -85 62 180
5290A80m33J79M0L3L58l05P6p6j89K42p2l74M99q7k83N27k41k78L25m19J45J55
$$ 180 -253 -74 -34 -1 357 52 128 52 -137 105 33 -341 158 71 -212 315 74 -204 121 -298 -153 2
5312Bq7K87M8n11M25r8j35M20n86K29L80m92J79j9l75M63j10k83M24k99J23J44
$$ 2 -85 202 250 -261 164 66 -69 351 -235 -6 374 -118 61 42 -333 130 20 -263 161 -138 -15 129
5334A29l53K09R8k44J12o9rN15n95k02N18l66J14L24k58K59j63l67K67k8O1L99
$$ 129 -224 -15 83 -161 -49 -118 -127 388 -207 -409 109 -257 -143 181 -77 182 19 -348 -81 -109 -48 351
5356C51l75K65R1p35L90J94k40J21O6k89M50l97m7M64n51J54K15k02p9L57m07
$$ 351 -24 241 332 -403 -13 181 -59 62 128 -161 289 -108 -155 309 -242 -88 127 -75 -154 203 -204
5377b04M35k04j02K88l57J7K94l88K22K93n05M73l76j19L46O6m64K94j01P4J05
$$ -204 231 27 -75 213 -144 -127 167 -221 1 294 -211 262 -114 -233 113 179 -285 9 -92 -18 87
5398H7l38K49J28k22K63k79k47O32k75j44K67k32J37J28l80K72j46m9J89k61P0
$$ 87 -251 -2 126 -96 167 -112 -359 273 -2 -146 121 -111 26 154 -226 46 -100 -149 40 -221 -151
5419a51L79n98M43R9m58N50k41m07N81r5l64M63r8j60K18k67K27k39n2M19l62
$$ -151 228 -370 73 172 -286 264 23 -384 197 102 -262 201 103 -57 161 -106 121 -118 -170 249 -113
5440a13r5M16l74K17K53l79J35O4l79M79r0l12M64l33l2M32n53K04J24j59K8N0
$$ -113 -208 208 -166 51 304 -75 60 124 -255 224 134 -178 286 -47 -79 353 -200 4 128 -31 -3 47
5462D7j03L50j90j67M69l02m3K95o69L66J61n83M56r2q7J90j31k8J37l56K50J29
$$ 47 -56 294 104 -63 406 104 61 356 -313 53 214 -369 87 -5 -92 98 -33 -61 76 -280 -30 99
5484I9m37L75J24n66N66p6j64M57m24LJ09r0q2K88k72J28j31M9M08m69n1L40l56
$$ 99 -338 37 161 -405 161 85 -79 378 -46 -43 66 -24 -106 182 -90 38 -93 -44 364 -105 -156 184 -172
5507a72K58J59n30M75l8l56M53k61j0K86o04K12L26l39K92q1l41N10k85j51M08
$$ -172 86 245 -285 190 152 -204 249 -12 -22 264 -340 -128 198 -141 151 70 -271 239 -46 -197 211
5528B11j53k56N26m76M4L48n48K66J80k02K33k06M1P9nK86k19m98N93j85k91K61
$$ 211 58 -198 328 -148 -104 244 -304 -38 142 -60 173 -33 8 87 82 368 149 -349 244 59 -232 29
5550B9J6n2J86p9Kk4j67O9J31m29L47P1j32J29k99Q6L61l45K52o5l61M55j01l76
$$ 29 45 -7 179 100 102 78 -89 -20 111 -318 29 100 -32 97 -202 -116 245 -100 152 87 -274 181 80 -296
5574b96J93J39k32L64j68K4l6k07K04J91l08M37j60n29R04o42J54J86m74J64M00
$$ -296 -103 36 -196 168 0 24 -12 -219 -15 176 -132 305 145 -384 520 -122 32 218 -256 -92 308
5595C08m48M25k55k58K76k2j67M48l78J96J34l79J52K53m79N77n23j74O58m51
$$ 308 -140 285 30 -228 48 26 -141 307 -71 125 259 -120 32 285 -194 383 -140 -314 344 -107
5615a07P2J4j2q1K68l46J95j15o3M46k07j29N05n13l9J00k30K99O5l41K46l3j86
$$ -107 -35 -21 -33 -114 154 -192 3 -112 -175 271 64 -65 440 -73 -112 -12 -242 57 122 -219 27 -6 -192
5638a92M50j50l03L38k65J16L44m95O2P0k76N89j17l70M49k64p5L73m65J53q8
$$ -192 258 108 -195 143 -122 -6 338 -157 -95 -25 -301 288 171 -199 250 -14 -89 284 -181 -28 -116
5659a16j32M34k39k67N40l43J01L78l73j00L44l53K95j95k01L61k39j88M64j78
$$ -116 -248 186 -53 -320 220 -123 -22 356 -17 -117 227 -126 169 -26 -227 134 -105 -293 171 -7
5679gk37L16l03K40N6k07K02m0l29L84k42K81q7j93K17J51m11L88j22l53M77k11
$$ -7 -244 72 -231 9 65 -142 60 20 -309 75 -167 114 27 -166 51 202 -209 179 57 -296 181 -30
5701c0j67L49j91K38j60j27R0N6k31M30l09j25M78k58l5J59m01L51J72m11J06
$$ -30 -197 152 -39 199 39 -88 2 58 -173 257 -52 -177 301 43 8 167 -234 117 289 -122 -16
5722a6R9k55M18l75P5J33l54L48j38r0L2O5k99O81k04n54O71j30n8K55m50J67
$$ -16 83 -172 246 -129 -54 79 -275 73 -65 -155 -123 -58 -357 324 120 -434 237 107 49 304 -146 21
5744B1Q8k57K14q8k8K18m68L08O5m45L10K50l31L92r2m01L47m6j91L22l51J95
$$ 21 109 -148 66 -22 -50 168 -300 8 73 -372 -62 188 -143 249 157 -244 103 57 -134 188 -163 32
5766C2J68l84J83K44l08M26k76m45K72J03l08M53l34L03J48l67P9R7j41L96m47
$$ 32 200 -184 -1 243 -65 361 85 -360 -88 15 -293 160 -174 129 277 -90 -11 86 -55 341 -106
5787a06J07K45l40K0K31l44L75q4m57M43o3j79L00k66M5L41m42J38K04l69J85
$$ -106 1 246 -94 -74 157 -187 188 104 -353 90 27 -152 148 -118 -73 268 -174 -36 168 -201 -16
5808a6J09l62M10j53l6J38n32M75K97m92J12J59l31L98m5k23N5Ok6K85m01R0L73
$$ -16 93 -269 141 -12 -48 90 -442 33 330 -162 -50 109 -222 176 131 -92 -37 -31 -57 228 -173 -83 290
5831B90l61K09L0l43N57n40J84K3j20L6J04l38M55P2m47K74j07j33L66j99l2P2
$$ 290 -71 138 168 -175 382 -158 26 49 -71 -35 69 -269 186 258 -189 85 -22 -155 211 12 -20 52
5853E2o1nK22m37M29k15m44Q04n12j81L24j67m0N10o19K88K93k44Q4j67j6J96
$$ 52 -9 -14 208 -229 200 -15 -459 345 -167 -348 -24 -191 -231 279 -340 -52 241 -3 81 -86 -102 94
5875I4k28K00P8l96K76K23n36L38j81k39L83k40J52K18l59R6K1j77M35l8l74N11
$$ 94 -134 66 144 -252 24 247 -289 49 -132 -371 12 -228 -76 142 -217 -121 -100 -277 158 120 -254 257
5897B57j25j47J25k64q6L49j92J6J60m92M93o1j20O6Pj12L23l33J85j54q5N01
$$ 257 132 -15 110 -154 -240 109 -83 -67 93 -399 94 33 -87 -21 -14 -126 197 -136 49 -105 -190 311
5919C11k86k25L33l01lL28j89m0K97l04N7J34k75J08J05j50J80n6m04M67k69J91
$$ 311 25 -200 133 -168 -171 157 -32 -72 225 -79 -22 112 -163 -55 50 -100 80 24 -380 87 -182 9
5941IK05k90R9J33m14M11j65j56J84k73K53K11k11M4j09k41M30j81q0N28n47J3
$$ 9 214 -76 23 156 -258 153 -12 -168 16 -257 -4 207 -4 40 -69 -310 120 -61 -141 387 -160 -147
5963a47L55l64K67Rl42M27J11n73L33o4j67J77r9J13Qq9L45l10k72M93j82k31
$$ -147 208 -156 111 120 -222 205 316 -257 76 12 -155 22 -77 36 44 -45 300 -10 -282 211 29 -202
5985b02K31j47L0K39k74J96J71l07K21N4k76K37k10j95L01j00M3K09l84K95R4
$$ -202 29 -118 -88 151 -123 73 244 -63 158 212 -64 173 -37 -232 69 -31 12 221 -163 132 226
6006B26m07L54j94j24J96j59n3K65k34L05o5l38K42q9j18L33l16K28K70n50J31
$$ 226 -181 173 -21 -145 51 -108 -161 104 -130 175 110 -228 14 -75 -193 140 -176 52 322 -228 -97
6027i7L65l07j81M35l52K41J05k87K27k61K92j04j21J63j77N7N9%m33N60l69J60
$$ -97 268 -39 -220 215 -137 104 209 -78 149 -112 180 76 -45 118 -59 -2 57 57 -376 184 -185 -25
6049b5K4o3J25J38k80%K56j15j71P9J03j9k66K64J96m34J92j0m31P49j18l07M07
$$ -25 -1 -64 61 199 -81 -81 175 60 -111 -32 71 52 -214 50 246 -188 4 -6 -437 312 194 -113 294
6072B94m04K51j3k17Q7K80l43J86l23q9L31Oj60K56M2k71K52l25K59Ok40K95r4
$$ 294 -110 141 128 -89 -2 278 -65 121 -202 -291 40 46 -114 142 184 -87 165 -160 99 105 -135 160 66
6095F6j35M9j17J06J62l07K25n3k75M53j23n2K45j96l59N43l19N1J31j75K00m2
$$ 66 -69 -20 -137 -31 131 -176 49 -4 -279 174 51 -1 244 48 -311 232 -87 -36 95 -80 120 78
6117G8o4l9j60K7M19m89J99M43n53j9K96k49L21j82j53J45Nj40O3J84j11J89k03
$$ 78 14 -25 -185 -158 261 -228 -29 414 -139 -158 138 -111 210 28 -125 20 25 -115 -52 132 21 210 7
6140Gp2L6j73L52k77P6K55j86q1K71k97J35P4k89K71L9l27M02n7j13q1k13L32
$$ 7 -65 -29 -202 150 -127 -51 204 18 -63 208 -89 46 120 -169 102 141 -186 216 159 46 -35 -248 84
6163H4O6k52K09l7l58M65j82j58M25m14P9L66m48P2K69l29O7J11r1L58k69j83
$$ 84 150 -102 107 70 -288 177 -5 -163 262 -152 -73 293 -155 -83 186 -143 -76 35 -56 302 33 -150
6185a50L65l52J39J21j64J40p5j18L25j70j79K55j50j63K69j65k36M54j95K26
$$ -150 215 -137 2 123 -41 99 24 -94 231 61 -118 137 -13 -176 93 -72 -308 146 -49 177
6205A77l16J11R4k07J15R7l47L24K61m32J66M3l57L15J04k19J88r9JJ86l97K57
$$ 177 -139 -28 66 -141 -26 71 -276 48 309 -123 43 86 -271 44 148 -71 117 18 19 205 -192 65
6227F5r3p3J54q9p6J74j21k03K97q8R2J51m56K85J19l14M79n77L05O7j08J61j80
$$ 65 -28 -101 53 -36 -112 62 -59 -262 35 -53 39 190 -266 19 138 -176 303 -274 31 98 -10 151 -29
6250b9k15L64P7k85L31k24k8M4J53j67N1k8k41L27j56K44j90j92N62k22k10K1
$$ -29 -244 120 197 -88 243 19 -9 35 188 21 72 44 -197 130 -26 218 28 -164 398 176 -34 -13
6272a3r9OM49n56K14J10n32O48k87J5K75k50j9R4k52L36k99j03O35m05k99O02
$$ -13 -112 -106 343 -213 1 111 -421 227 -60 -45 230 -20 -39 55 -197 139 -160 -263 372 -33 -332 270
6294B70l89J1K24l68L04P4l79K25L06n11J83J81k21J93j08N0j4k58L47o6j01K9
$$ 270 -119 -108 116 -252 52 126 -253 -28 278 -233 -50 131 -90 103 -5 45 31 -227 120 54 -47 -18
6316a8J36q0P2n6k52K49j72j0L29l32j6J05nK31j15j28K61l43R8K02k01L59k24
$$ -18 118 38 110 54 -198 51 -121 -131 198 -134 -150 -45 -50 181 66 -62 199 -144 -46 156 -45 314 90
6339I0l06L39j99j5M03m17N4K42j90j7%k16J66P7k49L84j58j29L55l45J67J36
$$ 90 -216 123 -76 -91 312 -105 -51 191 1 -16 -16 -232 -66 11 -238 146 -12 -141 214 -131 36 172
6361A72l09K38j49k92M78j84l3L26j66j06J18j61K40j57l04L72J0k86K81j09l8
$$ 172 -137 101 -48 -340 138 -46 -79 247 81 -25 93 -68 172 15 -289 83 93 -193 88 -21 -59
6382e9L41m21K43K82o38M27k90j70M94j56o7J23j36n3N4k74L63k38P6K58M8l89
$$ -59 282 -139 104 386 -252 175 -115 -285 209 53 -14 109 -27 -80 -26 -300 63 -175 -99 159 207 -182
6404a82K38k39K49K30m57K54J15m86L97j65j94N89l18q0K87m41O6J92n4n3J97
$$ -182 56 -183 66 296 -161 93 208 -278 119 -46 -240 349 31 -49 238 -203 -137 55 1 -52 145
6425A45k30L3J5k60N12k14J54l3k47%L93l10J89m5l85M99l64Q7K86l00K88j84
$$ 145 -85 -52 -37 -297 215 1 155 122 -125 -125 268 -42 147 102 -283 216 -148 -61 225 -75 213 29
6447B9r1K32j14k80L12q5K0J10k01K4J43k79Q8L83k49J10j20j25K94m14J28K60
$$ 29 -62 170 56 -224 88 3 23 133 -68 -44 99 -180 -92 291 42 152 32 -93 201 -213 -85 175
6469A75m23J40K30k21O9j77o1M13m1k68M28l93j16K17j96R9J88j32J14j50j36
$$ 175 -248 -108 122 -99 -30 -207 -268 145 104 -164 264 -129 -245 -28 -224 -125 63 -69 45 -105 -241
6490b41L40R5m63L82r9j84L34j4p7j69Q6J16M8k46R8q2P6M9q3J90k26j6Q5N6q3
$$ -241 99 194 -269 113 14 -170 164 150 73 -96 -10 106 154 -92 6 -76 0 49 -34 156 -70 -86 -1 55 -28
6515b8L85k84k88L89j82q5L28l88K35j60p9J92r2K7K09k23j07K07k54J70j1o7
$$ -28 357 73 -215 174 -8 -93 235 -153 82 -78 -157 35 -57 -30 179 -44 -151 56 -198 -28 -39 -106
6537a06J04k3j4J71k60J27K68l74J41M0k21O2L60n17L73j34l7K45l69K50K23m20
$$ -106 -2 -25 -39 132 -128 -1 267 -107 34 74 -147 -85 275 -242 131 -3 -40 205 -164 86 309 -111
6559a11O1K8k09L71j83k9J87J22r2O0k04p8J49m17L15p6j96M11j75N2K55m86J98
$$ -111 -50 -22 -231 140 -43 -72 115 237 145 205 1 -77 72 -345 -30 -106 -302 109 -66 -14 241 -245 -47
6582d7O4o2J96o8l72M57j48k37L28j5o5N5j36l6K44m30K51Q7j43J50j68J04K21
$$ -47 17 -45 151 83 -289 168 20 -217 111 96 31 86 -50 -86 158 -272 -21 66 -77 73 -95 9 230
6605B30l03M9K1r9K40J36m39R1J12j60K36o3q7J0r3J03J10k42L27j72j88K63%
$$ 230 -73 -24 -3 -102 138 274 -165 -74 38 -122 114 51 -36 -26 -119 -16 94 -148 179 7 -181 82 82
6628H2q9M4k04K75K50n01K88j06J6J04k68j35K92j10p6J02j99K76J17l78K33q0
$$ 82 -7 37 -167 108 358 -143 145 39 55 159 -109 -244 48 -62 -138 -36 -235 41 158 -220 13 -67
6650f7m2o0j16kL68j33P8Q5k10J22K65l82J50qm8K90l92o3K24j74K9J80j67L31
$$ -67 -109 -169 -285 -287 81 -52 26 111 -99 23 288 -94 56 48 0 290 -102 -165 59 -115 -86 94 -73 258
6674B58k91R8M2k97J56o3K56j90L21l50l9O1k08M05j78j03K79k84k0J34j12Q1
$$ 258 -33 65 107 -190 -34 -97 159 -31 290 -60 -99 -38 -246 159 -19 -122 157 -127 -147 -13 -125 -44
6696d4K21l19K37Q1l39K41j53J9K13l56K07O4j17j24L39j22L1Ll40N51l87J24
$$ -44 177 -142 95 176 -163 78 -75 -56 157 -199 8 72 -45 -169 170 48 79 82 -258 293 -94 30
6718C0lk34K14K29k47J02rj72L45j07QO8n06K32O0j9L2J43m13L03j49J12K71l88
$$ 30 27 -207 7 236 -11 91 82 -90 255 148 156 224 -282 -50 10 -9 23 166 -247 56 -93 19 290 -98
6742i8K42j50j49K41Ml78L86j22l03M21q0r7K55l41N6K95k29P5j99q0M00j90J02
$$ -98 144 -6 -155 86 90 -288 98 -24 -327 94 14 -83 172 -169 -113 182 -47 28 -171 -251 149 -41 61
6765F1P9j54nJ84k70J02J07l78K24R7k05P8J64k18K32o9J0L3l29M37l29Q4J72
$$ 61 140 -14 -19 165 -105 -3 104 -274 -50 47 -158 -80 84 -134 98 29 39 72 -257 180 -149 -65 107
6788A07q4j16M15n84K61K91n37K94J24l36J88P0j13J66j56OK34l29P8J05k81L55
$$ 107 23 -93 322 -262 -1 290 -247 47 171 -165 23 93 -20 146 -10 -4 230 -99 -21 84 -197 158
6810A58j32j50K9J83j72N8k09K74q6PN9P9j22O0L7j83K78m39N35k02m62L18M3
$$ 158 26 -124 -95 88 -84 -26 -235 39 -47 -40 19 98 -24 36 73 -110 168 -271 264 62 -400 -82 -39
6833c9j19N09k12k14L75l15J2K45k28J85j29j61L04m3j2kL1l39L37k49m9L25k46
$$ -39 -158 351 139 -75 300 -15 -3 242 14 199 70 -91 213 170 158 156 187 -152 185 -64 -113 212 -34
6856c4K9L8k84K91p0k11K47j64J46l8J75R5j17k47K69K1j52J42k36J97j10K6k08
$$ -34 -5 33 -251 40 -30 -241 6 -158 -12 -50 125 220 103 -144 125 146 -6 136 -100 97 -13 13 -195
6879a95L54j64R2m9j1J5j2o9K12r8K5Pl26L66j54j51K60k02j16L01q4j12K90j84
$$ -195 159 -5 87 38 27 42 30 -39 173 75 100 107 -219 147 -7 -158 102 -100 -216 85 1 -111 179 -5
6903eq4K38m06K38j33K3K07j17r0J30m2j27L10k20KL88j00j01n5j31L58l88j50
$$ -5 -89 149 -257 -19 -152 -129 78 -39 -129 1 -41 -168 142 -78 -76 312 212 111 56 -75 283 -105 -255
6926b55K03k06J3K58j21L4m0j48J88M9%J27k51J50m2p7j7M3l88O22n3j16M9O4
$$ -255 -52 -258 -245 13 -108 -74 -114 -262 -74 -25 -25 102 -149 1 -41 -118 -135 -92 -480 142 89 -27 22 86
6950H6k37K74k46K65J6l60M13j75j34J33k08J33K01j5k03J60j49k6J25l65L64
$$ 86 -151 123 -123 142 158 -202 211 36 -98 35 -173 -40 161 146 -57 103 -46 -72 53 -312 52
6971E2j37M9R8j13J22M9l05J58J06Q1j32J31j79l3q8n9J40K7O0n1J1j48K59j80
$$ 52 -85 -36 62 -51 71 120 -185 -27 79 160 28 159 -20 -53 -141 -200 -60 -33 27 -24 -13 -161 98 -82
6995h2N1J83l79P0L7J9K89m13K92q8k84J90Q5N7J28p4j1Nj91J06J71m01M78k50
$$ -82 -31 152 -227 -157 -120 -101 188 -225 67 -21 -305 -115 -30 27 155 81 70 75 -116 -10 161 -240 238 -12
7019a2M2r2N8%nKJ82k95O6J03n8j27M02k39l7P9j31n5K22k15P7K13o8M0j76oj2
$$ -12 30 -62 -4 -4 -9 -7 175 -120 -54 49 -9 -136 266 27 -10 69 -62 -117 105 -110 -33 180 112 152 -24 -30 -42
7046d2r8j88N10j79j5R4q0J14k68K0L11p9j51K57j63j6N6j46J36m9j18jJ27Ln3
$$ -42 -140 -328 182 3 -12 82 2 116 -152 -132 179 100 -51 206 43 27 83 -63 73 24 -94 -95 32 35 -18
7071a8j81J45K68l39j23M02k22PL2j45P9J63k31K99J8j59p9J36j29Q2M4jR5j00
$$ -18 -199 -54 214 -125 -248 154 -68 -61 -29 -174 -95 68 -163 136 154 -5 -84 52 -77 5 49 48 143 43
7095D3k0M2R5j12j34K61l7k15L24r3k95J39R0j96J58j41P3K5k42L79p9k91J26
$$ 43 23 65 160 48 -86 175 138 -77 247 154 -141 -2 88 -108 50 -91 -18 7 -235 144 65 -226 -100
7118a00J2j9J82j09K29n8j17j65N4n7J96l5k94O92l09j00n0J4J70m7l13J29K40
$$ -100 -88 -107 75 -34 195 137 20 -145 -91 -148 48 13 -281 411 102 2 -48 -34 136 89 -224 -95 145
7141A45j69J55J7k75L84j96n7J4q8O1R8k44J64J78n9R1l56J29pQ6p3K99k79j15
$$ 145 -24 131 148 -127 257 61 4 18 -70 -9 89 -155 9 187 128 219 -137 -8 -15 71 -2 297 18 -97
7165i7K27k09L4K04j57K72l90J01m2j18L51j35M9m4Pj54P0q0J76%j33j38K32j45
$$ -97 130 -79 -45 159 2 274 -116 -15 -57 -175 176 41 90 46 53 -101 -31 -111 65 65 -68 -206 26 -119
7189a19L77k42K4J18k65P2k9n2J56j75K70j68J05j64J30M5p2K28j49j63K17j72
$$ -119 258 16 40 158 -107 -35 -64 -116 40 -135 135 -33 72 -92 38 83 11 239 90 -73 144 -28
7211b8p4J94j46l7J95j2k6jl11N19m21J61N6j99J05J65l34L47j13n4L6N1j86K0
$$ -28 -102 92 -54 -91 104 92 66 65 -246 273 -148 13 69 -130 -25 140 -194 153 40 -14 22 73 -113 -93
7235i3l1l0J63j27L03J9k01L02l31j27L48J8l68K72j58R3J25j8j26J34k00ol4
$$ -93 -124 -154 9 -118 185 204 3 305 -26 -153 195 213 -155 117 -41 52 177 159 33 167 -33 -39 -73
7258g3p4M90l21o0K03l22L34o3k15L5J69j06L0q3lK54l06l0MN4K72k04P9J78k49
$$ -73 -147 343 22 -38 165 -157 177 114 -101 -66 103 -3 27 -56 -59 195 -111 -141 -137 -83 189 -15 64 242 -7
7283gJ02o4o7r4K90k11R0K4p4l12K72K1K37j77o8N3M2q4o0J17m0O4l08L59j7o1
$$ -7 95 31 -36 -130 160 -51 39 63 -11 -323 -51 -30 207 30 -38 15 57 -27 -87 30 -10 54 -254 105 88 27
7309B7L1o4j8M8j65M5J67j17R6n1M7lo9oJ43j26P7N9k57J58k8k6M3N4L7l2o4q6
$$ 27 58 -6 -24 24 -141 -96 71 -46 50 -1 46 43 -26 -32 111 -15 62 121 -136 22 -6 -32 11 65 102 70 6 -80
7337h0M8j81L20k32R2J95l13Q7K82k73RJ77n6r8J32j16m4J40j14j6j4n3Q0J54
$$ -80 -32 -213 107 -125 -33 162 -151 -64 218 -55 -46 131 75 -23 109 -7 -51 89 -25 -41 -55 -108 -28 126
7361A26j59Q3M3j06j19M6K65j76j30L55j94j28J82k45L29k9l78L95l04J28O2l4
$$ 126 -33 50 93 -13 -132 -86 179 3 -127 228 34 -94 88 -157 172 143 -235 160 -144 -16 46 12
7383A2j24K03k44L25j56j44J63n4n0k4O4JJ64j03jn3r6J45O5k14J62j69L1J14
$$ 12 -112 91 -153 172 16 -128 35 -19 -69 -93 -29 -28 136 33 32 -21 -117 28 93 -121 41 -128 -97 17
7407A7k48J07J27p3J25J6j44J56N6k61j29J15K82k93o3M23j6j94M9j40J09O4j25
$$ 17 -231 -124 3 -70 55 71 -73 83 139 -122 -251 -136 146 -147 -210 213 197 3 52 -88 21 85 -40
7430d0j07J44L8j9l2rJ78j37R1l9j31o6R3K0j64J70k81M41j70Q3kj86K5J29J00
$$ -40 -147 -3 35 16 -16 -25 153 16 107 68 -63 -129 -36 -16 -180 -10 -291 150 -20 63 61 -125 -100 29 129
7455A29n9l4m3l5O6o8Q0J18j23m5L88l77P1k63P1J79k80K69q4n6rP1r3Q5o9J78
$$ 129 70 36 -7 -42 24 -44 36 154 31 -14 374 -3 68 -195 -124 55 -225 44 -40 -96 -105 -34 -127 -42 -111 67
7481F7Lm5K47j15n6R1l00k9J15J30m03L51j72J6K26l07L3J21j58K68j11j3J54
$$ 67 70 25 272 157 101 192 -108 -137 -22 108 -295 56 -116 -100 126 -181 -148 -27 -185 83 -28 -41 113
7504A13j64M1j53K80l4k84K19O6P0j66j3%M4k3p4J46r3j88K80P7k08%L2rL7J15
$$ 113 -51 -10 -163 117 83 -201 18 84 154 -12 -25 -25 19 -4 -78 68 -25 -213 67 144 -64 -64 -32 -41 -4 111
7530A11L1j32o1j04K55p2O5k52K2K70q1k07L21k17N8n6r9K41N9k32L4K19k99k6
$$ 111 142 10 -51 -155 100 28 93 -159 -137 133 52 -155 166 -51 7 -49 -148 93 152 -80 -46 173 -126 -152
7554a52J57jJ34j62l3nm0J78Ql01L45j18o6L76k75q8K07k53L6j09J35J38j77K06
$$ -152 5 4 138 -24 -57 -62 -102 76 84 -217 128 10 -56 320 45 -43 164 -89 -53 -162 -27 111 -66 140
7578A40ok59O0J60k58K96L3l35Q6R3K28k0k92O6Q2J8j27K73m7p0j61J9M7J31q9
$$ 140 134 -125 -65 95 -163 133 166 -169 -83 10 238 218 -74 -8 74 92 -35 238 191 121 -40 -21 26 157 68
7603F8J1j91L2J83K7k40j9PJ75j4j05j67K68l9J61J54k10j55J79l67L62j74J09
$$ 68 79 -112 -80 103 130 -110 -129 -122 53 39 -66 -233 35 -4 157 311 101 -54 125 -242 120 -54 55
7626E5n1o3J07j27M1O8l6j84N0q1J88k6o0J21j21j2J34l2K94k24l0L4M8k58K64
$$ 55 4 -59 48 -79 -38 30 -6 -190 -140 -221 -33 -59 -119 2 -119 -131 3 -29 265 41 11 45 93 -165 99
7651I9q9k17J56K5RP2K9j66N2j70Q1R6k10L82l21J53J02j01O7j8j84K50K5j05
$$ 99 10 -207 -51 -26 -17 55 84 -82 -30 -200 -119 -23 -233 149 -172 -19 83 -18 49 31 -153 97 122 17
7675A7M4j50J58J02k69j61L10j36J47p6j43K13j24r2K21k02J31J57n06M45k36
$$ 17 61 -89 69 171 -98 -259 51 -85 62 -14 -157 56 -68 -160 61 -141 -10 147 -359 86 -150
7696a50J04Q6j50O6Q7j07R5M8m4j07K7pM2R3k50J32P2m8M0K0P0p7j33J81r3K88
$$ -150 -46 40 -110 -44 43 -64 31 79 35 -72 -45 -52 -10 83 -167 -35 37 -11 29 49 119 42 -91 90 -3 285
7722B85m25p0K48J24k33J84p5N4m2m6R3k15K12j69K2L3j4O1l7p9p1O3Q1J59m5
$$ 285 -140 -210 38 162 -71 113 38 92 50 4 97 -118 94 -75 -53 -20 -34 27 -10 -89 -160 -97 -16 143 98
7747I8r8q6J80n2Q4p2q0K4P9k2n0J5j41RQ7L8j30J35J2n8K95l44O2q6n4K77j07
$$ 98 0 -86 94 42 126 54 -26 -2 77 55 5 20 -121 -112 -25 13 -117 18 30 -28 267 -77 -15 -101 -155 122 15
7774A5j40J00k6R5j00N6N8k46R6J03q2k29K02J95k59K02j91OK63j30J75k2k37
$$ 15 -125 -25 -51 44 -56 0 58 -188 -92 11 -71 -300 -98 97 -162 40 -151 -145 118 -12 163 141 -96
7797i6j7j62K40K06k95l7L34k80K52j31L4k79L10j66J00j1j29L30m50K68j8j31
$$ -96 -113 -275 -35 171 -124 -161 173 -107 145 14 48 -231 79 -87 13 2 -127 203 -247 21 3 -128
7819a28J9p6J79j14j32J55L53l18N7J22k41L28L2l28J88j37O8m3j04M2K24l50
$$ -128 -109 -185 -6 -120 -252 -97 256 -62 -5 117 -124 204 236 -92 96 -41 27 -16 -120 -78 146 -204
7841b04J08M6rJ17k8j60K71k27J58k77J60j57K52l07K55J78j46J11j63m1L96m07
$$ -204 -96 -50 -59 58 30 -130 141 -86 72 -205 -45 -202 50 -257 -2 176 30 141 -22 -63 333 -74
7863g4J74j22L5m6N3P9o0q5j20J64j20J61j45O4O9KQ6P2j66q7J31K0LJ04k8k86
$$ -74 100 -22 13 -33 20 99 39 -46 -166 -2 -122 39 -106 -42 27 29 115 187 21 -66 65 85 88 192 164 -122
7889a22J88q1m4M4K1lJ29l30K68o3l21M21nj36m1M3J62r9r4J39k63P8Q9J7n6J77
$$ -122 66 -15 -59 -15 6 3 132 -198 70 7 -314 107 102 -34 -75 -32 130 31 -63 76 -187 -109 -20 -3 -59 118
7915A18l23L5K06p8J2L6L2Q8l31N27l19M8n0N4p0R1n3q0j14J86L4l6k2q4J67j17
$$ 118 -205 -170 36 -42 -30 6 38 126 -205 322 3 51 1 55 -15 76 23 -57 -171 15 49 13 -9 -93 74 -43
7941d3J40Nrj63K22m66L50q4j69K06J03j90R0j53J64M7K8N6k34j28K17O3Q3l20
$$ -43 97 102 93 -70 152 -314 36 -48 -217 -11 92 -98 -8 -161 3 50 78 134 -100 -228 -11 52 135 -185
7965a85K52j61P6J26j42M6P6j4L5k57K11j21N6J88k83P8p1L0R9l5P2K8k26J24
$$ -185 67 -94 -18 108 -34 12 88 74 109 -148 63 -58 -2 186 -97 -19 -90 -60 39 4 76 104 -122 2
7989Br8Q6l00O77l16Q9k05K19j03lJ7o7J98p8j27J24k39M2PJ07M0j54p6K42N1
$$ 2 -96 -10 -310 367 51 140 -65 154 51 48 65 -2 196 118 -9 115 -124 -82 -75 32 72 -82 -158 84 135
8014A35k92J04R7K1j59J69Q0lr3K0P3J23k66J62j66j32Q5j2J65O0o6J13l65J90
$$ 135 -157 -53 44 65 -94 75 155 152 59 79 152 275 9 171 5 -127 -42 -54 111 171 105 218 -147 43
8038D3P3n6K9q0J51j53l5j8o9ML8NJ60k01J75Qj70J13lJ01k2m2N6N3j24k07K29
$$ 43 116 60 89 9 160 7 -28 -46 -115 -111 -73 -68 92 -109 66 74 -96 17 14 115 93 51 107 160 36 -171 58
8065E8j15RK4oJ98p1q0j17mJ02P4lr2J29k77J43r4o6J69pk0K43j38m0K34j73j61
$$ 58 -57 -48 -24 -30 168 97 17 -100 -104 -2 72 69 -23 106 -171 -28 -122 -188 -19 -26 -46 197 59 19 253 80 -81
8092h1J70j36K1J61j89J37m9j6J47j57J35m1p8o7nQ7L6rK2k0k19J11K24l41K32
$$ -81 89 -47 -26 135 -54 83 34 18 165 8 143 102 24 -43 -48 39 75 66 88 68 -151 -40 184 -157 75
8117G5K1j90J91o3M5K1k06p9J39M5J7Q0j72J67k2j21J05qN7m7l39L29k43J47j03
$$ 75 96 -94 97 34 79 100 -106 -185 -46 -1 16 96 -76 91 69 -52 53 45 102 55 -284 45 -198 -51 -154
8142a54J78m7k7n7J00m6J84m1qj02K06j70L3j49J69pj04J64k63J82j09j36J62
$$ -154 24 -23 -50 -107 -7 -53 131 90 82 -20 186 16 49 -100 69 62 -42 122 -141 41 -68 -204 -42
8165d2k4M0p3J13O3nr9p4J01j08K8R2O0j9k14J90n3J0j5J14K6K8p8j92K1J12
$$ -42 -66 -26 -99 14 77 72 -27 -101 0 -108 -80 12 72 53 -161 29 -24 -14 -29 85 111 139 61 -131 -110 2
8191B
$$ Imaginary data points
##PAGE= N=2
##DATA TABLE= (X++(I..I)), XYDATA
0@%%%%%%%qJ6j6J6k4M0n5O3p2R6j26J50j76K16k64L12l68M33n05N91o88P93r10
$$ 0 0 0 0 0 0 0 0 -8 8 -8 8 -16 24 -31 32 -40 56 -70 80 -96 120 -144 168 -200 233 -272 319 -369 424 -486
30d86J045j196J358j537J740j965K213k481K772l098L456l842M264m727N234n788
$$ -486 559 -637 721 -816 924 -1041 1172 -1309 1463 -1635 1821 -2021 2243 -2484 2750 -3038
46c038O390p048P768q560R432j0389J1447j2622J3935j5411J7080j8985K1184
$$ -3038 3352 -3696 4072 -4488 4944 -5445 6002 -6620 7315 -8096 8984 -10001 11183
59A1183k3758K6817l0518L5106m0974M8780n9726P6287j04552J65320n16425N12437
$$ 11183 -12575 14242 -16276 18830 -22144 26636 -33090 43197 -61355 103965 -412460 99977
71I9977O51280j247725K25985P24994n48416l51580Q53783j13910p20901L69995
$$ 99977 751257 -496468 -270483 454511 -93905 -445485 408298 294388 -426513 -56518
81e6518N16633n87150j45572N01270j41931l02975L59414j733m44807J30956N20047
$$ -56518 460115 -127035 -272607 228663 86732 -216243 143171 141438 -303369 -172413 347634
92C47634j83586n24968K29168M63061l67786k12086N22629j04886o08787M05461
$$ 347634 164048 -360920 -131752 331309 -36477 -248563 274066 169180 -439607 -34146
102c4146N40473o05975l48066P08786K7326o68169L28118M25796n93776j0359
$$ -34146 506327 -99648 -447714 261072 288398 -379771 -51653 374143 -219633 -229992
112b29992O16930m03712l98550O23515O7320n67985K43588L26117m68260j8286
$$ -229992 386938 -16774 -415324 208191 275511 -292474 -48886 277231 -191029 -209315
122b09315N80992k60045n39265M38003L36633m56092o1357L39512j43363j94803
$$ -209315 371677 111632 -427633 10370 347003 -109089 -170446 169066 25703 -169100
132a69100K13726J08796k20426p8266K42768L5657k72221M0761K41533j15229
$$ -169100 44626 153422 -67004 -145270 97498 133155 -139066 -98305 143228 27999
142B7999j33189J57435j5104j78110J66504J80820k92873j05562L53812p8606
$$ 27999 -105190 52245 37141 -140969 25535 206355 -86518 -192080 161732 83126
152H3126k87235K96159Q5498m12857J55795L59929l23132j93912L66149N683l13932
$$ 83126 -204109 92050 177548 -235309 -79514 280415 -42717 -236629 129520 135203 -178729
163a78729J49087J94756k42506k1478K52389j41937j55894K17090Q724j67691
$$ -178729 -29642 165114 -77392 -98870 153519 11582 -144312 72778 81502 -86189
173h6189R3814N1756j20732K4613J06855l7372j02805L0054R9404m1164p1558
$$ -86189 7625 59381 -61351 -36738 70117 32745 -70060 -40006 59398 18234 -53324
184e3324N8391K7696o6357M468Q3581k6374j07566Q2324J05833j57131l5209J83712
$$ -53324 5067 32763 -33594 -29126 54455 28081 -79485 2839 108672 -48459 -83668 100044
196A00044p4830j16734J45265r997j41599J09009Q2567j50423j3865J43218o0569
$$ 100044 25214 -91520 53745 43748 -97851 11158 93725 -56698 -70563 72655 12086
207A2086j00866J34746J9268j61734Q7237J13202j48480j0770J29351o5532n8866
$$ 12086 -88780 45966 65234 -96500 -9263 103939 -44541 -55311 74040 8508 -50358
218e0358P6038j438n4159K5681L4168m0707k2126N2400n036m4303L0950J3390
$$ -50358 25680 24242 -29917 -4236 29932 -10775 -32901 19499 14463 -29840 1110 14500
230A4500k5367P855J360J0009L754l5225K8355K2420n3572K6218L5712o3220Q655
$$ 14500 -10867 -3012 -1652 8357 12111 -23114 5241 27661 -25911 307 36019 -27201 -18546
243a8546N8104m2094l3393N0923J2541n8354J2199O0417n3139k9062Q2920l5201
$$ -18546 39558 -2536 -35929 14994 27535 -30819 -18620 41797 -11342 -40404 42516 7315
255G315o1130Q5961l19p8706N2132L4063n9798L621M4618k0927l4477L4957J7696
$$ 7315 -53815 32146 31827 -46879 5253 39316 -20482 -16861 27757 6830 -27647 7310 25006
268B5006n3273J5881M5608n0132n616M8695l2372j3062L5876j2556j4362Q871
$$ 25006 -28267 -12386 33222 -16910 -22526 26169 -6203 -19265 16611 4055 -10307 -1436
280a436J0163L916k3390M035K6855k0897q460J7060j1091j707Q753k536n715j0855
$$ -1436 8727 12643 -10747 -6712 20143 -754 -9214 7846 -3245 -4952 3801 1265 -4450 -15305
294a5305K3226R711m5623K1699L8131m8851K839M3196l5281j1751L9096r995l0289
$$ -15305 7921 17632 -27991 -6292 31839 -17012 -14173 29023 -6258 -18009 21087 11092 -19197
307a9197J6258K8246l0234k2290M9945j0080n0489M9346J3903n8859K8146L2404
$$ -19197 -2939 25307 -4927 -27217 22728 12648 -37841 11505 25408 -33451 -5305 27099
319B7099l9459j532K7476o588j9725J0750K3042k7442j2556M3358j6848l3513
$$ 27099 -12360 -13892 13584 6996 -12729 -1979 21063 -6379 -18935 24423 7575 -25938
331b5938L6760L934k9181R716J0317k512j0939j068K2217j6841j4709L6359j3297
$$ -25938 10822 14756 -14425 -4709 5608 3096 -7843 -8911 13306 -3535 -18244 18115 4818
344D818k8551L5465N470l1344P874K2750q570k5475J7488K4609m0501k62M6070
$$ 4818 -23733 11732 17202 -14142 -6268 16482 7912 -17563 -75 24534 -15967 -16229 29841
357B9841l8401j8676N2659j9766l4870L6292J0817l0542j064K9226m960l2385
$$ 29841 -8560 -27236 25423 5657 -29213 7079 17896 -12646 -13710 15516 10556 -21829
369b1829K5769K1297m3125J0761L2628l4873l369K8310j5316j0771R346P298l833
$$ -21829 3940 25237 -17888 -7127 25501 -9372 -12741 15569 253 -10518 -1172 6126 2293
382B293j7969J7628J3833l2562R203K6240k4807n022K0749l130j1613Q69J7818
$$ 2293 -15676 1952 15785 -16777 -7574 18666 -6141 -11163 9586 6456 -5157 -4288 13530
395A3530q859k2487L1981K520m4594L0676K3874m7603P545L2612k3171j2318K0855
$$ 13530 4671 -17816 14165 16685 -27909 2767 26641 -20962 -13417 19195 -3976 -16294 4561
408D561L319j9564M784K6321k2813j6282M0945j1352l1568L2055K330k5343J3930
$$ 4561 7880 -11684 -6900 19421 -3392 -19674 21271 9919 -21649 10406 12736 -12607 1323
421A323M724q022j191j081J0546q096j1865K1497n017j6713J8935K625j3995K794
$$ 1323 6047 -1975 -3166 -4247 6299 -1797 -13662 7835 2818 -13895 5040 7665 -6330 -3536
435c536J0780M341k0514K385L0013k6753j5490M0795j9379k5748L7784o709l0366
$$ -3536 7244 11585 -8929 -6544 23469 -3284 -18774 22021 2642 -23106 14678 7969 -22397
448b2397K3663J2654k3922l488K6150l957k9159K3672J9246m0231J0368L0339
$$ -22397 1266 13920 -10002 -13490 12660 8703 -20456 3216 22462 -17769 -7401 22938
460B2938l3515r94K7796j8288o005J2566k335j915o621N856R845j5801O52J4391
$$ 22938 -10577 -11571 16225 -2063 -8068 4498 2163 248 -6373 -517 9328 -6473 -5821 8570
474H570p774l689J943M859P34j4218J2631P169k7690K0682J8498m2361J4104L4572
$$ 8570 796 -2893 -950 3909 4643 -9575 3056 10225 -17465 3217 21715 -20646 -6542 28030
488B8030l9540p485L7731j3871k5406K1449J6376k9050l833L8073j9517k6012
$$ 28030 -11510 -18995 18736 4865 -20541 908 17284 -11766 -15599 22474 2957 -23055
500b3055M0975o784l4785L4982M830l1750J7284Q054j5757M065K725k420k447
$$ -23055 17920 11136 -23649 11333 16163 -15587 1697 9751 -6006 -1941 784 -1636 -4083
513d083Q11P380o971k782R979l343O76k815n443J8121j1287j7350L4392p842l4231
$$ -4083 -3272 4108 -2863 -5645 4334 991 1667 -1148 -6591 11530 243 -17107 17285 9443 -24788
528b4788L6068P847l9075J7431J9801k5724k460K2171j0026j9772K5360J1721
$$ -24788 11280 19127 -19948 -2517 17284 -8440 -10900 11271 1245 -18527 6833 18554
540A8554m0668J4214L4771l9790j860L9875k9091j1233L3342j4040j5922J6865
$$ 18554 -22114 -7900 26871 -12919 -14779 25096 -3995 -15228 18114 4074 -11848 5017
552E017J547q398j046N079j718n481Q311l117p240J1679r649l710K0777j8330
$$ 5017 6564 -1834 -2880 2199 481 -5000 3311 194 -7046 4633 -5016 -8726 12051 -6279
566f279n776K9200j9839r797K9756j8315j3119K9878p971k4217J7514J5035k2594
$$ -6279 -12055 17145 -2694 -12491 17265 -1050 -14169 15709 7738 -16479 1035 16070 -6524
579f524o290K9484j4000k6802L6466J067m0195L0628J4588l8523K0345J9225l1816
$$ -6524 -12814 16670 2670 -24132 12334 13401 -26794 3834 18422 -20101 244 19469 -12347
592a2347O007K1713j3894q750J1360K116j1942N533R349j7440L608J5487k0333
$$ -12347 -6340 15373 1479 -7271 4089 6205 -5737 -204 9145 -8295 -4687 10800 -9533
605i533L756J6934k1058P167J4658k4204J0453J6973k4712M217J8359j5455n198
$$ -9533 -5777 11157 -9901 -2734 11924 -12280 -1827 15146 -9566 -5349 13010 -2445 -7643
618g643J4999k890j4698J1694J3645k7555J82L2660k6368j2033L7258k0828j9226
$$ -7643 7356 4466 -10232 1462 15107 -12448 -12266 20394 -5974 -18007 19251 -1577 -20803
631b0803L7333r249k4846K3586M988j7447O322R424j2027m211J9041o818k1729
$$ -20803 16530 7281 -17565 6021 11009 -6438 -116 9308 -2719 -6930 12111 5293 -16436
644a6436K1596M793k4863J6922M588k1913J9579L582k2244J5971N895j4924J0533
$$ -16436 5160 9953 -14910 2012 6600 -15313 4266 7848 -14396 1575 7470 -7454 3079
657C079L261j1861M404J0487o145j1500J2194N384k0344J2214J1100k8005J2976
$$ 3079 6340 -5521 -1117 9370 3225 -8275 3919 9303 -11041 1173 12273 -15732 -2756
670b756J8951k9482O994J9983k3801L414K0367j6385p837J6441J992j3894M459
$$ -2756 16195 -13287 -6293 13690 -10111 -6697 13670 -2715 -10552 5889 7881 -6013 -1554
683a554J3336j6163k813K3034j7692j0991K6197j4262j1896K4921j3780j3486
$$ -1554 11782 -4381 -7194 15840 -1852 -12843 13354 -908 -12804 12117 -1663 -15149
695a5149K3108l654j3511Q732L527n368R94P435n208q624J4944J28j6147J4002
$$ -15149 7959 4305 -9206 -474 3053 -2315 -1321 6114 906 -7718 7226 7354 -8793 5209
709E209p71j4849J9353l759k0692J9995K054j7380J2636J761j1484P483N730p319
$$ 5209 4438 -10411 8942 5183 -15509 4486 6540 -10840 1796 3557 -7927 -444 5286 -2033
723b033l490J0485Q03j3747J2128O953k3916J3983J5617k8908O694J9759k1978
$$ -2033 -5523 4962 5765 -7982 4146 11099 -12817 1166 16783 -12125 -5431 14328 -7650
736g650L93J7015j2813n090J1212M79q912J438J1443r042n530J7444r294j0339
$$ -7650 -7257 9758 -3055 -8145 3067 3546 -5366 -3928 7515 -1527 -7057 10387 1093 -9246
750i246J8669o730r486J4622q627n084J2822q537k544P223p016J743N055m843
$$ -9246 9423 2693 -6793 7829 -798 -5882 6940 -1597 -4141 3082 -3934 -2191 2864 -1979
764a979k175L236N932n651o037J4821n858j1706K0366o228j8549K2914n72k0944
$$ -1979 -4154 -918 5014 -637 -6674 8147 2289 -9417 10949 4721 -13828 9086 8514 -12430
778a2430J4770N544j5141L992Q053n426p177Q880O482j6265N060J5310j7938J467
$$ -12430 2340 7884 -7257 -3265 4788 -638 -7815 1065 7547 -8718 -3658 11652 -6286 -4819
792d819J6864j6006n26J3851j0555j012N773m884K718j894k478M763l928L70J984
$$ -4819 12045 -3961 -4487 9364 -1191 -2203 3570 -1314 1404 -490 -2968 1795 -2133 -1763 221
807B21l483M863k757j825Q500r181J272J3146j5368l90J7415j4890l972J5617
$$ 221 -3262 1601 -1156 -2981 5519 -3662 -2390 10756 -4612 -5002 12413 -2477 -6449 9168
821I168q701o583Q876M18o917r80R589m501j1225J6041M99j8713J6430N987j8548
$$ 9168 467 -6116 2760 3178 -3739 -4719 4870 369 -10856 5185 5684 -13029 3401 9388 -9160
836i160J0384O168j2280O088L337n173K3J39L679l395m274P835m257l958Q655
$$ -9160 1224 7392 -4888 1200 4537 -636 -613 -474 3205 -190 -4464 3371 -886 -4844 3811
851C811o599n29P022p869N305L799j2135R911M731j3194P655L633r001M646K750
$$ 3811 -2788 -3317 3705 -4164 1141 4940 -7195 2716 7447 -5747 1908 5541 -3460 1186 3936
866C936m860k503L359N865j1170k182J5828j0942o902J8049r943p835J7944o759
$$ 3936 -924 -3427 -68 5797 -5373 -7555 8273 -2669 -9571 8478 -1465 -9300 8644 1885
880A885r201J1594L8n650Q43K928J188p019M144M651j1486N736N434j1577O172
$$ 1885 -7316 4278 4316 -1334 -491 2437 3625 -3394 750 5401 -6085 -349 5085 -6492 -320
895c20L312r601Q333K68p446Q936l259l543Q141m908l028O400r85j957k456L047
$$ -320 2992 -6609 1724 1992 -5454 3482 223 -3320 4821 -87 -3115 3285 2300 343 -2113 934
911I34L115r387N011O366j4269P479R691j7940N845J1770j3861J279R195o029
$$ 934 4049 -5338 -327 6039 -8230 -751 8940 -9000 -3155 8615 -5246 -3967 5228 -801
925h01j665L663K198l648k404Q616n180o469J3002o451r206J4117m517p612J0216
$$ -801 -2466 1197 3395 -253 -2657 5959 779 -5690 7312 861 -8345 5772 1255 -6357 3859
940C859n315k154P641o561m1N057l657J345K77j15J456l028M321j222p239J0315
$$ 3859 -1456 -3610 4031 -2530 -2571 2486 -1171 174 451 336 1792 -1236 3085 1863 -5376 4939
956D939k154j1067J3433k162j2469J3951r47j1893R710J339o591L322K489j441
$$ 4939 2785 -8282 5151 2989 -9480 4471 3524 -8369 1341 2680 -3911 -589 1900 459
970D59l497N033M229j1683L949J0731j3478J836J0075j2665L737P855j2388L588
$$ 459 -3038 1995 6224 -5459 -1510 9221 -4257 -2421 7654 -5011 -1274 6581 -5807 -2219
984b219O792p798J360K723j454O12r59K753j779j642P082o686k396J1390r709
$$ -2219 4573 -3225 -1865 858 -596 16 -943 1810 31 -1611 5471 -1215 -3611 7779 -1930
999a930k816J2890j1559k261J3063j0546k974J0196n312l195N369Q43l615j117
$$ -1930 -4746 8144 -3415 -5676 7387 -3159 -6133 4063 -1249 -4444 925 1768 -1847 -2964
1013b964P103k078p584J0924j517j0842J3449j962j3298J3768O2j2368Q879J249
$$ -2964 4139 2061 -5523 5401 3884 -6958 6491 4529 -8769 4999 5061 -7307 1572 2821
1027B821p092L983O33j637j44J961J277n707M491M977j0920N916O783j3169O673
$$ 2821 -4271 -288 345 -1292 -1436 525 1802 -3905 586 5563 -5357 559 7342 -5827 846
1042H46N850j3351P451N864j2625M954N163p408J424L134j315k854K586M290p900
$$ 846 6696 -6655 796 6660 -5965 -1011 4152 -3256 -1832 1302 -13 -2867 -281 4009 -3891
1057c891J351J0740j1957o74J4410j2690k960J4769j0412l791J0993o621l130
$$ -3891 -2540 8200 -3757 -4431 9979 -2711 -5671 9098 -1314 -5105 5888 -733 -3863
1070c863O602k171m013J795M614l236n270R461k066q311J1958l296r469J3518
$$ -3863 2739 568 -3445 -1650 2964 -272 -5542 3919 1853 -6458 5500 2204 -7265 6253
1084F253l186j0019J1940k085q020P951j034n052L399R95k250j663M451J47q212
$$ 6253 3067 -6952 4988 2903 -5117 2834 1800 -3252 147 1142 -1108 -2771 1680 1827 -6385
1099f385Q162L955j3451Q760N884j4607R312N743j3901O879O217j0539K135N337
$$ -6385 1777 5732 -7719 1041 6925 -7682 1630 7373 -6528 351 6568 -3971 -1836 3501
1113C501m039k293K950K691o840J256Q180r464J62J1531j1618l53J3303j1452
$$ 3501 -538 -2831 119 2810 -4030 -2774 5406 -4058 -3896 7635 -3983 -4336 8967 -2485
1127b485j510J1476q813j006P246n679j387M101k40l808m57N905m182n007J0384
$$ -2485 -3995 7481 -1332 -2338 4908 -771 -2158 1943 1703 -2105 -2562 3343 -839 -5846 4538
1142D538m888o973J3514n310q593J4184m028q951J1411j383p617N469J576l825
$$ 4538 -350 -7323 6191 881 -7712 6472 2444 -6507 4904 3521 -4096 1373 2949 -876
1156h76p73L638j010o064O909J717j1469Q537M784j3163Q141M812j1509P515M005
$$ -876 -1649 1989 979 -5085 1824 3541 -7928 609 5393 -7770 371 5183 -6326 1189 5194
1171E194r743N257L567n807J100K557n31l447J129M241o820J137P252j0237J861
$$ 5194 -4549 708 4275 -1532 -432 2125 1594 -1853 -724 3517 -3303 -2166 5086 -5151 -3290
1186c290J0562j2375Q91J1456j0067m73Q779o639p02N111k022k675J400L852m396
$$ -3290 7272 -5103 -4212 7244 -2823 -3296 5483 -1156 -1858 3253 1231 -1444 -44 3808 -588
1201e88l517Q966m385o990J1435m327p677J1561m173o722J0604l255n607P302
$$ -588 -4105 4861 476 -6514 4921 594 -7083 4478 305 -6417 4187 932 -4675 2627
1215B627o89l110J236J511j04l192L708L10o909O956J609j1084Q476L096j1451
$$ 2627 1938 -1172 64 1575 1471 -1721 1987 2297 -4612 2344 3953 -7131 1345 4441 -7010
1230g010P962K560r563O672K578o634L118K914k057j767K008L254o068O45O807
$$ -7010 952 3512 -6051 621 3199 -3435 -317 2597 540 -1227 781 4035 -2033 -1388 5419
1245E419q166P68P886r983Q22R107r841M92P596o446K39L919k605m1J266Q45j335
$$ 5419 -2747 -1979 5907 -4076 -3254 5853 -3988 -3496 4100 -2346 -2107 1812 -793 -834 432 1277 -58
1262e8j261N149l136m592R162m530o184J0148m492n304R475n002m243P867k571
$$ -58 -1319 3830 694 -3898 5264 734 -5450 4698 206 -5098 4377 -625 -4868 2999 428
1277D28l611L219J085m99k141K305J605n164M678J742q552P085K401j0451P071
$$ 428 -3183 36 1121 622 -1519 786 2391 -2773 1905 3647 -4905 2180 4581 -5870 1201
1292A201K358q324N346J223n540L924M84k356J072O97J557l388Q23N313o098J62
$$ 1201 3559 -4765 581 1804 -3736 188 672 -1684 -612 85 1642 -1746 -923 4390 -1708 -1546
1308a546O807p701J171P028r128J396P025p527J55M654l855J53R85J14K16j715
$$ -1546 5261 -2440 -1269 5759 -3369 -1973 5052 -2475 -2320 2334 -1521 -1368 -383 -269 -53 -1768
1324a768L494j521k897O819l434m960Q930l052n292P313l723k658O088l998k487
$$ -1768 1726 205 -2692 4127 693 -4267 4663 1611 -3681 3632 -91 -2749 3339 -659 -3146
1339c146M337j314r12n84J372J738l995K955K007o355N887J640q240O817J745
$$ -3146 1191 -123 -1035 -1619 -247 1491 -2504 451 2458 -3897 1990 3630 -4610 2207 3952
1354C952q228N729J650n882L216M53k449J533m70N81j361J03M240n640K56O927
$$ 3952 -4276 1453 3103 -2779 437 890 -1559 -26 -496 85 -1276 -1173 3067 -2573 -2317 4610
1370D610o455k77O474o249J215N137o714J776L995m681Q00Q51r23L79j465J672
$$ 4610 -1845 -2122 4352 -1897 -682 4455 -2259 -483 3512 -1169 -369 482 -441 -62 -1527 145
1386A45j38k458M558k616l048P735l868m339Q191l435l592O553l659j711M168
$$ 145 7 -2451 2107 -509 -3557 4178 310 -4029 4162 727 -2865 3688 29 -1682 2486
1401B486k385j447J207R40r5l831K816K685o009L645K256o670N678J775p012N728
$$ 2486 101 -1346 -139 801 706 -3125 -309 2376 -3633 12 2268 -4402 1276 3051 -3961 1767
1417A767J342n597L904L35k665J934r78N0k06r35K284k999M84M090n665N76O160
$$ 1767 3109 -2488 1416 1751 -914 1020 42 92 -114 -1049 1235 -1764 -1280 2810 -2855 -2279 3881
1434C881o323Q41N259o003K573L740n971J478L231k547m89k25J562p38k331L755
$$ 3881 -2442 -1601 3658 -2345 228 3968 -2003 -525 2706 159 -330 -555 1007 269 -2062 1693
1450A693k135l197O755l635l963P830l015m134O693k840k113M286k106n36J745
$$ 1693 -442 -3639 3116 -519 -4482 3348 333 -3801 2892 52 -2061 2225 119 -417 1328
1465A328p78l8j154J477J066m540L268J744o196M305O14n560O092k6o009O021
$$ 1328 550 512 -642 835 1901 -2639 629 2373 -3823 482 1096 -4464 1628 1602 -4407 1614
1481A614M27m194L411j41q03L21j47J011k059N40K847n680J619N040p204J114
$$ 1614 2041 -2153 1258 1117 314 635 488 1499 -560 -20 2827 -2853 -1234 3806 -3398 -2284
1497b284N678o274J245M352n247J833L178l436O90J314L84j159j357L364j539
$$ -2284 3394 -2880 -1635 2717 -2530 -697 2481 -955 -265 1049 1433 274 -1083 2281 742
1512G42l080M586k718k492O448m265l160O953l554k355N068k916p20L165j799
$$ 742 -2338 2248 -470 -2962 3486 -779 -3939 3014 -540 -2895 2173 -743 -1463 1702 -97
1527i7k37M15P98J08k290L116K70n345N057L80o125N536j92n681N940j86n298
$$ -97 -334 81 879 987 -1303 1813 2083 -3262 1795 2175 -3950 1586 1394 -4287 1653 1467 -3831
1544c831M784M99k959J222P42L24j426P00K186l673J605L560o540K172N108p054
$$ -3831 953 1452 -1507 -285 457 781 -645 55 2241 -1432 173 3733 -2807 -635 4473 -2581
1560b581J054M349n429J912K614m448J575J835j499q6K71J584q92j538M264k883
$$ -2581 -1527 2822 -2607 -695 1919 -2529 -954 881 -618 -704 -433 1151 259 -1279 2985 102
1576A02k027N756m490j866O674n196k153O139l740j726L970j757j149J483K76
$$ 102 -1925 3831 -659 -2525 4149 -1047 -3200 2939 -801 -2527 1443 -314 -1463 20 296
1591B96n75j011K855l85m044N206K41o110N552L35n575N067m52m680M533l80l235
$$ 296 -279 -1290 1565 1180 -2864 2342 2583 -3527 2025 2360 -3215 1852 1400 -3280 1253 873 -2362
1608b362J945O48m17p88L68J689k404R82K806m627K575L305o511K976L775o440
$$ -2362 -417 231 -186 -974 -606 1083 -1321 -339 2467 -2160 415 3720 -2791 185 3960 -2480
1624b480K672K342m905K092J977l360L99J585K1j583J00L308l323q60N473m009
$$ -2480 192 2534 -2371 -279 1698 -1662 -1263 322 343 -1240 -1140 2168 -1155 -2015 3458 -551
1640e51j587O446m842j565O061m599j584M477k396j361J633l48j07r49J422Qk655
$$ -551 -2138 4308 -534 -2099 3962 -637 -2221 2256 -140 -1501 132 -216 -323 -1272 150 158 -2497
1657b497M039n22m567N826m59m817N217p85l707M771j502l370L746m75k049O07
$$ -2497 1542 1020 -3547 2279 1820 -2997 2220 1435 -2272 2499 997 -2373 1373 898 -1151 -544
1673e44N58L50j961J094J821l912K467K635n729L589L426o832K949L731n361J897
$$ -544 14 364 -1597 -503 1318 -2594 -127 2508 -3221 368 3794 -3038 -89 3642 -1719 178
1689A78K079l042N96Q94p97p24K26J968k876p64M833l457j777N419l589j105N410
$$ 178 2257 -785 -189 705 -92 -816 -590 1378 -1498 -2262 2571 -886 -2663 2756 -833 -1938 3472
1706C472m536p03N192l888o36K605j150m59o8K93k08j412K621j157l020N019j445
$$ 3472 -1064 -1767 3425 -463 -1099 1506 356 -103 -171 122 -86 -1498 1123 -34 -3054 1965 520
1723E20m258N642n68m441N047r89l061M224j170k068J958M36r91j223J311J173
$$ 520 -3738 1904 1336 -3105 1942 953 -2108 2116 946 -1122 836 1272 281 -942 369 1542
1739A542l622J566K268m765K801K409n637L426K710n219K457K309l264J466P08
$$ 1542 -2080 -514 1754 -3011 -210 2199 -3438 -12 2698 -2521 -64 2245 -1019 447 1155
1754A155j247M08%N57j573j41K904l258j145M813m020o28M772m447L79M220l983
$$ 1155 -92 316 316 873 -700 -841 2063 -1195 -2340 2473 -1547 -2175 2597 -1850 -1471 2749 -1234
1771a234m3L630k466l64R44L82j02j345J624m29k325L479j222l888N526j351m303
$$ -1234 -1277 2353 -113 -477 467 849 747 -598 1026 597 -1728 1751 529 -3359 2167 816 -3487
1788c487M681n52l066L655r98j657K420m42n52nM95R27k439J356J795m097J989
$$ -3487 1194 642 -2424 1231 233 -1424 996 554 2 -3 492 1419 -1020 336 2131 -1966 23
1805B3J897m762K972J767n108L110J787l837K012J034k051J545L2J83l59k11J841
$$ 23 1920 -2842 130 1897 -3211 -101 1686 -2151 -139 895 -1156 389 421 604 245 34 1875
1822A875k421n14L855l558j003M461l684p21L841l829L65K885l044M49J601n88
$$ 1875 -546 -1060 2795 -763 -1766 2695 -989 -1710 2131 -1698 -1333 1552 -1492 -1043 558 -30
1838c0o5m67J519L91k629K763l27l116M216j488l627M879j454l425L818r82k077
$$ -30 -95 -562 957 1348 -1281 1482 1155 -1961 2255 767 -2860 2019 565 -2860 958 -24 -2101
1855b101K689j278j98P64K03L07r96J195J579l783J927K189m170K206J358m132
$$ -2101 588 -690 -888 -124 79 386 -610 585 2164 -1619 308 2497 -1673 533 1891 -2241
1871b241K716J102m156K522J046k513J347J60j96K42o67J592j225k20K697k926
$$ -2241 475 1577 -2579 -57 989 -1524 -177 -17 -213 29 -638 954 -271 -491 2206 -720
1887g20l82M071l571p36L999l503K9K618k953L62J582j537R0J7P95L53j989K234
$$ -720 -1102 2969 -602 -1338 2661 -842 -813 1805 -1148 -786 796 -741 -651 -634 161 514 -1475 759
1905G59K64k646L367r56k867M368j341k831L856j538k194K761j246p92J623j324
$$ 759 1023 -1623 1744 788 -2079 2289 948 -1883 1973 435 -1759 1002 -244 -1036 587 -737
1921g37O62m35M21P04k552J880J745l922K640J590l970L061R25l898K650P11l000
$$ -737 -75 -510 -89 615 -1937 -57 1688 -2234 406 1996 -1974 1087 2012 -1886 764 1475 -1525
1938a525J759J35q45O6l09J027q53o97K574k328k42L770l308k04L966l759OK804
$$ -1525 234 369 -476 -410 -719 308 -545 -1242 1332 -996 -1238 2532 -776 -980 2986 -773 -767 2037
1956B037k639M21J290j842P02K72m01J86j016J545j61k267K693n04k231L513j446
$$ 2037 -602 -181 1109 -733 -31 241 -160 26 -990 555 394 -1873 820 316 -1915 1598 152
1973A52k039M212k018j914L300j365j147J807p92j49Rp6M84j561J111J264l508
$$ 152 -1887 2325 307 -1607 1693 328 -819 988 196 47 56 -20 464 -1097 14 1278 -2230
1990b230K159J728l909K346J461l260K548O54k786K225P7j272O25m66P68o80r48
$$ -2230 -71 1657 -2252 94 1555 -1705 843 1497 -1289 936 1013 -259 366 -100 668 -12 -960
2007i60K030j938o76L112l207N00L176l639O85L162l271Q72J939k582R14Q67j255
$$ -960 1070 -868 -1544 1568 -1639 -1139 2037 -1602 -917 2245 -1026 -154 1785 -797 117 984 -271
2024b71N95l30Q47m54j818K485j011k263L351j078k307L903j756j771L435j303
$$ -271 324 -6 841 387 -1431 1054 43 -2220 1131 53 -2254 1649 -107 -1878 1557 254
2040B54j361K234q24k3L07m75P20j124L00J262k748J624J173l612K511R78l381
$$ 254 -1107 1127 303 280 587 112 832 -292 8 1270 -1478 146 1319 -2293 218 1196 -2185
2057b185K589M11k622K637j77j654J603ql02l9m85J327j391l35K129k532R7K836
$$ -2185 404 815 -1807 830 653 -1001 602 594 292 253 -232 1095 -296 -631 1498 -1034 -937 1899
2075A899l661N85L164l516L83K341j998O55Q31j079Q78j26m6K5r68J908m27k401
$$ 1899 -1762 -1177 1987 -1529 -1146 1195 -803 -148 683 -396 482 356 310 335 -633 1275 848 -1553
2093a553K833j139j976L212j912j473L618k044r45K480j375j99P87o19O80k90
$$ -1553 1280 141 -1835 1377 -535 -2008 1610 -434 -1379 1101 -274 -473 314 -305 375 85
2109H5M0P60j691J368Q11l165K738O35l719K698L18k748K263p3j803J989m20p97
$$ 85 125 885 -806 562 1373 -1792 946 1581 -2138 560 878 -1870 393 320 -1483 506 86 -711
2127g11O39k1Q25j118PJ986k178K23K220k892Q14K297l667J039K032k945P83J384
$$ -711 -72 -93 732 -386 -379 1607 -571 -348 1872 -1020 -206 2091 -1576 -537 1495 -1450 -667 717
2145G17j631R02p5m68O03n23J117o11j119K843j364j766L124j633j536L381k134
$$ 717 -914 -12 -87 -555 48 -475 642 31 -1088 1755 391 -1375 1749 116 -1420 1961 -173
2162a73r71K550k018p24K079j211K3O2MR88j421J026Q35k191K187O13l418K864
$$ -173 -1144 1406 -612 -1336 743 -468 -445 -383 -379 609 -812 214 1049 -1142 1045 1658 -1760 1104
2180A104L35l248K675j24k286K306p32j233J245l37J64l18K1J398j725k9K422
$$ 1104 1439 -1809 866 742 -1544 762 30 -1203 42 -295 -131 -449 -428 970 -755 -784 1638
2197A638k437O98K007l148J329J789l248J067J438j958Q35K07p18N52o26N53n2
$$ 1638 -799 -101 1906 -1242 87 1876 -1372 -305 1133 -825 10 217 -501 51 -575 -22 -74
2214g4r04K105j148j492L197j669j375L180j831r96K813k298p4J876j638k17O13
$$ -74 -978 1127 -21 -1513 1684 15 -1360 1820 -11 -1007 1806 -492 -566 1310 -328 -545 68
$$ [...]
8191a22
##END NTUPLES=NMR FID
##END=
