##TITLE=1H_12-2025
 200.13MHz, CDCl3,
 8 sc
 
 20.1.2025
##JCAMPDX= 6.0         $$ Bruker NMR JCAMP-DX V2.0
##DATA TYPE= NMR FID
##DATA CLASS= NTUPLES
##ORIGIN= UXNMR, Bruker Analytische Messtechnik GmbH
##OWNER= pz
$$ XWIN-NMR		Version 3.5
$$ Mon Jan 20 14:06:27 2025 Russian Standard Time (UT+4h)  she@DPX200
##.OBSERVE FREQUENCY= 200.1313
##.OBSERVE NUCLEUS= ^1H
##.DELAY= (6, 6)
##.ACQUISITION MODE= SIMULTANEOUS
##.ACQUISITION SCHEME= undefined
##.AVERAGES= 8
##.DIGITISER RES= 18
##SPECTROMETER/DATA SYSTEM= spect
##.PULSE SEQUENCE= zg30
##.SOLVENT NAME= D2O
##.SHIFT REFERENCE= (INTERNAL, D2O, 0, 14.3821)
##AUDIT TRAIL= $$ (NUMBER, WHEN, WHO, WHERE, WHAT)
$$ ##TITLE= Audit trail, XWIN-NMR		Version 3.5
$$ ##JCAMPDX= 5.01
$$ ##ORIGIN= Bruker BioSpin GmbH
$$ ##OWNER= she
$$ F:/spectra/data/she/nmr/H-C/1/audita.txt
$$ ##AUDIT TRAIL=  $$ (NUMBER, WHEN, WHO, WHERE, WHAT)
(   1,<2025-01-20 14:05:13.92 +0400>,<she>,<DPX200>,
      <created by zg, POWCHK disabled, PULCHK disabled
       configuration hash MD5:
       00 E9 B6 7A A2 85 ED C7 34 08 36 98 17 FE 4E 26
       data hash MD5: 16K
       27 81 39 01 9C AE E2 31 C9 A6 FE D4 F4 FB A3 34>)
$$ ##END=
$$ 
$$ hash MD5
$$ E9 0A D4 54 48 18 CD 47 3A 48 8B 01 3F D7 A0 07
##$RELAX= 
##$RELAX= 
##$RELAX= 
##$RELAX= 
##$RELAX= 
##$RELAX= 
$$ Bruker specific parameters
$$ --------------------------
##$DU= <F:/spectra>
##$EXPNO= 1
##$NAME= <H-C>
##$PROCNO= 1
##$TYPE= <nmr>
##$USER= <she>
##$AMP= (0..31)
100 100 100 100 100 100 100 100 100 100 100 100 100 100 100 100 100 100 
100 100 100 100 100 100 100 100 100 100 100 100 100 100 
##$AQSEQ= 0
##$AQ_mod= 1
##$AUNM= <au_zg>
##$AUTOPOS= <>
##$BF1= 200.13
##$BF2= 200.13
##$BF3= 200.13
##$BF4= 200.13
##$BF5= 200.13
##$BF6= 200.13
##$BF7= 200.13
##$BF8= 200.13
##$BYTORDA= 1
##$CFDGTYP= 0
##$CFRGTYP= 5
##$CHEMSTR= <none>
##$CNST= (0..31)
1 1 145 1 1 1 1 1 1 1 1 1 1 1 1 1 1 1 1 1 1 1 1 1 1 1 1 1 1 1 1 1 
##$CPDPRG= <>
##$CPDPRG1= <>
##$CPDPRG2= <>
##$CPDPRG3= <>
##$CPDPRG4= <mlev>
##$CPDPRG5= <mlev>
##$CPDPRG6= <mlev>
##$CPDPRG7= <mlev>
##$CPDPRG8= <mlev>
##$CPDPRGB= <>
##$CPDPRGT= <>
##$D= (0..31)
0 0.7 0 0 0 0 0 0 0 0 0 0.03 0 0 0 0 0 0 0 0 0 0 0 0 0 0 0 0 0 0 0 0 
##$DATE= 1737367513
##$DBL= (0..7)
120 120 120 120 120 120 120 120 
##$DBP= (0..7)
150 150 150 150 150 150 150 150 
##$DBP07= 0
##$DBPNAM0= <>
##$DBPNAM1= <>
##$DBPNAM2= <>
##$DBPNAM3= <>
##$DBPNAM4= <>
##$DBPNAM5= <>
##$DBPNAM6= <>
##$DBPNAM7= <>
##$DBPOAL= (0..7)
0.5 0.5 0.5 0.5 0.5 0.5 0.5 0.5 
##$DBPOFFS= (0..7)
0 0 0 0 0 0 0 0 
##$DE= 6
##$DECBNUC= <off>
##$DECIM= 32
##$DECNUC= <off>
##$DECSTAT= 4
##$DIGMOD= 1
##$DIGTYP= 9
##$DL= (0..7)
0 120 120 120 120 120 120 120 
##$DP= (0..7)
150 150 150 150 150 150 150 150 
##$DP07= 0
##$DPNAME0= <>
##$DPNAME1= <>
##$DPNAME2= <>
##$DPNAME3= <>
##$DPNAME4= <>
##$DPNAME5= <>
##$DPNAME6= <>
##$DPNAME7= <>
##$DPOAL= (0..7)
0.5 0.5 0.5 0.5 0.5 0.5 0.5 0.5 
##$DPOFFS= (0..7)
0 0 0 0 0 0 0 0 
##$DQDMODE= 0
##$DR= 18
##$DS= 0
##$DSLIST= <SSSSSSSSSSSSSSS>
##$DSPFIRM= 0
$$ [...]
##$SUBNAM0= <"">
##$SUBNAM1= <"">
##$SUBNAM2= <"">
##$SUBNAM3= <"">
##$SUBNAM4= <"">
##$SUBNAM5= <"">
##$SUBNAM6= <"">
##$SUBNAM7= <"">
##$SUBNAM8= <"">
##$SUBNAM9= <"">
##$SW= 18.0517328524113
##$SWIBOX= (0..15)
0 0 2 0 0 0 0 0 0 0 0 0 0 0 0 0 
##$SW_h= 3612.71676300578
##$TD= 16384
##$TD0= 1
##$TE= 0
##$TE2= 300
##$TE3= 300
##$TEG= 300
##$TL= (0..7)
0 120 120 120 120 120 120 120 
##$TP= (0..7)
150 150 150 150 150 150 150 150 
##$TP07= 0
##$TPNAME0= <>
##$TPNAME1= <>
##$TPNAME2= <>
##$TPNAME3= <>
##$TPNAME4= <>
##$TPNAME5= <>
##$TPNAME6= <>
##$TPNAME7= <>
##$TPOAL= (0..7)
0.5 0.5 0.5 0.5 0.5 0.5 0.5 0.5 
##$TPOFFS= (0..7)
0 0 0 0 0 0 0 0 
##$TUNHIN= 0
##$TUNHOUT= 0
##$TUNXOUT= 0
##$USERA1= <user>
##$USERA2= <user>
##$USERA3= <user>
##$USERA4= <user>
##$USERA5= <user>
##$V9= 5
##$VALIST= <valist>
##$VCLIST= <CCCCCCCCCCCCCCC>
##$VD= 0
##$VDLIST= <DDDDDDDDDDDDDDD>
##$VPLIST= <PPPPPPPPPPPPPPP>
##$VTLIST= <TTTTTTTTTTTTTTT>
##$WBST= 1024
##$WBSW= 4
##$XGAIN= (0..3)
0 0 0 0 
##$XL= 0
##$YL= 0
##$YMAX_a= 260295
##$YMIN_a= -323448
##$ZGOPTNS= <>
##$ZL1= 120
##$ZL2= 120
##$ZL3= 120
##$ZL4= 120
##$ABSF1= 10
##$ABSF2= 0
##$ABSG= 5
##$ABSL= 3
##$ALPHA= 0
##$AQORDER= 0
##$ASSFAC= 0
##$ASSFACI= 0
##$ASSFACX= 0
##$ASSWID= 0
##$AUNMP= <proc_1d>
##$AZFE= 0.1
##$AZFW= 0.1
##$BCFW= 1
##$BC_mod= 2
##$BYTORDP= 1
##$COROFFS= 0
##$CY= -3
##$DATMOD= 1
##$DC= 2
##$DFILT= <>
##$DTYPP= 0
##$F1P= 0
##$F2P= 0
##$FCOR= 0.5
##$FTSIZE= 0
##$FT_mod= 4
##$GAMMA= 1
##$GB= 0.15
##$INTBC= 1
##$INTSCL= 1
##$ISEN= 128
##$LB= 0.25
##$LEV0= 0
##$LPBIN= 0
##$MAXI= 10000
##$MC2= 0
##$MEAN= 0
##$ME_mod= 0
##$MI= 1.114404
##$NCOEF= 0
##$NC_proc= 0
##$NLEV= 6
##$NOISF1= 3.799351
##$NOISF2= 2.8
##$NSP= 1
##$NTH_PI= 0
##$NZP= 0
##$OFFSET= 14.38212
##$PC= 1
##$PHC0= 249.6407
##$PHC1= 17.1922
##$PH_mod= 1
##$PKNL= yes
##$PPARMOD= 0
##$PSCAL= 0
##$PSIGN= 0
##$REVERSE= no
##$SF= 200.129724274929
##$SI= 16384
##$SIGF1= 3
##$SIGF2= 2
##$SINO= 400
##$SIOLD= 16384
##$SREGLST= <1H.CDCl3>
##$SSB= 0
##$STSI= 0
##$STSR= 0
##$SW_p= 3205.1282051282
##$SYMM= 0
##$S_DEV= 0
##$TDeff= 0
##$TDoff= 0
##$TI= <>
##$TILT= no
##$TM1= 0
##$TM2= 0
##$TOPLEV= 0
##$USERP1= <user>
##$USERP2= <user>
##$USERP3= <user>
##$USERP4= <user>
##$USERP5= <user>
##$WDW= 1
##$XDIM= 8192
##$YMAX_p= 0
##$YMIN_p= 0
$$ End of Bruker specific parameters
$$ ---------------------------------
##NTUPLES= NMR FID
##VAR_NAME=  TIME,          FID/REAL,        FID/IMAG
##SYMBOL=    X,             R,               I
##VAR_TYPE=  INDEPENDENT,   DEPENDENT,       DEPENDENT
##VAR_FORM=  AFFN,          ASDF,            ASDF
##VAR_DIM=   8192,          8192,            8192
##UNITS=     SECONDS,       ARBITRARY UNITS, ARBITRARY UNITS
##FACTOR=    0.0002768,     1,               1
##FIRST=     0,             0,               0
##LAST=      2.2672688,     0,               0
##MIN=       0,             -323448,         0
##MAX=       2.2672688,     260295,          0
$$ Real data points
##PAGE= N=1
##DATA TABLE= (X++(R..R)), XYDATA
$$ [...]
2083g02J735q09j756K082j250K4J848o11M26r0j659J111m65q61K218j098m04J654
2101A393k322m93J621j844J794J275j695J072k84j530J131q35L33J988j386Q02
2117A020Q14k969J031Q0j739K163K57j139J553j252j060J460j430O14J361o84
2133H0J114l34j613J410r14n43K679j589j80J278k328J11Q68j924J936R09j499
2150e39J540q07j179P95p89M57J549j091J220R3k240J244m47j418K517l76q39
2167c10J571j868l90J021j444R58R21p84J238o36j187J657j342qK236j545M49
2184E37J006k412N43L49j678J939J87q74J171r06j090J053j049J019J035j257
2200d27J720k36k027J707j000o79K064p85l08J314k116L20M66j318J292K75o92
$$ plain form
2083 -702 1033 224 -1532 550 -700 -676 1172 561 987 897 -762 349 -116 -977 1241 143 -261 1393
2101 1393 -929 -1422 199 -1645 149 1424 -271 801 517 -1013 118 -717 -384 1604 218 1020
2117 1020 1834 -1135 -104 -24 -1763 400 657 -482 1071 -181 -1241 219 -1211 -597 764 80
2133 80 1194 860 -753 657 -257 -800 1879 290 110 1388 -940 -829 39 -1885 51 960 -539
2150 -539 1001 194 -985 -190 -979 -522 1027 -64 1156 1249 -991 253 -194 -1612 905 529 -310
2167 -310 1261 -607 -997 24 -1420 -462 459 -325 913 277 -910 747 -595 -603 1633 88 537
2184 537 1543 -869 -326 23 -1655 284 471 -403 768 -138 -1228 -175 -1224 -205 830 -427
2200 -427 1293 1057 -970 737 -263 -942 1122 337 29 1343 -773 -453 13 -1305 -13 262 -430
2217d30J251q58r90J465j564O92J788j417Q66N95k104Q62k87p58J506o21q0J343
2235A259k007R5N59j531J472P58j250J886o77j631J684j043l05K059j180K36Q61
2252A245j965O55j58j086J647l97k35J564j631m22J022j596R23J537j509J413
2268A007J68j674J061q24m58J587q16K53P64j849P40j21j305J455M2p07J862j033
2286A52j197J470j299K47J473r75R74K91j730R57n39r18J595n87q1J363j699j
2304e04O39j752J318P94j039J358k85r99J135j204L15J462j217N93N26j309L98
2321B29k21j187J657n28m71J226j173l74J295j597O64J163q74J137j67j291J074
2338E62r19n37J778r77N78O74j652M22M86j871J244L84q64J522p16p10J207j441
$$ plain form
2217 -430 821 -37 -1027 438 -1126 -434 1354 -63 803 1398 -706 156 -131 -889 617 -4 -84 1259
2235 1259 -748 -653 -94 -1625 -153 605 -645 1241 564 -1067 617 -426 -731 1328 148 384 1245
2252 1245 -720 -65 -223 -1309 338 -59 -294 1270 -361 -783 239 -1357 -434 1103 -406 1007
2268 1007 1175 -499 562 -262 -720 867 51 304 1068 -781 -41 -162 -1467 -12 30 -677 1185 152
2286 152 -1045 425 -874 -627 846 -129 845 1136 -594 363 -176 -1094 501 -86 -167 1196 -503 -504
2304 -504 135 -1617 -299 495 -544 814 529 -470 665 -539 -224 1238 21 614 1140 -169 229
2321 229 8 -1179 478 -50 -521 705 -468 -842 453 -1144 -480 683 -191 946 779 -512 562
2338 562 -357 -894 884 -93 485 1159 -493 -71 415 -1456 -212 172 -692 830 114 -596 611 -830
2356h30N57R21j130J223J95j508J168q12p95J791p82o7J124j668J94P17j469Q59
2374c12Q30j096J439l76j086J057r59j76J499q83O44O74j596Q45l29j506J515
2391A84l24n44J566j142l61J121j421O92N99j068J583l47j399J410n66m34J315
2408H64j040O49O32j750L54M62j386J073K29p59J690q21n54O90j378N81J047j086
2426e03J156L79j263P58m60q62J252p15k89J397j397M39M74j473J029M37r70J236
2444F25o93o33J093q03J39J192r23O88M13j503M75l4j213J293l90k25J709j396
2462a86k81J058j522K26P17n23J230q1r76J145o60m77J107j448M72J054j312N49
2480I2Pj227J171K80q86J029n37l50R48j158K00J118r28R69K81j540R73p85q35
$$ plain form
2356 -830 -273 648 -482 741 936 -572 596 -216 -1011 780 -2 -69 1055 -613 -419 298 -1171 -312
2374 -312 518 -578 861 485 -601 456 -503 -679 820 -63 581 1255 -341 504 175 -1331 184
2391 184 -140 -684 882 -260 -621 500 -921 -229 370 -698 885 538 -861 549 -17 -451 864
2408 864 -176 473 1105 -645 -291 171 -1215 -142 87 -672 1018 197 -357 333 -1045 -464 583 -503
2426 -503 653 1032 -231 527 67 -795 457 -258 -547 850 -547 -108 366 -1107 -78 359 -611 625
2444 625 -68 -701 392 -411 -272 920 -3 685 1098 -405 70 36 -1177 116 -274 -499 1210 -186
2462 -186 -467 591 -931 -705 12 -511 719 638 -338 807 147 -330 777 -671 -199 855 -457 92
2480 92 99 -1128 43 323 -563 466 -71 -421 527 -631 -431 687 -241 728 1009 -531 442 -343 -1178
2499a178J643p18J10J078j158o4N59j276N38M35r08J426j76l76P40r50J80R30
2517H35j397P26P17j366Q30j89r01J173n41l53J158j004J2L91j098P12O09p58
2535d44J333k53q91J075j019o25J437q45L33R91j399N79L7j315Q55k26k56J235
2553F02j053K4J029j209L92Q62j261J087J85j005O97k11n21R92p32k3J007j179
2571c17J97J02j248J268p5m39J433m56o01O79j230p1J294r43O03Q29j037M82l46
2590A24r61J063o96j14Q64p70K55Q16j437R58N59j194R39l9j316J507k42n44R03
2609F75p16N18L25j214L31P4j019R02k9m63J543j017l24Q99r59J5P24j018J154
2628D01N26q72P41n89n41P59q82j9R66r18L69M78j298J151J1r75Q69l78k08Q44
$$ plain form
2499 -1178 465 -253 -143 935 -223 -287 272 -1004 -466 -31 -939 487 311 -65 675 -275 -95 835
2517 835 -562 164 881 -485 345 156 -745 428 -113 -466 692 -312 -300 91 -1007 -295 314 -444
2535 -444 889 636 -255 820 -199 -824 613 -232 101 1092 -307 272 309 -1006 -151 -377 -633 602
2553 602 -451 -427 602 -607 -215 647 -614 473 658 -347 350 139 -382 610 -122 -145 862 -317
2571 -317 -120 -18 -1266 2 -73 -512 921 465 -136 543 -687 -758 536 -407 196 1025 -12 470 124
2590 124 -837 226 -470 -584 280 -490 -235 581 -856 102 661 -533 406 367 -949 558 316 -228 675
2609 675 -41 477 802 -412 -81 -7 -1026 -124 -153 -616 927 -90 -414 485 -474 -459 265 -753 401
2628 401 927 55 796 207 -334 425 -457 -476 490 -428 -59 419 -879 272 283 -692 177 -201 -409 435
2648D35q17L53P42o80P73l00p42N94m38r04R75l87J64J207j263m4Q96j302M57
2667b81J82n61J279k78p51J223n72m74Q65r85K76P39j187P43j41p06J237p01m63
2686e56Q16k84m59N43q85O21J050j269J035J00r50Q13n72q76J250o12J13Q58j213
2705d77N85N43j508O13K06m66Q01l59p4J017p39n8J52m94N77K57j047M93K37o72
2725d13J110p69q9O87q46m05O39q85Q70M29q11J178j91m58M06r06K22P51p89L28
2745E8O48p27L28j09j008Q74k27o25Q05l36j88J033p69J48M23p02P02j7j072J409
2765F48m70n82P25j77Q4O23j307k5L32n40N14Pm51J347k58o14Q27r75O0O26p68
2786c74M40Q26q70M62l00l97O85q91m58Q49k55Q6N18r92Q18L35r29M96k07k84
$$ plain form
2648 435 -382 -29 713 33 806 506 -236 358 -80 -984 -9 -396 -232 975 -288 -332 564 -738 -281
2667 -281 -99 -660 619 341 -410 813 241 -233 632 -353 -77 662 -525 218 77 -629 608 -93 -556
2686 -556 260 -24 -483 60 -825 -204 846 -423 612 712 -238 575 3 -873 377 -235 -122 736 -477
2705 -477 108 651 -857 -244 -38 -504 297 -62 -136 881 142 84 236 -258 319 576 -471 22 259 -413
2725 -413 697 -72 -161 526 -320 -725 -86 -971 -101 328 -483 695 504 46 452 -454 -232 519 -270 58
2745 58 706 -21 307 198 -810 64 -163 -788 17 -319 -507 526 -243 -95 328 -374 328 311 -761 648
2765 648 178 -404 321 144 228 851 -456 -481 -149 -689 -175 -168 -619 728 470 -144 683 -292 -232 394 -374
2786 -374 66 892 22 484 184 -213 472 -419 -877 -28 -283 -197 321 -671 147 482 -447 49 -158 -442
2806d42J108o95k19J134r45J81L50r64O13m3j059O97O7J5Q33q39j24R86j126k1
2826d93N57p47R81L12j053J019j5j034J200j227Q2Q96q43K50J95o33R88j99r77
2845g41J027n08r6O63r23M02J004r26N88R9o44O00o06p62R21m04N5O02p03N42
2865A90M95j646Q31nn49J068m83l11J101l40l71L05m31J22L72p50M49J10n71P37
2885C23m11l67J109j022k51O95n72N56L70o83Q66r7n04L24m17n42Q70n23J11O10
2905D45m58L48j06q47M66N4o06R63n92K23P01q55J31N36n35K68k1q82J036k19
2925E0l44Q13o11j7M84p68jK16m50M75K85m41J037l15p05O56o23K33K32o23N89
2946A72N71p46K31j8r25R60n11n98R88n44J26O63p64L53M59p69P69l42o60R56
$$ plain form
2806 -442 666 -29 -248 886 -59 122 472 -492 121 78 -981 -284 -217 -202 631 -208 -332 654 -472 -493
2826 -493 64 -683 298 610 -443 576 561 -473 727 -500 -418 478 -365 -115 80 -553 435 236 -741
2845 -741 286 -222 -318 345 -578 -176 828 -98 490 589 -55 545 -61 -823 98 -306 -251 351 -352 190
2865 190 685 -961 -130 -135 -684 384 -99 -410 691 351 -20 285 -146 -24 348 -402 47 157 -414 323
2885 323 -88 -455 654 -368 -619 76 -496 60 430 -253 613 516 12 336 -81 -623 247 -276 -165 445
2905 445 -13 335 229 -618 -152 -98 -704 259 -333 -110 591 -264 -133 403 -132 136 115 -767 269 50
2925 50 -294 519 -92 -109 375 -393 -394 -178 -628 -153 132 -309 728 413 -292 364 -259 -26 206 -417 172
2946 172 743 -3 228 210 -715 245 -266 -864 124 -420 -294 369 -395 -42 417 -352 417 75 -585 371
2966C71l50n37J162m07j08M69r19L43K1j028P07K28r4P43o71k54P32o69jM81o41
2987d22P31M76q15P25n46m00N43m67l24Q28r92M24M22o01O00K7p62Q73k88m74
3007d42M01k16J25Q79p44K35K45p09N41l14q00Q72q5m54R37n45j35Q60j243K98
3027b94M48n11P39k04m98J172n36m32M44o18J77L55q08J43N55p07O80p4n21R77
3047D87o43l74P86q21M29P44o37N30L45j046M15n03k88J074o90r3P68n24J45k4
3067H0p24M60O3k69O78l99K2P87m85m19P58p55L69J98q27P79l4q93P86j60j13
3088i8M63o71j72N80n60M87J94n71Q42J11p29L88m35l24R89r92N41O14q41M17
3108B33o5p19O15l45l74R35n36K00P16r31N29J82o76K12K90n78Q54l19o87R53
$$ plain form
2966 371 21 -516 646 239 131 600 -319 24 45 -983 -276 -48 -142 601 -70 -324 408 -261 -262 219 -422
2987 -422 309 785 -30 695 149 -251 292 -175 -499 329 -663 -239 183 -418 182 209 -553 320 32 -442
3007 -442 -41 -257 -132 747 3 238 483 -226 315 1 -799 73 -12 -466 471 -74 -209 651 -592 -294
3027 -294 154 -357 382 178 -320 852 316 -116 328 -290 -113 242 -566 -423 132 -575 105 31 -490 487
3047 487 -156 -530 256 -565 -136 608 -29 501 846 -200 215 -288 -576 498 -192 -285 483 -41 104 80
3067 80 -644 -184 -121 -390 288 -111 -89 698 213 -206 552 -203 166 364 -463 316 282 -611 175 15 -98
3088 -98 365 -306 -478 102 -458 29 223 -348 494 605 -124 264 -171 -495 494 -498 43 657 -184 233
3108 233 168 -551 64 -281 -655 280 -256 -56 660 -271 258 440 -236 -24 266 -312 542 223 -464 489
3128D89l96j85L62m75M5L59j030O40L03m46Q16l24l07M90l50K9K06n04N79L18
3148F19o13K81j72l93M66o12k9O04n05rQ31j092Q09K69q11P17j81m09P70p69k9
3169b58P81l36p0K21o38M92j99q52P95P1l82P43m04k15P20p46k37M14j73M75L05
3190E07p11P79k51n70N13o60L12L25n24L8M24o09Q00k02o11Q00l63l61N74n63
3210c53J63O97p22M71L36p21K67l33n66J025n03l27Q31m84J55L21p87M16J63m34
3230c85O39n3j51Q57o70m08M76o10L95J56o64N08K30r22P39j74k02O49p28O2M98
3251B42o67K69M83n85R68l66n10L96m46j43N74n19lP04m50Q2J23o60L37J6k87
3272d42N57q4r1P70r03oO92p14K83J89n78O16j37n52O07l06j3N46q07K21K92o32
$$ plain form
3128 489 93 -92 270 -205 -160 199 -831 -191 112 -334 482 158 -149 341 -9 20 226 -278 301 619
3148 619 6 287 115 -278 188 -424 -453 151 -354 -363 468 -624 185 454 -357 360 179 -230 540 -229 -258
3169 -258 523 187 117 338 -300 192 -7 -859 -64 7 -375 368 -36 -251 469 -277 -514 -100 -273 202 507
3190 507 -204 575 324 -246 267 -393 -81 244 -280 -242 182 -427 373 171 -440 360 -3 -364 210 -353
3210 -353 -190 507 -215 256 592 -129 138 -195 -761 264 -239 -566 265 -219 -64 257 -530 -114 49 -385
3230 -385 254 201 50 907 237 -171 305 -305 90 246 -418 90 320 -602 137 -37 -239 410 -318 -256 242
3251 242 -425 -156 327 -258 710 344 -166 230 -216 -359 215 -304 -307 397 -53 29 152 -508 -171 -155 -442
3272 -442 115 31 -60 710 -193 -199 493 -221 62 251 -327 289 152 -400 207 -99 -112 434 -373 -152 140 -492
3294d92O04j70j19Q23q7o83N97o27PK19n17N35L48m26J48jm93M67l06m18P77k26
3316d0J7L29o11L41K25o17N24K16p35Q96m95l56Q03m59k65N32o44L46J57q00L26
3337c10K77j96P08k34k41O94p53Q4o2k96N34K15n07L48l0n14L54n05K50L76m07
3358b15M7M23n62N33p0n93P60J35o71N62m31k22O81m13J29L11m69K96k51m19L90
3379d9p6k15O49l48n3O33j109L40N15q02N95J17m84Q29l70l82L71n40P3N81m81
3400b06M0K70n07M78L5l64L66l5l00P62p13PM54q23P40M51o68L21k44m70O31m52
3422b27k04R72q68R0N17o93M00R3k37M85l30k27P76o73q3P48o16R9k8j60M95j11
3444B18p03P76l94p4M93m44J64mj63nK34k49L47K12o25O67m85j85L79o64M10M97
$$ plain form
3294 -492 112 -58 -177 646 559 -124 473 -154 -147 72 -445 90 438 12 160 159 -334 133 -173 -591 186 -40
3316 -40 -23 306 -305 36 261 -356 168 384 -351 545 50 -306 497 38 -227 305 -339 7 164 -636 -310
3337 -310 -33 -229 479 245 4 698 -55 29 -33 -329 205 420 -87 261 231 -283 71 -434 -184 192 -215
3358 -215 -168 255 -307 226 156 -437 323 458 -213 349 -82 -304 377 -36 93 404 -65 231 -20 -439 -49
3379 -49 -125 -340 309 -39 -92 541 -568 -228 287 -515 80 197 -287 542 172 -210 161 -379 -306 275 -206
3400 -206 -166 104 -403 75 110 -254 112 77 -223 539 -174 -167 287 -536 204 655 -13 308 64 -406 225 -227
3422 -227 -431 541 -327 -237 280 -413 -13 80 -157 328 -2 -229 547 -126 -209 539 -77 22 -6 -166 329 218
3444 218 -485 291 -103 -177 316 -128 36 32 -131 -136 98 -151 196 408 -217 450 -35 -220 159 -505 -95 402
3466D02m97M91m59k71L69n50l2Q41l00k3M85m36qK51n90L67M74p96O62l90k76
3487b86N46m43q8N39j94k61N22n83J24L37m80O26j19k94O45n85k2J76m99J76M43
3508B80o50M39N3o01M16k02l57Q60n04N7O08n30K69J90o09M91n8j84N62m13l76
3529b59O86o88P4O11q30L97M15r03N74r7m50P73J4n04M16l98O7L50n74N49K1l24
3551h0L47q4m41L90m09m9L64l66M43J35p89N37K39p88R28l17p2M28m26j65M96
3572C21m58k5N51m97O0J92l64J93q1m43R27m16N1L65o20M18j03o51O12J81l55
3593a42O39m93k93L89m35J51K84m32M47M1o05N80j76l88P57l47o4M96n62O3K19
3614A29m97O86K32p50O86l25l37M00l91j78P28p36L05K28n23N73j91l32N30j08
$$ plain form
3466 402 -95 396 -63 -334 35 -515 -547 294 -6 -29 456 20 12 263 -327 40 514 -282 380 -10 -286
3487 -286 260 -183 -271 268 74 -187 335 -248 -124 213 -267 359 240 -54 591 6 -16 160 -339 -163 280
3508 280 -370 69 122 -479 -63 -265 -622 238 -266 -209 399 -131 138 328 -281 210 152 -32 530 117 -259
3529 -259 427 -261 -187 424 -406 -9 406 -497 77 -20 -470 303 317 -187 229 -169 -102 248 -326 223 244 -80
3551 -80 267 183 -258 132 -277 -326 38 -328 115 250 -539 -2 237 -551 377 60 -12 416 -10 -175 321
3572 321 -137 -162 389 -108 -48 144 -220 -27 -108 -551 376 -40 11 376 -244 174 71 -580 32 213 -142
3593 -142 497 4 -289 100 -335 -184 100 -332 115 156 -449 131 -45 -433 324 -23 -87 409 -153 -90 129
3614 129 -368 318 550 -200 486 161 -176 224 -167 -345 383 -353 -48 180 -343 230 39 -293 237 129
3634A29k67P44n30k4K78p71N47R3l99O56m48l84N39l96k15O54j86k99P62o87L02
3655I8R5m49M37n3k66M75j24n52N83n11M1M63n43N40l3o66M02n0m39Q16k68m3
3677d7M97n00K77j71k79M30Nn20O41k51l07M53m35p1M58l19J75R0m24L52Jn38
3699d83N21k4j53N06l61j25N19o93M27J42m93L88m7l77L24l8n34Q52n75J78M28
3720C82n77L86q5k48M58l39j18M86k50k02N09o86L3N42n24L50J39n19L01k37p2
3741b71M21l67J11O00n05J41P7n71J66N20n98N63N2m75N14o07K06J02l01L62K
3762A42m10J26K13n53Q13l02k01O66m99n5L82n02J11L09m71O17j9n93L74l77j24
3783c53M80k65J53J38k02R1M80n86K77j14k26O87n96j03N67l75o9L71o49M39j04
$$ plain form
3634 129 -138 606 76 52 330 -441 106 199 -200 456 8 -376 163 -233 -448 206 20 -279 483 -204 98
3655 98 193 -256 181 128 -138 337 213 -339 244 -267 -226 237 -306 234 201 -465 -63 -113 -552 264 -4 -47
3677 -47 450 -50 227 56 -223 207 212 -308 333 82 -225 228 -207 -278 180 -139 36 126 -298 54 55 -483
3699 -483 38 14 -139 367 6 -119 400 -293 134 276 -217 171 124 -253 71 33 -501 351 -224 -46 382
3720 382 -195 191 106 -142 316 -23 -141 345 95 -107 402 -284 -251 291 -233 117 256 -263 38 -199 -271
3741 -271 150 -217 -106 494 -11 130 207 -364 -198 322 -276 287 339 -136 378 -229 -23 79 -222 140 142
3762 142 -268 -142 71 -482 331 29 -172 494 -5 -60 322 -180 -69 240 -231 386 367 -226 148 -229 -353
3783 -353 127 -138 15 153 -49 42 522 -64 213 99 -127 560 -36 -139 428 53 -16 355 -294 145 41
3804D1k65P5r3k50O16k18r0N90l78O3K41o03N27o7n37P09j05m58N64n14j36O20
3826C32n66L64j0l32K19j12j41N21l46K24L88p01J54L89n72K64k2l27L87L64q00
3847c23M67l90k67O82l04R7L42o80L20J52o87O54Rl92P67m95J16J64k70o2L58
3868B58m31N0K54j52J22l16Q3L59k77j5J99k46K13J56m07K79j50k90O76j73k34
3889d2L78m14j04L69o37L65K05l21J81N3k21J77j32jM89l85j06O39o21L14j2m07
3911b33L51m8m72N86m14l9N03k53J9J89l46K10k05m8N68n53q8P17m00k15M30n13
3933b54M8J87k67K19K43k52J91j46k93M78k77k25P01n94M56J39l58N7K80m82K57
3954A08j27k34N36k86k16J54j73L19M2m75L97R3l77L39j67j97O73m41J7J62j19
$$ plain form
3804 41 -224 -149 -242 -492 124 -94 -184 406 28 91 332 -271 256 189 -348 361 256 -202 362 -152 -288 332
3826 332 -234 130 120 -212 7 -105 -246 275 -71 153 541 -160 -6 383 -189 75 53 -274 113 477 -323
3847 -323 144 -246 -513 169 -135 -38 304 -376 -56 96 -591 63 72 -320 447 -48 68 232 -38 -100 258
3868 258 -173 -123 131 -21 101 -215 -132 227 -50 -65 134 -112 101 257 -150 129 -21 -311 365 192 -42
3889 -42 336 -78 -182 187 -450 -85 120 -201 -20 33 -188 -11 -143 -144 345 -40 -146 493 -128 186 174 -233
3911 -233 118 70 -402 184 -230 -269 234 -19 0 189 -157 53 -152 -200 368 -185 -273 444 44 -171 259 -254
3933 -254 -206 -19 -286 -67 176 -76 115 -31 -324 154 -123 -348 353 -241 215 354 -4 53 333 -149 108
3954 108 -19 -253 283 -3 -219 -65 -238 81 123 -352 45 138 -239 100 -67 -264 409 -32 -15 147 28
3975B8j13J57k09J75L1m09L58j21p9J32j79O2L27l03j4L02n42O07j37l27L93l02
3997a63K69K83o23M1M24l44L01r6m37O08k12m41M49k55n1P02m67q6K16k22J50
4018D6J42m80N87q1j92K21k80J41Jn52K90K62l13K23L5L0K31l92r8M86j80k55
4040a28L33k74J25N8m73L59K55l77L61k16k58K67k83L1M24k88J86J24m40L46j67
4061c5Q5L19l23q0M00m79K28q7m3L11k12k44J79J92m93L94j98K0N56o57M7J01
4083a9j71M44k4n84O40R8o63O00l79k49N54j86k60O60m84N1L98o81N64m30R8J19
4105I6l62L82K30m27K30J26n05M14j47n21P97l58o1K49l63N5O06m35l8J44m46
4126c34L44n6j65K97J40m57L73m08J82J23k92J52K7j22L34j28j90L96l65L3L84
$$ plain form
3975 28 -85 72 -137 38 69 -340 18 -103 -182 -50 -229 -167 160 -143 -157 145 -397 210 73 -254 139 -163
3997 -163 106 389 -234 -193 231 -113 188 92 -345 263 51 -390 59 -196 -247 455 -12 -98 118 -104 46
4018 46 188 -292 295 214 22 243 -37 104 105 -447 -157 105 -208 15 50 80 311 -81 -179 307 127 -128
4040 -128 205 -69 56 114 -359 0 255 -122 239 23 -235 32 -251 -220 204 -84 102 226 -214 132 -35
4061 -35 50 369 46 -34 366 -113 115 28 -15 296 84 -160 19 211 -282 112 -86 -66 490 -167 -120 -19
4083 -19 -190 254 230 -354 286 384 -279 321 -58 -307 247 61 -199 461 -23 28 426 -255 309 -121 -23 96
4105 96 -266 116 346 -81 149 275 -230 184 37 -484 313 -45 -106 143 -220 -165 441 6 -32 112 -334
4126 -334 10 -46 -211 86 226 -231 142 -266 -84 39 -253 -101 -74 -196 138 10 -180 216 -149 -116 268
4147B68l49r7J76j55L48M0m39M28j22m6J77k55q4J54k40K51J07l20L82%m34K54
4169D4n0K0J54k86L86P2n64L38o3m69M92Rk41K78r3k29J78l46K49K72l85K54L4
4192E4j26K98m78KM25j24j17K12l76K55L02l04Pr1O7R3q3l21N06k77K72K1k92
4215g5M30N2m16j06J02m19N26j07j45L54j91j74K11k39P8M3k85L17j22N4L05L
4237A96m01L98k52r3N02m27K59R5m63K62M7n9p1q8n7N23p47O1P26n08K27n9k60
4260a89M4K17m15O14m54lN80l14j01J08j92J98j74k05J62J48o9M52n54O1L42l69
4282a13R7J4k10M48j80k39O07m16j38K25o5N4j37k67L12M49n47J98Q0n26N39l44
4304a59j4K09l8J43J68o14N45l1l40l1J1j63M65k66O7K62m04J55K80m99K38L16
$$ plain form
4147 268 -81 -178 -2 -157 191 231 -208 220 98 52 229 -26 -110 44 -196 55 162 -158 224 224 -210 44
4169 44 -6 14 168 -118 268 340 -224 114 51 -418 74 83 -158 120 27 -202 -24 -370 -121 151 -234 20 54
4192 54 -72 226 -252 -250 175 51 -66 146 -230 25 327 23 30 -61 6 99 16 -305 201 -76 196 217 -75
4215 -75 355 407 -9 -115 -13 -432 94 -13 -158 196 5 -169 42 -197 -119 -76 -361 -44 -166 -112 193 196
4237 196 -205 193 -59 -152 350 -77 182 277 -186 76 123 64 -7 -95 -152 371 -376 -315 411 -97 130 71 -189
4260 -189 -145 72 -343 271 -183 -186 394 80 -21 87 -105 93 -81 -286 -124 24 -45 407 -147 -86 256 -113
4282 -113 -16 -2 -212 236 56 -183 424 8 -130 95 30 84 -53 -320 -8 441 -106 92 172 -354 185 -159
4304 -159 -173 36 -2 141 309 -305 240 209 -131 -162 -151 -314 151 -115 -48 214 -190 -35 245 -254 -16 300
4326C00n60M96l77O0M82m86J13M84o78P1J07l54L91j29k14M26j2j01K51m49J62
4347a7K12m12K72L32m60M04k12j65J54Q8l80K08m71K77L28m08Q5K11k37M33k75
4368c3m47O13r2K9q1k29K82M38o19M36k63j87L68j60j54L64j72m21L94l15R3K16
4390F0l59L62J03k54K87k42J1L45n21M00J95n99N09j47l84M15M1m06J88j37L4
4411i9L70l39j7Q6o4L55k53m02O06j07l64L66j99k1M33o14L15L19o75L03Nn72
4433e68O44l2l65L78k01N9L91o80L78J75l94L90j16k32J93J89l68K92l07k4M09
4454B11m61K65Q8n8K84l33k31N43k15j48J06o9J90K51o18N15p6n91N67k60j46
4475a86L45j14l14K89j29J96L0k79J34J79l43J86%j81M22j18j35L60m66M9R7n44
$$ plain form
4326 300 -260 236 -141 -81 401 -85 28 512 -166 -95 12 -342 49 -80 -294 132 120 19 270 -179 -17
4347 -17 195 -217 55 387 -73 331 119 -46 108 196 -184 24 -447 -170 158 -250 -165 46 -191 242 -33
4368 -33 -480 133 41 70 -11 -240 42 480 -139 297 34 -153 215 55 -99 265 93 -328 66 -249 -156 60
4390 60 -299 63 166 -88 199 -43 -32 313 -208 192 387 -212 297 150 -234 181 222 -184 4 -133 -99
4411 -99 271 -68 -85 1 -63 292 39 -363 243 136 -228 138 -61 -82 351 -263 52 371 -304 -1 4 -568
4433 -568 76 44 -321 57 -144 -85 306 -374 4 179 -215 175 59 -173 20 209 -159 133 -174 -198 211
4454 211 -250 15 103 45 329 -4 -235 308 93 -55 51 -18 172 423 -195 320 244 -347 220 -40 -186
4475 -186 159 45 -269 20 -109 87 117 -162 -28 151 -192 -6 -6 -187 235 117 -18 342 -124 -75 22 -522
4497e22O40r5k11K94r3m7L13n55M0L67k54L33kj39L56j22n05M11k04j57K30l62
4519b84J85M3K8N8p9n6L12l05l29M93M2j54L16k20M7K96l95J48l3p8J45j48l19
4542b87M60j08j97J69k38o0L34l01K21K22k49K91q7o8J76k33l0O6l64K17K87n24
4564c03M16l9l62L77j33k40M27m10R1J53o5L80k19j84R3O6q6J96k07p6O44m83
4586C6k78K93j22j6l9k24N69j84k03L61j29q8L21l97P2J37j73R7J25m16N64k28
4608G8j93L02k64r8K22k64LO17o41M11o9k04M56l82r9L77m84K46L10n35PN00m29
4631a33OO9m44O74j82l57L31m0k9K89n46M26Q4k05K9m6K21m0j20k09J99n0r1L93
4655B29m78J35J37j48J16J01k69L32k87LM25k67J1K80l03J53O6l51N9j4k97P40
$$ plain form
4497 -522 118 23 -188 106 13 -34 279 -276 -236 131 -123 210 208 69 425 303 -202 209 5 -152 78 -284
4519 -284 -99 -56 -28 30 -49 -105 207 -98 -427 66 108 -46 270 50 97 393 -2 146 113 35 180 32 -287
4542 -287 173 65 -132 37 -201 -261 73 -228 -7 215 -34 257 170 102 278 45 15 81 -283 -66 221 -303
4564 -303 113 74 -288 89 -44 -284 143 -267 -176 -23 -88 292 73 -111 -18 48 -38 158 -49 -125 519 36
4586 36 -242 51 -71 -87 -126 -350 219 35 -168 193 64 -24 297 -100 -28 109 -64 33 158 -258 306 78
4608 78 -115 187 -77 -175 47 -217 -214 403 -238 173 104 -100 356 -26 -125 252 -232 14 324 -211 -204 296 -133
4631 -133 -127 -58 -502 172 -10 -367 -36 -76 -105 184 -362 64 148 -57 -28 -74 147 107 -13 -222 -23 -73 -164 229
4655 229 -249 -114 23 -125 -9 92 -177 155 -132 -129 296 29 40 320 17 170 236 -115 -56 -70 -367 373
4677C73l56l78M76j41j47M17l64R0J97l33K91Qm4J00qj39L34m20J2n3k91L71K18
4700B13m17M84j84p7J82k17j03L81m71K50J45l52M67l3o57O65l12J8l7k14L53
4721H4J29n88L68j12k05M42k09k54L04o8m5M41l45L12Q8m67L18o0j47L7J51k12
4743c8J46k82QK61k84K07J72l25J69L30o18L68nj33L45n60L06J94l67J39J64k78
4765h1J55J28l30K90j71j04J50j17j8M92o50M21K1l11J21J59k14K65j89k6K56
4786B47m35J67R7j13p9K77j03J39l68J06J91l6j27K73l39M4K78j92m3k5k38N05
4808B26J9n06K75j54j29M64n08K01K90k74K93N8k52L3j70j36M81l48J93k8j59
4829a31J76lm1J31k81n4M00k31r0K07k66K3K86l07J55N9k68M24j51m1po9j22L11
$$ plain form
4677 373 17 -361 115 -26 -173 244 -120 -30 167 -166 125 133 89 189 181 42 376 -44 -32 -85 -376 -5 213
4700 213 -204 280 96 19 201 -16 -119 262 -209 41 186 -166 301 268 -389 276 -36 -18 -55 -269 84
4721 84 213 -375 -7 -119 -324 118 -91 -345 -41 -109 -154 287 -58 254 342 -125 193 133 -14 23 174 -38
4743 -38 108 -174 -166 95 -189 18 190 -135 34 364 -254 114 109 -24 321 -239 67 261 -106 33 197 -81
4765 -81 74 202 -128 162 -9 -113 37 -80 -98 394 -256 165 186 -125 -4 155 -59 206 17 -9 247
4786 247 -188 -21 76 -37 -116 161 58 197 -171 -65 126 90 -37 236 -103 -59 219 27 -16 -41 -279 226
4808 226 245 -261 14 -140 -269 195 -313 -112 178 -96 197 255 3 36 -134 -270 211 -137 56 28 -131
4829 -131 45 42 1 132 -149 -203 197 -34 -124 83 -183 -160 126 -181 -26 33 -235 189 38 -3 -10 -79 -201 110
4853A10j36k07K47l30O2M83o28M86n9k74M64o5n9n9m00M63M10n20q3M5k54L25
4875B1j02k45N09l24O5J25j63J7M06m05J36P0k98L36j88q8L74m11R3J88k81J13
4897e2K61n08K95j04K7K13q1j42J51l8N1J9m56L62J18k09K69L6o0l3j04j40K71
4920A46l00j12L64m78K93K90j73J32k16k01K83k18J13K82k66J22J53k97K31P5
4940B23k94%K38k71R0j49j5M23l66K07k00k5K84j40j04%j75J21K62j90O7K54l45
4963a05K45Ok72M53p8n49K85m0j48L30m07J51K09j15R3n3j92L83k06k37L79k19
4985h7J51m6j16J56k3k27J57M1j25R3R6k21L07m2o4r7l8K11j7j34Q7r2r8J5L24
5010B11j85K44l03j76L85l66M1L11l67K36j77KL70j79k11L35k14K7L21m27M40
$$ plain form
4853 110 -26 -233 14 -316 -254 229 -399 87 28 -246 218 153 94 35 -365 98 508 -12 -95 -50 -304 21
4875 21 -81 -326 183 -141 -76 49 -114 -97 309 -96 40 110 -188 148 -40 -128 246 -165 -72 116 -165 -52
4897 -52 209 -299 -4 -108 -81 132 51 -91 60 22 73 92 -364 -2 116 -93 176 212 152 119 15 -125 146
4920 146 -154 -266 98 -380 -87 203 30 162 -54 -255 28 -190 -77 205 -61 61 214 -83 148 223
4940 223 -71 -71 167 -104 -14 -163 -178 245 -121 86 -114 -139 145 5 -99 -99 -274 -153 109 -81 -14 240 -105
4963 -105 140 146 -126 327 249 -300 -15 -55 -203 127 -280 -129 80 -35 58 5 -187 196 -10 -247 132 -87
4985 -87 64 18 -98 58 35 -192 -35 6 -119 -26 70 -151 156 114 50 -47 -85 126 109 -25 62 -30 -128 -113 211
5010 211 26 270 -33 -209 176 -190 -149 162 -205 31 -146 -144 226 47 -164 171 -43 -16 305 -122 318
5031C18n8n18K67j43j0J02o0J1K70j61J33o5j61N5K49n02K55J7P9J16j70%J55
5054A79k19jJ39m79L65q4j40L15j4j60K07j51k90O42m45K99m2p2J14R7m00K50
5076A10l9k88L69m08N06k70k34L85O7k58L1P9k59L87j42j61L27k07J37J12k46
5097bJ63j27j66K67p2l63L80k26J24K69k70LJ20j96K79J31m15K49N6l48K60p6
5119D0q7L00m77J10L19l33J89M8l22L11J1k41L00j14q8J45M7j23k9j24M2J31l50
5142b95L69j5l08M11n42R9M30m07N11l43q7L58k75J47J72k41j84M81l40R6J46
5163A83j36k08J56k30M20p6k99L77n58L33R4k16P8J70m75L39K89l83N31n04j0
5184a25M54l50L4J90k73K02ml25M27k28k51L86k47pJ89j98K5M55n79L73L1l40
$$ plain form
5031 318 260 -258 9 -134 -144 -42 -102 -91 179 18 151 86 -75 -20 229 -273 -18 -1 78 194 24 24 179
5054 179 -40 -41 98 -381 -16 -100 -240 75 61 -99 108 -43 -333 309 -136 163 121 49 163 260 -140 110
5076 110 71 -217 152 -256 250 -20 -254 131 198 -60 -29 50 -209 178 36 -125 202 -5 132 244 -2
5097 -2 161 34 -132 135 63 -300 80 -146 -22 247 -23 -20 100 -96 183 314 -101 148 204 -144 116 40
5119 40 -47 253 -224 -114 205 -128 61 109 -213 98 109 -132 168 54 -34 111 158 35 6 -118 -76 55 -295
5142 -295 74 59 -249 162 -380 -281 149 -258 253 -90 -177 181 -94 53 225 -16 -200 281 -59 37 183
5163 183 47 -161 -5 -235 185 109 -190 187 -371 -38 56 -160 -82 88 -387 -48 241 -142 389 -115 -125
5184 -125 329 -21 13 203 -70 132 128 -197 230 2 -249 137 -110 -117 72 -126 -101 354 -225 148 179 -161
5206a61K16O2l8O8j55j24M51m69O4K70l46P5K34k65K3J82j55J83j96J89p8p2J18
5229G6R7l59M7J05k50M71l37j18L41r1J9K95m29j00K30mL0J57l07L73m1l65O60
5252E00m77k70K56k68J17L57m65K74j73J19K36k40L6j3O6r3J6j30N3K80k83J21
5274A9O8k16M26k83j1J44k08oK4l45M20m6j21j2J84j56N0k9j80M51l16J33K70
5297B60l25J00J33m84K98m3j79M15m33J22L21j87k7J47k03j7J12k46J75jm5P0
5319c7J12j57K73k63J77j13k03L68k2k93L79j71j11K68m82M9M15m97M89j06J01
5340A76j83o9j25M21j19k46M82k58k2Rl42L74K9l12M49k86k63L56k4l87N11j37
5362C4J78j01o4J15n9k25J76J74l35J98k12k6J00j47L93k00k13M65k56o8N4N4
$$ plain form
5206 -161 55 117 79 147 -8 -132 319 -150 -86 184 -162 -87 147 -118 -95 87 -68 115 -81 108 30 -42 76
5229 76 173 -186 -139 -34 -284 187 -150 -268 73 -18 1 296 -133 -233 -3 -7 23 180 -127 246 205 -160 500
5252 500 23 -247 9 -259 -142 215 -250 24 -149 -30 206 -34 2 -11 55 -38 -22 -152 -99 181 -102 19
5274 19 87 -129 297 14 3 147 -61 -67 -43 -388 32 -14 -135 -147 37 -119 -69 -98 -278 173 -143 -10 260
5297 260 -65 35 168 -316 -18 -61 -240 175 -258 -136 185 -2 -29 118 -85 -102 10 -236 -61 -62 -107 -37
5319 -37 75 -82 191 -72 105 -8 -211 157 135 -158 221 50 -61 207 -275 -226 189 -308 181 75 176
5340 176 -7 -76 -201 220 101 -145 337 79 57 66 -276 98 127 -185 264 -22 -285 71 47 -340 171 34
5362 34 212 111 47 162 103 -122 54 228 -107 91 -121 -147 -47 -194 199 -1 -214 251 -5 -73 -19 35
5384C5j28J82k34Q7J64k81J49P0j18k09L66l43O95k93j59K55k91Q1Q3k18K43j
5406A35j62K25j35j72J34j14K06J97n64K53L08l84m5J67k54M22m6m64L95k68L8
5427a28K98o5k03K03j89K43K26m21L0o9j52M95m70J86J06l02K62M2p8J64k70%
5449i2L40j63l9K86k49l6O8pk8J25k48P4N1l67M06k73O6L52n01M25l34Q6J63l
5473A02j93K39j85k34J87R7m1M3q4j63L62m44J64J28j51R0N7j5J54L5k04L67l69
5496e8J58j52K4j1J45j63LL3n0J06k55J17K90l08K02J65l59K74j66q6M66m25n6
5519a06J20n3P1J06j91J45j11Rl1j79O5K14q5k68L26j27R7P7k30O1L20l95L19
5542A54k5j19K05k77j3J97j88j6J33j72O0K01l59M18J3l93M19k67r2J18j48M84
$$ plain form
5384 35 -93 89 -145 -58 106 -175 -26 44 -74 -283 83 -260 435 142 -17 238 -53 28 111 -107 136 135
5406 135 -27 198 63 -109 25 -89 117 314 -250 3 311 -73 -118 49 -205 217 171 -293 102 -166 -128
5427 -128 170 105 -98 105 -84 159 385 -36 -6 -75 -227 268 -202 -16 90 -212 50 92 14 178 -92 -92
5449 -92 248 85 46 332 83 47 115 108 80 205 -43 31 82 -285 121 -152 -86 266 -235 190 -144 -58 105 102
5473 102 -91 148 -37 -271 -84 13 -28 15 -69 -232 130 -314 -150 -22 -173 -83 -26 -41 113 148 -56 311 -58
5496 -58 100 -52 -28 -39 106 -57 -54 -21 -71 35 -220 -103 187 -121 81 246 -113 161 -5 -91 375 -50 -106
5519 -106 14 -39 32 138 -53 92 -19 -10 -41 -220 -155 59 -26 -294 32 -95 2 79 -151 -90 230 -165 154
5542 154 129 10 215 -62 -75 122 -66 -82 51 -121 -61 140 -219 199 212 -181 238 -29 -121 -3 -151 333
5564C33L7k85N7ll89M58j98k46M21m63K4K40k34J63K42j93K91j12k72L74l23q7
5586a65K61j0j6p0r8j12K91j41J01k83j81M89p0l0K09l56J38Q9k02K03Q1J10J0
5609B48r3n6J04l57m7L95m85K76J05k37K81j86p1L37k74M8J15k43j8L36j68J58
5631A68K3n04M27j89P2J23p0k86L45l14Q9J45j02K34j82l8L05q2j62J19m5k52
5653a76L03l97K51J6q1K12O0m14J77J26l73M50l17J50J80l07J30K65l50J61l4
5674C2k87L56j66o0K22k44k3K97j87J50j09k45J25O2k06K55oJ67J14m36mK56l36
5697b73K41J93l49K32l8j91M59m34q5K60j41J08J08k67J88J34k87L14j1k34L86
5718C13k87j51L11k84J48P1m00L59l9O4p9p8j02J62j14R9K40l99K43m7m30N32
$$ plain form
5564 333 370 85 142 139 -250 208 10 -236 185 -278 -254 -14 -248 -85 157 -36 255 143 -129 245 -78 -165
5586 -165 96 86 70 0 -98 -210 81 -60 41 -242 -423 66 -4 -34 175 -181 -43 46 -156 47 128 238 248
5609 248 155 99 203 -154 -201 194 -291 -15 90 -147 134 -52 -123 214 -60 -12 103 -140 -158 178 10 168
5631 168 191 -313 114 -75 -3 120 50 -236 109 -205 -116 29 -73 161 -21 -59 246 164 2 121 76 -176
5653 -176 127 -270 -19 -3 -84 128 188 -226 -49 77 -296 154 -163 -13 167 -140 -10 255 -95 66 32
5674 32 -255 101 -65 -125 97 -147 -170 127 -60 90 -19 -264 -139 -77 -283 -28 -34 133 247 -189 -193 63 -273
5697 -273 -32 161 -188 44 6 -185 274 -160 -245 15 -126 -18 90 -177 11 145 -142 172 161 -73 313
5718 313 26 -125 186 -98 50 121 -279 80 41 105 26 -52 -154 8 -106 -7 233 -166 77 30 -400 132
5740A32j20k50K49J88Pj87j99P7L64m88J76M8k93L34J04l69K46L7j34J23o2J30
5762A13J44n5j99m3j64L40j14j46K18n4l17K42J1N4M1m49L45J45j55M10l83j25
5784a41K70m5l9L4o9J6J38l27L18p0r9o7L4nN0Qo8K4P0o1L23n65M43l2k59K42
5810A23n1j02j8K80k75L11j77j2k2r1J16J00l46J73k43J58J07l11M8M85l27L35
5832B61j90j89K80J65n44K12j26l8K09R2k42J47l44M54j99o6L34j16l30L17j44
5853e7NJ10M5j42K61l32J22r8J83m2Mk95O7l4J31J71k38K71O5m35K43p5j75M39
5877A94k90m1L70r8o2l5k54N15k79m57L18P0o6K58l27R9J75R0r1J6j99J69O6j35
5901FL9Q6k82K34k55J47J37l07n9K31P8J35k6l33M9J74p2K22r6m0J59l21J37J4
$$ plain form
5740 132 12 -238 11 199 206 19 -180 -103 261 -227 -51 -3 -296 38 142 -227 19 56 -78 45 -17 113
5762 113 257 202 3 -40 -204 136 22 -124 94 40 -277 -35 -24 30 71 -378 -33 112 -43 367 -16 -141
5784 -141 129 84 45 79 10 26 164 -163 155 85 -14 -81 -47 -52 -2 6 -62 -38 32 -29 294 -271 172 140 -119 123
5810 123 72 -30 -48 232 -43 268 91 79 57 -34 82 182 -164 9 -234 -76 31 -280 -232 253 -74 261
5832 261 71 -118 162 327 -217 -5 -131 -169 40 132 -110 37 -307 147 -52 -118 216 100 -230 87 -57
5853 -57 -52 58 103 -39 222 -110 12 -86 97 55 59 -236 -169 -203 -72 99 -139 132 197 -238 5 -70 -245 194
5877 194 -96 -137 233 135 73 38 -216 299 20 -437 -119 -49 -115 143 -184 -85 90 180 89 105 -94 75 141 6
5901 6 45 131 -151 83 -172 -25 112 -195 -254 -23 55 190 164 -169 -120 54 -18 204 108 68 227 -94 43 57
5925E7j38K38j71j01K22K9j34n5j69J83J28j70J20J24j17O1p1q3J67q4j17J97
5947A16k11J84K9l78QK40k3O3K7j02M3oK7j7j22N9L24m07J47J02n6P8r3J9J97
5972B48k78p5K72k91K14k4j35p4P0l0J70k55J36K79l46J7L66k80J49q4p3J1L28
5995C15n51J45K4N6N3N6l1P2j61p7K26k54K48o4p5K32j75q6J60k18o6K10J0K4
6019G3Mk01J42k7j04L50l33m7K62k23K7J76j04K27j75l50K34K98l97J55M5j58
6041a26P6j08J82j29j36l4N45m99M74k06j35K92k25m9K41k30J39M1m52K08k40
6062c71K47K93k99L1J14m7R1k28K2J99j80q1L87j49j48K16J4r4j34N0Q1Q3j22
6085b5R5K4j61k5j83k0N51j61j50K52l88Q2K67rn3q3j16R7J12m1m6j60L13j2k69
$$ plain form
5925 57 -81 157 -14 -115 107 136 2 -53 -222 -39 89 -81 39 163 46 107 36 -47 120 36 -81 116
5947 116 -95 89 118 -260 -252 -12 -35 28 55 -47 -4 -10 17 0 -122 -63 261 -146 1 103 47 125 32 51 248
5972 248 -30 -105 167 -124 90 66 -69 -143 -73 -103 67 -188 -52 227 -119 -102 264 -16 133 49 -24 -13 315
5995 315 -236 -91 -67 -11 42 98 67 139 -22 -99 127 -127 121 57 -18 214 39 -47 113 -105 -171 39 49 73
6019 73 77 -124 18 -9 -113 237 -96 -143 119 -104 -77 99 -5 222 47 -303 -69 229 -168 -13 32 -126
6041 -126 -50 -158 24 -105 -241 -275 270 -229 245 39 -96 196 -29 -78 163 -67 72 113 -339 -131 -371
6062 -371 -124 169 -130 -99 15 -32 59 -169 -147 52 -128 -209 178 29 -119 97 111 17 -117 -67 14 97 -25
6085 -25 70 94 -67 -92 -275 -295 256 95 -55 197 -191 -109 158 149 96 13 -103 -6 106 65 19 -141 172 160 -109
6110a09J08Q5k73L41j35j18J48p8R9l6j27nK53m43L08J65k62P0n9j25K67k04n0
6133a80J66k55J29K50k61QL04j90K3O9j84K44n8k67K13O0o1nR8Jk35J27j46P6
6157g4m28O63o4k08K11k44K44pn0p6J61j18J75k07j36M36k13J04k05j11O5J07
6179B5l17K55k5j19L41p6k29J53R0j91M69m02O9O2l33N19k18m48M59l38j9K78
6201Ek25L64J96m27n2K82l27L76l20q7O1K13j01Q0N2k11J32k09K66m7k43N34k85
6224B7n1P9k89J80J80l42K18J91k05o6K19l59J74l5K72j74j01K5Q9j81K01j77
6246a25L2Q5J65m10K31%Q8K12k16Or0p5p6J40j95L22J3k42J07O7l8J28j15j0R
6271A3j29K21j47J17M0l25J20K72j95j1r3K06r9j9J23K9m9j44j29J94n8K68k53
$$ plain form
6110 -109 -1 84 -189 152 17 -101 47 -31 68 32 -95 -100 153 -290 18 183 -79 -9 -68 -193 74 -130 -180
6133 -180 -14 -269 -140 110 -151 -143 161 -29 -6 63 -121 123 65 -202 11 71 10 5 103 104 -131 -4 -150 -74
6157 -74 -502 161 97 -111 100 -144 100 93 43 -33 128 10 185 -22 -158 278 65 169 -36 -147 -82 25
6179 25 -292 -37 -62 -181 160 84 -145 8 98 -93 376 -26 43 105 -228 291 73 -375 84 -254 -273 5
6201 5 -220 144 340 -87 -139 143 -184 192 -128 -215 -154 59 -42 38 90 -121 11 -198 68 21 -222 312 27
6224 27 -24 55 -234 -54 126 -216 2 193 -12 -78 141 -218 -44 -79 193 19 -82 -57 32 -149 52 -125
6246 -125 -93 -8 157 -253 -22 -22 66 278 62 68 -22 -97 -173 -33 -228 94 107 -135 -28 39 1 129 14 4 13
6271 13 -116 105 -42 75 115 -210 -90 182 -13 -24 -117 89 -10 -29 94 123 74 -70 -199 -5 -63 205 -48
6294d8m7L78l58K47j70j65K61j34J15P8j0l75L31j04r8K06k64N0l6m2J44j05J87
6317D1mj16L4J13j76J33Rm4j4J50k40J06J23l27P2J84K7j45n9p1J92n8L5K33l80
6342a82K69p7lJ95l02o3L40j36J51j21k46J72P6n1k33L66m66N47j42k54L22m02
6364b40L16J00j34K28k72o2R5J86j94k01J81R0j96J15l16M08l78L93j4k04Q4K7
6386A2q9o7J56o3J59m16L10N7k50K72nlN8k15m6J93j79j7O4J36M1j67J4j05j3
6411a63J41L02l71O0L4K26j46j80K66J24j73j43L8k14J48J99j13j3J60j98K59
6432B43L6l35J13J05l21K19j3k76L33r5mJ14j97P7Rk01J27k6o2J79k19K92N3j12
6456C9J55n1j1k16M74n00K00R3l60K62q4j13J35m9J63J4l23kK52k39K00J09l19
$$ plain form
6294 -48 -95 283 -75 172 2 -163 98 -36 79 157 147 -228 103 -1 -99 107 -157 -107 -143 -185 -41 -146 41
6317 41 37 -79 -45 68 -108 25 34 -10 -24 126 -114 -8 115 -212 -140 44 71 -74 -133 -204 -12 -70 -35 198 -182
6342 -182 87 10 7 202 -100 -163 177 41 192 71 -175 -3 73 22 -211 155 -311 236 94 -160 162 -240
6364 -240 76 176 42 270 -2 -64 31 217 23 -178 3 93 -103 12 -304 104 -274 119 105 -99 -15 12
6386 12 -77 -144 12 -51 108 -308 2 59 -191 81 76 73 131 -84 -130 63 -116 -133 -69 67 108 -59 -45 -150 -163
6411 -163 -22 280 -91 -31 3 229 83 -97 169 293 120 -23 15 -199 -51 148 35 22 182 -16 243
6432 243 279 -56 57 162 -159 60 47 -229 104 9 5 119 -78 -1 8 -193 -66 -92 -154 25 -194 98 151 39
6456 39 194 143 132 -84 390 -110 90 183 -177 85 1 -112 23 -26 137 151 -172 -174 78 -161 39 148 -171
6479a71L80j39k1N6j59J87m6o6j9j82M7J36m5k00K21qj85L00L2m7R8k98K24k18
6503a23j25L03r4J2K70k40J25J08k76q5J03rj6j47K28o8l3q2K28j29Q7J11l96
6526b48L07P7l00K73p8j7k42R0R3J26k53K42J81l98J31J60l13L18P9m65K69j20
6548h8r4L30k59N1J6MN5o2RJ40l29K9M66m46J76L6R5J40k70M6P7o0k13L70k60
6573d1j85K66k9k7j93K23L7j8k39L01M9k18J70P3j72L38k44r1J09k80M23k38m2
6596b8k2K13n3K31l88N7K3P5j26J17k87K30J02j60J73l9L2j64r0N8K17k61M2Q
6620d0j00J72Q1k61Q0O7j63J30j09K27j8j40LJ82K3p4j36PJ44k26P4O1k8J18N5
6645A29k53J90J6k68L71j45j41J8j07J43M1l63M06Lr3M4Jk4l3p8J40p7j7k2R0
$$ plain form
6479 -171 209 70 49 105 -54 133 87 21 2 -180 -133 3 -42 -242 -21 -29 -214 86 118 71 169 -129 95 -123
6503 -123 -248 55 -39 -27 243 3 128 236 -40 -125 -22 -31 -47 -194 34 -34 -67 -149 79 -50 37 148 -248
6526 -248 59 136 -164 109 31 14 -228 -138 -45 81 -172 70 251 -147 -16 144 -169 149 228 -237 32 -88
6548 -88 -182 148 -111 -60 -44 -40 15 -47 -38 102 -227 -198 268 -178 -2 34 129 269 -1 45 122 62 -151 219 -41
6573 -41 -226 40 11 -16 -209 14 51 33 -206 95 144 -74 96 169 -3 335 91 0 109 -171 252 14 -28
6596 -28 -50 163 110 341 -47 10 33 108 -18 99 -188 42 144 -16 157 118 150 -14 -104 -46 171 -90 -48 -40
6620 -40 -140 32 113 -148 -68 -1 -164 -34 -143 84 66 -74 -71 111 134 60 -76 -69 75 -151 -77 -16 -44 74 129
6645 129 -124 66 82 -186 185 40 -101 -83 -190 -47 -6 -369 37 40 -53 -9 -8 -32 -65 -143 -3 -80 -97 -119 -29
6670b9j26L05j29j9J53j73j14K93L4j35K12k63M5L0l14J61L06j99O1j02J14Q9
6692B00j06p5nj66R7n4j29J07K2k4J29k1J11J29m30J50J47k91J48R2j21J32qj05
6716g1O8j77Q1R9K59m24N82m36L2K17j66Q7j11k60J73Q2j06K45k81J07j92j14
6738c06J77o0K09J23n4j66J37k53J83K45j40J43r8j76M0p0q7K50R7k82K57k85
6760a16J67j12P2J76k20N3J94r2j31J80m73J91L4P9K22P4m88P0J48j36j1K77l90
6783b32K88kj25J19k9l4J15p8j08M0J64k7J27k75NJ88k26L18m33k2ML70k56J16
6807G%rK49l05M3J88k71P9O2P2j51j76L64j69j12N3J88k04J31k45M0K74j18J24
6831A14o5k5K38k38l3J82j18O9k7j8k5Mm08L88P5j71O0K14l66J77l2Lk41J69K13
$$ plain form
6670 -29 -155 150 21 2 155 -18 -132 161 195 60 272 9 54 84 -230 -69 237 38 99 -3 111 200
6692 200 94 19 14 -152 -55 -109 -238 -131 -109 -133 -4 -25 86 215 -215 -65 82 -209 -61 31 -90 42 34 -71
6716 -71 -3 -180 -99 0 259 -165 417 -19 13 230 64 151 40 -220 -47 35 -71 174 -107 0 -192 -306
6738 -306 -129 -189 20 143 89 -77 60 -193 -10 235 95 238 140 -36 4 -66 -153 97 194 -88 169 -116
6760 -116 51 -61 11 187 -33 20 214 122 -9 171 -302 -111 -77 2 224 298 -190 -120 28 -108 -119 158 -232
6783 -232 56 54 -71 48 19 -15 100 22 -86 -46 118 91 218 -57 -52 136 -90 228 -205 -227 -223 147 -109 7
6807 7 7 -2 247 -58 -15 173 -98 -19 43 115 -36 -212 152 -17 -129 -76 112 -92 39 -206 -166 108 -10 114
6831 114 49 24 262 24 -9 173 55 124 97 79 54 58 -350 38 113 -58 2 216 -150 27 -5 -2 -243 -74 139
6856A39Kk22N9J53k21l8L07j58Ml4j55K97k85j72J90J41NM6k23L27l00J15j33
6879a56J05m4K22j43p8Q8j0J0J46k71K4K40k54L60l13m9L2j10P2L79k06n9j0r3
6903a18J79l73K84J6J08r8L5J44j68J8j21L32j66k48J03K9J11j49R2q2L17k89
6925d4J97j19l8J60J01O5l80N0P4k3J3m4P4j68N3J52j77k4pK04r3K3J02j36k1
6950fMN8j05kO0j29K78j28k37J72r0J24j21Q4j62J31J14j02J66m7L5L8O0l38J24
6975a9q7K01j02P3j43j0K72j03m03M61m01j1L90k74K34N0k96K1K31o8K11l83L3
6998a23m1K28m0K46m68J31K86p3n3j44r0K02L0j13n3K05J1l36K04o4J64k09J46
7021D6k7j00J3J55j76pJ58j25J77k7l5J8q0J5p7K01J3Lm8K8j32J09J28j80K6J19
$$ plain form
6856 139 141 -81 -22 131 -90 -128 179 21 25 -9 -164 133 -152 -324 -134 7 12 58 -165 162 -138 -23 -156
6879 -156 -51 -95 127 -16 -94 -6 -16 -6 140 -131 -107 133 -121 239 -74 -123 -91 -201 -129 250 44 -15 -25 -118
6903 -118 61 -312 -28 -12 96 -2 33 177 9 27 -94 238 72 -176 -73 -44 67 -82 10 -72 245 -44
6925 -44 153 34 -4 156 257 322 -58 -8 66 43 56 12 86 -82 -29 123 -54 -78 -85 119 26 49 151 15 -6
6950 -6 -2 56 -49 -51 9 -120 158 30 -207 -35 -125 -1 -122 -38 -200 -69 45 -57 109 62 97 135 195 -143 -19
6975 -19 -106 95 -7 66 -77 -87 185 82 -321 140 -261 -272 118 -156 78 128 -168 -147 84 16 227 -156 -123
6998 -123 -164 64 24 270 -198 -67 219 146 93 -51 -141 61 91 -22 -75 130 141 -195 9 -55 109 -100 46
7021 46 19 -81 -68 87 -89 -96 62 -63 114 87 52 70 -10 5 -72 129 142 145 97 125 -7 102 230 50 76 195
7047A95m58K64Q1p5j09n3J84J33m0k57K15j98O6J82q3PMk76L25o8%j99m6M24l98
7072a80J91K3j38J5R3J71k46m7K74k50M5K30j32O4L9m7n9no1J85k80o4J55J49
7096A25Jl07Q9J86m50K67P7k4J00j19J16j05J28P5p7j63m5K14j33K10j93J80j80
7119b8K54j84k88J51J04j42J66R6j39L3m3m9K80m0j24j25J75j23M8O0q4j15J57
7142D0k44Q4K28L6j13j25J48J78j15j42J39j09Q0K8j61n7M8O3QQ2j14j02r5J34
7166h1j1J97j19Q5j17J77j24q1R5L6j68L38k88J19Q3j40Pm0O2N8k17J03J11j14
7190b9l4J76J6j1k03R9k55L72p3j08K2l20M68J5Mk00j77K65k6M7n9J01k25K85
7214A50k2l87L62J09l08J21r9M3R0J56k47N9j6J7J14p0J42k24j21J64m5J72j1
$$ plain form
7047 195 -263 1 82 7 -102 -155 29 162 122 -135 80 -118 -52 130 47 54 58 -218 107 39 39 -160 -206 218 -180
7072 -180 11 34 -104 -89 4 175 -71 -118 156 -94 -49 181 49 113 152 105 46 41 -20 165 -115 -179 -24 125
7096 125 126 -181 -92 94 -356 -89 -12 -36 64 -55 61 -44 84 159 82 -81 -126 88 -45 165 -28 152 -28
7119 -28 226 42 -246 -95 9 -133 33 129 -10 23 -20 -69 211 171 47 -78 97 -26 22 82 -2 -117 40
7142 40 -204 -120 108 144 31 -94 54 232 117 -25 114 5 85 113 -48 -105 -57 6 14 96 -18 -120 -215 -81
7166 -81 -92 105 -14 71 -46 131 7 -74 21 57 -111 227 -61 58 141 1 8 -32 30 88 -129 -26 85 -29
7190 -29 -63 113 129 118 -85 14 -241 131 58 -50 -28 -348 120 135 139 -61 -238 27 1 48 -11 90 -135 150
7214 150 128 -259 103 212 -96 25 -74 -31 59 215 -32 27 11 28 142 72 214 -10 -131 33 -12 160 149
7237A49k03j31l5K20N5j4k56L40k26J24l0O5Q5j40j10N8P8k3l3K77j80M3r6j15
7261i8j34K17Pj6o0m4K65k35J85j24R6j42J82q4l0LJ47m5r6m4J58j89Q6J4j19
7286a00n1L31k38J34k19J51j8k76L11j29n0l5N7O9K42k41J52j52k2J14%J40r7
7309G3j77J98n6j67J74J09j03o4QNM4j26N8m1J38j98L3J00J5J65j64j66K56j50
7333c6J75k24J29Lq0O1Qk71L41p6k13J23M3J04j18mO7N9M9l9P0k53J05m4J20o
7359I3j69qK33k20k8J13p7j01L9P5K19j09j58R1j04K14j53MK74j62p0k0j55N19
7383C40l59l0p5J70j04r9J52J43j48p8O1K27j57Q3j51K02k69K64p0r4N8mj50Q0
7407hj55J81n0m9K35k82K64j6n9m6J00N1j58j33J3K1LJ45J4j2ml1j66M9J86o4
$$ plain form
7237 149 -54 -185 -220 0 55 41 -215 125 -101 23 -7 58 143 3 -107 -49 29 6 -27 250 70 113 17 -98
7261 -98 -232 -15 -8 -24 -84 -128 137 -98 87 -37 59 -83 99 15 -15 -12 135 90 -6 -50 108 -81 5 19 -100
7286 -100 -151 180 -58 76 -143 8 -10 -286 25 -104 -154 -189 -132 -63 179 -62 90 -62 -84 30 30 170 73
7309 73 -104 94 38 -129 45 154 51 -13 -5 0 44 -82 -24 -65 73 -125 -92 8 23 188 24 -142 114 -36
7333 -36 139 -85 44 47 -33 28 36 -235 106 30 -183 -60 -17 87 -31 -35 32 91 140 101 171 -82 23 -21 99 93
7359 93 -76 -84 149 -71 -99 14 -63 -164 -125 -50 169 60 -98 -7 -111 103 -50 -46 228 66 -4 -24 -179 340
7383 340 -19 -49 -124 46 -58 -157 -5 138 -10 -88 -27 200 43 126 -25 177 -92 172 102 8 66 62 -88 -8
7407 -8 -163 18 -32 -81 154 -128 136 120 61 15 115 166 8 -125 -112 -91 -88 57 71 59 55 24 -142 -93 93 29
7433B9r3K65l75K12j17J48J65k28j67J28j00qJ73j61J15k27J67m4J53l08K97L2
7455E6j71J39j53k0J78J11j70l0L14k04k12J90L5m9Q1j08O7j51L2J37k08J60q9
7478f5K04j41J11l11L57k77n3L08J9O0l46J22k11J92J75k10k88L84m5j03K19J4
7500A15k12Q6l4Rn3O9m7K22Oj38mk1j63J31J7R6n1Mj22J00j00N1N7M8k44L11j68
7527c5o6L1J15l9M2K3%J78l14O4j61K18nK68p91M93l46K25N3j54K28Q2j61k9K39
7552A58k7k52Q6J63j11J81k73Q1j1k54K25O2K16k14J00q7NL1j63OJ30j17J40o7
7576HJ36j31J07P6l13J72l55M55j96K53m19J15j99M10j55R4N0k3j44j16K28k74
7598b21L26j18j20Q6M3j75M7K77j43j84J96Q8M0j64K3j11m8J48j66n7K90k17K10
$$ plain form
7433 29 -64 201 -174 38 -79 69 234 6 -161 -33 -133 -141 32 -129 -14 -241 -74 -118 35 -273 24 56
7455 56 -115 24 -129 -149 29 140 -30 -60 254 50 -162 28 63 14 95 -13 54 -97 -65 72 -136 24 -65
7478 -65 139 -2 109 -202 155 -122 -175 133 152 212 -134 -12 -223 -31 144 -66 -354 30 -15 -118 101 115
7500 115 -97 -11 -45 -36 -89 -20 -67 155 161 23 19 -2 -165 -34 -17 79 28 32 -90 10 -90 -39 18 66 -178 133 -35
7527 -35 -101 -70 45 6 48 71 71 249 -65 -1 -162 56 51 319 -472 21 -325 -100 -47 -201 27 109 -52 -81 158
7552 158 131 -121 -35 128 17 198 -75 6 -5 -259 -34 28 244 30 130 43 48 79 -84 -78 52 -65 75 8
7576 8 144 13 120 196 -117 55 -300 155 -41 212 -207 -92 -291 119 -36 58 108 85 -59 -175 53 -221
7598 -221 105 -13 -133 -47 -4 -179 -132 145 2 -182 14 102 142 -22 1 -110 -158 -10 -176 -233 57 -160 50
7621E0j18J79K06l67qL2J29k39K61j4j13q7o7M18k59Lk4J12k15Mk8J76r9K82k06
7646Hj4j32J64J48j63n1R3j79J53l7p9m0K24l12J59L19j77p7K3o5J75j43p8J73
7670I2jk50P4j17M9N7Q5O9j55J06Q6L9j33m8J70j05j99K38j96J83o9J84k8l44
7694b13L95k52R4Q5k95O8q5o5o2L53O5k6N0k14K44j58L4M8P2q5k09K69j21J43
7718A35Rj50J1k05J68Q9K7l75J80J12j4o3j61J08J18n4K30Q6j86j46L30j57k5
7741F7K8j51K7m6k1J88j59j62L02J1j40j88J55P3J11m1J0K00j10j61O6j39J07
7764B7o7k1lR3K1p6J36R6l43n4K79p7J87p0k44lK32j41O5n3R5j79kJ33j30J32
7790C3j72P7pJ36j47j00R0J32L9j7j05k08K97k4nJ63j89P4j37N4j24K17jk53J86
$$ plain form
7621 50 -68 111 317 -50 -58 -26 103 -136 125 111 -2 -89 -156 262 3 6 -18 94 -121 -117 -145 31 -68 214 8
7646 8 -6 -138 26 174 11 -40 53 -126 27 -10 -89 -129 95 -217 -58 261 84 7 30 -35 140 -3 -81 92
7670 92 91 -159 -85 -202 -153 -96 -11 58 -97 9 95 134 1 -47 123 18 -181 57 -139 44 -25 159 131 -213
7694 -213 182 -70 24 109 -186 -118 -203 -268 -330 23 88 62 112 -102 142 -16 18 66 138 53 -156 113 -8 135
7718 135 144 -6 5 -200 -32 57 84 -291 -111 1 -13 -76 -237 -129 -11 -65 165 251 65 -81 249 92 67
7741 67 95 -56 -29 -75 -96 92 -67 -229 73 84 -56 -244 -89 -16 95 54 64 264 154 -7 59 -80 27
7764 27 -40 -61 -64 29 50 -26 110 206 -137 -191 88 11 198 128 -116 -119 113 -28 37 -16 79 -100 -102 31 -99 33
7790 33 -139 -62 -69 67 -80 -180 -90 42 81 64 -41 -249 48 24 19 182 -7 67 -70 -16 -140 77 76 -177 9
7815IL8k43M81l02j7rj00J19K32r5j03j80L05P7l44j13K10K7Q1j60J05j29J45
7838C4o1j81J15Q4q6N4L2q4P9O9K2m0j82J08kj99K69K34k69m7n9K27j30p9J23
7863C1J15k48K38k95J14l3J87j8k03P8P3KJ03r3j55kL8n7J45K0j00o1J61o9m3
7888g2MK22j54k4K02j64j8J31j84j21J83r0K87o8k54m7P3N6L7r0j9K08K9j85K47
7913A89k88K13mk00L16k71o3L6J04qJ55k39j71J92K56n2n5j6j32J18j50K27J7
7936A74J75l06k06J09R7J2j73JK19l44K97L8q1m8J42j45P0k6j68Q1j40J77J03
7959E8P8j68q4J16q2l0J18j08J98l6j38k9J16R6R5m7N6k96N8j04N8O2l6L7j38
7984a50J39r0K07p4l6o6O5QQ2j7l30N74k33k07J77N1J6j88J58j73J0J72q5J46
$$ plain form
7815 9 47 -196 285 -17 -34 -43 -143 -24 208 113 10 -170 135 212 -132 -245 -35 -8 73 -87 18 -111 34
7838 34 -27 -208 -93 -9 -95 -41 -9 -93 -14 55 77 37 -145 -37 -39 -238 31 265 -4 -51 -110 117 -13 -92 31
7863 31 146 -102 136 -159 -45 -78 109 91 -112 -34 39 41 144 51 -104 -106 -68 -125 20 40 -60 -121 40 -29 -72
7888 -72 -68 154 0 -24 178 14 -4 127 -57 -178 5 -85 202 134 -120 -167 -94 -38 -1 -91 -110 98 127 -58 189
7913 189 -99 114 110 -90 226 -45 -108 -72 32 24 179 -60 -231 -39 217 165 110 94 -38 80 -70 157 174
7936 174 349 43 -163 -54 43 55 -118 -117 102 -242 55 93 12 -36 106 -39 31 5 -163 -82 -222 -45 58
7959 58 136 -32 -116 0 -82 -112 6 -102 96 60 -78 -107 9 105 200 153 209 -87 -29 -133 -75 -13 -49 -12 -150
7984 -150 -11 -101 106 32 -4 -70 -5 3 85 68 -262 312 79 -128 49 100 116 -72 86 -87 -77 95 10 156
8008A56j19M6r6m2J78j78K9j0R6L1k53j9K57k17J46K38j64j65K06k84L35J38m47
8031a38J98j78K11k18K71j5p2p4k3K11k80J44P1j01K08k52j65K85k42j58K85l7
8053f9j56O2J75J22o3K3j59LK30k3j55p2J16j48J20kp5k21M8M31j28J77m60P2
8077a52o0J35J03J3O9j81j8O8J86j61J49n7j28J4L0q6K42k52O2Op7LkP7q0P8L2
8104A3m2j7J70K6r7Q4o3m8O8k44K27o8mO3jKo8J83k25nJ24n9r9o5L34l76K3K6
8132a38K26J07j95j06J4J13L8j69J17m6K54j43j61j78L72j22j01J25j35J26j14
8153a16Q3K78k52P7p1J93j32j32J17r4j70J76N9mj30Q8J08j49L98k31j21QM6j36
8177a07J36j14J47O4k27J50m1k52R5K45j4j50J75P8
$$ plain form
8008 156 37 83 -13 -55 123 -55 -26 -36 60 91 -162 -181 76 -141 5 243 79 -86 120 -164 171 309 -138
8031 -138 60 -118 93 -125 146 131 59 -15 -38 173 -107 37 108 7 215 -37 -202 83 -159 -317 -32 -69
8053 -69 -225 -163 12 134 71 94 -65 -62 168 145 -10 -82 34 -114 6 4 -71 -292 -244 187 59 236 -224 -152
8077 -152 -212 -77 26 39 108 -73 -91 -23 163 2 151 94 -34 -20 10 -76 166 -86 -24 -18 -95 -92 -94 -17 -97 -19 13
8104 13 -29 -46 124 150 53 137 74 26 94 -150 77 9 5 68 67 69 1 184 -41 -46 78 19 -80 -145 189 -187 -164 -138
8132 -138 88 195 0 -106 -92 21 59 -110 7 -39 215 72 -89 -267 105 -17 -118 7 -128 -2 -116
8153 -116 -33 245 -7 70 -1 192 60 -72 45 -49 -219 -43 16 12 -118 -30 78 -71 327 96 -25 -17 29 -107
8177 -107 29 -85 62 126 -101 49 8 -244 -149 96 82 -68 107 185
8191A85
$$ Imaginary data points
##PAGE= N=2
##DATA TABLE= (X++(I..I)), XYDATA
0@%%%%%%%%%%Qj6J6j6K4l2M0m8N6p2Q8j04J20j44J69j93K26k66L10l56M06m63
32b47N27n98O76p62Q58r62J076j201J338j489J652j831K028k242K475k729L010
49A579l318L654m024M432m887N399n971O615p355Q210r211J0400j1839J3627j5919
64h608J8973k3264K9782m0966O5243k10364J67577K61922m27895J39872K50687
75B22959k66742j37486L13729o2868k58778J55810K02682j97313j3352J65438
85A24079j42593j17142J73980J0793p1250L4853j7241k2403K4631j9332L2325
96A0700k394n2489Q1312O1830j31032m8346J05529k1708r5068J37076R8470k01596
108e7716M578K06995k02016j53250K91872j5683k42681K12899J44435k72009j6011
$$ plain form
0 0 0 0 0 0 0 0 0 0 0 0 8 -8 8 -8 16 -16 24 -24 32 -40 48 -56 64 -80 89 -104 122 -144 166 -190 216 -247
32 -247 280 -318 358 -404 454 -508 568 -633 705 -784 868 -963 1065 -1177 1298 -1431 1579
49 1579 -1739 1915 -2109 2323 -2564 2835 -3136 3479 -3876 4334 -4877 5523 -6316 7311 -8608
64 -8608 10365 -12899 16883 -24083 41160 -169204 -1627 260295 -167600 -27728 222959
75 222959 -43783 -181269 132460 69592 -189186 -33376 169306 -28007 -41359 124079
85 124079 -18514 -135656 38324 49117 -22133 12720 -4521 -26924 -2293 -21625 10700
96 10700 8306 -44183 37129 98959 -32073 -80419 25110 3402 -91666 45410 143880 -57716
108 -57716 -53138 153857 -48159 -201409 90463 74780 -167901 44998 189433 -82576 -98587
119i8587K14103j28209j46759K17875N9700k15598R1570J52506k12213m0557K05234
130I9065p7472r8077J22557j2382r0802N1092K8522n4029m927O2627K6622m2668
142A0128k3005k242j1771O603O209L6710L4496o6113O550P6856j03624n8392J18937
155C1342m0905o4225J46265J7646j51115K2883Q9156p7256m1590J11413j5328
166B8286r9483J09642N4587j62137K4673J16943r9288j0657J19494o8176q2725
177f8841P2520J6990o0545K7609O0761m2417l4921O3985j7028q1222L4936L4485
189F312j2875M2074J340l4634J1798k3977j7498K7511k1237L697N5604j1043l3643
202f571R587l38l0499m482M5553O85l6050M3686N556o9089M2780L6233p0720K9116
$$ plain form
119 -98587 115516 -12693 -159452 58423 118123 -97475 -5905 146601 -65612 -106169 99065
130 99065 21593 -76484 46073 33691 -57111 -6019 22503 -31526 -36453 26174 52796 10128
142 10128 -12877 -15119 -26890 -20287 -14078 22632 57128 -8985 -2435 74421 -29203 -87595 31342
155 31342 -9563 -73788 72477 90123 -60992 -38109 51047 -26209 -67799 43614 28286
166 28286 -71197 38445 93032 -69105 -44432 72511 -26777 -37434 82060 13884 -68841
177 -68841 3679 20669 -39876 -12267 48494 6077 -28844 35141 18113 -63109 -28173 6312
189 6312 -6563 35511 36851 2217 14015 -9962 -27460 51 -21186 -17489 38115 27072 -6571
202 -6571 3016 2678 -27821 -32303 13250 13935 -22115 21571 27127 -41962 818 37051 -33669 -4553
216d553O1776n9745k6792L9923j4987k8349L4802L3871l6971r922M9776m1179
228b350o0333N4629J4754l0793M8253J3881l8042Q112k899k4002q41R432J8640
241H441K967j596J5319k1989k4017J2827n404O693J8892j5551L952N202j8215
254a2479J7486l692k2992L9196J2753l5779L024K628j7020L020J7883J6462j2097
267H393n425K0684l3325k9301L7100q141j6698M7935P872k3605M296j3130j5822
280a9167N049J0621J1416p312R680K0452l2519j5449K2662j8465j127K9032j2398
293B475o839O989r668P89l334O345K3929j4560r745J5209j8220r987J1717R95
307c905J6428O585r131L957k0848j5689J6857j2228K438L3742m894o501M865j9069
$$ plain form
216 -4553 57223 -2522 -29314 10609 -4378 -32727 2075 35946 -1025 -10947 38829 -2350
228 -2350 -62683 -8054 6700 -24093 24160 38041 -1 8111 5212 -18790 -19631 -10199 8441
241 8441 11408 9812 25131 3142 -20875 -8048 -13452 -6759 12133 -3418 534 5736 -12479
254 -12479 5007 1315 -21677 17519 30272 -5507 -2483 145 -16875 -13855 4028 20490 8393
267 8393 2968 23652 -9673 -38974 -1874 -10015 -26713 21222 29094 5489 9785 -3345 -19167
280 -19167 -14118 -3497 7919 607 10287 30739 -1780 -17229 5433 -13032 -14159 14873 2475
293 2475 -4364 2625 -7043 -6254 -9588 -3243 20686 6126 -3619 11590 -6630 -16617 -4900 -3905
307 -3905 12523 19108 9977 13934 -6914 -22603 -5746 -17974 -15536 18206 13312 6811 11676 -7393
321g393n249K248j422J4128L106Q495Q248k9322q42J8380k2449L463K1907j3350
335e2p34M317j1405o59k162J0542J4866j5083L649Q414k6590m03J4703m099J4555
350I859O051p245O405j4728j3093K801r995J4800K1111j2004M544J787k0649K920
364g436m76p302J4958N729M913L147j7937N273M396j9201J5318J3330j6339M248
378B621j020j0265N853n224M860J3209r117O057L63k5048M659J0560k853J3677
392H332J762j407Q207j6391q923J642j0411J5688J3361j0474J1119l137k1451
405a2083O998n13p025J0799K414M923L776j0585M742o803j1028K4431L772j6429
419b611P980n421p839J0009p849J489J1535n344N775k960j8334L098K86K003J7843
$$ plain form
321 -7393 -12642 -10394 -11816 2312 5418 13913 22161 -7161 -8003 10377 -12072 -8609 13298 -52
335 -52 -786 3531 -7874 -8533 -10695 -153 14713 -370 3279 11693 -14897 -15300 -597 -4696 9859
350 9859 15910 8665 15070 342 -12751 -9950 -19945 -5145 15966 3962 8506 10293 -10356 -7436
364 -7436 -7912 -15214 -256 5473 10386 13533 -4404 869 5265 -13936 1382 14712 -1627 2621
378 2621 1601 -8664 -2811 -8035 -3175 10034 917 6974 7337 -17711 -13052 -2492 -5345 8332
392 8332 10094 8687 16894 503 -8420 -6778 -17189 -1501 11860 1386 12505 9368 -12083
405 -12083 -5085 -5598 -12623 -1824 590 5513 9289 -1296 3446 -3357 -14385 10046 13818 -2611
419 -2611 5369 -52 -7891 2118 -5731 -4242 7293 1949 7724 4764 -13570 -10472 -10186 -8183 9660
434I660k443O85O156j8018j70M465j3930J0035R920k769J3590r345j8800P713
448c251k873k802R565k973M496K312o718O047r253o429K1802k696q700J2114j1254
463f13p842R939n772M683P999o814M977k869j1317M09p886O139J8257o093L340
478F537N078j8000L738M894j4190P760Q097K261J0221j1533j0283N779r074L301
492e414J0046p717L901J237o181P530q045n624J4881l072J692R915j7039m717
506h607Q285l734J0015L496r982O815j526p823p10j1302N694J4463m666Q616K213
521A1247k0506M010N102q282P665K279J452P911p312J80j48j6851Q560J2251q374
536h16N020k036j0109P528j892l596P629l577M755N135j2273K296j62p396J5903
$$ plain form
434 9660 7217 7902 14058 -3960 -4130 335 -13595 -3560 6360 3591 17181 7836 -10964 -3251
448 -3251 -6124 -8926 639 -2334 2162 4474 -2244 3803 -5450 -11879 9923 7227 -1473 10641 -613
463 -613 -8455 1484 -4288 395 8394 1580 6557 3688 -7629 -7220 -15106 -8967 9290 3197 6537
478 6537 11615 -6385 -2647 2247 -11943 -4183 3914 6175 16396 4863 -5420 359 -8715 -5414
492 -5414 4632 -3085 816 2053 -4128 3402 -4643 -10267 4614 1542 3234 13149 -3890 -8607
506 -8607 -322 -4056 5959 9455 -527 6288 4762 -3061 -3771 -15073 -9379 5084 418 9034 11247
521 11247 -9259 -5249 -147 -8429 -764 1515 2967 10878 3566 3746 3598 -13253 -4693 7558 -816
536 -816 4204 2168 -7941 -413 -2305 -5901 1728 -1849 2906 8041 -4232 -1936 -2098 -9494 6409
551F409K156q018J0395o350r903L435o652K773P287l450J0933j220j5221N158
565b268j065n668Q579q83L144P437p843L638k236j5240J2729Q227j0167O821k894
580B311r459P931j475l481L272k780O997J436p683M047r120m486K0956j242o839
595C85J0766j0505p064J0722n714m116K225J744J0813k226r227R67r150J295J3608
610D523n761J969M326r984Q442L386j3890P135K220n115J1604k518r621J046l530
625e768M016N769m233L073m328l988R732j0089m671J5742o261o5J5535j1953p997
640e486P242n120K10M991R87L311n311o20L135j1851L142P515q819Q818N080j3454
656f230P448K180j1582Q418L473l560N943l149l502J9m350O941J046n552P282
$$ plain form
551 6409 8565 547 10942 4592 -5311 -1876 -8528 -5755 1532 -1918 9015 7795 -7426 -2268
565 -2268 -3333 -9001 -422 -1305 1839 9276 1433 5071 2835 -12405 324 8551 -1616 5205 2311
580 2311 -7148 783 -692 -4173 -901 -3681 3316 4752 -2931 1116 -8004 -12490 8466 7224 385
595 385 11151 646 -6418 4304 -1410 -5526 -3301 -1557 9256 7030 -2197 -1230 -10380 -9085 4523
610 4523 -1238 731 5057 -4927 3515 6901 -6989 146 2366 -2749 8855 6337 -3284 -2238 -5768
625 -5768 -1752 4017 -216 2857 -1471 -5459 4273 -5816 -10487 5255 -1006 -1071 14464 2511 -5486
640 -5486 1756 -3364 -3154 1837 2824 6135 824 204 3339 -8512 -5370 2145 -6674 2144 7224 -6230
656 -6230 1218 3398 -8184 234 3707 147 6090 2941 -561 -542 -4892 2049 3095 -2457 4825
671D825m164m801P641j0629k309J3264o402K786J1227j2215l764N517l782K802
685dJ390K27M071m724K311J555j2989M253N488p344J1074k33j3903R015J118q475
701g170Q801N45m154M882m07R97l866n585Q589q22k825J0231q106p057Q584p599
717d962m28Q715p807L466P681p918K12k05m043N554n01K572N364q259J732L331
733D504r585N244J811o880R787j529q835Q036m662o178R358o63r92L060k691K419
749B204l559l433R404m412j963J1238q073m529P171q505J7P000n717M012L164
764D019o552K215k891j513N844l965M204N764r076K851L116q743N400J502m066
779a891P727m084m245N845p507j716P608l912J743K760m151L491m166k167Q508
$$ plain form
671 4825 661 -4140 3501 -7128 -9437 3827 -2575 211 11438 -777 -4541 976 -2806 -4
685 -4 1386 1613 5684 960 3271 4826 -8163 -3910 1578 -5766 5308 5075 -8828 187 1305 -7170
701 -7170 1631 2176 -1978 2904 2497 3494 -372 -5957 2632 1810 -1015 9216 1110 -5947 2637 -4962
717 -4962 -5390 3325 -4482 -1016 6665 -1253 -1041 -1246 -5289 265 -236 2336 7700 -559 1173 4504
733 4504 -5081 163 1974 -4906 4881 3352 -5483 2553 -2109 -8287 1071 408 -584 2476 -215 2204
749 2204 -1355 -4788 4616 204 -1759 9479 1406 -3123 4048 -4457 -4440 2560 -3157 855 4019
764 4019 -2533 -318 -3209 -4722 1122 -2843 1361 7125 -1951 900 4016 -4727 673 2175 -1891
779 -1891 5836 1752 -2493 3352 -4155 -5871 1737 -2175 -432 2328 -1823 1668 -2498 -4665 3843
794C843n346K24R938q574r34N870q855K483M297n657N269k98m697L052m426J51
810c660M765n518N711M176r647N248K048q161O311Q11k481O064m593j011L596
825C659q217K217M764n856L901J358m443L879m201j467O934n659K471P048q133
840a745K473L431p994M931J800n148O130j531m312L147m675J632K838n321O322
855A978P26p790O928j100o690P192n62n60N630n528L87K467p545M659K917o380
871c271M686K12l194L826n370n23M751n588N007M070q562M518J668o144P799r84
887B901n576O307j907k164K468m620J376J135k634P236l491o772P502l557l714
902e510Q206l901l15N810m491K365R77p502M852K053l705M557k426k208L237m857
$$ plain form
794 3843 -1503 -1279 8659 85 -849 5021 -3834 -1351 2946 -2711 2558 2260 -2437 615 -3811 -3660
810 -3660 1105 -4413 1298 5474 -4173 1075 3123 -5038 1273 2084 -397 5667 1074 63 3659
825 3659 -4558 -2341 2423 -3433 468 1826 -2617 1262 -2939 -4406 2528 -3131 -660 6388 -1745
840 -1745 728 4159 -3835 1096 2896 -2252 3878 2347 -1965 1182 -3493 -1861 977 -4344 1978
855 1978 2704 -5086 1842 742 -5948 1244 682 122 5752 224 611 3078 -4467 192 3109 -3271
871 -3271 1415 1627 -1567 2259 -3111 -3634 1117 -4471 536 4606 -3956 562 2230 -3914 3885 2901
887 2901 -2675 3632 1725 -439 2029 -2591 -1215 -80 -2714 4522 1031 -5741 1761 -1796 -5510
902 -5510 2696 -1205 -1520 4290 -201 2164 3141 -4361 491 2544 -1161 3396 970 -1238 1999 -2858
918b858K495J373o953O745J982p703O822j388n670R039j823l993N899l174k013
933a220K665k179J985j542r40O965o057l674P256p532j212Q950n646L9N956n135
949a321K983P26o071L949Q58j179L313l226R98J362n126M981l64p561P526n58
965A290o823P747k905n082R042k037k304M758m347r90K200k66J996l861J498O906
981F822p834L3N596j1140K008Q808p699J460N566o238K917J743m537K119n95J038
997F7K482l071L752j676n554Q681j378p832P767l288o024Q697l295m190O814j969
1013a7m58L438m523k27Q1P76L387l738K861N062q722K837N084j1476K789O625
1029C779p850M181L432o703K474J556k145R98j938K071M62k175N928l703m795
$$ plain form
918 -2858 -363 1010 -5943 802 2784 -4919 1903 515 -5155 3884 2061 -1932 3967 793 -1220
933 -1220 1445 -734 1251 -291 -1231 5734 -323 -3997 3259 -4273 -5485 3465 -2181 -2142 3814 -1321
949 -1321 1662 2388 -3683 266 1124 -55 3258 32 1030 2392 -2734 2247 1883 -5678 1848 1290
965 1290 -5533 2214 -691 -5773 3269 1232 -1072 3686 -661 -1651 549 283 2279 -1582 -84 6822
981 6822 -1012 -979 4617 -6523 -4515 4293 -3406 -1946 3620 -2618 299 2042 -2495 -376 -971 67
997 67 2549 -522 3230 1554 -4000 4681 3303 -4529 3238 -50 -6074 2623 -672 -4862 1952 -17
1013 -17 -475 2963 -1560 -1787 -1706 -930 2457 -1281 1580 6642 -2080 757 5841 -5635 -2846 3779
1029 3779 -4071 110 3542 -3161 -687 869 -1276 -278 -2216 -145 317 -1858 4070 367 -4428
1044d428J0960l222p329Q964m973n810Q226k976k701N456k167M11L02k735J361
1059f61l154J107N040l804L451L711q886N024L872j0630M153L701o611N138J431
1074B882n836K901J55p51N13k232K458j592k139P140m358k636J0446n595m126
1089b770R403o480n503P041k310l88L290j988J033j341j041J545o047J976N655
1104B075n031M381L451q297N293K620q784M733K004m928M584n13k696K686k504
1119i26R82J045k994K605l102k591P116l729j199Q410o165m82Q081p971l394N467
1135A153k504J586K144j357J770k662n34J410o478K789L952n675N842L059p863
1150c368M520J178o097N372L81m050L229j081J139J187m179K890R27l597L536
$$ plain form
1044 -4428 6532 3310 -4019 4945 -28 -5838 2388 -588 -3289 2167 0 411 713 -2022 -661
1059 -661 -3815 -2708 2332 -1472 1979 5690 -3196 1828 5700 -4930 -777 2924 -3687 1451 2882
1074 2882 -2954 -53 102 -649 -136 -2368 90 -1502 -3641 3499 -859 -3495 6951 1356 -2770
1089 -2770 6633 153 -5350 1691 -619 -1007 2283 295 1328 -13 -1054 491 -5556 -3580 2075
1104 2075 -2956 1425 4876 -3421 1872 4492 -4292 441 2445 -2483 2101 1588 -1108 1578 -926
1119 -926 56 1101 -1893 712 -2390 -4981 2135 -1594 -2793 5617 -548 -1030 7051 -920 -4314 1153
1135 1153 -1351 235 2379 1022 2792 130 -404 1006 -5472 -2683 1269 -4406 1436 4495 -3368
1150 -3368 1152 2330 -3767 1605 1986 -2064 1165 84 1223 2410 -1769 1121 2048 -1549 1987
1165A987m053k876O051l915K32P133n175P08M804p318PL273l152K398J684K11
1181A999L168n025r9J452n925L297J687n436O605J469o663M693k88m076M763j360
1197B61k054K978j471J901k67l327N428o39m069L932l782k783M332m433J766O154
1213C927m346J401J971n368J469j29k835M193P38J436K787n539R27K057o131K697
1229g45R85l976O393j033m859N136j852k686L811k398O17J489k731K539k96j764
1245a370O109k763l169N490m730k681K940l969L016M736m199K303M40m388J648
1260e87k680j040N155j234J791L151m652K136L55n852L268P52k590M438k399k160
1276b148N029l723j468L724k510J000pl409L347l80q86N460l043n18M556n843
$$ plain form
1165 1987 -2066 -4942 1109 -2806 -2574 4559 -616 92 4896 -2422 -2415 858 -2294 104 1788 1999
1181 1999 5167 142 43 1495 -4430 -1133 554 -4882 1723 3192 -3471 1222 934 -3142 1621 261
1197 261 -1793 1185 -286 1615 1348 -1979 3449 2810 -1259 2673 -1109 -3892 440 -3993 -2227 3927
1213 3927 -419 982 2953 -2415 -946 -1075 -3910 283 1021 2457 5244 -295 632 2689 -3442 -745
1229 -745 240 -3736 2657 1624 -3235 1901 49 -2637 1174 -1224 -607 882 -1849 690 394 -1370
1245 -1370 4739 1976 -1193 4297 -433 -3114 -174 -4143 -1127 3609 -590 1713 2153 -2235 -587
1260 -587 -3267 -4307 848 -386 1405 4556 -96 2040 2395 -3457 -189 563 -2027 2411 12 -2148
1276 -2148 2881 -842 -2310 1414 -1096 -96 -103 -3512 -165 -545 -1431 4029 986 468 5024 -819
1292h19j922K803l379L119K543l074M111o90m340R73l415O39L934k758K853L297
1308C875m253K487n89m862M497n35k214L609k255q0K991m466Q15L272l297R09
1324i6j121k138L767k460l50N364k273J374K840o812O4K233l731L406J421j168
1340C20M340k412l646J393l327N07J871k232M792J843m809K640j151k484M380
1355B025k664j105M426k742L50K035m613K998K141l144J045j716j588K057l604
1370d099J663N171k754K159J591n557J720l14m297M354J915o2L382l344j585J626
1386A569m410M99O82j207N222n91l801L686j746j903L359l329J008L853l931O31
1402d09J987l005L329N52k340K283k297j557J47l331L910L228m278L824J585m713
$$ plain form
1292 -819 -2741 62 -3317 -198 2345 -729 3382 2692 -1648 -675 -4090 -3451 483 -2275 578 3875
1308 3875 -378 2109 1520 -3342 1155 620 -1594 2015 -240 -320 2671 -1795 -980 2292 -1005 -96
1324 -96 -1217 -3355 412 -2048 -2398 2966 693 2067 4907 -1905 -1841 392 -3339 67 1488 320
1340 320 4660 2248 -1398 -5 -3332 -2825 -954 -3186 1606 3449 -1360 1280 129 -2355 2025
1355 2025 -639 -1744 2682 -60 290 2325 -2288 710 2851 -293 752 -964 -2552 -495 -4099
1370 -4099 -2436 2735 -19 2140 3731 -1826 -106 -420 -4717 -363 1552 1490 4872 1528 -57 1569
1386 1569 -2841 -2342 -1660 -2867 2355 1764 -2037 1649 -97 -2000 1359 -1970 -962 2891 -1040 -409
1402 -409 1578 -1427 1902 2454 114 2397 100 -1457 -1310 -4641 -731 2497 -1781 2043 3628 -1085
1418a085J555k459l318N378J283l19K931k402L3K29m481J250M32j314M533j952
1434B94j684M125l949j666L706k109J488J398m535K475J786k395K577k91k27K863
1450C856l397j552j94l095M145J725l524N041L42m946J514k325j780L957r04J204
1466F7L749j510L5j586l330L164j168j217L615k189O56K932n517J8L677k619J385
1483A62J79l236L043l38j916L212p9J111J317l612M81l10l888L314J036j466N360
1500D370j425m778K034k025j608J918j343L124L235k082K06j836j279K768k435
1515a156n53M198k290L02K055m649J269K491l108J589J96k062J390k071l85M296
1531A512m71O27O83k681J925j533m548L751R85j28M646k739k813K087l079j457
$$ plain form
1418 -1085 470 -1989 -5307 71 1354 1035 3966 1564 1597 1826 -2655 -1405 -973 -2287 2246 294
1434 294 -1390 2735 -1214 -2880 826 -1283 205 1603 -2932 -457 1329 -1066 1511 1220 993 3856
1450 3856 459 -1093 -1287 -4382 -237 1488 -2036 3005 3347 -1599 -85 -2410 -4190 -233 -1137 67
1466 67 3816 2306 2341 755 -2575 589 -579 -1796 1819 -370 286 3218 -2299 -2281 1396 -1223 162
1483 162 341 -2895 148 -190 -2106 1106 1027 2138 3455 -157 324 14 -3874 -560 476 -990 4370
1500 4370 2945 -1833 201 -1824 -3432 -1514 -2857 267 3502 1420 1626 -210 -1489 1279 -1156
1515 -1156 -1709 2489 199 501 2556 -2093 -824 1667 -1441 148 344 -1718 -328 -2399 -2784 1512
1531 1512 1041 1668 2351 -330 1595 62 -4486 -735 250 122 4768 2029 -784 1303 -1776 -3233
1547c233J420q69L576J165j927J590j650j496K002k717J550M103l708Q9J928k904
1563a081J876M70k734K680j72j861J70k851J131L715j999J895J359k731J626k306
1579h13l560M451J37k10M065j743j092O50m162m33J397n93K911o19p94K950k724
1596a82k071J927j859K347K312l757J620J400k596J510j85o70K901j930j383L30
1612b86k808J555J928k209L491J202l122R32k471j578L569j306J72M387r27k41
1628B288o90l841J327M34j347K807j035J69K614l691j334K392j957J811J410k761
1644a404K407J64k952K010K99N31K030l270M07P48l508J107J083j548M269M20
1660B793l532J526k334j128J746j571K145L551j190K57r81k904J904j284j193
$$ plain form
1547 -3233 -1813 -2682 894 2059 132 1722 72 -1424 578 -2139 -589 3514 -194 -105 1823 -1081
1563 -1081 795 1265 -1469 1211 1039 -822 -652 -3503 -2372 1343 -656 1239 2598 -133 1493 -813
1579 -813 -4373 78 215 5 4070 2327 1235 1885 -2277 -2710 -1313 -1906 1005 386 -408 2542 -182
1596 -182 -2253 -326 -2185 162 2474 -1283 337 1737 -859 651 466 -204 2697 767 -616 -286
1612 -286 -3094 -1539 389 -1820 1671 2873 -249 683 -1788 -3366 203 -1103 -931 3456 2529 2288
1628 2288 1598 -2243 -916 -482 -1829 978 -57 112 2726 -965 -2299 93 -1864 -53 1357 -1404
1644 -1404 1003 1167 -1785 225 524 1055 3085 -185 222 970 -2538 -1431 -348 -1896 2373 2793
1660 2793 -739 787 -1547 -2675 -929 -2500 -355 3196 2006 2263 1282 -1622 282 -1002 -2195
1675b195L789q59j64J523l490L81J511k458J419R96j424K339k017j831K970q0
1691D10L83J554k288J335k0m150J672P13p60L734o45k159J635k679j432R47q70
1708b620L100J597j619J641r84k156J458k151J08L927j460k64J189k606P85L08
1724B53k377K273K91j177J337k412q3K826j741J177J731j616J474j269l646K612
1740c47M11n39K802p26k26P04l775o19P32q59K851M01r85K590j717k202J230j716
1758a990J135L089k243Q33J271k351L83n50p73K687r80j349J355k380L74J463
1774b6k077K299J927j944J301j629k388K721r61j37L158l36L5j88l427O64K21
1791g87j726K854P7n78K884k762j771J611j522J370J803k311K175O68k765R75
$$ plain form
1675 -2195 1594 735 571 2094 -1396 -1015 496 -1962 -543 453 -971 1368 -649 -2480 490 410
1691 410 793 2347 59 1394 1374 -2776 -1104 -391 -1151 2583 1938 -221 1414 -1265 -2697 -1750 -2620
1708 -2620 480 2077 458 2099 1115 -1041 417 -1734 -1626 2301 841 577 1766 -840 -55 253
1724 253 -2124 149 440 -737 600 -1812 -1895 931 -810 367 2098 482 1956 687 -2959 -347
1740 -347 64 -475 2327 1601 1375 2079 -1696 -2315 -1583 -2442 409 810 -175 2415 698 -1504 -274 -1990
1758 -1990 -855 2234 -9 824 2095 -256 127 -423 -1196 1491 511 -838 517 -1863 -1489 -26
1774 -26 -2103 196 2123 179 1480 -149 -2537 184 -777 -914 2244 1908 1943 1755 -1672 -1008 -787
1791 -787 -2513 341 418 -160 2724 -38 -1809 -198 -1720 -350 1453 -858 1317 1985 -780 195
1807A95n15j4K016j509j94J558l239M64P76j765L058R12k101J439j259j544J309
1824d13j432J023L040p28P02p60k697J530j254j508L231l40j27J892k706n19J275
1841B09k369J527Q87r48K147o65j938J685r51L45J921k054J254P06l554J019M18
1858c61j478L024j8j256J454j861j498J071j376J875K065j076J758q17k084R65
1874C87j804o60L505r38r3J555k382J83l0k128J716P38n45J698j467j008J901
1891F28j523Q44J722j908K009o8l513J668oj391K819n57j66J228k538q49O82j481
1909b400K139J196j064K323r91j804J195k230K26L052j444M17J711k459K78m22
1925b77j743K117K13j050J798j561n51J061j576J194J462j613K184n77k514K007
$$ plain form
1807 195 -320 -334 1682 173 -21 1537 -1702 -1238 -462 -2227 831 1743 -358 1081 -178 -1722 -413
1824 -413 -1845 -822 2218 1490 2192 1432 -1265 265 -989 -2497 734 394 267 2159 -547 -1066 209
1841 209 -2160 -633 254 -694 1453 788 -1150 535 -416 -71 1850 -204 1050 1756 -1798 -779 -361
1858 -361 -1839 1185 1167 -89 1365 -496 -1994 -923 -2299 -424 1641 565 2323 1506 -578 387
1874 387 -1417 -2077 1428 490 397 1952 -430 -247 -277 -2405 -689 49 -496 1202 -265 -1273 628
1891 628 -895 -51 1671 -237 1772 1704 -1809 -141 -147 -1538 1281 724 558 1786 -752 -1601 -919 -2400
1909 -2400 -261 935 -129 2194 1203 -601 594 -1636 -1410 1642 198 615 2326 -133 145 -277
1925 -277 -2020 97 310 -740 1058 -503 -1054 7 -1569 -375 1087 -526 1658 1081 -1433 574
1941E74j071j070K954n28qR35k647p4M5j762K158N47j49K313j695j311J478k578
1959a889N76K638j625J349R77k181P46o39j306K025j007m4J733k171L8O96j994
1976b078K256N96j449K277j182j705J891j623j75K605o06N27N98k305K24n20j458
1993b127K243l69P4K176k269k92J183k818J050J747j087J891L35j844Q97q10n48
2010e68J286j199J015J011k155K27J99j732K475j80r45K072j541j340J675j743
2026a443L49K401j118J239R0j706N81j331q71K377p24N13J324k022L28L66k829
2043b476J698J273j269J996r8j747J429j320k39J649j097J243M08k195J202q12
2059c55j409K087k83m83K187k057q02J262j789P47J462p67J659j70j319P79j828
$$ plain form
1941 574 -497 -1567 1387 859 851 1786 -861 -935 -890 -2652 -494 53 -96 2217 522 -789 689 -1889
1959 -1889 -1313 1325 -300 1049 2026 -155 591 -48 -1354 671 -336 -380 1353 -818 -780 -84 -2078
1976 -2078 178 774 -675 1602 420 -1285 606 -1017 -1192 1413 807 1334 1932 -373 -149 -669 -2127
1993 -2127 116 -253 -179 1997 -272 -564 619 -2199 -1149 598 -489 1402 1737 -107 790 -20 -568
2010 -568 718 -481 534 1545 -610 -383 -184 -1916 559 379 -566 1506 -35 -1375 300 -1443
2026 -1443 -1094 1307 189 1428 1518 -188 393 -938 -1809 568 -156 357 1681 -341 -13 353 -2476
2043 -2476 -778 495 -774 1222 1124 -623 806 -514 -753 896 -201 1042 1450 -745 457 -355
2059 -355 -1764 323 40 -443 1744 -313 -1115 147 -1642 -895 567 -200 1459 1289 -30 749 -1079
2076a079k45J994j094Q89J120j979O75n1k428J852K45j114K298n52j141J114j564
2093a060L45J486j209J753p1j634J320j188j155J943q83K64J788j873n73O19j600
2110a728J002M94r3J848r34n52R49k080J67J813j476J243J274k376J128o39j797
2127a757J728j98n80J895j177k02O13j836J202O60j050J897k32j407J297j250
2143c97o83J797r89O11J531k368M35J95j833J008M20k63J708j171k02J050k197
2160a348O61J487j503J765M59j795J287j108j087J680o84J15J216j307q8N3j517
2177a714J476m2p24K280p75j077J712j824j01J607j308J091J150k027O91m05j290
2194a280J356o83K31J570j740N12O15k304J152Q21j168J833J34j293J234j173
$$ plain form
2076 -1079 -1324 670 -424 465 1585 -394 281 230 -2198 -346 -101 -1215 1083 531 -610 504 -1060
2093 -1060 -715 771 -438 1315 1244 -390 930 -258 -1413 530 -353 -89 1699 -174 -747 -128 -1728
2110 -1728 -726 -232 -325 1523 589 37 986 -1094 -927 886 -590 653 1927 -449 679 40 -1757
2127 -1757 -29 -227 -807 1088 -89 -291 322 -1514 -312 348 -702 1195 963 -444 853 -397
2143 -397 -1080 717 -272 339 1870 -498 -63 132 -1701 -693 -273 -536 1172 1 -201 849 -1348
2160 -1348 -687 800 -703 1062 1521 -274 1013 -95 -1182 498 -186 -71 1145 -162 -250 -197 -1714
2177 -1714 -238 -280 -1004 1276 501 -576 1136 -688 -789 818 -490 601 1751 -276 415 10 -1280
2194 -1280 76 -607 -376 1194 -546 -34 581 -1723 -571 250 -918 915 1049 -244 990 -183
2210a83o85J365p33N64Q48j597O71l93j322J672p21m72K306j172o02J319k049
2227a184N74J127j140J345M79j276R98j015r18J199p45O37R36j599R05j7k041
2244a735J550K75j316K313m72q86J169j400Q4J022j048J139M95j397J099r59j086
2261a153J228q62L37J528j313J39O66j823Q21P17r06J538k11p36Q49r76o78J520
2279F85j118P29P37j732J276l45j874J530j04q22J758m58l50N74j610O57R77j257
2297g47J695P4j143J335j295p40J213j026K14J649j745O05L25j757J132Po98J754
2315H52n14n41J181j468J09Q63j040J389L14j360R98p45j340J424p82J8J619r46
2333C1l88O35j433P70K81q74J884j81p36J188j220m24J165j346O72J147j594P32
$$ plain form
2210 -183 -868 497 -236 328 1176 -421 250 -143 -1465 207 -514 -986 1320 148 -454 865 -1184
2227 -1184 -610 517 -623 722 1201 -75 923 -92 -1010 189 -556 81 1017 -582 323 306 -1735
2244 -1735 -185 90 -1226 1087 615 -271 898 -502 -418 604 -444 695 1190 -207 892 -67 -1153
2261 -1153 75 -787 -450 1078 -235 -96 570 -1253 -432 285 -621 917 706 -30 819 -157 -835 685
2279 685 -433 296 1033 -699 577 232 -1642 -112 -216 -1038 720 262 -88 486 -1124 -467 510 -747
2297 -747 948 1022 -121 1214 -81 -821 392 -634 -420 1229 -516 89 414 -1343 -211 -204 -902 852
2315 852 338 -203 978 -490 -381 482 -558 831 1145 -215 783 38 -1302 122 -660 -642 977 31
2333 31 -357 278 -1155 -385 -104 -978 906 725 -11 1177 -43 -467 698 -648 24 1171 -423 309
2351C09J73j798J354p02p6J610j109j25J335j783O51N85j127J446J65j078J238
2368A068j111q92J358q68K99J178j287K93L75j913J329k41p13J824k40n61J219
2385A117j336j27Q84j468J155O28j084J244o82j326J336p52j04J088j065L49N30
2402C87j607J252K44r28J610m44q80J291j282m54J436j070M94J035j282P84j32
2419D54j762J121m27m28J787p48j2Q77j306K91N38j066J439j65r07J352r42o85
2437e89J342j205R3J261j657P11M27j593J070J4q08J645o22k48J083j589K63R40
2455E38j167J054N16j170J175q22j162J178p35k03J328r38O09M20j450Q90n0p58
2473g47J260l31m73J468r65l22Q88j077N15O49j484O97l7r65J003n13q0J175o65
$$ plain form
2351 309 482 -1316 38 -664 -740 870 -239 -364 971 -812 -161 424 -703 743 908 -170 1068
2368 1068 -43 -935 423 -445 -146 1032 -255 38 413 -1500 -171 -412 -1125 699 459 -102 1117
2385 1117 -219 -346 538 -930 225 853 -231 1013 331 -995 341 -411 -515 573 -492 -143 387
2402 387 -1220 32 276 -652 958 514 -366 925 -357 -811 625 -445 49 1084 -198 586 454
2419 454 -1308 -187 -614 -1042 745 -3 -15 862 -444 -153 385 -681 758 593 -314 1038 96 -589
2437 -589 753 -452 -359 902 -755 -44 383 -1210 -140 -126 -934 711 89 -159 924 -665 -402 538
2455 538 -629 425 941 -229 946 124 -1038 140 -595 -798 530 -408 201 621 -829 61 11 -747
2473 -747 513 182 -291 1177 212 -110 778 -299 216 865 -619 78 41 -924 79 -434 -514 661 -4
2492dK07L69j511P43N66j324J434L99p88Q10o21p27P53q43O0R67p21L36L56j312
2512h51J122m07r28J420p56j48J672j595L77P37j084Q66M25j161O44j02j113J067
2530A85o24L31R33j204J86Q04j667P39O7q69J718k20l24J097j003l08P06j103
2548e56M03Q05q38P14l22r04J098p75n27J414r56R8R80j480Q41M91j134J079R3
2567E24n85R66r66o64J102p95N13N64j018Q06Nj475Q56l44o81J827n76l92J234
2586I01q33j23N27j426J434K1j111J188k88l08Q22j170k64R42p87K26M48j008
2604h09Q56J16q01R90R4k84N66r89n4Q93r40M05O82r07R06l77j123R76q68k22
2624h90J285q03N71P64j297K27L11r15J205j51q07J267k43o29Q70r12K13N59j361
$$ plain form
2492 -4 203 572 -939 -196 370 -954 480 879 91 901 280 -447 306 -537 -477 490 -231 105 461 -851
2512 -851 271 -136 -1064 356 -400 -548 1124 -471 -94 643 -441 425 850 -311 333 231 -882 185
2530 185 -439 -108 825 -379 -193 611 -1056 -317 -250 -1119 599 379 55 1152 149 -159 547 -556
2548 -556 -153 652 -186 528 206 -698 400 -375 -902 512 -444 -346 634 -846 -5 486 -648 431 524
2567 524 -61 905 -61 -725 377 -418 95 659 -359 447 452 -1023 -167 -511 -1192 635 59 -333 901
2586 901 68 -55 472 -954 480 501 -610 578 290 -18 804 -366 -630 312 -475 -249 199 -809
2604 -809 47 163 -638 352 446 162 728 -261 -315 578 -362 43 725 -182 724 347 -776 200 -668 -890
2624 -890 395 -408 163 927 -370 -143 168 -747 458 307 -500 767 524 -105 765 -147 66 625 -736
2643g36O04L15j162J309l77n43J215k66m19M86q60K80L02q88J027K51n83R20m17
2662D58r45R23j007rQ24p12N12N39j223N47J31p07Q35l77j51R09n20J8O45q01
2682a11M36K61j341Q15K09r43P47m49N6J014j147K70N58q42M96j09p39J114L05
2701F00n00Q77p52k72M39j144L72N14n82P42J18r19P88k01q11Q68l19j25P81r70
2721d96N75Q69j021N25J55p66O46n29p21J076n61J67Q02j044M66J29j068N92J5
2740a89m91J092j59m17J050n66m23O17j172O16M98r15O87J4k99M00j81o65O40
2759A37n08M1M75q81Q88L42r80J202l19m62N88p40j86P31m92L1P00p40N98o4j272
2780i11O88k32k74Q21n55L56J037r18J30J79r22P60Oo23R43j93l72M17o12R5O51
$$ plain form
2643 -736 -132 183 -979 330 -47 -590 625 359 -60 426 -434 -154 148 -740 287 538 -45 875 458
2662 458 -487 436 -571 -580 244 -468 44 583 -640 -93 38 -669 166 -211 -362 547 27 45 690 -111
2682 -111 325 586 -755 60 269 -674 73 -376 -320 694 -453 -183 375 -467 29 -80 -819 295 600
2701 600 100 977 225 -47 392 -752 -380 134 -448 294 412 -507 281 80 -731 137 -182 -307 474 -496
2721 -496 79 948 -73 452 607 -159 487 -42 -763 313 -248 -81 721 -323 143 272 -796 -204 -189
2740 -189 -680 412 253 -164 886 320 -103 514 -658 -42 456 -459 228 242 -57 343 162 -503 137
2759 137 -371 -330 145 -736 152 494 -486 716 397 -65 523 -217 -403 328 -164 -133 567 -173 425 361 -911
2780 -911 -223 -455 -729 92 -463 -107 930 12 142 321 -601 159 165 -458 485 292 -80 337 -275 -180 471
2801D71j048K40M54q58R59j14n33J130o22l49P53q61J29P99j029N74M68k59M92
2820G96n51j070R09m25p16J174l90L85L46r68M41N92r82M40L5k58Q30l20l63Q22
2840G27q68K06L54r83O09J58j066R00k28j40J186q28j38O29r32K10L31n93R92
2859E26K17n13M91n33k18N21j013k25R68p17N09L12q77R51j05p78O86l64m2Q04
2879F00r76M82O37o22L37q0p60O94k50r24Q82l70L3J088j089K33M83j012L61Q7
2899a66l70R90Q0n74Q43n32m51O27r54K31Q44j165N96O4l78P02o14l62P07l28
2919b10l77R12q83O69Q27j281N72K57o32Q01r87l34R40m23N7L77n79N74K0j244
2939i44O89K24m75Q29n75K10J096j127R8L81q13M47K78p62P55k29n20P33n62M9
$$ plain form
2801 471 -577 -337 117 -741 218 104 -429 701 79 -270 483 -378 -249 550 -479 95 563 304 796
2820 796 245 -825 84 -341 -1057 117 -273 112 458 -510 -69 523 -459 -19 16 -242 588 268 -95 727
2840 727 -141 65 419 -564 45 203 -863 37 -191 -331 855 27 -111 518 -414 -204 127 -466 526
2859 526 743 230 721 188 -30 491 -522 -747 221 -496 13 325 -552 399 294 -484 202 -162 -204 600
2879 600 -376 106 743 121 458 378 -382 312 62 -862 20 -350 -317 771 -318 -85 398 -614 -253 -166
2899 -166 -536 454 534 -40 803 271 -180 447 -507 -276 568 -597 -1 63 -315 387 -227 -589 118 -210
2919 -210 -587 325 -558 111 938 -343 229 486 -146 655 -332 -666 274 -149 -92 285 -294 280 300 -944
2939 -944 -255 -31 -506 323 -252 -42 1054 -73 25 406 -407 40 318 -444 311 82 -438 295 -267 -218
2959b18N82j107L55M26o92Q71j66o20J198k22n31N68p32l2P23q63M06M55n65O99
2979E35m99n64M14j75k74Q23m06L78L90r27L56K87q78Q29k48m89J110n17m06O74
2999D13n62R9M47j008M34M20q27N19j09k18R60l40n06O82n45K64L0p40P87O13
3019H13j016N45j46n73M88m87m03Q29l97L98K08p54O45Q9p82P15j70j41O07n96
3039a28Q0O46n11K27m2q59J020k92q20N59ok21Q63o60P8N44p48J76j2m04J016
3060E06j49m33O72l20n32N11j033M01P87o51K18L14o91O78j07p63J005o21j23
3079c31Q37q30J88J046j200M95M4l72O81p56l85P82n07R6M56n70L84N30j181L91
3099b02J33k92P48l20j74R27m14n53P06j101M30M39o84O36R7o33M85m39m93J040
$$ plain form
2959 -218 364 -743 -388 38 -654 217 51 -569 629 407 -124 444 -288 -320 403 -460 -54 401 -164 535
2979 535 36 -528 -114 -289 -563 260 -146 232 622 -305 51 338 -540 289 41 -448 662 145 -261 413
2999 413 -149 -50 397 -611 -177 243 -584 -65 -174 -392 568 228 -278 404 -141 123 153 -587 200 813
3019 813 -203 342 196 -377 111 -376 -779 50 -347 51 259 -495 150 239 -543 172 2 -139 468 -128
3039 -128 -48 598 87 314 272 -587 433 141 -679 -120 -126 -347 516 -144 -66 478 -270 -94 -106 -510 506
3060 506 357 -76 596 276 -256 255 -778 -377 410 -241 -23 291 -400 278 171 -592 413 -208 -331
3079 -331 506 -324 -136 910 -290 205 249 -123 558 -198 -583 199 -308 -212 244 -326 58 588 -593 -202
3099 -202 -69 -361 387 67 -107 820 406 -147 559 -542 -112 327 -357 279 376 -257 228 -211 -704 336
3119C36m71j32N05o04M91L68r52P86K44p02M64m83l20Q45q36L54O65p59N94l28
3139F5q65P45j51l75Q51l47J19P10p28n6M12n71K42N3m13P43m48l09O70n30K21
3160C8L48q17K06L72n86M39j39k30P66o6l81L84n44k7N99q86N51L44l48N25l17
3181B31r25P39m75k16Q34m86M44K77o95L80L45p34M71j86m9O15m35m15P88p06
3201a98J52K47p21N88M2r00N89K40k76O20l75k20Q13n59j39J97l51N74K4n18R24
3222G53n20n70M04p09K39O70o31L79J98m30N16K4q37P27j67r8O70r13K42N46p62
3243b69K46M33p39N21k16m98N81m92J69O86o20L60N59j082L30m3l51Q01j72k86
3263h2R11o73m11N87o93J46N42o56N05n6n52N33k59l44P41m46k24O72m85M92K85
$$ plain form
3119 336 -135 -267 238 -366 125 493 -459 327 571 -131 333 -150 -470 375 -461 -107 558 -201 393 65
3139 65 -800 -55 -206 -581 270 -77 42 752 24 -32 380 -191 51 104 -309 434 -14 -323 347 -183 38
3160 38 386 -431 -225 147 -439 0 -139 -369 397 331 -50 334 -210 -237 362 -524 27 371 23 548 231
3181 231 -694 45 -430 -646 188 -298 146 423 -272 108 453 -281 190 4 -45 570 135 -280 508 -198
3201 -198 -46 201 -520 68 110 -790 -201 39 -237 383 8 -212 601 42 -97 100 -251 323 347 -171 753
3222 753 233 -337 67 -642 -403 267 -364 15 213 -217 299 323 -514 213 46 -52 618 -295 -53 493 -269
3243 -269 -23 410 -329 192 -24 -522 59 -433 -264 422 -198 162 721 -361 -31 -74 -425 376 204 -82
3263 -82 829 156 -255 332 -361 -215 327 -329 176 120 -432 101 -158 -502 239 -207 -431 241 -244 248 533
3284E33r97M77M03n26L78k64m12O93m62k31P02m31N29k0p35M49r3p01Q75Nq0Q52
3306I44q02k72M35o13M46k07l66O85k93j57M11l82l7M66o50K21Q19j067O19L1
3326B31q40J204m78j40M80o37OM18o53L84L50p16P64k30p84P69m14k19Q32k97
3346C0KN32q02M01R8o69M54o4J25K16l50k99Q62p35j31M80n85M45K77p30O27j50
3368C4l75P48k62l54O31m53J7L22n59K55K88n50N81l83k61O17m09n30Q40m93K73
3389b3M33n54M33r2n57M75k5j08N02n17P2K88o11J22M83r22R18k58n65M51n8k14
3411c27M57j58n5N83o61o7K86n20O55O5l58M55p4l20L42p40kN12n54M68L10n49
3433b52L65j68k35N07k03j20O59n88K04K63p69N33qm82L59J40m94N53m89j59N00
$$ plain form
3284 533 -464 13 416 -110 268 4 -408 285 -177 -408 294 -137 392 372 -363 86 -7 -708 167 172 92 944
3306 944 142 -130 305 -308 138 -69 -435 250 -43 -200 211 -171 -208 258 -392 -171 648 -419 200 231
3326 231 -609 595 117 -23 457 -180 -174 244 -409 -25 325 -391 373 143 -641 128 -286 -505 327 30
3346 30 32 564 -238 163 261 -408 46 -18 107 323 -27 -326 536 -199 -330 150 -435 10 287 -443 184 34
3368 34 -341 407 145 -209 422 -31 -14 308 -251 4 292 -258 323 -60 -321 296 -113 -643 197 -296 -23
3389 -23 410 -144 289 197 -360 115 90 -18 484 -33 39 327 -284 -162 321 -601 317 59 -506 -55 -113 -327
3411 -327 130 -28 -83 500 -161 -228 58 -462 193 258 -100 355 281 -39 303 -437 -439 73 -481 -13 297 -252
3433 -252 113 -55 -290 217 14 -106 553 -35 169 432 -337 196 188 -294 65 205 -289 264 -225 -384 116
3454A16l66L00L17p20L99j20l27O40l30K3N91m00k76L42p54R7O10m17J63M33m96
3475a75J1K68l96O80n21m2N86n19K58M14j063O34L91p47N59m94r1N99n97j10N10
3496A55n12L72O8l40N03l66m14M68m1R5M94n62K66J58p84K91L75m84N83k26k66
3517a67L55l69j92N04m74L41M64p14L46L55o00L31R9o73R14p24Q1L05o19M11K52
3538B26p15M07P4l16M75k32m79R13o06J97M21m63K08K88p20M99p4n34P57k98j19
3559i1K56k98M3J31m07K82O4m92O97p0o01Q32l72QN50n93O3M70r06K77K03l78
3581c32N13n0l88L04l23M0L65m82K39M00l79Q8P8k41L23l47k58Q40j15j81K23
3602C17n59N3L95n46M03p3l62O04l45l67N25l01K13N56q10L91k8k53M59M4l20
$$ plain form
3454 116 -250 50 367 -353 46 -74 -401 239 -91 -68 523 123 -153 189 -565 -468 142 -275 -112 321 -175
3475 -175 -164 104 -292 388 -133 -175 411 -108 150 564 -499 135 526 -221 338 -156 -247 352 -245 -355 155
3496 155 -357 15 83 -257 246 -120 -534 -66 -107 -12 482 -80 186 344 -440 -149 226 -258 325 99 -167
3517 -167 188 -181 -373 131 -343 -2 462 -252 94 449 -151 180 279 -394 520 -204 -123 182 -437 -26 226
3538 226 -489 -82 -8 -324 151 -81 -560 353 -253 -56 365 -98 110 398 -322 177 103 -431 326 28 -91
3559 -91 165 -133 -90 41 -366 -84 -20 -512 185 115 -486 346 -26 -18 532 -61 2 472 -434 -157 46 -332
3581 -332 181 131 -257 47 -276 -236 129 -353 -114 286 -93 -5 73 -168 155 -192 -450 390 275 94 317
3602 317 -242 -189 206 -340 63 -10 -372 232 -113 -480 45 -256 -43 513 -297 94 66 -187 272 316 -4
3623dN13j90n03N24n75L13M3n10M54K63n30J88J66n36N53k16j36L53J8r7L14o62
3645b57L57L87o37L48R4k52K94n40k02M82l12J99K42k65L09k13m71O19j53p6M77
3666D30l03RK30p40K98J10n39O33J0l32K82j60l65M14r2j36O06m32J47J99l84
3687a15l1M02k41K43l73j2M24n16J08K77m15O3L62o45M95q2k14L49K49n15M84
3708B97k85p2K96n08J03K15k71L85k43p1N56n04j99N35p87M94N20p64M61J1k71
3729a02K08j0j79M48l03RK22o60K64K23n78M74P4m44N75m38J16K11k96o7N13n32
3751b72M15L00n34J68Q5k68M73j61m56P14o38o1M43p52N02K18m73M82r7n97P88
3772B79n65J82N26m95Q3N22p58K09J63n70O03q3m25L75j42j09M55m82L25r2m22
$$ plain form
3623 -4 509 319 -184 340 -235 78 121 -389 65 328 -202 -14 152 -384 169 -47 -183 170 188 91 405 -257
3645 -257 100 487 -150 198 292 40 334 -206 -408 74 -238 -39 203 -62 247 34 -437 182 29 -47 430
3666 430 127 136 366 -374 -76 34 -505 128 138 -194 88 -72 -437 -23 -115 -251 355 -77 70 269 -115
3687 -115 -146 256 15 258 -115 -127 297 -219 -111 166 -249 -186 176 -469 26 -56 -270 79 328 -187 297
3708 297 12 -60 236 -272 -169 46 -225 160 -83 -154 402 -102 -301 234 -553 -59 461 -303 158 169 -102
3729 -102 106 96 -83 365 62 71 293 -367 -103 120 -458 16 90 -354 221 -217 -101 110 -186 -253 260 -272
3751 -272 143 443 -91 77 162 -106 367 206 -250 464 -174 -235 208 -544 -42 176 -297 185 88 -509 279
3772 279 -286 -104 422 -73 10 532 -226 -17 146 -424 179 96 -329 46 -96 -205 250 -232 93 1 -421
3793d21P15k43k81N84m59J11L76m19j8K70k86P7K00n95N57O9m06J83l5l62M93
3814A10m85K24M93m41N74k64o15P21n2m47K57M1k89K17k59J34L47n45L42K79n78
3835b36L19N7m25N92n33R5M82m49J30L49n42K41K3k84L32Lj60J51k08o1K53o92
3857e63L30M90l19K14M1m77M36j47o9J92k06O1N31n96J24J61n51M35Qm58M37l46
3879b72J9K43j56R4K39k03J90M5l66K48j42j93M56j02r7L69m07m5J47m23L17J21
3901H2l85M88n9l26N70m87j22L20j01K16K47n59L05R3n16M85k43L3K20m85lL07
3923H0k49K01p2k48L14K01o03O77k98j16L01l73L19K75l51L3L5l69K09j03k76
3944d13N53m48J57K31l16K90K71m78L75J1l9J86m30j82N07l43J10K10m26K80Q9
$$ plain form
3793 -421 294 51 -230 354 -105 6 382 -37 -55 215 -71 6 206 -389 168 237 -169 14 -21 -383 110
3814 110 -375 -151 342 -99 475 211 -404 317 265 -182 75 116 -173 44 -215 -81 266 -279 63 342 -236
3835 -236 83 140 -285 307 -226 -131 351 -98 32 381 -161 80 103 -181 151 154 -6 145 -63 -124 129 -563
3857 -563 -233 257 -62 152 193 -284 152 5 -64 128 -78 -17 514 -82 42 203 -348 87 95 -363 74 -272
3879 -272 -253 -10 -166 -72 167 -36 154 199 -167 81 -61 -254 202 100 3 372 -35 -80 67 -356 -39 82
3901 82 -303 185 126 -200 370 -117 -239 81 -20 196 443 -116 189 282 -234 251 8 41 261 -224 -227 80
3923 80 -169 32 -40 -288 26 227 -376 301 3 -113 188 -185 134 409 58 91 126 -243 -34 -137 -413
3944 -413 140 -308 -151 80 -236 54 325 -153 222 233 194 380 -50 -232 275 -68 42 252 -174 106 195
3965A95m93N28k35l04L33K9k86L35l46P2M43j56Q9L00k38k55J16n41N99j50m18
3986c83O82k49j07K26l34J13J92j49J59m5j57K77k05k65N37j78k83M65m24J82
4006E4m0m85N87k30j29M75j22l42K63m11M09J58m06L95Q5l76O23l73k67L71l87
4027a48m3N29n80J90P0k34M30k76m15P05Kl49K76l67J15M08n34N21L8m57K28j34
4049b5m17O96k72n2K90l46j23L18o34K84L86k46K16q0L7K72j78l24J78j02K08
4070H6J93l36J49Rl83L65q2k73M83k30j09K37m79M83L6k77J88J30l60M26k83l13
4092c40N89m34J50L13l24J4L04n85L63%l81K57Oj04L60k65L0K05k64K79J29m51
4114a49K42K37n69K62j37o1M63m98j91N32m24J39K93j21J40n2k26L08k05q5K95
$$ plain form
3965 195 -298 230 -5 -309 24 53 -233 102 -244 -172 271 115 204 504 266 11 127 -414 185 35 -383
3986 -383 299 50 -57 169 -165 -52 140 -9 150 105 -52 225 20 -245 292 114 -169 296 -128 54
4006 54 14 -471 116 -114 -243 232 110 -232 31 -380 29 187 -219 176 261 -115 508 135 -132 239 -148
4027 -148 -191 338 -242 -52 18 -216 214 -62 -477 228 230 -119 157 -210 -95 313 -221 300 338 -119 109 -25
4049 -25 -442 254 -18 -70 220 -126 -249 69 -565 -281 105 -141 75 -5 32 304 126 -198 -20 -122 86
4070 86 279 -57 92 101 -282 83 1 -272 211 -19 -128 109 -370 113 149 -128 60 190 -170 256 -27 -340
4092 -340 249 -185 -35 278 -46 -32 272 -313 50 50 -331 -74 -68 -172 188 -77 -47 158 -106 173 302 -149
4114 -149 93 330 -239 23 -114 -175 288 -210 -401 131 -293 -154 139 18 158 106 -120 188 -17 -102 193
4135A93l01K91K00m53K69j20l47L13Pn53O38k63l6J55j76K31K01m92M73j32k06
4156a08L44k55q9L71o2l37K12l53J93L7j39J33r8J24J30n6q8K21j36k76M57n30
4178c05M55J90o59L65R9k61K03k90n5M22k22J22L5l72L13K85r09P11k23k32N64
4199B36l40k9M65m02MN66n75L32k66k12K97J14m89N06j55k38M54n04j16M27j08
4220c3J95j75j09N65l31k70L59m56K64M09o15J23M33m56L9k48n1Q80n84QJ27L8
4242A12k50L61l62L30M7k50K48j74j53L68m83R6L22j60M3J89o42K4M18k80K71
4263G5qj50L97l66J15L09k61j35K51n46K75L21m71L18l8l56M28k47L5J33n44L86
4285g9J95k48L84K8l39L32j77k32L33l25j03N96m07j93M65m49M21m87J44O4J39
$$ plain form
4135 193 -108 183 383 -70 199 79 -268 45 52 -501 137 -126 -162 -7 -183 48 249 -243 230 98 -108
4156 -108 236 -19 -108 263 201 -136 76 -277 -84 -47 -186 -53 -151 -27 103 47 -41 180 44 -232 225 -305
4178 -305 150 340 -319 46 145 -116 87 -203 -258 164 -58 64 99 -273 40 325 -584 127 -96 -328 236
4199 236 -104 -133 332 -70 -66 500 -75 257 -9 -221 76 190 -299 207 52 -186 268 -236 -352 75 -33
4220 -33 162 -13 -122 443 112 -158 201 -255 9 418 -197 -74 359 -97 -58 -306 -357 523 -61 -53 74 112
4242 112 -138 223 -139 191 238 -12 236 62 -91 277 -206 -110 212 52 95 284 -358 -334 84 -196 75
4263 75 67 -83 314 -52 63 372 111 -24 227 -319 -44 277 -194 124 86 -270 158 -89 -54 79 -465 -79
4285 -79 116 -132 252 280 -59 273 96 -136 197 -128 -231 365 -42 -235 230 -219 202 -285 -141 -77 62
4306F2m8J06j76n4L43l95K13J46k69J30j65r1M50j89j1n0j66l2M34n49J83K71
4328A43k38L48j98m46O25k33l6J71j21M5K36l29J53R2m32P1J36k76N06k90k1K78
4350A84k43J64m3l91K75L78k09J81j70j08J49K8n7J16m18J68J30l18R8K15l61
4371b32L64n5r4K41n67R0M29k24p0L42l29M53j28n24J66m5p6O72n50P5K98j46
4393I0OLl83M48j72l00O06l64N6N07n78K63K00l93J47j65l72N59Q3n17M96l58
4415a38J36Rk37K53O3m48M87L5j82K91j59k31K57k03J00Ll11N59j18j32Q8J21
4437B43k82M44o67P9M17m89K26J19k97J17M94o16L95J2l45K84j78j22M39k96l6
4458e9K86m12K23R1l40L82Jk21N22m76l6L73j49k99K29k22K77k1l41K62p3k58
$$ plain form
4306 62 14 120 -56 -110 233 -162 51 197 -72 58 -107 -198 252 63 52 2 -164 -196 238 -311 -128 143
4328 143 -95 253 55 -391 234 1 -35 136 15 60 296 -33 120 212 -220 -149 -13 -289 217 -73 -94 184
4350 184 -59 105 62 -329 -54 324 115 296 126 18 167 195 138 254 -164 4 134 -184 -86 129 -232
4371 -232 132 77 -17 224 -343 -253 176 -48 -118 224 -105 348 220 -304 -138 -183 -259 413 -137 -62 236 90
4393 90 96 99 -284 164 -8 -308 298 -66 -10 497 -81 182 382 -11 136 -29 -401 158 241 -276 220 -138
4415 -138 -2 7 -230 23 86 -362 125 160 -22 269 110 -121 136 -67 33 36 -275 284 166 34 122 243
4437 243 -39 405 -262 -183 234 -255 -29 90 -207 -90 404 -212 183 195 -150 134 -44 -166 273 -23 -59
4458 -59 227 -185 38 129 -211 171 172 -49 473 -3 -39 334 185 -114 115 -107 170 149 -192 70 -3 -261
4480b61K50k51j61N80n17J53K85j37K08n7m44O14j97l70Q03n85rL98l76jQ6k60
4502b49J86j28j67M49k66mL80l03Q3L63m72K08Q0j60J57P4l24K32k46J3K09r6
4524A9j57N19o64K46J05l81J84J25m19P85m10j28K97p6J12j4m50M96J31n34K54
4545D0j17l5M26l46l47P01l81J95j79j71J77K20m31L60J27j83L68n09K6M00m95
4566a54K57n4l13L58J4j70M45n14J75K7l77O9L45l38K52J73j40k3K11j77P5j55
4588a4k8L82n58J73K06m61J85J41l25L65k45L3L22o6l31N76m74J03K76o78M59
4609D1Qp8J07q2l60L97j21j00L73j92j25N2k88N55j62l1J82l33l2M99l52L1K04
4632A93n66L53J09k52M31l45j06J89n1k38N37l70pM45k85K6j8j99M31j69k91M32
$$ plain form
4480 -261 -11 -262 -423 157 -360 -207 78 -59 149 92 -352 262 65 -305 498 -87 -96 302 -74 -75 11 -249
4502 -249 -63 -191 -358 91 -175 -179 201 -102 -19 344 -128 80 160 0 157 231 -93 139 -107 -94 115 19
4524 19 -138 381 -283 -37 68 -313 -129 -4 -423 362 -48 -176 121 45 157 143 -307 189 320 -214 40
4545 40 -77 -112 314 -32 -379 322 -59 136 -43 -214 -37 183 -248 112 239 56 424 -85 -59 341 -154
4566 -154 103 49 -264 94 108 -62 383 -131 44 71 -306 -237 108 -230 22 195 55 32 243 66 141 -14
4588 -14 -42 340 -218 -45 161 -300 -115 26 -299 66 -179 -146 176 110 -221 355 -119 -16 260 -418 41
4609 41 49 -29 78 -4 -364 33 -88 -188 185 -7 -132 -80 -368 187 25 -6 176 -157 -189 310 -42 -11 193
4632 193 -373 -20 89 -163 268 -77 -183 6 -45 -283 254 -116 -123 322 37 63 45 -154 277 108 -183 249
4654B49k67o5L44m06J45K17m51K17N9k61L13J5k53L47k96K2M39l77L8J56m68L47
4676F4K18l69K03k24j3K94m94L82P2l03J55K84m85L46l1j92M09l84R0J65j40j18
4698g1L85m20J36Q7m10K65K4k78M37k71O5J95l29Q4M21p21L86L54m35J48J41k58
4720f5L41k13J9R8m01K35l7k64J44K78m26M20j78Rm0q1o6K71K9m0K8J48N0k16
4744D3j94J05J0l59L27l59L54M02m81l4K41o7J63k18k16M64k45J28J58l03J43
4765F2J93l95K36K7j84K82k12o7L24l65k5J19k44M40r1l21K40J54k78L79l10o4
4787a00L46l00P0K25l69J38K58m04j31L76k38J01m4K4Q6j56m7M85m69J51J15j00
4809A7M8ll71N95k69n7K96m53m0K68k76Q6Q7l9K64j37j03M42k26k48L52k82J15
$$ plain form
4654 249 -18 -83 261 -145 0 217 -234 -17 42 -219 94 109 -144 203 -93 -71 368 -9 29 185 -283 64
4676 64 282 -87 116 -108 -121 173 -321 61 133 -170 -15 269 -216 130 99 -93 316 -68 22 187 47 -71
4698 -71 314 -106 30 117 -293 -28 -4 -282 155 -116 -51 144 -185 -101 320 -401 -15 339 -96 52 193 -65
4720 -65 276 63 82 180 -221 14 -23 -287 -143 135 -291 129 -49 -40 -80 -161 -227 44 73 33 61 209 259 43
4744 43 -151 -46 -36 -395 -68 -427 -73 329 -152 -186 55 -12 151 -67 -283 181 -64 64 222 -81 62
4765 62 255 -140 96 123 -61 221 9 -58 266 -99 -124 -5 -249 191 100 -221 19 173 -105 274 -36 -100
4787 -100 246 -54 16 241 -128 10 268 -136 -267 109 -129 -28 -72 -48 38 -118 -165 320 -149 2 117 17
4809 17 65 62 -309 286 17 -40 256 -197 -237 31 -245 -159 -72 -111 153 16 -87 355 129 -119 233 -49 66
4832F6j3j56Q5J84m09N54m58r5M00j83M6K63m73P7M68m84M23m19K2L49j77l51
4854b81L93O0k02J84l05L12o9j4J35j25l10L37j80p5K84k63J77K74n73L74Q3j64
4876E2K68q2l23L62j91k80L95l60N1M46p17M95j49k32K44K6n6K56l76J30J23j73
4898i1J24J02l56L60J19m76K15J2j19J49k51P4L22n01J37L25j32m3J97l11N54
4919D10l73j05J90l62L9L07j77j47J57l66K53J41j33K58M3k28J87j10M7L44l08
4940F7k04M01m25K55m2l94N37k04j60K81m00L67M8k78NL05k88L12j85j06M34n17
4962a91K86K70l66LJ54l53K34J90l76L00mj70J74l05q4L15j58l0N05n80K26r1
4984e1j58L85k53p2L14m80J41L46k17R7K43n37L47J17l91K58m1r5R0n5q0L00k75
$$ plain form
4832 66 53 -103 -18 166 -243 311 -147 -242 158 -25 21 284 -189 -112 356 -128 295 -124 -102 247 70 -281
4854 -281 112 172 -30 154 -151 161 92 78 213 88 -222 115 -65 -140 144 -119 58 332 -241 133 216 52
4876 52 320 238 -85 277 86 -194 201 -159 -108 338 -379 116 -33 -265 -21 5 -51 205 -171 -41 82 -91
4898 -91 33 135 -221 139 258 -218 -3 9 -110 39 -212 -138 184 -317 -180 145 13 -30 167 -144 410
4919 410 37 -68 122 -240 -201 106 -71 -218 -61 -427 -174 -33 -166 92 135 -93 94 -16 31 375 67
4940 67 -137 264 -161 94 52 -342 195 -9 -169 112 -288 79 127 -151 -146 159 -129 183 -2 -108 326 -191
4962 -191 95 365 -1 2 156 -197 37 227 -149 151 147 -23 151 -154 -238 77 -81 -111 394 -186 40 -51
4984 -51 -209 176 -77 -149 165 -315 -174 172 -45 52 295 -242 105 222 -169 89 48 -47 43 -12 -92 208 -67
5007f7NK02k86J47J50l06L61l02k93M99k03J72j03p6m6R0n9J44Q6k35K09K75j72
5030A92L9k43K71L0m16k7K56l65L78p3l00L51k64K2K43n7k8J16l79L26J09j27
5052E4MJ55l65L40k56m0L72m50K21J03l31J78K8l06J58R8j91L70l33J05N91n11
5074fj48L93l36P6J74j05K26k89k31N12l02K6L40m68J66M8m51L84K5j28L94l43
5096d3R4rk28J1J64j08J66J20m55M46j64j03K05k19q6K68q2j1J03l25M77r2m25
5119b96M96j60J68K9k75n0K69k27J50Ql70M01l58l8M71j48j74R2l6m0K04k64K41
5142I3L8j54L61j72k63J95J88l33N7q9j9J29j8Mj27n4L37k53j84M91j59q7M5j52
5166a26m0L82l71J53J91k00J16Pl4j54P1P9l51J0M92k07k71L50N4k89K69l5k07
$$ plain form
5007 -67 -62 140 -146 1 151 -155 206 -96 -389 110 -93 79 -24 -100 -146 -56 -115 29 115 -120 89 364 192
5030 192 231 -12 259 289 -127 -154 102 -263 115 42 -258 93 -171 -149 94 37 9 125 -254 72 181 54
5052 54 58 213 -152 188 -68 -108 264 -186 35 138 -193 -15 13 -293 -135 -37 -228 142 -191 -86 505 -6
5074 -6 -154 239 -97 -21 153 48 274 -15 -246 266 -36 -10 330 -138 28 76 -375 9 34 -94 300 -43
5096 -43 51 42 -186 -175 -11 -119 47 167 -288 158 -6 -109 96 -123 -209 59 -23 -34 69 -256 221 129 -296
5119 -296 200 40 208 237 -38 -88 181 -46 104 112 -258 143 -215 -253 218 70 -104 -12 -48 -88 116 -148 93
5142 93 131 -23 338 166 -97 98 286 -47 10 -79 -98 31 13 17 -110 -164 173 -80 -264 227 68 -19 26 -126
5166 -126 -166 216 -155 -2 189 -11 105 112 78 -76 -5 74 -277 -267 225 18 -253 97 151 -138 131 96 -111
5189a11L70k88J35n2k10K54k43NJ09J86m26M55j67LJ21l39K78J01m14L47L6k78
5211a28M24k59k43J59n2l5J00j82K8P8q0L59j32k67L41j24r9L68k41n0K86l45
5233i4K67q8l14K88ol38L91j63r6M16l39J93J10k34J15J23o29M92j11o6J43k47
5255a87K66M31m21o7J19k18J30J91m69K36k25O8L64m48J98J31j17NJ84l78K08
5276AJ14k26K92j15j60J7j5L06j93Kk41K58j52J65J18l08J48N3k27M11m05J10
$$ plain form
5189 -111 259 -29 106 54 -156 98 -145 -140 -31 155 -271 184 17 20 141 -198 80 181 -233 114 150 -128
5211 -128 296 37 -206 -47 -99 -134 -34 -216 -188 -110 -190 169 37 -230 111 -13 -112 256 15 -35 251 -94
5233 -94 173 85 -229 59 53 -285 106 -57 -153 263 -76 117 227 -7 108 231 -398 94 -17 -83 60 -187
5255 -187 79 510 89 22 141 -77 53 244 -225 11 -214 -146 218 -230 -32 99 -18 -13 171 -207 1
5276 1 115 -111 181 66 -94 -77 -92 214 21 23 -218 40 -112 53 171 -137 11 64 -163 248 -157 -47
$$ [...]
8191B38
##END NTUPLES=NMR FID
##END=
