##TITLE=1H_12-2023
 CDCl3
 8 sc, 
 13.3.2023
##JCAMPDX= 6.0         $$ Bruker NMR JCAMP-DX V2.0
##DATA TYPE= NMR FID
##DATA CLASS= NTUPLES
##ORIGIN= UXNMR, Bruker Analytische Messtechnik GmbH
##OWNER= root
$$ XWIN-NMR		Version 3.5
$$ Mon Mar 13 14:11:07 2023 Russian Standard Time (UT+4h)  she@DPX200
##.OBSERVE FREQUENCY= 200.13135
##.OBSERVE NUCLEUS= ^1H
##.DELAY= (6, 6)
##.ACQUISITION MODE= SIMULTANEOUS
##.ACQUISITION SCHEME= undefined
##.AVERAGES= 8
##.DIGITISER RES= 18
##SPECTROMETER/DATA SYSTEM= spect
##.PULSE SEQUENCE= zg30
##.SOLVENT NAME= CDCl3
##.SHIFT REFERENCE= (INTERNAL, CDCl3, 0, 15.7039)
##AUDIT TRAIL= $$ (NUMBER, WHEN, WHO, WHERE, WHAT)
$$ ##TITLE= Audit trail, XWIN-NMR		Version 3.5
$$ ##JCAMPDX= 5.01
$$ ##ORIGIN= Bruker BioSpin GmbH
$$ ##OWNER= she
$$ F:/spectra/data/she/nmr/H-F/1/audita.txt
$$ ##AUDIT TRAIL=  $$ (NUMBER, WHEN, WHO, WHERE, WHAT)
(   1,<2023-03-13 14:09:49.15 +0400>,<she>,<DPX200>,
      <created by zg, POWCHK disabled, PULCHK disabled
       configuration hash MD5:
       00 E9 B6 7A A2 85 ED C7 34 08 36 98 17 FE 4E 26
       data hash MD5: 16K
       FF 6B F6 D0 03 C1 C0 D4 91 21 FD 11 28 68 A7 AA>)
$$ ##END=
$$ 
$$ hash MD5
$$ BC 98 D8 D9 0F CF DC 5C B5 14 36 B1 21 EA F5 FA
##$RELAX= 
##$RELAX= 
##$RELAX= 
##$RELAX= 
##$RELAX= 
##$RELAX= 
$$ Bruker specific parameters
$$ --------------------------
##$DU= <F:/spectra>
##$EXPNO= 1
##$NAME= <H-F>
##$PROCNO= 1
##$TYPE= <nmr>
##$USER= <she>
##$AMP= (0..31)
100 100 100 100 100 100 100 100 100 100 100 100 100 100 100 100 100 100 
100 100 100 100 100 100 100 100 100 100 100 100 100 100 
##$AQSEQ= 0
##$AQ_mod= 1
##$AUNM= <au_zg>
##$AUTOPOS= <>
##$BF1= 200.13
##$BF2= 200.13
##$BF3= 200.13
##$BF4= 200.13
##$BF5= 200.13
##$BF6= 200.13
##$BF7= 200.13
##$BF8= 200.13
##$BYTORDA= 1
##$CFDGTYP= 0
##$CFRGTYP= 5
##$CHEMSTR= <none>
##$CNST= (0..31)
1 1 145 1 1 1 1 1 1 1 1 1 1 1 1 1 1 1 1 1 1 1 1 1 1 1 1 1 1 1 1 1 
##$CPDPRG= <>
##$CPDPRG1= <>
##$CPDPRG2= <>
##$CPDPRG3= <>
##$CPDPRG4= <mlev>
##$CPDPRG5= <mlev>
##$CPDPRG6= <mlev>
##$CPDPRG7= <mlev>
##$CPDPRG8= <mlev>
##$CPDPRGB= <>
##$CPDPRGT= <>
##$D= (0..31)
0 1.2 0 0 0 0 0 0 0 0.06 0 0.03 0 0 0 0 0.0002 0 0 0 0 0 0 0 0 0 0 0 0 
0 0 0 
##$DATE= 1678702188
##$DBL= (0..7)
120 120 120 120 120 120 120 120 
##$DBP= (0..7)
150 150 150 150 150 150 150 150 
##$DBP07= 0
##$DBPNAM0= <>
##$DBPNAM1= <>
##$DBPNAM2= <>
##$DBPNAM3= <>
##$DBPNAM4= <>
##$DBPNAM5= <>
##$DBPNAM6= <>
##$DBPNAM7= <>
##$DBPOAL= (0..7)
0.5 0.5 0.5 0.5 0.5 0.5 0.5 0.5 
##$DBPOFFS= (0..7)
0 0 0 0 0 0 0 0 
##$DE= 6
##$DECBNUC= <off>
##$DECIM= 32
##$DECNUC= <off>
##$DECSTAT= 4
##$DIGMOD= 1
##$DIGTYP= 9
##$DL= (0..7)
0 120 120 120 120 120 120 120 
##$DP= (0..7)
150 150 150 150 150 150 150 150 
##$DP07= 0
##$DPNAME0= <>
##$DPNAME1= <>
##$DPNAME2= <>
##$DPNAME3= <>
##$DPNAME4= <>
##$DPNAME5= <>
##$DPNAME6= <>
##$DPNAME7= <>
##$DPOAL= (0..7)
0.5 0.5 0.5 0.5 0.5 0.5 0.5 0.5 
##$DPOFFS= (0..7)
0 0 0 0 0 0 0 0 
##$DQDMODE= 0
##$DR= 18
##$DS= 0
##$DSLIST= <SSSSSSSSSSSSSSS>
$$ [...]
##$SUBNAM2= <"">
##$SUBNAM3= <"">
##$SUBNAM4= <"">
##$SUBNAM5= <"">
##$SUBNAM6= <"">
##$SUBNAM7= <"">
##$SUBNAM8= <"">
##$SUBNAM9= <"">
##$SW= 18.05172834244
##$SWIBOX= (0..15)
0 0 2 0 0 0 0 0 0 0 0 0 0 0 0 0 
##$SW_h= 3612.71676300578
##$TD= 16384
##$TD0= 1
##$TE= 0
##$TE2= 300
##$TE3= 300
##$TEG= 300
##$TL= (0..7)
0 120 120 120 120 120 120 120 
##$TP= (0..7)
150 150 150 150 150 150 150 150 
##$TP07= 0
##$TPNAME0= <>
##$TPNAME1= <>
##$TPNAME2= <>
##$TPNAME3= <>
##$TPNAME4= <>
##$TPNAME5= <>
##$TPNAME6= <>
##$TPNAME7= <>
##$TPOAL= (0..7)
0.5 0.5 0.5 0.5 0.5 0.5 0.5 0.5 
##$TPOFFS= (0..7)
0 0 0 0 0 0 0 0 
##$TUNHIN= 0
##$TUNHOUT= 0
##$TUNXOUT= 0
##$USERA1= <user>
##$USERA2= <user>
##$USERA3= <user>
##$USERA4= <user>
##$USERA5= <user>
##$V9= 5
##$VALIST= <valist>
##$VCLIST= <CCCCCCCCCCCCCCC>
##$VD= 0
##$VDLIST= <DDDDDDDDDDDDDDD>
##$VPLIST= <PPPPPPPPPPPPPPP>
##$VTLIST= <TTTTTTTTTTTTTTT>
##$WBST= 1024
##$WBSW= 4
##$XGAIN= (0..3)
0 0 0 0 
##$XL= 0
##$YL= 0
##$YMAX_a= 366310
##$YMIN_a= -379807
##$ZGOPTNS= <>
##$ZL1= 120
##$ZL2= 120
##$ZL3= 120
##$ZL4= 120
##$ABSF1= 10
##$ABSF2= 0
##$ABSG= 5
##$ABSL= 3
##$ALPHA= 0
##$AQORDER= 0
##$ASSFAC= 0
##$ASSFACI= 0
##$ASSFACX= 0
##$ASSWID= 0
##$AUNMP= <proc_1d>
##$AZFE= 0.1
##$AZFW= 0.1
##$BCFW= 1
##$BC_mod= 2
##$BYTORDP= 1
##$COROFFS= 0
##$CY= 11.3945322036743
##$DATMOD= 1
##$DC= 2
##$DFILT= <>
##$DTYPP= 0
##$F1P= 2.36226072786647
##$F2P= -0.459571619588291
##$FCOR= 0.5
##$FTSIZE= 0
##$FT_mod= 4
##$GAMMA= 1
##$GB= 0.15
##$INTBC= 1
##$INTSCL= 1
##$ISEN= 128
##$LB= 0.24
##$LEV0= 0
##$LPBIN= 0
##$MAXI= 10000
##$MC2= 0
##$MEAN= 0
##$ME_mod= 0
##$MI= 1.114404
##$NCOEF= 0
##$NC_proc= 0
##$NLEV= 6
##$NOISF1= 3.799351
##$NOISF2= 2.8
##$NSP= 1
##$NTH_PI= 0
##$NZP= 0
##$OFFSET= 15.70392
##$PC= 1
##$PHC0= -19104.69
##$PHC1= 12.80074
##$PH_mod= 1
##$PKNL= yes
##$PPARMOD= 0
##$PSCAL= 0
##$PSIGN= 0
##$REVERSE= no
##$SF= 200.130013532006
##$SI= 16384
##$SIGF1= 3
##$SIGF2= 2
##$SINO= 400
##$SIOLD= 16384
##$SREGLST= <1H.CDCl3>
##$SSB= 0
##$STSI= 0
##$STSR= 0
##$SW_p= 3612.71676300578
##$SYMM= 0
##$S_DEV= 0
##$TDeff= 0
##$TDoff= 0
##$TI= <>
##$TILT= no
##$TM1= 0
##$TM2= 0
##$TOPLEV= 0
##$USERP1= <user>
##$USERP2= <user>
##$USERP3= <user>
##$USERP4= <user>
##$USERP5= <user>
##$WDW= 1
##$XDIM= 8192
##$YMAX_p= 0
##$YMIN_p= 0
$$ End of Bruker specific parameters
$$ ---------------------------------
##NTUPLES= NMR FID
##VAR_NAME=  TIME,          FID/REAL,        FID/IMAG
##SYMBOL=    X,             R,               I
##VAR_TYPE=  INDEPENDENT,   DEPENDENT,       DEPENDENT
##VAR_FORM=  AFFN,          ASDF,            ASDF
##VAR_DIM=   8192,          8192,            8192
##UNITS=     SECONDS,       ARBITRARY UNITS, ARBITRARY UNITS
##FACTOR=    0.0002768,     1,               1
##FIRST=     0,             0,               0
##LAST=      2.2672688,     0,               0
##MIN=       0,             -379807,         0
##MAX=       2.2672688,     366310,          0
$$ Real data points
##PAGE= N=1
##DATA TABLE= (X++(R..R)), XYDATA
0@%%%%%%%%qJ6j6J6k4L2l3M1n6P2q8J04j24J48j76K09k49K93l41L95m54N24o02
$$ 0 0 0 0 0 0 0 0 0 -8 8 -8 8 -16 16 -17 24 -32 40 -48 56 -68 80 -96 113 -136 157 -184 211 -243 281 -321
31c21O87p82Q86j001J129j269J424j595J780j983K208k454K719l007L324l671
$$ -321 366 -416 470 -531 598 -671 753 -842 938 -1045 1163 -1291 1428 -1579 1745 -1926
47a926M052m466M920n420N970o580P256q010Q858r816J0910j2175J3653j5407
$$ -1926 2126 -2340 2580 -2840 3130 -3450 3806 -4204 4654 -5162 5748 -6427 7226 -8181
61h181J7532k0168K3535k8009L4279m3764N9931r4658K96531k60698k72874O62854
$$ -8181 9351 -10817 12718 -15291 18988 -24776 35155 -59503 237028 -23670 -296544 366310
73C66310l57266l88851M96341J70184m84358J77067K76043l37891j05997L55723
$$ 366310 9044 -379807 116534 286718 -197640 -20573 255470 -82421 -188418 167305
83A67305j00682j70163J94429M130k38778M5504J18968q5008l2472K12592n252
$$ 167305 66623 -103540 90889 95019 -143759 -98255 20713 -64295 -96767 115825 110573
94A10573k31769J09241J35710k97370J2765L49222j76954k43017L41141L9542
$$ 110573 -121196 -11955 123755 -173615 -160850 188372 11418 -231599 109542 149084
104A49084m17707J94430L55350l66506q6185M26535k17186l17928L46718N5230
$$ 149084 -268623 -74193 281157 -85349 -171534 255001 37815 -280113 66605 121835
114A21835k89500J86798J70757k40141j8716J55606j21637m0014J78041m5447
$$ 121835 -167665 19133 189890 -50251 -68967 86639 -34998 -75012 103029 57582
124E7582q4274J05105o4273j21986R8356M5350n5889M6957O8413m4609j04249
$$ 57582 -26692 78413 14140 -107846 -9490 35860 -20029 26928 95341 50732 -53517
135e3517K0068P6376q6557k3295J61713l1460j61571Q0272P7855j54219J7890
$$ -53517 -33449 42927 -43630 -66925 94788 63328 -98243 -17971 59884 -94335 -76445
146g6445K02429q3963j14170J48091n9027j71314J33256M5310j06917J22281N9754
$$ -76445 125984 42021 -72149 75942 16915 -154399 -21143 24167 -82750 39531 99285
157I9285j40124L8815O6998j32808Q163J46202q7152p8513J47268l6658j39218
$$ 99285 -40839 -2024 64974 -67834 -59671 86531 -621 -79134 68134 31476 -107742
168a07742J25385O6150j13646L7567P0897p7047n4667L7445K2356l4436O086O1224
$$ -107742 17643 83793 -29853 7714 78611 1564 -53103 -15658 6698 -27738 -21652 39572
180C9572j4478m9015K7221J9288l9569k86M7422l1190m6850N6876j2608n8896
$$ 39572 25094 -23921 3300 22588 -16981 -17267 30155 -1035 -47885 8991 -3617 -62513
192f2513R4714K1291r4094P1563L0849j31246L1550R4822q4425j7393J21190m1984
$$ -62513 32201 53492 -40602 30961 61810 -69436 -37886 56936 -27489 -44882 76308 34324
204C4324j04847Q6956K5992j08432O4132P8964q9001n25N0846o4129k0138M9506
$$ 34324 -70523 16433 42425 -66007 -1875 77089 -11912 -12437 38409 -25720 -45858 3648
216C648M40r173K9235O787m1236o038K1910k5413N79M3241l875k6673K780J3442
$$ 3648 4088 -5085 24150 30937 -10299 -16337 5573 -19840 -19261 23980 20105 -6568 -3788 9654
230I654k4570k6252N8035J8794o3537M0857L8192q8708K42O8445m5413k7045P0973
$$ 9654 -14916 -41168 16867 35661 -27876 12981 51173 -37535 -37293 31152 -14261 -41306 29667
243B9667k187o1872L7705L0799o7980J9223N4505o2001O22N8289n0140j5940N8099
$$ 29667 27480 -34392 3313 34112 -33868 -14645 39860 -22141 -21519 36770 -13370 -29310 28789
256B8789k0638l4105L8320J4593m6079N754M6885l2938k7939M7586p409m0384
$$ 28789 8151 -25954 12366 26959 -19120 -13366 33519 581 -27358 20228 12819 -27565
268b7565K2586K2741j6194j3320K4344R879m4060N127L4862l4612l119M3101j8067
$$ -27565 -4979 17762 1568 -11752 12592 22471 -21589 -16462 18400 -16212 -19331 23770 5703
281E703j9399K2665n356k4416J6827K1836k5636O627L5382m2452j6337M8843l0154
$$ 5703 -13696 8969 3613 -20803 -3976 17860 -7776 -1149 34233 -8219 -24556 24287 -5867
294e867k5819N6706j224l9049K2436J8460l7565j3794L8807o247l0446L3105R662
$$ -5867 -31686 25020 23796 -15253 7183 25643 -11922 -25716 13091 6844 -23602 9503 19165
307A9165l4404R844Q823j3957J830N545O425l367m874Q316j1056k817J3724j2322
$$ 19165 -15239 -5395 3428 -10529 -8699 -3154 3271 -96 -4970 3346 -7710 -10527 3197 -9125
321i125N087J8135j3538m625J1935k557j5440L634K5457j4945j5574L6739j0043
$$ -9125 -4038 14097 559 -4066 7869 5312 -10128 -6494 18963 4018 -11556 25183 15140
334A5140l6780K6861P087k8150J2471K1183r286j0763J1489o46k2572O740P579
$$ 15140 -21640 5221 12308 -15842 -3371 17812 8526 -2237 9252 8606 -13966 -7226 353
347C53j4646J5221N936j4081J5253j769j8423J0573L670r673k030Q901M143j7220
$$ 353 -14293 928 6864 -7217 8036 6267 -12156 -1583 2087 -7586 -9616 -715 3428 -13792
361a3792M081J8633j4893k259J9716l548j0231k839N240m666j6990J7669J4414
$$ -13792 -9711 8922 -5971 -8230 11486 7938 -2293 -5132 108 -4558 -21548 -3879 10535
374A0535j5653J4542J1476j7458O57j525q767M807K126P40M966P385l675j2351
$$ 10535 -5118 9424 20900 3442 4099 2574 -6193 -1386 740 1480 6446 13831 10156 -2195
388b195J4821J146k5346J9738J1548l0647O780J4719j7188m361J2562N519j0320
$$ -2195 12626 13772 -11574 8164 19712 -10935 -4155 10564 -6624 -10985 1577 7096 -3224
401c224j860J1284j2010r985R258l925o82M301k548P732l505n078Q294n409R56
$$ -3224 -5084 6200 -5810 -15795 -6537 -10462 -11144 -6843 -9391 -1659 -5164 -10242 -1948 -7357 -6401
416f401M059p647J2407J721j3629J4662N529j8266K448J5435m623j2182K0164
$$ -6401 -2342 -9989 2418 4139 -9490 5172 10701 -7565 -5117 10318 5695 -6487 13677
429A3677J3790k9025M672J9564k9424m022K3735r042j644J1885l063n281m234
$$ 13677 27467 -1558 3114 22678 -6746 -10768 12967 3925 2281 14166 11103 5822 1588
442A588j81j173N95M878p175k00K941j5654M597J3974n469N709M336m930o140
$$ 1588 1407 234 829 5707 -1468 -1668 1273 -14381 -9784 4190 -1279 4430 8766 3836 -2304
457b304j7799L778J0886j3528J1348K2923j3542j0176J0964j955j7163N854J9260
$$ -2304 -20103 -16325 -5439 -18967 -7619 15304 1762 -8414 2550 595 -16568 -10714 8546
470H546j4843o542J9414j3290n757K0688o308K846J2736j6237l813P964j2277
$$ 8546 -6297 -12839 6575 -6715 -12472 8216 1908 4754 17490 1253 -2560 5404 -6873
483f873k432J6898N710j2174N187J2610j9948m796J9827q927o473P362o285r73
$$ -6873 -9305 7593 13303 1129 6316 18926 -1022 -5818 14009 5082 -1391 5971 -314 -1287
497a287m650j174J7158m973q173J2344q011j5471N230P647j455M36J0553n119
$$ -1287 -5937 -7111 10047 5074 -3099 9245 1234 -14237 -9007 -1360 -2815 -2379 8174 3055
511C055j2032N769n873K28K0843r778j634J9867k5360j5505K6453n437j3779K3282
$$ 3055 -8977 -3208 -9081 -8853 11990 2212 578 20445 -4915 -20420 6033 596 -13183 10099
525A0099J0725k3483o161J6732j3158r819K5097K48j1570O020j0849n719N797
$$ 10099 20824 -2659 -8820 7912 -5246 -15065 10032 10280 -1290 4730 -6119 -11838 -6041
538f041o363J3610J2730j2499M83J120j2964l578O610P672N47N43J874n263L65
$$ -6041 -12404 1206 13936 1437 1920 3040 -9924 -13502 -6892 780 1327 1870 3744 -1519 -1154
553a154m018K22J9789r585j4893K3816j1931k6659K7775J0040k0185J2934J4665
$$ -1154 -5172 -4950 14839 5254 -9639 14177 2246 -24413 3362 13402 -6783 6151 20816
566B0816j8957j1038J3542k453r752J5939L86j1726J0372r032p595K0576o762
$$ 20816 1859 -9179 4363 1910 -7842 8097 8483 -3243 7129 -1903 -9498 11078 4316
579D316p930J8569r173j7888P699M303n222K180J1546K38j2254k019Q56q54l16
$$ 4316 -3614 14955 5782 -12106 -4407 -104 -5326 -3146 8400 8638 -3616 -5635 -4779 -5633 -5949
594e949j019J5031j742k3504J3333O254k5042J6547J9777j7038R31R971j3478
$$ -5949 -6968 8063 6321 -17183 -3850 2404 -22638 -6091 13686 -3352 -2421 7550 -5928
607e928o424J0323J935k193J2878k784j4668J3523l497j8382K5233P476k3104
$$ -5928 -12352 -2029 -94 -2287 10591 7807 -6861 6662 3165 -15217 10016 17492 -5612
620e612J3976O439k2690R46J2615j565m084O648L287j0454l586K297j47M467l525
$$ -5612 8364 14803 -7887 -6941 5674 4109 25 6673 9960 -494 -4080 -1783 -1930 2537 -988
635i88J576Q122j6173k290J5341j1754J499J5370j0662k656N098r670N72R619
$$ -988 588 8710 -7463 -9753 5588 -6166 -4667 10703 41 -2615 2483 -7187 -6615 3004
649C004k873k948J0888l274j7806J1975R604k1532J2460J8367k4681o78J5079
$$ 3004 131 -2817 8071 4797 -13009 -1034 8570 -12962 -502 17865 -6816 -7494 7585
662G585j5188j930J3310r71k470K801k137o383J784L107m621Q835L906j1963N847
$$ 7585 -7603 -9533 3777 2806 336 3137 1000 -5383 -3599 -492 -5113 3722 7628 -4335 1512
677A512J292j1178Q016L709k455O152o299j598M596r924J262J1967l896n690P547
$$ 1512 2804 -8374 -358 3351 896 7048 749 -849 3747 -6177 -4915 7052 3156 -2534 5013
692E013J744j4331J982J4984j2381k313J7911j3309p062J3789j0117j587J3303
$$ 5013 6757 -7574 -5592 9392 -2989 -5302 12609 -700 -7762 6027 -4090 -5677 7626
705G626o590l481Q716m764r265O735P539j1470K209J3569j3513n128J2536o622
$$ 7626 1036 -2445 6271 1507 -7758 -1023 6516 -4954 -2745 10824 -2689 -7817 4719 -1903
719a903k959O921j944J966m227l904P320m735l650R000N08n154N71L651k508m923
$$ -1903 -4862 2059 115 2081 -2146 -6050 1270 -3465 -7115 1885 2393 -2761 -2190 1461 -1047 -5970
735e970P940J37n244Q676n000m607J1924q229m013J6216p245r371J2301k16j2581
$$ -5970 1970 2107 -3137 5539 539 -4068 7856 -373 -4386 11830 4585 -4786 7515 7299 -5282
750e282L758J1173q628p049J4692l871j2427J0637p66p648N677k497r65L878n584
$$ -5282 -1524 9649 1021 -6028 8664 4793 -7634 3003 2237 -5411 266 -2231 -3196 682 -4902
765d902K243L174m094l2J011J611k004k393N805m33l465K946k49K213k857l357
$$ -4902 -2659 515 -3579 -3611 -2600 -989 -2993 -5386 419 -14 -3479 -533 -782 1431 -1426 -4783
781d783J1532m750j0458J5316p62j3652R718O126r610n48Q690k239r136P295L204
$$ -4783 6749 1999 -8459 6857 6095 -7557 2161 8287 -1323 -1871 6819 4580 -4556 2739 5943
796E943r641O775K538p493O986j784p551Q141j632o662N608K615l330l071M568
$$ 5943 -3698 3077 5615 -1878 5108 3324 -4227 3914 2282 -4380 1228 3843 513 -2558 2010
811B010J468r720L127O109p203j0L472M68q89n161O408J965j1563O690O619j0133
$$ 2010 3478 -6242 -3115 2994 -4209 -4219 -747 -279 -1168 -6329 79 2044 -9519 -2829 3790 -6343
827f343K377O064m246q97K668K011j952J185K651n195L238J955q775Q579N221
$$ -6343 -3966 2098 -2148 -3045 -377 1634 -318 867 3518 -1677 1561 3516 -5259 3320 8541
842H541j2137Q189O320j1988j48N715l211n525M220O743o782j812P419n709l655
$$ 8541 -3596 4593 10913 -1075 -1223 4492 1281 -4244 -24 6719 -63 -1875 5544 -165 -3820
857c820L433k342K033j905j645O186m284k468O317k789l67K214k622K435j052
$$ -3820 -387 -2729 -696 -2601 -4246 1940 -2344 -4812 1505 -1284 -1651 563 -2059 376 -676
872f76k945L192J382m01j413M514L683j0060K432Q779j3113o03J2848p028l434
$$ -676 -3621 -429 953 552 -861 3653 7336 -2724 -292 8487 -4626 -5229 7619 591 -2843
887b843Q612q56n288k56L222l497l243N426j544j296M975n706J042L722p423J780
$$ -2843 5769 4913 -375 -631 2591 -906 -4149 1277 -267 -1563 3412 -2294 -1252 2470 -4953 -3173
903c173N107m404J10J489k3n71m006M954K177n908K773L268l139l697J486N981
$$ -3173 1934 -2470 -2360 -871 -894 -1465 -5471 -517 1660 -4248 -1475 1793 -1346 -5043 -3557 2424
919B424m919k240J2159n000p380R416l149n876O268N58l51K594J7q83n24J173
$$ 2424 -2495 -4735 7424 2424 -4956 4460 1311 -4565 1703 2261 1910 4504 4521 3638 3114 4287
935D287m191o79P588n963k461J0723n852o371Q523k549n142J672J063j74m268
$$ 4287 96 -583 7005 1042 -1419 9304 3452 -2919 5604 3055 -2087 -415 648 474 -3794
950c794J098L850m328j095L349q01o34k402K799K44p136M412K929n863N906K343
$$ -3794 -2696 1154 -3174 -4269 -920 -1721 -2355 -4757 -1958 -1714 -8850 -4438 -1509 -7372 -1466 877
966H77l414M981k831m474M557j729l170N373N023l653k397Q291l754j0274J0174
$$ 877 -2537 2444 -387 -4861 -304 -2033 -5203 170 5193 1540 -857 7434 3680 -6594 3580
981C580J898r287Q476K326o649J301n78m8P83l08K906o38j249j698k834K520j027
$$ 3580 5478 -3809 4667 6993 344 1645 1067 1019 1802 1494 4400 3762 2513 815 -2019 501 -526
998e26j201O766j780k909K441m813K29J021l778O961K30p360N335J157p982J288
$$ -526 -1727 5039 3259 350 2791 -2022 -1793 -772 -4550 2411 2641 -4719 616 1773 -6209 -4921
1014d921O169k033m968O310K601j0334M069N710q834L915M318o551M017J360m021
$$ -4921 1248 -785 -5753 557 3158 -7176 -3107 2603 -6231 -2316 2002 -4549 -532 828 -3193
1029c193M138J291l008L1K393j243l812N617K690o392L498K097n746J190Q95R18
$$ -3193 945 2236 -772 -741 1652 409 -3403 2214 4904 -1488 2010 4107 -1639 -449 446 1364
1045A364L020m485K093L008r474O72O610l096r8N405J41o193j432L139m911K238
$$ 1364 4384 -101 1992 5000 -4474 -3802 2808 -288 -386 5019 5160 -1033 -2465 674 -4237 -1999
1061a999P669m528J375L012j0243J861N255p230M739P521n249m197K499j272o292
$$ -1999 5670 1142 2517 5529 -4714 -2853 2402 -4828 -89 7432 2183 -2014 485 -787 -7079
1076g079K906Q242l825j238M664n902k165J153j091N110p21k725M958l368m285
$$ -7079 -4173 4069 244 -994 3670 -2232 -4397 -3244 -4335 775 54 -2671 2287 -1081 -5366
1091e366M615P81p62K140J122j235k829Q47k74L71M811l320Q9O004q221j079R987
$$ -5366 -751 30 -732 1408 2530 1295 -1534 -687 -961 -590 4221 901 990 6994 -1227 -2306 7681
1108G681p142l231Q013l844o304M128M134k837l48N698m457n297K859l483K67
$$ 7681 539 -2692 5321 1477 -4827 -699 3435 598 250 5948 1491 -3806 -947 -4430 -4163
1123d163O314k894L209K746q792j5K517l120K666L691N01j864l497l8l65K3L631
$$ -4163 2151 -743 2466 5212 -3580 -3595 -1078 -4198 -1532 2159 2660 796 -2701 -2739 -3104 -3081 550
1140E50K280K578m086n666M289m161m222J2596J699n480N531k281p849K15K496
$$ 550 2830 5408 1322 -4344 -55 -4216 -8438 4158 5857 377 5908 3627 -4222 -4007 -1511
1155a511R68K072L711o04l825J472l825j842P767l049k704P537n936n303N511
$$ -1511 -543 1529 5240 4636 811 2283 -1542 -3384 4383 1334 -1370 6167 231 -5072 439
1170D39j92r77K088J032j112m648r79J738q47J656J111J861n25n397L118K658
$$ 439 247 -730 1358 2390 1278 -3370 -4349 -2611 -3458 -1802 -691 1170 645 -4752 -1634 1024
1186A024o109M423L883o542J623J508k206L915J884l7R65j849m213k005L912K56
$$ 1024 -5085 -662 3221 -3321 -1698 -190 -2396 1519 3403 3366 4331 2482 -1731 -3736 176 432
1202D32j372R388k52r585L982j055p855N026M024r34Q56r69j777k504j730L294
$$ 432 -940 8448 8196 -1389 2593 1538 -6317 -1291 2733 1799 2655 1686 -91 -2595 -4325 -1031
1218a031J993J619j390k831O12m623j873P638K83M22M646m200k954k034l042M053
$$ -1031 962 2581 1191 -1640 -1028 -5651 -7524 114 397 819 5465 1265 -1689 -3723 -6765 -2712
1234b712K412q36M997J085m540l164K706O98n004M880N069p378J200M586n409
$$ -2712 -300 -1136 3861 4946 406 -2758 -52 646 -4358 522 5591 -1787 -587 3999 -1410
1249a410J572L726k165O36j148k408J051j12K6R30K521K03m543K469J318o515
$$ -1410 162 3888 1723 2359 1211 -1197 -146 -258 -232 698 3219 3422 -1121 1348 2666 -3849
1265c849L298K126m241Q81L51p5J571j786L056J190o019o99J604k074l28L319
$$ -3849 -551 1575 -2666 -1785 -1434 -1509 62 -1724 1332 2522 -3497 -4196 -2592 -4666 -4994 -1675
1281a675N341k543j615L320m980k545M394j152J915M044l343J064N36m234J478
$$ -1675 3666 1123 -492 2828 -2152 -4697 -303 -1455 460 4504 1161 2225 2761 -1473 5
1296EL849m07j739J361J310o428o66O258l249k62N483k801k251q63k404J272r66
$$ 5 3854 3447 1708 3069 4379 -2049 -2715 3543 294 32 5515 2714 463 -400 -2804 -1532 -2498
1313b498L27M944j761j901R81j505j478j301K016J588k012K138J215k315J582
$$ -2498 -2171 2773 1012 -889 92 -1413 -2891 -4192 -2176 -588 -2600 -462 753 -1562 20
1328B0j787p68L295l724j47N164l451j004M072m53k491J59L690j900k973M741
$$ 20 -1767 -2535 760 -2964 -3111 2053 -1398 -2402 1670 1217 -1274 -1115 2575 675 -2298 2443
1344B443j130l661L434n14o19L566j555J053J387m111l92L37r92M17J417L153
$$ 2443 1313 -2348 1086 572 -47 3519 1964 3017 4404 293 -99 238 -754 -337 1080 4233
1360D233o37k528J893k635k821J227j33J635L10k022L557k223l751M147l85l095
$$ 4233 3596 1068 2961 326 -2495 -1268 -1401 234 544 -1478 2079 -144 -3895 252 -133 -3228
1376c228L100P26j905j401R06O22k077K696J518j468K350j382k855L108k349j858
$$ -3228 -128 598 -1307 -2708 -1802 -1180 -3257 -561 957 -511 1839 457 -2398 710 -1639 -3497
1392c497M857m45j744K363N27j794k063J704J012l103K661J873k331M51o55j22
$$ -3497 1360 915 -829 1534 2061 267 -1796 -92 920 -2183 478 2351 20 471 -184 -306
1408c06L93k144K595K713l641J851J503l708j5L83K50P15K53J527n48n62j91j909
$$ -306 87 -2057 538 3251 -390 1461 2964 -744 -759 -376 -126 589 842 2369 1821 1259 1068 -841
1426h41K098O0l144M296P10n498K457J101l859R35K565K18j425N42Q01k931j582
$$ -841 1257 1317 -1827 2469 3179 -2319 138 1239 -2620 -1685 880 1098 -327 215 1016 -1915 -3497
1443c497J796j166K038R07r05K784k148k432K412j287p99K611l75P08q01j124
$$ -3497 -1701 -2867 -829 78 -827 1957 -191 -2623 -211 -1498 -2297 314 -61 647 -154 -1278
1459a278J310r63n94K419P19P6j656O33J134n151J736M314m040J452M125l308
$$ -1278 32 -931 -1525 894 1613 1689 33 666 1800 -3351 -1615 2699 -1341 111 4236 928
1475I28o26J131j081l58j0Q08m83j2J015j523J037J214l145J864K033l903J048
$$ 928 302 1433 352 -6 -16 792 309 297 1312 -211 826 2040 -1105 759 2792 -1111 -63
1492f3J093k499m6j51J204J27j253K097J159k285K59m43q18j774n8L947j002m63
$$ -63 1030 -1469 -1515 -1666 -462 -335 -1588 509 1668 -617 -358 -801 -1619 -3393 -3451 496 -506 -969
1510i69M407k360k776K497k170j17K608j145J158Q96k138j095J218J410j094J154
$$ -969 3438 1078 -1698 799 -1371 -1488 1120 -25 1133 2029 -109 -1204 14 1424 330 1484
1526A484L304m695k094L155l644j099M414P03m0K83j441n20k496k59K132N60P28
$$ 1484 4788 93 -2001 1154 -2490 -3589 825 1528 1488 1771 330 -190 -2686 -2945 -813 -253 475
1543D75K07o2p18k509J249K044j781K585N18k718J621j625q66L551j626l37K591
$$ 475 682 620 -98 -2607 -1358 686 -1095 1490 2008 -710 911 -714 -1580 1971 345 8 2599
1560B599j671k511J230J933j486l90L634k096l929L298m08k280K934J32o76L74
$$ 2599 928 -1583 -353 1580 94 -296 3338 1242 -2687 611 203 -2077 857 989 313 687
1576F87j731L93J393q85Q58L13j111k105r30K131j84Q20L987j526k156p65k584
$$ 687 -1044 -651 742 -143 715 1028 -83 -2188 -3118 -987 -1171 -351 3636 2110 -46 -811 -3395
1593c395N49N37J1N041l44l413J561p34k798J072L499P24k030J043k77m287K010
$$ -3395 -2846 -2309 -2298 2743 2399 -1014 547 -187 -2985 -1913 1586 2310 280 1323 1046 -3241 -1231
1610a231K291n25L644l8l106L20k795j898L433J332J06J562L04k727l259J467
$$ -1231 1060 535 4179 4141 1035 1355 -1440 -3338 95 1427 1533 3095 3399 672 -2587 -1120
1626a120J099j782K973L79j801l95k075R24J771j469K049J060l864m51J318j060
$$ -1120 -21 -1803 1170 1549 -252 -647 -2722 -1798 -27 -1496 553 1613 -2251 -2702 -1384 -2444
1642b444J249J927J254j275j055l64j471P57K327q25K201L04m212J804Q47k346
$$ -2444 -1195 732 1986 711 -344 -708 -2179 -1422 905 80 2281 2585 -1627 177 1024 -1322
1658a322K820K180k127j731l8m66j585K378L150p55p2n1l786o56l41M04L987R6
$$ -1322 1498 3678 1551 -180 -218 -684 -2269 109 3259 2504 2432 2381 -1405 -2061 -2402 -1998 1989 2085
1676B085j198R96l003j781J149N94K186O33o65q08k237j048K96J742K656j033
$$ 2085 887 1883 -1120 -2901 -1752 -1158 1028 1661 996 188 -2049 -3097 -2801 -1059 1597 564
1692E64N24J284n593k77L443j724J289L464j214k065n05l53l40O74K757J61n70
$$ 564 1088 2372 -3221 -3498 -55 -1779 -490 2974 1760 -305 -810 -1163 -1503 -829 1928 2089 1519
1709A519P8k546J17J542j673K371J581k640j54Mr38Q88O91J222l65k063o12r07
$$ 1519 1597 -949 -832 710 -963 1408 2989 349 195 199 -739 149 840 2062 1697 -366 -978 -1885
1727a885O2R55P77K128j555j546J918k288j607L616p8j132J306j316j455M87P66
$$ -1885 -1823 -868 -91 2037 482 -1064 854 -1434 -3041 575 497 -635 671 -645 -2100 -1613 -847
1744h47J748J072L65j503j562J65k724N74M367q85j82K873k731k195P57j78O33
$$ -847 901 1973 2338 835 -727 -562 -3286 -2712 1655 770 588 3461 730 -1465 -708 -886 -253
1761b53L00P22m1k051n53P98K24J635N28J035m49l426J45L59j441K398J427q86
$$ -253 47 769 728 -1323 -1876 -1078 -854 781 1309 2344 1895 -1531 -1386 -1027 -2468 -70 1357 471
1779D71J234j318p28J064p72M07R66J12k061o54J210r25o48L796N2k532J909p59
$$ 471 1705 387 -341 723 -49 358 1324 1436 -625 -1279 -69 -994 -1642 2154 2206 -326 1583 824
1797H24k272J129k3ON95o48K71k65k45Q93N23J186j096j414Q88k206j003K450
$$ 824 -1448 -319 -342 -336 259 -389 -118 -383 -628 265 788 1974 878 -536 352 -1854 -2857 -407
1815d07r6M25J118r39L59r05j148J896j22j415Q64J45j386o77J706J448j380K237
$$ -407 -503 -78 1040 101 460 -445 -1593 303 181 -1234 -370 -225 -1611 -2288 -582 866 -514 1723
1833A723R37k943J46K88k116J435O49j21J574n17m03J81L68k15m99R09Q9k854
$$ 1723 2660 -283 -137 151 -1965 -530 119 -2 1572 1055 652 833 1201 986 487 1396 1485 -1369
1851a369J082N53k047J726J357m98O55j032R5j83j931R88M75j225N00P20j15j84
$$ -1369 -287 266 -1781 -55 1302 804 1459 427 522 339 -1592 -604 -129 -1354 -854 -134 -249 -433
1869d33N69J220j267n11J167j696n57J169j358J385J036j640J652P99k019K09
$$ -433 136 1356 89 -422 745 -951 -1508 -339 -1697 -312 724 -916 736 1535 -484 -275
1885b75P12l78j404K77J135j469j54K500p57K2J424j359K26p02j228J140m11m09
$$ -275 437 59 -1345 -1068 67 -1402 -1556 944 187 209 1633 274 500 -202 -1430 -290 -701 -1110
1903a110J574m8O5L03L10K27j060L44N90j718L71k81k46J386q42Q84J619k178
$$ -1110 464 416 481 784 1094 1321 261 605 1195 -523 -152 -433 -679 707 -135 749 2368 190
1921A90j62J650j838r53N58L32o30m4J636m36r17J903n79p48R55j623K43M67j575
$$ 190 28 1678 -160 -1113 -555 -223 -853 -897 739 303 -614 1289 710 -38 917 -706 -463 4 -1571
1940a571N97J120r01L40P65J0m79n14R21r60j131J120k60n0L54k9J260l83j041
$$ -1571 -974 146 -755 -415 350 360 -119 -633 288 -672 -1803 -683 -943 -993 -639 -668 592 209 -832
1959h32K088j094j364J612p59p89P88N74N65k85M12L09m68Q14l91j094Q97q82
$$ -832 1256 162 -1202 410 -349 -1138 -350 224 789 504 916 1225 757 1571 1180 86 983 101
1977A01o72J710j310l84K036l15q36M64m21j83j120L26N68j238M90O79m21M60
$$ 101 -571 1139 -171 -555 1481 1166 330 794 373 190 -930 -604 -36 -1274 -784 -105 -526 -66
1995f6p64O18P54j732P76J43j482J039K12k67O64r6L57L45n54K05l71L79K1j055
$$ -66 -830 -212 542 -1190 -414 -271 -1753 -714 -502 -769 -105 -201 156 501 -53 152 -219 160 181 -874
2015h74J147r8j347K030M15j682J541K84r77j54k04K89o10M0J041m79j6P21r27
$$ -874 273 175 -1172 858 1273 -409 1132 1416 439 285 81 370 -240 -200 841 362 346 1067 140
2034A40L54k07n87J467j030r77Q01n08k00O13RO97n65n28O54q98l60L60L94L02
$$ 140 494 287 -300 1167 137 -840 -39 -547 -747 -134 -125 572 7 -521 133 -765 -1125 -765 -371 -69
2054f9r39P89Q36j636M61J280j193O52O92j207J78j9P8O93l23O03l9k32%r11Q86
$$ -69 -1008 -219 617 -1019 -558 722 -471 181 873 -334 -156 -175 -97 596 273 876 837 605 605 -306 580
2075E80L33j477J156O15j716M69L36n23L61k76K18M4j350N90M09p8J43j83M28
$$ 580 913 -564 592 1207 -509 -40 296 -227 134 -142 76 120 -1230 -640 -231 -309 -166 -349 79
2094G9o21r42J248l88l60J723p85j06L46j008K99J93k67R98K25n02l29K06J12
$$ 79 -542 -1484 -236 -624 -984 739 -46 -152 194 -814 -515 -322 -589 409 634 132 -197 9 121
2113A21o99N51J553j380k73J104j310l13N58k3R57k20j36M09j057l90M79k58N48
$$ 121 -578 -27 1526 146 -127 977 -333 -646 -88 -111 846 626 490 899 -158 -548 -69 -327 221
2132B21LK12N6j238N96M18p48R07j57m03M31j129J74R06o31j37P80o25k36K49
$$ 221 224 436 492 -746 -150 268 -480 427 270 -133 298 -831 -657 249 -382 -519 261 -364 -600 -351
2152c51N60L8q64J578m62j168R62o38o3J162o93M62O12j356M71K22m24K78K8K62
$$ -351 209 247 -617 961 499 -669 293 -345 -408 754 61 523 1135 -221 250 472 48 326 354 616
2172F16m74p51O56m26l38J666o70Q3j87j218N95m98k90J513L1n36O87o70k90k04
$$ 616 142 -609 47 -379 -717 949 279 362 175 -1043 -448 -946 -1236 277 308 -228 459 -211 -501 -705
2192g05O05O34o85K20K34j112N69N4m67J783l62o65J049r52r78Q44m42L0K72N78
$$ -705 -100 534 -151 69 303 -809 -240 -186 -653 1130 768 103 1152 200 -778 66 -376 -346 -74 504
2212E04J76j061P20J38r27J021j47n32L12q78L71P23j015P71J061j293R0K03j03
$$ 504 680 -381 339 477 -450 571 424 -108 204 -674 -303 420 -595 176 1237 -56 34 237 134
2231A34O8m10L15r1p19O24m14O61L00o25R18l80j512R67k44o63R20K19J6l91M4
$$ 134 202 -208 107 16 -703 -79 -493 168 468 -157 761 381 -1131 -164 -408 -1071 -151 68 84 -307 -263
2252b63M15o71J15P05m95L51q2n59M80o30j37J475l80J52L76p38l00k84j51O77
$$ -263 152 -519 -404 301 -194 157 75 -484 -4 -634 -771 704 324 476 852 114 -186 -470 -621 56
2272E6m31O26M36k00k19l77R8M56p67N74Q53j239J20P43j143N45L50l30O46n92
$$ 56 -375 251 687 487 268 -109 -11 445 -322 252 1105 -134 -14 729 -414 131 481 151 797 205
2292B05N47k10n83Q1l56K88M61r00M52M76r40N54J32p62J77j5J93k61o18N56k1
$$ 205 752 542 -41 40 -316 -28 433 -467 -15 461 -479 75 207 -555 -378 -393 -200 -461 -1079 -523 -544
2313e44m21N94o9J08K79q0M44n71o56R63q61k89J586o4lN23o07K78k08l94L51
$$ -544 -965 -371 -440 -332 -53 -133 311 -260 -916 47 -814 -1103 483 419 416 939 332 610 402 8 359
2334C59l3K3L6j94P79r86J57R74q19j27R84r25o29K65k27L71l42N44N65p09m5
$$ 359 326 349 385 191 970 -16 141 1115 296 169 1153 228 -401 -136 -363 8 -334 210 775 66 21
2355B1J5o62M01p18L58Q24p98O56k36m77L06p6k53N45n73M99L86o55r7J87K19
$$ 21 36 -626 -225 -943 -585 239 -559 97 -139 -616 -310 -386 -639 -94 -667 -168 218 -437 -534 -347 -128
2376a28k59k50J073l38l87Q56m31m20N27N0J6J85j19J31j47l87M50l0K00N3j29
$$ -128 -387 -637 436 98 -289 567 136 -284 243 293 309 494 375 506 359 -28 422 392 592 645 516
2397E16L94o62m40K81m47j54Q49k67L40k19p15P59p99l61Q18j92k82L41J30J22
$$ 516 910 248 -192 89 -358 -512 337 70 410 191 -524 235 -564 -925 -107 -299 -581 -240 -110 12
2417A2n67O58R0r00O46L80q55M86j50M1M55p4k61P67l11l12L25j44n91l84P87
$$ 12 -555 103 193 -707 -61 319 -536 -50 -200 -159 296 222 -39 728 417 105 430 286 -305 -689 98
2438I8K41o02Q07J14n47J13n72q4K68o29O47L11m96L26N5j62j42J0J57j0J48J22
$$ 98 339 -263 544 658 111 224 -348 -432 -164 -793 -146 165 -331 -5 50 -112 -254 -244 -87 -97 51 173
2460A73m40J18J84l40M64J53o11Q04k40o76L32L38o30P00j99K90l68j13L62p11
$$ 173 -267 -149 35 -305 159 312 -299 505 265 -411 -79 259 -371 329 130 420 52 -61 301 -410
2480d10K74N71p87O06K23m05K95l16n53N21k60J78L99p4J7j30k24k1k78K30J38
$$ -410 -136 435 -352 254 477 72 367 51 -502 19 -241 -63 336 262 279 149 -75 -96 -374 -144 -6
2501fl31M37n38J08M19p56K89P49p33M83J02n18p2k66M77L6J12N10l8j62J99p57
$$ -6 -337 100 -438 -330 89 -667 -378 371 -362 121 223 -295 -367 -633 -156 -120 -8 502 464 302 501 -256
2523b56K05K93q22Q91J15n74O49k98p9j12l20J6K74q6K74R0m49K70m46L50k20
$$ -256 -51 242 -580 311 426 -148 501 203 124 12 -308 -292 -18 -104 170 260 -189 81 -365 -15 -235
2544b35K89M02n19k09J97j2j47L22k01J95pl9J31j15q2K4j90L59n25J53P03p60
$$ -235 54 456 -63 -272 -75 -87 -234 88 -113 82 75 36 167 52 -30 -6 -196 163 -362 -209 494 -266
2566b66j85M88m59J35O26p1k97J4L9M6n14M49J05n4L40q2j38J30n91K69Q6k40
$$ -266 -451 37 -422 -287 339 268 -29 -15 24 70 -444 5 110 56 396 314 176 306 -285 -16 70 -170
2588a70N71j44l28M50l93j1k79O8L70K44j77j54l49J31J6q75J269J3n59N72n8
$$ -170 401 257 -71 379 -14 -25 -304 -236 134 378 201 47 -302 -171 -155 -1030 239 252 -307 265 207
2609B07p68N37k65J63Q4J07K85j81k87M00m34rM3J08M61m64k60M44k67m39K52
$$ 207 -561 -24 -289 -126 -42 65 350 169 -118 282 -152 -161 -118 -10 451 -13 -273 171 -96 -535 -283
2630b83P7K48P4l09K93j82k10N66m07K62j66J72L73p14L60J11p57M87K95l80N22
$$ -283 -206 42 116 -193 100 -82 -292 274 -133 129 -37 135 508 -206 154 265 -492 -5 290 -90 432
2651D32k5k62K27j47j55l4j4N6j15L53k77l16J08Qk80K28N42l06k9r1k37R3m19
$$ 432 407 145 372 225 70 36 22 78 -37 316 39 -277 -169 -161 -441 -213 329 23 -6 -97 -334 -241 -660
2674f60L06K56L8J41O0k69P4m10L41j70L09K75k79n6J45m82M72J25L8J92j3o67
$$ -660 -354 -98 -60 81 141 -128 -54 -464 -123 -293 16 291 12 -44 101 -381 91 216 254 446 433 -234
2696b34K52l53J46O5K88N19n18p6M03n93J77J30k75L24j65k5M12l35j13J67j05
$$ -234 18 -335 -189 -124 164 683 165 89 492 -101 76 206 -69 255 90 65 477 142 29 196 91
2717I1J96m95J69k25m1K96K34m06L62k34l53L34j73J18J86n38p7M84m51L27J67
$$ 91 287 -208 -39 -264 -305 -9 225 -181 181 -53 -406 -72 -245 -127 59 -479 -556 -72 -523 -196 -29
2738b9K02Jl44L76l00k93N43J6m0M66m64P8k50l63M11L60j16O5J31j88k81j11
$$ -29 173 174 -170 206 -94 -387 156 172 132 598 134 212 -38 -401 10 370 254 319 450 262 -19 -130
2760a30JJ55j80O97l93JQm02J76O4j42O38n21j98J79m54j30P73K4L13k21k77M05
$$ -130 -129 26 -154 543 150 151 159 -243 -67 -3 -145 493 -28 -226 -47 -501 -631 142 166 479 258 -19 386
2783C86p55N4J46k77O50k15M5L24k14j26J02j50k1p7j07p7J37J41K79k57L59l18
$$ 386 -369 -315 -169 -446 204 -11 34 358 144 18 120 -30 -51 -128 -235 -312 -175 -34 245 -12 347 29
2805B9l26L75k79K2K13j03k9K82n16L35N0M1K84k24L8k45n9k82L4M96L5j02K18
$$ 29 -297 78 -201 -179 34 -69 -98 184 -332 3 53 94 378 154 192 -53 -112 -394 -360 136 171 69 287
2828B87m9p08L68J1j69P02k05j68M1m43K09K45q7K19J68j24M2m08J39l82K84K30
$$ 287 238 -470 -102 -91 -260 442 237 69 110 -333 -124 121 34 253 421 297 339 -69 70 -312 -28 202
2850B02j76N3M5m01J91Nj50J56P3%j39k23P2N4k30L36J7j4K08j30N7l9o58P08
$$ 202 26 79 124 -277 -86 -81 -231 -75 -2 -2 -141 -364 -292 -238 -468 -132 -115 -129 79 -51 6 -33 -691 17
2874A7P0l17K65j99L92J6Qj26j29k01L72m00K65M29m73M43k46l57M51k07K0Q4
$$ 17 87 -230 35 -164 228 244 252 126 -3 -204 168 -232 33 462 -11 432 186 -171 280 73 93 177
2896A77j1J06k91j38K18j63J2M87k07L05n06k42J99R9m27P29k06lpl18J95k8m29
$$ 177 166 272 -19 -157 61 -102 -90 397 190 495 -11 -253 -54 45 -382 347 141 138 131 -187 8 -20 -449
2919d49L99K96m44J31k89K24O7o9M53m87J27R4m26M67n9j04J65Nj99L64n45L63
$$ -449 -50 246 -198 -67 -356 -132 -65 -134 319 -168 -41 53 -373 94 35 -69 96 101 -98 266 -279 84
2941H4Ql4k7m8L3J83j86J14Q8k66o6J97o2P9j55J15J55m32J29m4j54J58k43L54
$$ 84 92 58 31 -17 16 199 13 127 215 -51 -117 80 18 97 -58 57 212 -220 -91 -135 -289 -131 -374 -20
2965b0r6k83O36m15m5N70l41j3K32j66K07l8m52K88k76J2L92k88K22j45r9Q4o3
$$ -20 -116 -399 237 -178 -223 347 6 -7 225 59 266 228 -224 64 -212 -200 192 -96 126 -19 -118 -34 -97
2988i7P3J54m53L44J82m93K27P3k82P43o43J43N1o8J66j71J49K7k17J44R6k72
$$ -97 -24 130 -323 21 203 -290 -63 10 -272 471 -172 -29 22 -46 120 -51 98 125 -92 52 148 -124
3010a24K55P1k36K74k97J0M35l42j76J56q9m1j01K85n0r9J08o1P9K2j91J82N0
$$ -124 131 202 -34 240 -57 -47 388 46 -130 26 -63 -104 -205 80 30 -69 39 -22 57 79 -112 70 120
3033A20m06L83j20o1K74p6n54M27j71K29q0J70J52k01k34K43k87L63k2m76M17
$$ 120 -286 97 -23 -84 190 114 -440 -13 -184 45 -35 135 287 86 -148 95 -192 171 149 -327 90
3054I0K1l43J73N0m81O77pR7l05J95j71j69J78J94k24P3K61l68M27l70K76O6l64
$$ 90 111 -232 -59 -9 -490 187 180 277 -28 167 -4 -173 5 199 -25 48 309 -59 368 -2 274 340 -24
3077b4j75L42k07K89j70m20L03j55P8k4p3M8J9j22L64j83k23J07J77o1J2p7R0
$$ -24 -199 143 -64 225 55 -365 -62 -217 -139 -163 -236 -188 -169 -291 73 -110 -333 -226 -49 -110 -98 -175 -85
3100h5j3P7k35K5M25k48rK73o7n2J73o14J58N00k76J37k77o8J94J76l09J66k04
$$ -85 -98 -21 -256 -231 194 -54 -63 210 143 91 264 -350 -192 308 32 169 -108 -176 18 194 -115 51 -153
3123a53L55j85r1L08l91K19k55J2K84q7Oq1J21j89J21p4J61j10j20K49j70k22
$$ -153 202 17 -74 234 -157 62 -193 -181 103 16 22 -59 62 -127 -6 -80 81 -29 -149 100 -70 -292
3145b92N18k32k0J78N1J91n72N2M08n84L12M6k97M35m94K38J38N5O3j72l72O02
$$ -292 226 -6 -26 152 203 394 -178 -126 282 -302 10 56 -241 194 -300 -62 76 131 194 22 -350 252
3167B52j95k53M37o02K20J50j95J00j9k4K87k90m5J96j24l18J86J5L24m2K05k21
$$ 252 57 -196 241 -361 -141 9 -186 -86 -105 -129 158 -132 -177 19 -105 -423 -237 -222 102 60 265 44
3189D4k73J73J2k29M14K7j79K62j39P1Q9l75K09K84j58P3q5l02m0K48P3K38l36
$$ 44 -229 -56 -44 -273 141 168 -11 251 112 183 272 -103 106 390 232 305 220 -82 -122 126 199 437 101
3212A01K28k84l93M5K5J11J76N3l16Q9k14M38k5p5J24q7M4l23o5J74j72M88m1
$$ 101 329 45 -348 -303 -278 -167 9 62 -254 -165 -379 59 34 -41 83 -4 40 -283 -348 -174 -346 142 101
3235A01l02J98o7k04M10j83J7L85l68l5j81j14M08m81O60p3r1K44l35j22K99j20
$$ 101 -201 -3 -70 -274 136 -47 -30 355 -13 -48 -229 -343 65 -416 244 171 80 324 -11 -133 166 46
3257D6J47P1j55j0K74n67J65K46J41j83k71J65j25j75L06R5o3J9l99L45k55j10
$$ 46 193 264 109 99 373 -194 -29 217 358 175 -96 69 -56 -231 75 170 107 126 -273 72 -183 -293
3279b93R7K37k84M43k56j77o0mL67p1N6L9k94O6R0k59M99l52L13j81K4k03J89
$$ -293 -196 41 -243 200 -56 -233 -293 -297 70 -1 55 94 -200 -134 -44 -303 196 -156 157 -24 0 -203 -14
3302a4l12L70K88j85r8j92Q9o7j99M73K82m07l1Oj8J99m42J15K73q4M6l07K15
$$ -14 -326 44 332 147 49 -143 -54 -121 -320 153 435 28 -3 3 -15 184 -258 -143 130 46 92 -215 0
3325@J59j06K4j52L04r9j31l1p1J65K23K73o02J42k38R0l07J13K16n9K41l33Q0
$$ 0 159 53 77 -75 229 130 -1 -32 -103 62 285 558 -44 98 -140 -50 -357 -244 -28 -87 154 -179 -99
3348i9JJ84j89K17J12k44J76l02j27K69K3k7J40j7j97m1J11J98J20l58L45m75
$$ -99 -98 86 -103 114 226 -18 158 -144 -271 -2 21 -6 134 117 -80 -121 -10 188 308 -50 295 -180
3370a80j43L05m5J31m04L13K58m80K49j41q3K92O1m2j60O4k0k4r7J15L12l44L89
$$ -180 -323 -18 -63 68 -336 -23 235 -245 4 -137 -220 72 133 91 -69 -5 -25 -49 -146 -31 281 -63 326
3393C26k66r6ol36O14K0n21K32J98j80J1k68K71n9Q5l15K63J2j35J26L37l16k17
$$ 326 60 -36 -42 -378 236 256 -265 -33 165 -15 -4 -272 -1 -60 25 -290 -27 -15 -150 -24 313 -3 -220
3416b20N67k72j22rON2K0J24J27m46J15J17k08O1K29p8Q4j74j63L13j80J18N4
$$ -220 347 75 -47 -56 -50 2 22 146 273 -173 -58 59 -149 -88 141 63 147 -27 -190 123 -57 61 115
3439A15j20J6n8k43L56j44K69l09M5r9L50l11r6J39OM07k77k7J56k70K94N6j11
$$ 115 -5 11 -47 -290 66 -78 191 -118 -73 -172 178 -133 -229 -90 -84 323 46 19 175 -95 199 255 144
3462A44N2l07L23k70m6J80n8Q8Lk10K61k47l28M73J71l11K67l04k84L84Q6k48
$$ 144 196 -111 212 -58 -104 76 18 106 109 -101 160 -87 -415 58 229 -82 185 -119 -403 -19 67 -181
3484a81J54j02M1J45q6p6J24M5l45K62J83j46%K80n05J50O1k84M51k42j20J52
$$ -181 -27 -129 -88 57 -29 -105 19 64 -281 -19 164 18 18 298 -207 -57 4 -280 171 -71 -191 -39
3506c9M3L0j75m7J92l13J32O6q2J37m9J3J23J04j05M27j90l74L93k15l1L0k30
$$ -39 4 34 -141 -188 4 -309 -177 -111 -193 -56 -105 -92 31 135 30 457 267 -107 286 71 40 70 -160
3529a60O3L22j06R4k07K1J15k16K0j37K0K73k54J99k2k57M27j67j31K92l36P7
$$ -160 -97 225 119 213 6 27 142 -74 -54 -191 -171 102 -152 47 25 -232 195 28 -103 189 -147 -70
3551g0J24n08M18q0p1K27K05m47L01k04J53J63k23J4pJ29k20K66p5l44M27P9j73
$$ -70 54 -454 -36 -116 -187 40 245 -202 99 -105 48 211 -12 2 -5 124 -96 170 95 -249 178 257 84
3574H4L28l58l00J70L3j53L86k15j45L5m9L68k29m2k0L27m28K76j40n7L53m66
$$ 84 412 54 -246 -76 -43 -196 190 -25 -170 -135 -184 184 -45 -87 -107 220 -208 68 -72 -129 224 -242
3596b42M25l44j6L01j38m33K75j50J94p1q5K73j1J52rj4m0n1j70K30P8k01M25
$$ -242 183 -161 -177 124 -14 -447 -172 -322 -128 -199 -284 -11 -22 130 121 107 67 16 -154 76 154 -47 378
3619C78l54M74n17K06j04lk46K61O9k0k24L9L4K95k59L88n01p9M20k97O6k33j2
$$ 378 24 498 -19 187 83 80 -166 95 164 144 -80 -41 -7 288 29 417 -84 -163 257 -40 26 -207 -219
3642b19R8Q4K4oJ04p3Rm10K89j77L12Jr7J17k15m7K68nj2K03l32j79J71j14K06
$$ -219 -121 -37 -13 -19 85 12 21 -389 -100 -277 35 36 -61 56 -159 -206 62 57 45 248 -84 -263 -92 -206 0
3667@K4L9J78q9j53Q8l9O3j91L5K47l00Q8K17j62J26q3P3kk30J48Kj32L5r4n5
$$ 0 24 63 241 152 -1 87 48 111 -80 -45 202 -98 -10 207 45 171 88 161 159 -71 77 79 -53 -18 -112 -167
3693a67L89l04p4J98j42M47N3o30M23o4m36K06L8L9J82k89R0Qp8J67J02k28L1
$$ -167 222 -82 -156 42 -100 347 400 -230 193 129 -307 -101 -63 -24 158 -131 -41 -33 -111 56 158 -70 -39
3716c9j37J0K01l58L24J37n9L50m56J97k53m11M55m2j46L09l6n6J01L0j57j0J02
$$ -39 -176 -166 35 -323 1 138 79 429 -27 170 -83 -494 -39 -81 -227 82 46 -10 91 121 -36 -46 56
3739E6k23j2J20J92q9J37J8r9P2j93J55j2q8J42Q5l59J94k23K39J26P8k02m0l64
$$ 56 -167 -179 -59 133 44 181 199 100 172 -21 134 122 34 176 261 -98 96 -127 112 238 316 114 74 -290
3763b90K81J26l59N88m09Q8J21k18J30J22j60L5j21K70k28j47m3j17J44L36o5
$$ -290 -9 117 -242 346 -63 25 146 -72 58 180 20 55 -66 204 -24 -171 -214 -331 -187 149 84
3784H4k56L47k75J77k43QJ21m9J04L2j44L5j65j8L20M0j14R8P9k39L41l08j04
$$ 84 -172 175 -100 77 -166 -158 -37 -86 18 50 -94 -59 -224 -242 78 118 4 102 181 -58 283 -25 -129
3807a29LL7oK19J23j15k48j16J55j71N11j91j87L28j32l6m1o9K83j81J76j6o25
$$ -129 -126 -89 -95 124 247 132 -116 -232 -77 -248 263 72 -115 213 81 45 4 -65 218 37 213 197 -428
3830d28K77j39M80lk17j25K77k65m6O2J9K71k62j62N15l37L22j74k92K74k08L00
$$ -428 -151 -290 190 187 -30 -155 122 -143 -189 -127 -108 163 -99 -261 254 -83 239 65 -227 47 -161 139
3852A39j4j56j06K78j53K91l54J3J27p2L9J16j65n6K16m05K21K46k83L36j99j96
$$ 139 125 -31 -137 141 -12 279 -75 -62 65 -7 32 148 -17 -73 143 -262 -41 205 -78 258 59 -137
3874a37J21j28q2M04j34J3j05J62K63m31K65l80L31J7m24J58L0K78j5l53K62j24
$$ -137 -16 -144 -226 178 44 57 -48 114 377 -54 211 -169 162 179 -245 -87 -57 221 206 -147 115 -9
3896iK02j51j29l9J73l16L7J04J2K10J85m28K4L32l14J13j98j59N38k01L1J16
$$ -9 193 42 -87 -126 47 -269 -232 -128 -116 94 279 -149 -125 207 -107 6 -192 -351 187 -14 17 133
3918A33j07J89j98j31K86k81Q3J14k36L99k35J01k49P1K0K07j01Q0l2l2j76P4
$$ 133 26 215 17 -114 172 -109 -26 88 -148 251 16 117 -132 -61 -41 166 65 145 113 81 -95 -21
3940b1M6R9J18Q4k55l7q5k9R5K44q8j17K12n74K62Q7j35K31k85J43J13l97L13
$$ -21 25 124 242 326 71 34 -51 -80 15 259 171 54 266 -308 -46 41 -94 137 -148 -5 108 -289 24
3963B4P4k20O5q3Q1K22m05M11j18j99M84q9j72KJP8N4j68J10j96K78kn73J71J03
$$ 24 98 -122 -57 -140 -59 163 -242 169 51 -148 336 247 75 77 78 156 210 42 152 -44 234 232 -341 -170 -67
3988f7j09K91k42N0l6N3L03j32l11K28K24l86M37n39N8K15o2J9J62q7N8k55J63
$$ -67 -176 115 -127 -77 -113 -60 243 111 -200 28 252 -134 303 -236 -178 37 -25 -6 156 69 127 -128 35
4011C5J11k53Q7o6J22K4k8J7n8n6M0M5k25K05l1j4K20j24p4K04l26K22k9M6k42
$$ 35 146 -107 -20 -86 36 60 32 49 -9 -65 -25 20 -205 0 -31 -45 175 51 -23 181 -145 77 48 94 -148
4036a48K3J87j85r5M18L8m52M16l0P1l43O6J06j50K6J10j8n5l9j40J49P2k04n6
$$ -148 -125 62 -123 -218 200 238 -214 202 172 243 -100 -34 72 -78 -52 58 40 -15 -54 -194 -45 27 -177 -233
4060b33J77R9j61p0L61k06j5K7J87O1o1k38J30j35J9K83n33J88K53m88M95k2j90
$$ -233 -56 43 -118 -188 173 -33 -48 -21 166 227 166 -72 58 -77 -58 225 -308 -120 133 -355 140 118 -72
4083g2J46l80J23L81p16K20RJ02K41k4l35L1K91j43J19n3j32J9J44K25m83K32
$$ -72 74 -306 -183 198 -518 -298 -289 -187 54 30 -305 -274 17 -126 -7 -60 -192 -173 -29 196 -287 -55
4105e5j10L68o8j57K28J08m80mK12j66K74j88J24J88m38K76K4l58O2L21j44J83
$$ -55 -165 203 135 -22 206 314 -166 -170 42 -124 150 -38 86 274 -164 112 136 -222 -160 161 17 200
4127B00l92K47K94k55O5P3k42n8K91j92M0m48K05L40k51k2M3J43q0j57J0J60l12
$$ 200 -192 55 349 94 159 232 -10 -68 223 31 71 -377 -172 168 -83 -105 -62 81 1 -156 -146 14 -298
4150b98L04l08m2O30m12O9K97l35J08j62J14o3r5J57j16J34j88K73j84J79o2j71
$$ -298 6 -302 -344 286 -126 -57 240 -95 13 -149 -35 -98 -193 -36 -152 -18 -206 67 -117 62 0 -171
4172a71M73k37L3m7n9K72l07K85L7o9j26j56l9K61k14N1k6j78K77j36L4Q4l5j
$$ -171 302 65 98 51 -8 264 -43 242 279 210 84 -72 -111 150 -64 -13 -39 -217 60 -76 -42 42 7 6
4196FK11j1k17k7k26J90L04r6j8j2L2m1l47K94o7j89J67J40l18J63j98J16J59
$$ 6 217 206 -11 -38 -264 -74 230 134 116 104 136 95 -252 42 -25 -214 -47 93 -225 -62 -260 -144 15
4219A5j2j25j74J51O6R9k70L00k04O8J95j30J02k4K42k59j47J6K20l52L95j29
$$ 15 3 -122 -296 -145 -79 20 -250 50 -154 -86 109 -21 81 57 299 40 -107 -91 129 -223 172 43
4241D3k04K24q8K18k34P1j44K47n8o7k11J30J88m94N55Kk78L85k85K67k86q3Q2
$$ 43 -161 63 -25 193 -41 30 -114 133 75 8 -203 -73 115 -379 176 178 -100 285 0 267 -19 -102 -20
4264b0m6J43K14j58j77K7j64K86j0K3o4j54l1o6O2K22L3j70L04n8p5M3n83M38
$$ -20 -66 77 291 133 -44 -17 -181 105 95 118 54 -100 -131 -197 -135 87 120 -50 254 196 121 164 -419 19
4288A9O8J02k01J48j23O0k41J8K07k4M1K51k52o6o0K33q7k67K90O0j56K18k71
$$ 19 87 189 -12 136 13 73 -168 -150 57 33 74 325 73 7 -53 180 93 -174 116 176 20 238 -33
4311c3q4MJ04N3r3j92K52l74L73K18k00M2%l74K24J32j13K48k68J32j5O2o0N7
$$ -33 -117 -113 -9 44 -49 -241 11 -363 10 228 28 70 70 -304 -80 52 -61 187 -81 51 36 98 38 95
4335I5j64j15J87P0j67K2K14k22k07L68K9q2l3j45J16J2K4J47k87J15L72l97M69
$$ 95 -69 -184 3 73 -94 -72 142 -80 -287 81 110 28 -5 -150 -34 -22 2 149 -138 -23 349 -48 421
4358D21n34K6K86k07J21J15m58J43J04j90M13q1j69r5j03K08k50J83L96j39k11
$$ 421 -113 -87 199 -8 113 228 -230 -87 17 -173 240 159 -10 -105 -208 0 -250 -67 329 190 -21
4379b1J30l42K28l9L0J62k35J64k86K41O9k01o0M55j99l85M71Jj42j4n43P22r0
$$ -21 109 -233 -5 -44 -14 148 -87 77 -209 32 101 -100 -160 295 96 -289 182 183 41 27 -516 206 116
4402A16l12J69J11k42J94j53J26l4j36K67k81J62J78n13L25P8l14L98m60K31M09
$$ 116 -196 -27 84 -158 36 -117 9 -25 -161 106 -175 -13 165 -348 -23 55 -259 139 -321 -90 319
4423C19k90M1J75n89K98k40J87K6j51K84J30k45Q4k18K47j1R8K23l69k8J2K03
$$ 319 29 70 245 -344 -46 -286 -99 -73 -224 60 190 -55 29 -189 58 47 145 368 -1 -29 -17 186
4445A86k36J17O1j25L7k95L59j81q5L89r2P8j13k94J20p8L1K7J86o0J40l20J18
$$ 186 -50 67 128 3 40 -255 104 -77 -162 227 135 213 100 -194 -74 -152 -121 -94 92 32 172 -148 -30
4468c0K82k61p1K29j40J03j91N2K75k54J5L60l07O5k86L90j85l02K80J05K05k92
$$ -30 252 -9 -80 149 9 112 -79 -27 248 -6 9 369 62 127 -159 231 46 -256 24 129 334 42
4490D2J50k55J96j40K15r7k92M04l20j1M73l50r3L01o8k49J66j78K6j56J8K46
$$ 42 192 -63 133 -7 208 111 -181 223 -97 -108 365 15 -78 223 155 -94 72 -106 -80 -236 -218 28
4512B8j66O0m4J43J8K56k32p5jk35Q9l4J2J39J17Lj06L05l08j42L09k51J39pM
$$ 28 -138 -78 -122 21 39 295 63 -12 -13 -248 -159 -193 -181 -42 75 78 -28 277 -31 -173 136 -115 24 17 21
4537B1J05j56lK36J24k81J36j05Q9q5k52L55q0n7k3nj81M23k70N00m64r4J76l39
$$ 21 126 -30 -33 203 327 46 182 77 166 81 -171 184 104 47 24 19 -162 261 -9 491 27 -67 109 -230
4561b30J92m8j43L02j00O2N2j76Q8m7q4L2o6R7k22J33Jp7R7K55q2N7j77Rj58J37
$$ -230 -38 -86 -229 73 -27 35 87 -89 -1 -48 -132 -100 -166 -69 -291 -158 -157 -234 -137 118 36 93 -84 -75 -233 -96
4587i6J2n8J96M6j21j21r4M17l74J13J74j90K67k38J76j5k06K55J60k81j02J80
$$ -96 -84 -142 54 100 -21 -142 -236 181 -193 -80 94 -96 171 -67 109 94 -112 143 303 22 -80 100
4609A00k33K56L3k26J75j03k9M47m21K95j99J13k24j1Qj06O7q2K13l00M65m19
$$ 100 -133 123 156 -70 105 2 -27 420 -1 294 95 208 -16 -27 -19 -125 -58 -140 73 -227 238 -181
4631a81j22L49p4m7j4q1K36r9j34K02l81K22J26k56J07j34K47Pj9j93M99l16R0
$$ -181 -303 46 -28 -75 -89 -170 66 -33 -167 35 -346 -124 2 -254 -147 -281 -34 -27 -46 -239 260 -56 34
4654C4N9Q7J05K3j06r8j48M08m06pk1n4M3L38j29J80m90k22M99k41K94p9j20k
$$ 34 93 180 285 308 202 104 -44 364 -42 -49 -70 -124 -81 257 128 308 -182 -404 95 -146 148 69 -51 -53
4678e3K24l21J18J61J9k47J11lj07rJ31O3n17M45l4K28k65n5J7LJ97L9j82J9O6
$$ -53 171 -150 -32 129 148 -99 12 9 -98 -107 24 87 -430 15 -19 209 -56 -111 -94 -91 106 145 -37 -18 48
4703D8l85O76j95k64J50k01J78r8oK12k77L47m7j52J12j4J58j86j84R1J16Q7j97
$$ 48 -337 339 144 -120 30 -171 7 -91 -97 115 -162 185 138 -14 98 84 242 56 -128 -37 79 166 -31
4726c1P5j93K70q4K14l20J58l42P0R0Q9j67J03k4R5O3O6k26K12R6l10N2R1r7L1
$$ -31 44 -149 121 37 251 -69 89 -253 -183 -93 -4 -171 -68 -92 3 66 132 -94 118 214 -96 -44 47 -50 -19
4751a9L1m3J02J0r8l48M63k16K63k42J17j84K23k12j75M65K4j04J31j38m7P0l32
$$ -19 12 -31 71 81 -17 -365 98 -118 145 -97 20 -164 59 -153 -328 137 161 57 188 50 3 73 -259
4774b59M80p8k34J69k8k2j42L33Mk60J88J53m41J73J15j89l8K86l88K03n2lK87
$$ -259 221 143 -91 78 50 28 -114 219 223 -37 151 304 -137 36 151 -38 -76 210 -178 25 -27 -30 257
4797B57l66M4o1J32j32J29j50J19m0Q5q2P5K08k23O1j84K07j35J21N6j94J39j46
$$ 257 -109 -65 -126 6 -126 3 -147 -28 -68 17 -65 10 218 -5 56 -128 79 -56 65 121 -73 66 -80
4820h0Q2l1L3J89q9L8l38J09J28o5J80j85q8M65l08k21J32K49k09R9k70J74K02
$$ -80 2 -29 4 193 104 142 -196 -87 41 -24 156 -29 -117 348 40 -181 -49 200 -9 90 -180 -6 196
4843A96l96L03k35L6J44j85M07k17J5k80Q1J32%q5K43o4m27L35j67L91Q4l98M
$$ 196 -200 103 -132 -96 48 -137 270 53 68 -212 -131 1 1 -84 159 95 -332 3 -164 227 311 -87 -83
4866h3Q9k34K69k17r5J70L28j44l5j60L60k15k22K42N5k47N01m68J20K31l35J11
$$ -83 6 -228 41 -176 -271 -101 227 83 48 -112 248 33 -189 53 108 -139 362 -106 14 245 -90 21
4888B1j23K39n5n52K89J74k87M10j35jP9k03LJ77l11L72O3l40J55j3K2P8k63L56
$$ 21 -102 137 82 -470 -181 -7 -294 116 -19 -20 59 -144 -141 36 -275 97 160 -180 -25 -38 -16 62 -201 155
4912A55k40P5J64j91J18j11K59M0j13k42J74k21m8K46Q4j52j09o0K35m0P7j8l54
$$ 155 -85 -10 154 -37 81 -30 229 269 156 -86 88 -133 -181 65 149 -3 -112 -172 63 23 100 82 -272
4935b72K29k73M2L93J81k27J38j53J45l08p1j11L55J21m8k75j0J3j63J31J92Q8
$$ -272 -43 -316 -274 119 300 73 211 58 203 -105 -176 -287 68 189 141 -134 -144 -131 -294 -163 29 117
4957A17n7j56m0J82n1m4j20J34J73j36K48j62k9J13K0m76K96Rm7L5n0MK41j45
$$ 117 60 -96 -136 46 -5 -49 -169 -35 138 2 250 88 59 172 192 -284 12 21 -26 9 -41 -37 204 59
4981E9j05J65J27k57p5j61J34j75K14J71j7p8l25K48J81m40M19j31K45J07m21
$$ 59 -46 119 246 -11 -86 -247 -113 -288 -74 97 80 2 -323 -75 106 -334 85 -46 199 306 -115
5002a15j90K87J33r4N6k32M3J94j25j35K52K79l61J13j65K1l10N22l01RN8J82
$$ -115 -305 -18 115 21 77 -155 -112 82 -43 -178 74 353 -8 105 -60 -39 -349 173 -128 -119 -61 121
5024A21k81N4j1J77R7j37mj76J96M1k23N55l77J62n8j07J79q2ok9n3o9J69k88
$$ 121 -160 -106 -117 60 157 20 16 -160 36 77 -146 409 32 194 136 29 208 126 120 91 38 -31 138 -150
5048a50J98L5l17M32k97K56K6l90J19L1j93K53m7O4j44J3M8J32k41J90j9j78K04
$$ -150 48 83 -234 198 -99 157 183 -207 -88 -57 -250 3 -44 20 -124 -111 -63 69 -172 18 -1 -179 25
5071B5q9k34K04J81l8qq2L53n06O1J37m07M83P6k81J83k86K76N8o4L8M1p2J17
$$ 25 -64 -298 -94 87 49 41 -41 312 -194 -133 4 -403 80 156 -125 58 -228 48 106 42 80 121 49 166
5095A66l53MK31m8R4q5J82J63j64l3j57l7L56j78q7JJ10j59J07J2j0j41k7J22
$$ 166 -187 -183 48 0 94 9 191 354 190 157 0 -37 319 141 54 55 165 6 113 125 115 -26 -53 69
5119F9o0l64K52r8L12n4k2J86K7k66L6J41k93m2K05j68J74l04M36q6j44O8J89
$$ 69 9 -355 -103 -201 111 57 35 221 248 -18 18 159 -134 -176 29 -139 35 -269 167 81 -63 5 194
5142A94j90K6j49M01m95J94K61l97J65kR3prk80K23k68L28k19J03J37m1j0J33
$$ 194 4 30 -119 282 -213 -19 242 -155 10 8 101 94 85 -195 28 -240 88 -131 -28 109 68 58 191
5165A91m13j6M51l10J42oj22j4L0q9L96m44K22L64n08J79M12k80l22R1k96N40
$$ 191 -222 -238 213 -97 45 39 -83 -97 -67 -156 240 -204 18 382 -126 53 465 185 -137 -46 -342 198
5187A98j60k34R9j03J57l4n1R6j28J1L50o01J66L49k08M06l04J42j13j27L83l20
$$ 198 38 -196 -97 -200 -43 -77 -128 -32 -160 -149 201 -400 -234 115 -93 313 9 151 38 -89 294 -26
5209b6P5j13n1L03k98J26J60j4n8L7k13J32q1J40Q4k35k06M16l69J49Q9J4p5j48
$$ -26 49 -64 -115 188 -110 16 176 162 104 141 -72 60 -21 119 203 -32 -238 178 -191 -42 47 61 -14 -162
5233a62mK95k44J85m1R8l9j07J72po5l68L93Q4l17j80p6M27j86P1K58m77K44J12
$$ -162 -166 129 -115 70 29 127 88 -19 153 146 81 -287 106 190 -127 -307 -383 44 -142 -71 187 -290 -46 66
5257F6j99L30Kj57J28k92K11p8o0k2L67l65j03QLJ6J82J41j13j48J19L7m10J75
$$ 66 -133 197 199 42 170 -122 89 11 -49 -71 296 -69 -172 -164 -161 -145 37 178 65 -83 36 73 -337 -162
5281a62J38m8K16l31L12j84j24L92m89L38l4l75K97P8j0Q3j60M6L05j17m9j65
$$ -162 -24 -72 144 -187 125 -59 -183 209 -280 58 24 -351 -54 24 14 97 -63 -17 288 171 122 -43
5303d3L4K50l34J02ql99N81k04NK6k50K01J23k28Q8J57j25M9k90K69j26j05J88
$$ -43 -9 241 -93 9 1 -398 183 -21 -16 10 -240 -39 84 -144 -56 101 -24 25 -265 4 -122 -227 -39
5326c9j57m6K01l9J02J01j72k05NL98k3j69p2R6j03J73nj98L23k2p5j2j09k3L32
$$ -39 -196 -242 -41 -80 22 123 -49 -254 -249 149 126 -43 -115 -19 -122 51 46 -152 171 149 74 62 -47 -70 262
5351B62l35J70P7n94M02k73K46l6J84J07n9l22J65M4j69J65K4J19k38K70k11r
$$ 262 -73 97 174 -420 -18 -291 -45 -81 103 210 151 -171 -6 38 -131 34 58 177 -61 209 -2 -11
5373a1j57k6J93l9j20J24L0lJ03k52J6J90K29m11M25j61k54K05l32K93r3K7J9
$$ -11 -168 -194 -1 -40 -160 -36 -6 -9 94 -158 -142 48 277 -134 291 130 -124 81 -251 42 -51 -24 -5
5396eQ3J5R7j69J95k64l3M1J30k44L11O5j89J34j92M3J51n21J17K88j20J00o0
$$ -5 78 93 190 21 216 -48 -81 -40 90 -154 157 222 33 167 -25 18 169 -352 -235 53 -67 33 -27
5419b7J14R7m04R7Ll3K94k89n8R3K6M9Q1R2O6l03J13p4%R9Ko4K90n01J38K42j70
$$ -27 87 184 -220 -123 -120 -153 141 -148 -206 -113 -87 -38 43 135 201 -102 11 -63 -63 36 38 -26 264 -237 -99 143 -27
5446b7J75%m80J95M8j65M0m7N43l15J80j49J01j98L91l13J65j85J9k85M19j18
$$ -27 148 148 -332 -137 -89 -254 -214 -261 282 -33 147 -2 99 -99 292 -21 144 -41 -22 -307 112 -6
5468fP5p8p5R1m7O5O8r9P2j8N1k25R3K44l55J28J44k45q4K82l72M37m1k86L0l1
$$ -6 69 -9 -84 7 -40 25 93 -6 66 48 99 -126 -33 211 -144 -16 128 -117 -201 81 -291 146 105 -181 -151 -182
5494a82K28l27J00L40l29j72M47p4k34K93k65j04L77l7J2p3r0J96j52K6K81l81
$$ -182 46 -281 -181 159 -170 -342 105 31 -203 90 -175 -279 98 61 73 0 -90 106 -46 -20 261 -120
5516a20K61k09k8L2K29J9o0L1j97M8J59J3k84L38k0m42L07J64j43L0k61j18L65
$$ -120 141 -68 -96 -64 165 184 124 155 -42 6 165 178 -106 232 212 -230 77 241 98 128 -133 -251 114
5539A14l90L01k11N7J59j19J45J37k00j8J91o2L0j72J4j57j9j79P44p04K39J55
$$ 114 -276 25 -186 -129 30 -89 56 193 -7 -25 166 104 134 -38 -24 -181 -200 -379 365 -339 -100 55
5561E5j5K9k11K11J51j63nj11j06J07n2J73P7l66L8L58m25K89J8R1j31l1J38P0
$$ 55 40 69 -142 69 220 57 52 -59 -165 -58 -110 63 140 -226 -188 170 -255 34 52 143 12 -19 119 189
5585A89l49K34l6j21J81k25P9J17j89K58l20L19j74m5J50N7k40J92J83m30L7j97
$$ 189 -160 74 38 -83 98 -127 -48 69 -120 138 -182 137 -37 -82 68 125 -115 77 260 -170 -133 -330
5607c30Q9L25m44J95L53l20M62l11J8j5k78L23l45K61QO2jP6o46M84l1j83K10
$$ -330 -241 84 -360 -165 188 -132 330 19 37 22 -256 67 -278 -17 -9 53 52 128 -518 -34 -65 -248 -38
5630c8r6L28m15L94l71L12j66K71r8k20qJ49j12K23l72J25M7J76r0J85j96M5j1
$$ -38 -134 194 -221 173 -198 114 -52 219 121 -99 -107 42 -70 153 -219 -94 -47 129 39 224 28 73 62
5653F2j13J9j95J44j14K14J18j10K16j77j12M08o29M98j37n81O91j10j67L8K8
$$ 62 -51 -32 -227 -83 -197 17 135 25 241 64 -48 360 -269 229 92 -489 202 92 -75 -37 -9
5674iK03k44j31M0J6J25K16k02p0J70k09J57j07K53k39J44j46K30j46j44J23j32
$$ -9 194 -50 -181 -141 -125 0 216 14 -56 114 -95 62 -45 208 -31 113 -33 197 51 -93 30 -102
5696a02r8N73l53p4P5J96j31l26Q0K05j79K62o4r9Q5J89r8q8r7K04l52K71R0J4
$$ -102 -200 373 20 -54 21 217 86 -240 -160 45 -134 128 64 -35 50 239 141 53 -44 160 -192 79 169 183
5720A83k88J43j67pK68P3j79q3J45j12L3L8J69k91J17j78m3L11k92K41k21j31
$$ 183 -105 38 -129 -136 132 205 26 -57 88 -24 9 47 216 -75 42 -136 -179 132 -160 81 -140 -271
5742b71J89K29j60L6Kj83K83l06L02J1l12K37j12J85j5J31k30m7K25m9l45J85
$$ -271 -82 147 -13 23 25 -158 125 -181 121 132 -180 57 -55 130 115 246 16 -31 194 145 -200 -15
5764a5N7k53N4K45k68L23l74L55l05L09Rl6j05LL2j84K15j17N4r4j6Q7P1J11j57
$$ -15 42 -211 -157 88 -180 143 -231 124 -181 128 137 101 -4 -1 31 -153 62 -55 -1 -95 -111 -24 47 158 1
5789AK5K58k08O6l13r0J91J88n0q4P3j53J59rj04J94q9j50O2MmNK5k1O8j44P4
$$ 1 26 284 76 142 -171 -261 -70 118 68 -16 57 -96 63 54 -50 144 55 -95 -33 -29 -33 -28 -3 -24 44 -100 -26
5816b6J64O1K5k82M0r6O5J97k31J26L4m7j65J71l9J3j1pK20j53L0k37Q3K78m40
$$ -26 138 199 224 -58 -18 -114 -49 148 -83 43 77 30 -135 36 -3 10 -1 -8 212 59 89 -148 -65 213 -227
5841b27K28l6J3r9L82j51r1k01K2j43J95J8Q2j44K43L5PO0l96Q1k3L4O8lL1n4
$$ -227 1 -35 -22 -121 261 110 19 -182 -160 -303 -108 -90 -8 -152 91 126 133 193 -203 -122 -145 -111 -43 -46 -15 -69
5867f9j04L4K24k10L5Q4J19J51k23m7l0L39l32k1K12J23r4K5j32j12p2J83l7l2
$$ -69 -173 -139 85 -125 -90 -6 113 264 41 -6 -36 303 -29 -50 162 285 191 216 84 -28 -100 83 46 14
5891A4n3K09k11P8R1j02m5J67j71k34M74l02M6J63l13J04J60M0N5m16J45K98j54
$$ 14 -39 170 -41 37 128 26 -19 148 -23 -257 217 -85 -39 124 -189 -85 75 115 170 -246 -101 197 43
5914D3J5J7j26j08P6R0K08k19J01q3p6j80l0J78k51J95J59j1m4j44L22q2j68p4
$$ 43 58 75 -51 -159 -83 7 215 -4 97 14 -62 -242 -272 -94 -345 -150 9 -2 -46 -190 132 50 -118 -192
5938a92J49J48k13L76n41J96L3L4K46j38N4j27M9Q8q5P4j57k8P7J26j67j17J83
$$ -192 -43 105 -108 268 -273 -77 -44 -10 236 98 152 25 74 162 77 151 -6 -34 43 169 2 -115 68
5961F8N1k24R3j0L90n46L41j44P6k2k18J45J1r1j73M47l14K05k24J96k52N9r9
$$ 68 119 -105 -12 -22 368 -178 163 19 95 73 -145 0 11 -80 -253 194 -120 85 -139 57 -195 -136 -235
5984b35J92p0J23R9m51K95J28j84p4r8k4K22r7J43j41j64L71j33J70J9o9j33L47
$$ -235 -43 -113 10 109 -342 -47 81 -103 -177 -275 -299 -77 -174 -31 -172 -336 35 -98 72 91 22 -111 236
6007B36j79J47J1k61K11j50j52kp5J54n8L1K10j22k6Q5pj84j81J19L09k79J61
$$ 236 57 204 215 -46 165 15 -137 -139 -214 -60 -118 -87 123 1 -25 60 53 -131 -312 -193 116 -163 -2
6030bJ40j90j33Q9Q4J72k13M6m5j51J8L51k70K04j7R0j06J3J16o4k08n0K11j92
$$ -2 138 -52 -185 -96 -12 160 -53 -7 -52 -203 -185 166 -104 100 83 173 67 80 196 132 -76 -126 85 -107
6054a07q1J68r9R1p7J4J69j77L54j92J9l7k35K8J86j56J38K56j63L8l09K61j3
$$ -107 -188 -20 -119 -28 -105 -91 78 -99 255 63 82 45 -190 -162 24 -132 6 262 99 137 -172 89 76
6077G6M1j8j17j59L06j21K84j31k91R4J10M5m3J4r8n6Q0J25j2j73J01j30r7J15
$$ 76 117 99 -18 -177 129 8 292 161 -130 -36 74 119 76 90 -8 -64 16 141 129 -44 57 -73 -170 -55
6101e5J83r0N4k89L7J38j62N31j87k27p4L69j75j6k36J26m4j14K03O3j13J16K02
$$ -55 128 38 92 -197 -160 -22 -184 347 160 -67 -141 228 53 37 -199 -73 -117 -231 -28 35 -78 38 240
6124B40j65l1k24l7J91j01P1Q2m9R4k35J18P1j32J24rl00m4L39M0J20j80J26q8
$$ 240 75 44 -180 -217 -26 -127 -56 26 -23 71 -164 -46 25 -107 17 8 -292 -336 3 43 163 -17 109 21
6148B1N6O6m5j24k9N2k95J19n3O9K16p2L8q7K52l69K44j38O3n9M2J69K4l20J7
$$ 21 77 143 98 -26 -55 -3 -298 -179 -232 -163 53 -19 19 -68 184 -185 59 -79 -16 -75 -33 136 160 -160 -143
6173a43K03m5J62J2r3O6j74j67qJ32n0j74L73k00k1L65r5o9J3j95L6M30m53M0
$$ -143 60 15 177 189 96 162 -12 -179 -187 -55 -105 -279 94 -106 -127 238 143 74 87 -108 -72 358 -95 -55
6197e5N2j89K20J37r1j56P0o7J45%k59L38j82J86m4q0P8l55J34J29Q5N6j67J31
$$ -55 -3 -192 28 165 74 -82 -12 -79 66 66 -193 145 -37 149 105 25 103 -252 -118 11 96 152 -15 116
6221A16k86J16L10l42N0r4j10Q9K19l21N07j34k89L95k28M4Q0N8O1n9j48j68J60
$$ 116 -170 -54 256 -86 -36 -130 -240 -151 68 -253 254 120 -169 226 -2 42 122 180 241 182 34 -134 26
6244B6n0r1j36J32M12m15R7J33k18K19j39RK11r0J53k73L3J71j5j72K42k93P4
$$ 26 -24 -115 -251 -119 293 -122 -25 108 -110 109 -30 -21 190 100 253 -20 13 184 169 -3 239 -54 20
6267B0L54m15j71K74k15K63K83l37o2JJ53k58o1J58q6K87j42k57J92p9m4J39J6
$$ 20 374 -41 -212 62 -153 110 393 56 -6 -5 148 -110 -171 -13 -99 188 46 -211 -19 -98 -142 -3 13
6290A3P6K5k84K26M4l9nK2j16N4L8o2L7j73N35m13R0J48j12j21L5j68J96l7k7
$$ 13 89 114 -170 56 100 61 56 78 -38 16 54 -8 29 -144 391 -22 68 216 104 -17 18 -150 46 9 -18
6315a8J05rJ6r7n6P8Mr9j11J20K64m1j13P0r7L60k56j61M5J42j48Q0R7j50K6J9
$$ -18 87 78 94 -3 -59 19 23 -76 -187 -67 197 156 43 113 16 376 120 -41 4 146 -2 78 175 25 51 70
6341G0L5L42n84J09n1J37oJ5k2j22P1p8L61l03J38k49J1K85j10N2o1j78K65j19
$$ 70 105 447 -137 -28 -79 58 52 67 45 -77 -6 -84 277 -26 112 -137 -126 159 49 101 40 -138 127 8
6365Hj52K24N9Q4j68j23K09J01k62q2n2J06K9m7J99j56n0L09m65K07R4qn8K16
$$ 8 -144 80 139 223 55 -68 141 242 -20 -102 -154 -48 -19 -66 133 -23 -73 236 -229 -22 72 64 6 222
6389B22j59n4m4M66l54J25j76j10r6M77m32K5J69O0l97J07L42j02j59p7L54n35
$$ 222 63 9 -35 431 77 202 26 -84 -180 297 -135 -110 59 119 -278 -171 171 69 -90 -167 187 -348
6411c48L61p3Q5M5N6k36J49l5j33L80l11j26K55j85n9l4K73J06k28J30J40j66
$$ -348 13 -60 25 70 126 -110 39 4 -129 251 -60 -186 69 -116 -175 -209 64 170 -58 72 212 46
6433D6j06n2J68k49N6J06J00j9p3J41l27L05o5r6Q0J25k0O7m2l89Q4L25k16K19
$$ 46 -60 -112 56 -193 -137 -31 69 50 -23 118 -209 96 31 -65 15 140 120 187 145 -244 -160 165 -51 168
6457A68k62J55j94J80pl9K0q3J75j37J2O7rj46J33k25O2J39L1J8J62k04k01j13
$$ 168 -94 61 -133 47 40 1 21 -62 113 -24 -12 55 46 -100 33 -192 -130 9 40 58 220 16 -185 -298
6481b98M76p0jj03j17j5L26k31j48L21k2M5P7j24r4p1MJ24q4k6k9K43k5N2k38
$$ -298 178 108 107 4 -113 -128 198 -33 -181 140 118 163 240 116 22 -49 -45 79 -5 -31 -60 183 158 210 -28
6506b8J47j53K12k23l03K41J49j74J69j88J21R6o8J18k47K1J70j53K99P3k82K8
$$ -28 119 -34 178 -45 -348 -107 42 -132 37 -151 -30 66 -2 116 -131 -110 60 -93 206 279 -3 25
6528B5l15L92J48j30j30J03l78M42J1R8k25%k1Kn7R8j31LJ74j13k23J36L16j38
$$ 25 -290 102 250 120 -10 93 -285 157 168 266 41 41 20 22 -35 63 -68 -65 109 -4 -227 -91 225 87
6552H7Q7k93L77j57l4l8j18J94k1k70J90N9l08P4J59j17J73Kj86L37l06J73l06
$$ 87 174 -119 258 101 67 29 -89 105 84 -186 4 63 -245 -171 -12 -129 44 46 -140 197 -109 64 -242
6575b42K16Q0q3k23K29P2k3K3k56M78k73l9m9o0L9M15l40J04J16k37J69k90J46
$$ -242 -26 54 -29 -252 -23 49 26 49 -207 271 -2 -41 -90 -150 -111 304 -36 68 184 -53 116 -174 -28
6598b8J77k43J30O0k30J91J2M2l8R0N2k49o0J82N0j11n8n0j86K78j54L67k47N1
$$ -28 149 -94 36 96 -134 57 69 111 73 163 215 -34 -94 88 138 27 -31 -81 -267 11 -143 224 -23 28
6622B8J4j34O3l71L30L86m44J05Kj20J73p8n2O3J40M3j60K67j07m4l2J38l53K6
$$ 28 42 -92 -29 -400 -70 316 -128 -23 -21 -141 32 -46 -98 -35 105 148 -12 255 148 104 72 210 -143 -117
6646a17O3J60J1j55j09K1L77j72%p9K93j31j43l7R8Pj47k7J35o1k22L47p1j64
$$ -117 -54 106 117 -38 -147 -126 251 79 79 0 293 162 19 -18 80 87 -60 -87 48 -13 -235 112 41 -123
6670a23N3k2N7j32J35J08J82n90K38L4J57q4j6J3j20J44P6m58L78j9J20n6k7%
$$ -123 -70 -92 -35 -167 -32 76 258 -332 -94 -60 97 13 -3 10 -110 34 110 -348 30 11 131 75 48 48
6694D8R2k50o2J00j24K30J1Q2Pj37K16m91J70J87J1N2k22K27k85M77m52l5K25
$$ 48 140 -110 -172 -72 -196 34 45 127 134 -3 213 -278 -108 79 90 142 -80 147 -138 339 -113 -148 77
6717G7l82K29k25M23k10K9m4J43N0j41N7P4K08k80j8m8J8K96l42K0J71j95j87
$$ 77 -305 -76 -301 122 -88 -59 -103 40 90 -51 6 80 288 8 -10 -58 -40 256 -86 -66 105 -90 -277
6740b77K30k87M96j21O8k66K37J55j4k42L3K8k27K79j41N6N8p2M7K76m14J23j32
$$ -277 -47 -334 162 41 109 -157 80 235 221 -21 12 40 -187 92 -49 7 65 -7 40 316 -98 25 -107
6763a07K41j15n4j5Oj32J51j06L1L35l97R2J83m25J68R6J39P6n8lp2j15n9oK34
$$ -107 134 19 -35 -50 -44 -176 -25 -131 -100 235 -162 -70 113 -312 -144 -48 91 167 109 106 34 -81 -140 -146 88
6788H8j0j9j81L17m14J81j0n5J13K0q7rJ14o9J23j12J1R6j03J36j85J54j81Q7
$$ 88 78 59 -122 195 -219 -38 -48 -103 10 30 -57 -66 48 -21 102 -10 1 97 -6 130 -55 99 -82 5
6812Eq4L40m58J18m9R6Qr5P7N2N2J83p4l91j03K38J79j46J47j71K53j30o4j87
$$ 5 -79 261 -197 -79 -128 -32 -24 -119 -42 10 62 245 171 -220 -323 -85 94 -52 95 -76 177 47 -17 -204
6836b04K35Lj65K77o0l21K46m1j08L77m70J60m6k63N00K06k85J68l46N9K66l80
$$ -204 31 34 -131 146 86 -235 11 -30 -138 239 -231 -71 -117 -380 120 326 41 209 -137 -78 188 -192
6858a92K43k07O4J61j74NL74j90j6%l2J31l94K05K24l62L03k38J22J16j26J45
$$ -192 51 -156 -92 69 -105 -100 274 84 68 68 36 167 -227 -22 202 -160 143 -95 27 143 17 162
6880A62Ql09J27L82m57J97l97M79o6m4k73K9J05j84K55q6J77j75J15j34K4K18
$$ 162 170 -139 -12 370 -87 110 -287 192 126 82 -191 -162 -57 -241 14 -72 105 -70 45 -89 -65 153
6902A53k41l3J09k0PN7l30K63j80K15mK8k9K7k40K04K27j75K01m55L54l2R4o2
$$ 153 -88 -121 -12 -32 -25 32 -298 -35 -215 0 -4 24 -5 22 -218 -14 213 38 239 -216 138 106 200 138
6926A38j39J18l08O7K86j98Q5r7L64l24l58M23P4j77K01PJj6p1k62K09M8M6q5
$$ 138 -1 117 -191 -124 162 -36 49 -48 316 -8 -366 57 131 -46 155 162 163 147 76 -186 23 71 117 32
6950C2k01k0K52Oj43P9LN3k33Q2j32J82k0J05p5j0Q1r4P0Kp4KJ81j93K32J2k40
$$ 32 -169 -189 63 69 -74 5 8 61 -172 -90 -222 -40 -60 45 -30 -40 41 -53 17 19 -55 -53 128 -65 167 179 -61
6977f1kO3n4O7J13Rk86L10k9j65K49k41K08j67j5r4R0n4j43J30J39N1j53j23J22
$$ -61 -63 0 -54 13 126 135 -151 159 130 -35 214 -27 181 14 -1 -95 -5 -59 -202 -72 67 118 -35 -158 -36
7002c6J17J35j84k63N09k22o5l3K58j77P6L4j26nJ63k62j53K29R2j05j72o3K42
$$ -36 81 216 32 -231 278 56 -9 -42 216 39 115 149 23 18 181 -81 -234 -5 87 -18 -190 -253 -11
7025a1J08j93j05R5J0K57l34J7K72k50K11k05m9K27K77m43J31l8j58K72l8j71
$$ -11 97 -96 -201 -106 -96 161 -173 -156 116 -134 77 -128 -177 50 327 -116 15 -23 -181 91 53 -118
7047a18K16j57j8J56k45J83j70J79k39L40k0j84KK81j87n4j22J41J09j25J09o1
$$ -118 98 -59 -77 79 -166 17 -153 26 -213 127 107 -77 -75 206 19 -35 -157 -16 93 -32 77 16
7069A6J60j39J18j78r0J91R4j29p9l3J73K2p2K8k86M58k42R8J63k71P2J52o8m23
$$ 16 176 37 155 -23 -113 78 172 43 -36 -69 104 126 54 82 -204 254 12 110 273 2 74 226 158 -265
7093b65M78P7l44L9J15q4Q9j96K11Q6m7p0j77l7J90j33R9n5N8k1m6j09L84l83
$$ -265 213 290 -54 -15 100 16 105 -91 120 206 159 89 -88 -125 65 -68 31 -24 34 13 -33 -142 242 -141
7117a41K24n2p0j4Qj24K11k39J52K24O8m40K24n0P2n4R0J13j86Q2k04k4n3J99
$$ -141 83 31 -39 -53 -45 -169 42 -197 -45 179 247 -193 31 -19 53 -1 89 202 16 98 -106 -130 -183 16
7141A6K45p9k39J23j73J55J71l94M63l34J82j80J24l03K7NjK26j6N6l26L70n3
$$ 16 261 182 -57 66 -107 48 219 -175 288 -46 136 -44 80 -223 -196 -191 -192 34 18 74 -252 118 65
7164F5j25J20q3J17J7N0j55J12J20j32k31N1J70j06o7J38j27K41k8J13j78k04
$$ 65 -60 60 -23 94 111 161 6 118 238 106 -125 -74 96 -10 -77 61 -66 175 147 260 82 -122
7186a22J46lq5R6r3O5O9m3q8R5j65L24k62L18o2k81J31r8J55N2k19J10r8j04K86
$$ -122 24 21 -64 32 -61 4 73 30 -58 37 -128 196 -66 252 190 -91 40 -58 97 149 -70 40 -58 -162 124
7211A24l11nM0J40k4L0p8K8rP5q3K5p2K29p9j92O2O4O3n1J30j15m8L24k67j05
$$ 124 -187 -192 -152 -12 -36 -6 -84 -56 -65 10 -73 -48 -120 109 30 -162 -100 -36 27 -24 106 -9 -57 267 0 -105
7237a05J23k88K09L11K7l42r5K57L5j34J08k35L48k60O2J38k72kJ66j54oJ83O0
$$ -105 18 -270 -61 250 277 -65 -160 97 132 -2 106 -129 219 -41 21 159 -113 -115 51 -103 -109 74 134
7260A34N3k64J85M6r6L7j84j80M37j21j77J08P3n7J3K39k29j75K65n4J7J07m37
$$ 134 187 -77 108 154 58 95 -89 -269 168 47 -130 -22 51 -6 7 246 17 -158 107 53 70 177 -260
7283b60Q9J48N6M9j69N7k8m3l3j68M32j28L75k08k34K41l19K2L52m37L45k7j72
$$ -260 -171 -23 33 82 -87 -30 -58 -101 -134 -302 130 2 377 169 -65 176 -143 -121 231 -206 139 112 -60
7306f0J50m3q9j9J73j21o0O6k38L13J40J2j25J82j7k39J46r0j54L3M5pJ96m74
$$ -60 90 47 -42 -61 112 -9 -69 -3 -241 72 212 224 99 281 264 25 171 81 -73 -40 5 -2 194 -280
7330b80K31l0l5j69L84O4k9k09L3J59k45PJ05r1J0J8K44k53J48k28J38n8m3K61
$$ -280 -49 -79 -114 -283 101 165 136 -73 -40 119 -126 -119 -14 -105 -95 -77 167 -86 62 -166 -28 -86 -129 132
7354A32l45L08j91J97%L4L7j08J05j10J7j68m5K09k36P6nJ54k69L08P5r3j43P8
$$ 132 -213 95 -96 101 101 135 172 64 169 59 76 -92 -137 72 -164 -88 -93 61 -208 100 175 82 -61 17
7378A7j00P7J79l42m1L93q4L3l23J26J18l0q0k10J84n3K30r8k76L21R5k35K03
$$ 17 -83 -6 173 -169 -210 183 99 132 -191 -65 53 23 -57 -267 -83 -136 94 -4 -280 41 136 -99 104
7401A04k02O8J7j49J81O7j33k5J57p3k94J35k1K76k38NJ20j80j11L72q3N4j1j12
$$ 104 -98 -30 -13 -162 19 86 -47 -72 85 12 -282 -147 -168 108 -130 -125 -5 -185 -296 76 -7 47 36 -76
7425g6N7J20N2L7j30j35J69j75N9r9J64j69n2L38j4OJ1j67K04k28L39k22L8l87
$$ -76 -19 101 153 190 60 -75 94 -81 -22 -121 43 -126 -178 160 146 152 163 -4 200 -28 311 89 127 -260
7449b60J89L66l47K24j54j35L00k91K29r1j69L78j33P1k30P2j3K87k89l9O3K4
$$ -260 -71 295 -52 172 18 -117 183 -108 121 30 -139 239 106 177 -53 19 6 293 4 -35 28 52
7471E2j39K90k44O9J71j14j87J90p5l90L19J14J43j38j67P7j99K38j64L4R4l13
$$ 52 -87 203 -41 28 199 85 -102 88 13 -377 -58 56 199 61 -106 -29 -228 10 -154 -120 -26 -339
7493c39N31j00j95L8j95J90k47M25K00k86k64J55J58J01j39j27P0j79J65j11J01
$$ -339 192 92 -103 -65 -260 -70 -317 108 308 22 -242 -87 71 172 33 -94 -24 -203 -38 -149 -48
7514d8J28j36J11mj32J29j78QO1k8J24j92N2Q2L6o2l4J66j15O5j17J62J1J08k66
$$ -48 80 -56 55 51 -81 48 -130 -122 -61 -89 35 -157 -105 -23 13 -49 -83 83 -32 33 -84 78 89 197 -69
7539f9K70k07L8m9J91k71J41k1o2j40J96p5o3O0J24J05j15j96J71k9J51j81P3
$$ -69 201 -6 32 -17 174 -97 44 23 -39 -179 17 -58 -121 -61 63 168 53 -143 28 -1 150 -31 42
7562D2M1j91K9o4K57o0j59M3%p6K97k63O0q6J04J04j81o9K66k68L39j52J00m66
$$ 42 83 -108 -79 -143 114 54 -105 -62 -62 -138 159 -104 -44 -130 -26 78 -103 -172 94 -174 165 13 113 -353
7586c53L50J03q1Mo7p8J97J6j00j59J97l2q8J6N3K42l77K60j0k47L88j48l5L9
$$ -353 -3 100 19 23 -44 -122 75 91 -9 -168 29 -3 -91 -75 -22 220 -157 103 93 -154 234 86 51 90
7610I0P7l6k72J8L72n9k1m4k83l0K09k9M4j97K05O8k27K58l31M06j09j8%j59J83
$$ 90 167 131 -141 -123 249 190 169 125 -158 -188 21 -8 36 -161 44 112 -115 143 -188 218 109 91 91 -68 115
7635A15J10j46q6L6j18P1J41Jl43K96l41J07J42J36k67M16r3m7%j09r5M3Q7K67
$$ 115 225 79 -7 29 -89 -18 123 124 -219 77 -264 -157 -15 121 -146 270 177 130 130 21 -74 -31 56 323
7659C23m06J9nJ7O9j73N4N8J47j50J91m7j45j14M45m43K65J24l00K71k72K04k16
$$ 323 -83 -64 -69 -52 17 -156 -102 -44 103 -47 144 97 -48 -162 283 -160 105 229 -71 200 -72 132 -84
7682h4K63j45j58n0J14j56K5M16j98K11k12q5J23K04j69M3j11j74L26l14J55L7
$$ -84 179 34 -124 -174 -60 -216 -191 225 27 238 26 -59 64 268 99 142 31 -143 183 -131 24 61
7704F1j53k9L0K87j51J13l36M21j78l8j07J58J39j91l10L3K79K38j47M0k34OJ34
$$ 61 -92 -121 -91 196 45 158 -178 243 65 27 -80 78 217 26 -284 -251 28 266 119 159 -75 -69 65
7727F5R3l82L01n15N52o9J30j65k38L41j38j04j50L74j07K04l61L45j58j24Q9
$$ 65 158 -224 77 -438 114 45 175 10 -228 113 -25 -129 -279 95 -12 192 -169 176 18 -106 -17
7748a7N7j4j52K67M5n0p1Ol23P0K13o5j98K57o1J99j37j11k0r0J2J56K59m98M50
$$ -17 40 26 -126 141 186 136 65 71 -252 -182 31 -34 -232 25 -36 163 26 -85 -105 -195 -183 -27 232 -266 184
7773A84J05l17R1m2J05k32MJ37j38L03j86J83k66j92K36K7q5O4J18j46q7P4J58
$$ 184 289 -28 63 21 126 -106 -102 35 -103 200 14 197 -69 -261 -25 2 -83 -19 99 -47 -134 -60 98
7796I8j83J49k39K89J65m85K18Q6j03k10L80j80J09l96M11lJ6J78m42J56O1q1
$$ 98 -85 64 -175 114 279 -206 12 98 -5 -215 165 -15 94 -302 109 106 122 300 -142 14 75 -6
7818fj92J20mJ03k9P2j94m9q4K57l60J47K46k68J91k35L33K4o0m3L7J03k08K29
$$ -6 -198 -78 -82 21 -8 64 -130 -179 -263 -6 -366 -219 27 -241 -50 -285 48 72 12 -31 6 109 -99 130
7842A30L3k86J74q8R7pj20k4j12J27M0J31J13m6k07J66J76j78j22J93n7j88j52
$$ 130 163 -123 51 -37 60 53 -67 -91 -203 -76 -36 95 208 162 -45 121 297 119 -3 190 133 -55 -207
7865b07L67j95K99k09l52K70J91k80J89J13k85Kj6P5QJ20P9l53P1l0K27k52j08
$$ -207 160 -35 264 55 -297 -27 164 -116 73 186 -99 -97 -113 -38 -30 90 169 -184 -113 -143 84 -168 -276
7888b76L47j18J62l15K88L8N1l2n03L93j15J04K9k8k10K45j61M6J17j16K95k95
$$ -276 71 -47 115 -200 88 126 177 145 -358 35 -80 24 53 25 -185 60 -101 -55 62 -54 241 -54
7910e4K58k49J57l14Q9n6N9OJ30j09l2P1J19J78l49o9j59L08qJ23k73M68j85J24
$$ -54 204 -45 112 -202 -113 -169 -110 -104 26 -83 -115 -44 75 253 -96 -165 -324 -16 -24 99 -174 294 109 233
7934B33l28J92j33K51l37j03O4j19O10m74J24O5J6J17l24J45k06K17j2j37K50
$$ 233 -95 97 -36 215 -122 -225 -161 -280 330 -144 -20 45 61 178 -146 -1 -207 10 -2 -139 111
7955A11k22K56j63j94L42j70J41j39KK03k25jJ76m16K41q3J77J22j35O8L8oNj0
$$ 111 -111 145 -18 -212 130 -40 101 -38 -36 167 -58 -59 117 -299 -58 -141 36 158 23 91 129 123 128 118
7979A18J21r9p5J1k25N07k73J25j17k35M8J29o0R4O9k8j18K6k0L4j34J46r0j09
$$ 118 239 140 65 76 -149 358 85 210 93 -142 -94 35 -25 69 138 110 -8 18 -2 32 -102 44 -46 -155
8003a55J06M0L04o5j85l54L22L3Ok7l30L55M6l45J51K4J59j72l3M15p9m39J2L98
$$ -155 -49 -9 295 230 45 -309 13 46 52 25 -305 50 96 -249 -98 -74 85 -87 -120 295 216 -223 -211 187
8027A87k60m5j12J85K02L7nl47J14O5j9p4j10q4M88j61K3J12M4p5j39k24K21j56
$$ 187 -73 -118 -230 -45 157 194 189 -158 -44 21 2 -72 -182 -266 222 61 84 196 240 165 26 -198 23 -133
8051a33J32j26J82j60p8J58O8l0lO3P2k2k51J33Q8j91K48r2j64L97j92p7J28R6
$$ -133 -1 -127 55 -105 -183 -25 43 13 10 73 145 123 -128 5 93 -98 150 58 -106 291 99 22 150 246
8075B46k00m0M0o6N6p8K08j52l7R5r7M9j02J05Kj50K69o3j57m6O0j21K52J2MN5
$$ 246 46 6 46 -20 36 -42 166 14 -23 72 -25 24 -78 27 29 -121 148 85 -72 -118 -58 -179 73 85 89 144
8101A44k51J47nJ40n1j06j7j0N9j10k09K72J02m3P4j41q5oJ02O0J39l62K48j32
$$ 144 -107 40 35 175 124 18 1 -9 50 -60 -269 3 105 62 136 -5 -90 -96 6 66 205 -157 91 -41
8125d1p3R7J00q8r7M4OK86j31j20j5p6oK17k29O5r9Q8L67l53j35K68P2j42j26
$$ -41 -114 -17 83 -5 -102 -58 -52 234 103 -17 -32 -108 -114 103 -126 -61 -160 -72 295 -58 -193 75 147 5 -121
8150a21L9l5K93j76M5o1k1qJ31Qn8q5L3j76K26J79j89K47k64q0N7j77K08l57K30
$$ -121 -82 -117 176 0 45 -16 -37 -45 86 94 36 -49 -16 -192 34 213 24 271 7 -73 -16 -193 15 -342 -112
8175a12n0J21J78j92r1J08K67k10J08j16n3J12M2j45j94J32
$$ -112 -162 -41 137 -55 -146 -38 229 19 127 11 -42 70 112 -33 -227 -95
8191i5
$$ Imaginary data points
##PAGE= N=2
##DATA TABLE= (X++(I..I)), XYDATA
0@%%%%%%%%%%%qJ6j6J6j6J6k3L1l2L8m6N5o3P2q7R9j12J28j46J67j89K14k42K71
$$ 0 0 0 0 0 0 0 0 0 0 0 0 -8 8 -8 8 -8 8 -15 16 -16 22 -24 31 -32 40 -47 52 -60 68 -78 89 -100 114 -128 143
35A43l06L43l83M27m72N26n84O43p11P87q68R56j053J159j277J407j550J709j887
$$ 143 -163 180 -203 224 -248 278 -306 337 -374 413 -455 501 -552 607 -670 737 -813 896 -991
54i91K088k317K582k888L246l677M201m857N705o837Q432j0830J4794k2400M1591
$$ -991 1097 -1220 1362 -1526 1720 -1957 2244 -2613 3092 -3745 4687 -6143 8651 -13749 27842
69B7842j67109k34669O48019j02850m59474M32140J94341n38536M5063L56022
$$ 27842 -139267 -373936 274083 171233 -288241 143899 338240 -200296 -155233 200789
79B00789k80496j37379M10755j6798k69769J70018P3788k46093J8667J76732n2993
$$ 200789 -79707 -217086 193669 176871 -92898 77120 150908 -95185 -76518 100214 47221
90D7221r7503J05943L4829k05872J4806K14965j26700p6246K79232p2768l09345
$$ 47221 -50282 55661 90490 -115382 -100576 114389 -12311 -88557 190675 117907 -191438
101a91438J74726J24187l25316Q0615L80223k35156j94841L64574j03165l65106
$$ -191438 -16712 107475 -217841 -137226 242997 7841 -187000 177574 74409 -290697
111b90697K95329J60138l11480J11523K23131k45924r4850K01116o0000j01698
$$ -290697 4632 164770 -146710 -35187 187944 -57980 -152830 48286 -11714 -113412
121a13412J71509L3297j27467N4876J3287j01807M9448N0205l7441K4284J4347
$$ -113412 58097 91394 -36073 18803 32090 -69717 -20269 29936 -7505 16779 31126
132C1126k8079k6026k037N8106j602l9325P3823J609j26781K6673Q5945r4590
$$ 31126 3047 -22979 -25016 33090 31488 -7837 65986 67595 -59186 -32513 53432 -41158
144d1158k4496J58419m2666j38766J32918L1902j72890R9261J03882j63906J3520
$$ -41158 -65654 92765 50099 -88667 44251 76153 -96737 2524 106406 -57500 -43980
155d3980R8282j22520j5646J27699l5795k9931J02494m0368j07594O8668J139
$$ -43980 54302 -68218 -83864 43835 8040 -21891 80603 40235 -67359 1309 2448
166B448r9188R4377P0298r8909K9416N8187q1429j4181O3231N525k3559L085J7149
$$ 2448 -96740 -2363 67935 -30974 -1558 56629 -24800 -38981 24250 29775 6216 9301 26450
179B6450l3743m9615L1052M2760j7253O180N6743k0301q4588K8539L0456q3877
$$ 26450 -7293 -56908 -25856 16904 -349 5831 62574 42273 -42315 -13776 16680 -67197
191f7197L9503Q9160p7243m639P1742p3216k6589Q0800k7860l5780O8613j0635
$$ -67197 -27694 61466 -15777 -20416 51326 -21890 -48479 32321 4461 -31319 37294 26659
203B6659p8819M7669L4616q1957L9926P8670q0884r245P4642n5868l4762N9508
$$ 26659 -52160 -4491 30125 -51832 -11906 66764 -14120 -23365 51277 -4591 -39353 20155
215B0155k849l5055J3638J9423j9325j6668K7186J0344j7653K889P007n376j8708
$$ 20155 17306 -17749 -4111 15312 -4013 -20681 6505 16849 -804 2085 9092 3716 -14992
228a4992L664K8365j9623o760L4257l2925j5669M1454k5501n883N1226k4355l3017
$$ -14992 -11328 17037 -2586 -9346 24911 -8014 -23683 17771 -7730 -13613 37613 13258 -19759
241a9759L3821r116n0637L2388M7115m7781P75O5667n3047m5169O3772j4744m1903
$$ -19759 14062 4946 -45691 -13303 33812 -13969 -13194 52473 -574 -45743 18029 3285 -38618
254c8618M8953J5707l4512L25J3896j2688j3743K2315J2358j1993J0189k780j6664
$$ -38618 10335 26042 -8470 -8145 5751 -6937 -20680 1635 13993 2000 12189 9409 -7255
267g255L218n195J443J1768o19J0370p415j1209J7559j9985j3911L6506r789k4357
$$ -7255 -4037 -9232 -7789 3979 3360 13730 6315 -4894 12665 -7320 -21231 15275 5486 -18871
281a8871K9135P417l5148L81L3425j9430k6497M6003M395m4613K9398J5463l9700
$$ -18871 10264 17681 -17467 -17086 16339 -3091 -29588 16415 20810 -23803 5595 21058 -18642
294a8642R348J7093j3058J598J1246K861o386J269J791j3845P456N429j4730J5480
$$ -18642 -9294 7799 -5259 -3661 7585 10446 4060 5329 7120 -6725 731 6160 -8570 6910
308F910P940j8754N022K513o638k467k499J6618l264j9095K0000O36k7750R703
$$ 6910 14850 -3904 1118 3631 -3007 -5474 -7973 8645 5381 -13714 6286 6922 -20828 -11125
322a1125J6806j0246q101J7406Q663k8284L292K2308k3074Q52K5466j1167m88
$$ -11125 5681 -4565 -12666 4740 13403 -14881 -11589 10719 -12355 -11503 13963 2796 2308
335B308P345j1603j68m84l753N416P783N672p496K993Q122k2727k702J7406j3266
$$ 2308 9653 -1950 -2118 -2602 -6355 -939 6844 12516 5020 8013 16135 -6592 -9294 8112 -5154
350e154j443J3801l63j938p386N298P909j8817L999J6065j5424p618Q857J197
$$ -5154 -6597 7204 6841 4903 -2483 2815 10724 -8093 -4094 11971 -3453 -11071 -2214 -1017
364a017q393p65J9355k509j2636J4581o011j6256O970p012n26J2744o303P041
$$ -1017 -9410 -10175 9180 6671 -5965 8616 2605 -13651 -6681 -13693 -14219 -1475 -7778 -737
378g37J2570r935m701L494k18j0627k806J7900m485p932J9470j429r699N887j665
$$ -737 11833 1898 -2803 691 473 -10154 -12960 4940 455 -7477 11993 10564 865 6752 5087
393E087L595k715n808J4489n235j4650J1448J620p870M017Q041K761j1696j541
$$ 5087 8682 5967 159 14648 9413 -5237 6211 7831 -39 3978 12019 14780 3084 1543
407A543L355j4274M09O309k150J0612o517q089J2146j5189j1108K0179j24p540
$$ 1543 4898 -9376 -8967 -2658 -4808 5804 -713 -8802 3344 -11845 -22953 -2774 -2898 -10438
421a0438R193M412j0792j1118Q694L705q667J4326O545n865M952q067N60R041
$$ -10438 -1245 3167 -7625 -18743 -10049 -6344 -15011 -685 5860 -5 4947 -3120 -2560 6481
435F481j2266N052J3226j3435j721P568p78M32K150P990K48j0282m32k298j920
$$ 6481 -5785 -733 12493 -942 -2663 4905 4127 4559 6709 14699 14947 4665 4233 1935 15
450A5q56k892J5561j318j6907J9388K366k3221J3995P067j9548j473M594m354
$$ 15 -841 -3733 11828 10510 -6397 12991 15357 -7864 6131 13198 -6350 -7823 -3229 -7583
464g583l380J0063R716m400K360l939j4397M765o498o522K2516j801j0751J3250
$$ -7583 -10963 -900 8816 4416 6776 2837 -11560 -6795 -13293 -19815 2701 900 -9851 3399
478C399n824j0053O950K966N291J050n245J18n156o388K212J3334J0706q811Q659
$$ 3399 -2425 -12478 -5528 -2562 2729 3779 -1466 -1348 -6504 -12892 -10680 2654 13360 4549 13208
493A3208O682l0691j73J8650j5737O982K0266j0683n564J12p795Q6O111L387K67
$$ 13208 19890 -10801 -10974 7676 -8061 -1079 19187 8504 2940 3052 -4743 -4657 1454 4841 5108
508E108N027n495j7707Q473M375j4825J8440J1009j9189N238J012j2295Q414L044
$$ 5108 10135 4640 -13067 -4594 -219 -15044 3396 14405 -4784 454 1466 -10829 -2415 629
522F29M56Q836o633q711K826P34n414O741J7006r527r832J4543j3199j2377J9620
$$ 629 1085 9921 3288 -5423 -2597 -1863 -7277 -536 16470 6943 -2889 11654 -1545 -13922 5698
537E698l759l994J2034j2649l951Q372r378L385J6597m488j2620M520k74k0466
$$ 5698 1939 -2055 9979 -2670 -6621 1751 -7627 -4242 12355 7867 -4753 -233 -507 -20973
551b0973O162K2601j0703K787J5345j7843n629N374r704J0680Q441r045O728n9
$$ -20973 -14811 7790 -2913 -126 15219 -2624 -8253 -2879 -12583 -1903 6538 -2507 4221 4162
565D162j5570J185J3025L0l240J3705l80k1547M185K751r941J5206M896m699J2752
$$ 4162 -11408 -10223 2802 2832 -408 13297 12917 -8630 -4445 -1694 -11635 3571 8467 3768 16520
580A6520j3296j3336J6697n044r682J8831N803j8030j748J1216j0985o533K1247
$$ 16520 3224 -10112 6585 1541 -8141 10690 16493 -1537 -3285 7931 -3054 -9587 11660
593A1660j756r875R092j0963o546J0027j0469N594J6085j6644m100J2190j1431
$$ 11660 9904 29 9121 -1842 -8388 1639 -8830 -3236 12849 -3795 -7895 4295 -7136
606g136q242J4591O947j1283Q58P870j2985l661J0720k904P848L294j2339J0745
$$ -7136 -15378 -787 6160 -5123 -4265 3605 -9380 -13041 -2321 -5225 2623 5917 -6422 4323
620D323k020j9181J7870J0971j5625O230J0083j3217r427J0882M314o774R919
$$ 4323 2303 -16878 992 11963 -3662 2568 12651 -566 -9993 889 5203 -1571 8348
633H348L552j1660L128o393o882J6902o070o313K0695r573j8644J3422K950j1435
$$ 8348 11900 240 3368 -3025 -9907 6995 925 -5388 15307 5734 -12910 512 3462 -7973
647g973O481J2854o374j0210N537k302o210Q245P44L446O213j5618K236R973j7982
$$ -7973 -1492 11362 4988 -5222 315 -1987 -8197 48 792 4238 10451 -5167 -2931 7042 -10940
662a0940M115J8620j0874n259R248m558q895L980P799k863N15L308p824K147m82
$$ -10940 -6825 11795 921 -4338 4910 352 -8543 -4563 3236 373 888 4196 -3628 -1481 -1963
677a963j0212J5505M456j7221J3067N618k0455N173J2121o727j963P512L83r552
$$ -1963 -12175 3330 7786 -9435 3632 9250 -11205 -6032 6089 -638 -2601 4911 5294 -4258
691d258M03M499l306N271M66l093Q548j0111p977J5448o318p476J5800j805r948
$$ -4258 -3855 644 -2662 2609 3075 -18 8530 -1581 -9558 5890 -428 -7904 7896 6091 -3857
706c857M056R44l068J05M149J670j383L83n399J684N006j1011O624J2933j6228
$$ -3857 199 1143 -1925 -1820 2329 3999 2616 2999 -2400 -716 4290 -6721 -97 12836 -3392
721c392m1J3529j3500l683J1223k198m279J788J983l873k407L477k001L376J841
$$ -3392 -3433 10096 -3404 -7087 4136 1938 -2341 -553 1430 -2443 -4850 -1373 -3374 2 1843
736A843q039O475J650j3524R547O365j1192O096M938o023K31J125J855Q56j592
$$ 1843 -6196 279 1929 -11595 -2048 4317 -6875 -779 4159 -1864 -1633 -508 1347 2203 611
751F11K138M17n86k819o35R291n924m909J3780p031j0447J1896l243o902P020
$$ 611 2749 3166 2580 -239 -874 8417 2493 -2416 11364 4333 -6114 5782 2539 -4363 2657
766B657k41j461P4j738k74m08K08k181J318N283q411l59J0181j0322j927J1575
$$ 2657 2416 955 1029 -709 -983 -1391 -1183 -3364 -2046 3237 -5174 -5533 4648 -5674 -7601 3974
782C974o173k866N745k489J09r16l41M225k147m91J697J110p39m917N623K945
$$ 3974 -2199 -5065 680 -1809 -1700 -2616 -2957 1268 -879 -1370 327 1437 698 -4219 1404 4349
798D349r569O753N441r083M123K449m786L171k303o38M623k986p91L760L33l982
$$ 4349 -5220 1533 6974 -2109 2014 4463 -323 2848 545 -93 4530 1544 753 4513 4846 864
814H64k115O837m272p477J1327r51r727Q524l55n820L108j662L48Q41l458J856
$$ 864 -1251 5586 1314 -6163 5164 4213 -5514 3010 2655 -3165 -57 -1719 -1371 -530 -3988 -2132
830b132Q59k150q57P60M541l689j897Q099n348n095P241k920k37L334q83N118
$$ -2132 -1273 -3423 -4280 -3520 1021 -2668 -4565 3534 -1814 -6909 332 -2588 -2825 509 -374 4744
846D744j195n007N642j381o168L162M326j248m016N862L077j0196L121N589r052
$$ 4744 3549 -1458 4184 2803 -3365 -203 4123 2875 -1141 4721 7798 -2398 723 6312 -2740
861b740K274L256n052L155j552k903N193k228k550L590R46l051l645M909L42q162
$$ -2740 -466 2790 -2262 893 -659 -3562 1631 -597 -3147 443 1389 -1662 -5307 -398 -56 -8218
877h218P539M283o920M536J782l358J035m007K364L913o054L764N411m351p35
$$ -8218 -679 3604 -3316 1220 3002 -356 679 -3328 -964 2949 -3105 659 6070 1719 984
892I84J683Q79m517j658P079l379k707O094l326r27K799n810M340J933p437M853
$$ 984 2667 3546 -971 -2629 4450 1071 -1636 4458 1132 205 3004 -2806 1534 3467 -3970 883
908H83L415p258J39L778m93m883K907O304p914j217O244o830l43L863k445M411
$$ 883 4298 -2960 -2821 957 464 -4419 -1512 4792 -3122 -4339 1905 -4925 -5268 -1405 -3850 561
924E61j052l323N111l831m391L982J119j43O98L503K070n785J443K363m733L284
$$ 561 -491 -3814 1297 -2534 -6925 -2943 -1824 -1967 -1269 2234 4304 -1481 -38 2325 -2408 876
940H76P45N68N212o050M98P126q228j055Q629l811m316L525J189m932k072O577
$$ 876 1621 2189 7401 1351 1849 8975 747 -308 8321 4510 194 3719 4908 -24 -2096 4481
956D481k011l451N923k878l064K049o804J704M259o587L537N795n329j248K304
$$ 4481 2470 -981 4942 2064 -1000 1049 -5755 -4051 208 -6379 -2842 2953 -2376 -3624 -1320
971a320o97l524p28N383k307j789M757j145L81o9k272N635l069n168R139j531
$$ -1320 -2017 -5541 -6269 -886 -3193 -4982 -225 -1370 -989 -1058 -3330 2305 -764 -5932 3207 1676
987A676o635P228Q37m606J405K330K38k520K376J311l243J885k549j589P371n177
$$ 1676 -4959 2269 3106 -1500 -95 2235 2473 -47 2329 3640 397 2282 -267 -1856 5515 338
1003C38j119J0259o475n649O818k772m320L868L548p75k964K207j494n094J962
$$ 338 -781 9478 3003 -2646 4172 1400 -2920 948 4496 3721 757 2964 1470 -3624 -1662
1018a662N17J451L051m384K159J224r811K643N333n086L216M105k532j376k556
$$ -1662 -1145 306 3357 -1027 1132 2356 -7455 -4812 521 -4565 -1349 2756 224 -1152 -3708
1033c708j52J158K48K221R85K230l403n344O800j394o906J1579J594r448N588
$$ -3708 -3860 -2702 -2454 -233 752 2982 -421 -5765 1035 -359 -7265 4314 5908 -3540 2048
1048B048R86o769J451K839N15k13O53L50k387Q91j390p07N953l926l188P821m766
$$ 2048 3034 -3735 -2284 555 1070 857 1510 1860 -527 364 -1026 -1733 4220 294 -2894 4927 161
1065A61l855P087j532j868J782j361J238j376r95L821N00k243j876J546p29n584
$$ 161 -3694 3393 1861 -7 1775 414 1652 276 -719 3102 3602 1359 -517 1029 300 -5284
1081e284N926N974q465L278M144j0676L80L895l307L403L051k488J97j729l129
$$ -5284 642 6616 -1849 1429 5573 -5103 -4723 -828 -4135 -732 2319 -169 28 -1701 -4830
1096d830p30N112J417l425O321o22j1015M457L249n215O475M877k456j03m145
$$ -4830 -5560 -448 969 -2456 3865 3243 -7772 -3315 -66 -5281 1194 6071 3615 3512 -633
1111f33j712Q12k164M071M456J57k667r33J042n052j089P981k766k094N338n574
$$ -633 -2345 -1533 -3697 374 4830 4987 2320 1387 2429 -2623 -3712 4269 1503 -591 4747 -827
1127h27k033L498l369L736L818n136k75K144m549k550N232L619n976K467N764
$$ -827 -2860 638 -2731 1005 4823 -313 -588 1556 -2993 -5543 -311 3308 -2668 -201 5563
1142E563r273p04O905m469P4L413l520N16l35j386M487N79j152M09o33l023l398
$$ 5563 -3710 -4414 2491 -1978 -1904 1509 -2011 -1495 -1830 -3216 1271 1850 698 1107 474 -2549 -5947
1159e947M234M004k192N214Q06o224K66l056p29O834j959J253O453p350m822L981
$$ -5947 -1713 2291 99 5313 6119 -105 161 -2895 -3624 3210 1251 2504 8957 1607 -3215 766
1175G66p67k264M491N524n796n345L929n081l052R370Q0J0L402p245k959J102
$$ 766 -1 -2265 2226 7750 1954 -3391 538 -4543 -7595 1775 1855 1865 5267 -1978 -4937 -3835
1191c835m542L049O553P29m92k97m16n118j587N832k71j43M111k641n25q50j870
$$ -3835 -8377 -5328 1225 1954 1462 1165 749 -4369 -5956 -124 -395 -538 3573 932 407 -443 -2313
1208b313O227p12l567N930k993o252K906K291j316J249L624r24m908J647o03l793
$$ -2313 3914 3202 -365 5565 2572 -3680 -774 1517 201 1450 5074 4150 -758 889 286 -3507
1224c507M729n72l173N543l903l467P112j556l135L680p10m877k128L642J037
$$ -3507 1222 650 -2523 3020 -883 -4350 2762 1206 -1929 1751 1041 -3836 -5964 -2322 -1285
1239a285j415N913J680n166k62k850j788K352o97M856L969n420Q88O08m605J247
$$ -1285 -2700 3213 4893 -273 -535 -3385 -5173 -2821 -3518 1338 5307 -113 775 1383 -3222 -1975
1255a975L001R93Q29j245r19k127q5J866O56M781Q83o128K613k266p910N487L946
$$ -1975 1026 2019 2848 1603 684 -1443 -1528 338 994 5775 6658 530 3143 877 -7033 -1546 2400
1272B400k671L529K673l614m145m83P06k929K126L248k441J204l39k905L461j706
$$ 2400 -271 3258 5931 2317 -1828 -2311 -1605 -4534 -2408 840 -1601 -397 -736 -3641 -180 -1886
1288a886k009M674k116k280J991o25P30Q24N63K385j796q62J219m26L91j145J963
$$ -1886 -3895 779 -1337 -3617 -1626 -2251 -1521 -697 -134 2251 455 -407 812 386 777 -368 1595
1305A595K190n132K628M658n956J346M337m708j473J417j325N24J331J873m64
$$ 1595 3785 -1347 1281 5939 -17 1329 5666 958 -515 902 -423 101 1432 3305 2841
1320B841r14m82m155J3K323l403M213M055n228J151R63m752l1J181J370N61j394
$$ 2841 1927 1445 -2710 -2697 -374 -3777 436 4491 -737 414 1377 -3375 -3406 -2225 -855 -294 -1688
1337a688K123r67l336J752J202M36R1j86K204l715l322M904j732l37N530p96o74
$$ -1688 435 -532 -3868 -2116 -914 -478 -387 -573 1631 -2084 -5406 -502 -2234 -2571 2959 2163 1489
1354A489J016l217l88K1p75J791K053J535j923K21L022n078j188N623m146j403
$$ 1489 2505 -712 -1100 -1079 -1854 -63 1990 3525 1602 1823 4845 -233 -1421 4202 56 -1347
1370a347M528j680j434R52k21P15j941R01J549k393l8j72k70L01k284J833K331
$$ -1347 3181 1501 67 1019 798 1513 -428 473 2022 -371 -409 -581 -851 -550 -2834 -1001 1330
1387A330k777K136J150l185R80j676m01K396j810Q90L379k201j484J250J69k309
$$ 1330 -1447 689 1839 -1346 -366 -2042 -2443 -47 -1857 -967 2412 211 -1273 -23 146 -2163
1403b163o38N004j060l512M513j420m486L187k78o89K408l14O31n9k131l40r7
$$ -2163 -2801 2203 1143 -2369 2144 724 -3762 -575 -853 -1542 866 552 1183 1124 -1007 -1347 -1444
1420a444R05j99N62L294j758k146K817j790j438K680J29R87q10j646J794j982
$$ -1444 -539 -738 -176 3118 1360 -786 2031 241 -1197 1483 1612 2599 1789 143 1937 -45
1436d5k158L771O1q26J173J046j629l546J688R76l703L011J893k996K265l46k631
$$ -45 -2203 1568 1629 803 1976 3022 1393 -2153 -465 511 -3192 -181 1712 -1284 981 635 -1996
1453a996K536j458j728K809k08j589N72J330j270k521L588P70l190K906J771l422
$$ -1996 540 -918 -2646 163 -45 -1634 -1062 268 -1002 -3523 65 835 -2355 551 2322 -1100
1469a100J060o06r68M12j538K563K051j990J523O86k231j118K92J573r32K1K853
$$ -1100 -40 -646 -1614 -1202 -2740 -177 1874 -116 1407 2093 -138 -1256 -964 609 -323 -302 2551
1486B551j829p14O96k030K368J819k665K945K57n135P10R80k102Q80L628J243
$$ 2551 722 8 704 -1326 1042 2861 196 3141 3398 -1737 -1027 -47 -2149 -1269 2359 3602
1502C602k941J55J114m353o64K848j745J660N04j493K039j793j293L147q09q75
$$ 3602 661 816 1930 -2423 -3087 -239 -1984 -324 180 -1313 726 -1067 -2360 787 -22 -897
1518h97J028k90j161o80R88J795j206J508N00j038O45k053J031J851l449Q05L262
$$ -897 131 -159 -1320 -2000 -1012 783 -423 1085 1585 547 1192 -861 170 2021 -1428 -623 2639
1535B639l889K34L625j618j170J049k59k247j012K401n94N49K172k088jQ4l720
$$ 2639 -1250 -1016 2609 991 -179 870 611 -1636 -2648 -247 -841 -292 1880 -208 -209 -125 -3845
1552c845J952K763j978K389J411k708j579j13K71N39P66K821q23j750k95j076
$$ -3845 -1893 870 -1108 1281 2692 -16 -1595 -1708 -1437 -898 -132 2689 1866 116 -179 -1255
1568a255P72M11M95L819k319l185K006k615j436M094Q97N76Q47j269j641j900
$$ -1255 -483 -72 423 4242 1923 -1262 744 -1871 -3307 787 1684 2260 3107 1838 197 -1703
1584a703j57M28J117K833j750o79K454m290o50M306j730j389K283j873j940j38
$$ -1703 -1860 -1432 -315 2518 768 89 2543 -1747 -2397 1909 179 -1210 1073 -800 -2740 -2878
1600b878J720J112L33J051l81k291l66j287J018K186j480K163P66l756J122J248
$$ -2878 -1158 -46 287 1338 957 -1334 -1700 -2987 -1969 217 -1263 900 1666 -2090 -968 280
1616B80m78J798L2o86q6k284l97K093J608P99M97J380m086l584L022p65j400N645
$$ 280 -198 1600 1632 946 860 -1424 -1821 272 1880 2679 3176 4556 470 -3114 -92 -857 -2257 3388
1634C388L35k853L20k184j929R35Q68K007Q11j155j341j882M99l15R07M428j485
$$ 3388 3723 870 1190 -994 -2923 -1988 -1120 887 1698 543 -798 -2680 -2181 -2496 -1589 2839 1354
1651A354j893R88l167j125J964J314K771N21j731M69k718j771J779J708N89j72
$$ 1354 -539 449 -2718 -3843 -1879 -565 2206 2727 996 1465 -1253 -3024 -1245 463 1052 880
1667H80J653r17l765J743K125k223K255J183l154J69o86j035K627O48k07J055
$$ 880 2533 1616 -2149 -406 1719 -504 1751 2934 -220 -51 -737 -1772 855 1503 1296 2351
1683B351r47k178j347K030L76j431L247n6m004O93P67j622K074O69L69k16l203
$$ 2351 1404 -774 -2121 -91 285 -1146 2101 2045 -1959 -1266 -499 -2121 -47 622 991 775 -2428
1700b428M96M06q53K045J687J56k066j178N14j577L86M332l67P6L19l163q9K85
$$ -2428 -1932 -1526 -2379 -334 1353 1509 -557 -1735 -1221 -2798 -2412 1920 1553 1629 1948 -1215 -1304 -1019
1718a019j271L770J958j679rj60j890j850K426K182k112R36J128m168m51K122
$$ -1019 -2290 1480 3438 1759 1750 1590 -300 -2150 276 2458 346 1282 2410 -1758 -2209 -87
1734h7m12J736O65r19L49k775j477J243N33M29J101R64n58j817M90P20r27J235
$$ -87 -499 1237 1902 983 1332 -1443 -2920 -1677 -1144 -715 386 1350 792 -1025 -535 185 -742 493
1752D93Qp66J10j942N67K937j906J388K392k707j463M50l77r94J134K226r90j265
$$ 493 501 -265 -155 -2097 -1530 1407 -499 889 3281 574 -889 -439 -816 -1810 -676 1550 560 -705
1770g05J489j498n85K425q58Q06M65l129l05P74r43J370K099N32o76j001K44j689
$$ -705 784 -714 -1299 1126 268 1074 1539 -1590 -1895 -1121 -2064 -694 1405 1937 1261 260 504 -1185
1788a185n58K099R8R6K79j333K62o77l31L263l57j046J493j436k529K64M32M80
$$ -1185 -1743 356 454 550 829 -504 -242 -919 -1250 2013 1656 610 2103 667 -1862 -1598 -1166 -686
1806f86O62J492K54j299K75n89q06J961j263n66K120k433j213K601k41n12J570
$$ -686 -24 1468 1722 423 698 109 -697 1264 1 -565 1555 -878 -2091 510 269 -243 1327
1823A327L73r70j713N29j84j930J638N13m37Q77r60O46P42j547J516N30k340N44
$$ 1327 1700 730 -983 -454 -638 -2568 -930 -417 -854 23 -937 -291 451 -1096 420 950 -1390 -846
1841h46m06l18Q15K50J299N10m88J77n50p2l03n91J642o73k224K877m57j921K905
$$ -846 -1252 -1570 -755 -505 794 1304 816 993 443 371 68 -523 1119 446 -1778 1099 642 -1279 1626
1860A626P42j245J43k64r21j395o3J121o85Q76R11q88J044p85q13J843j354p95
$$ 1626 2368 1123 1266 1002 81 -1314 -1377 -256 -941 -65 846 -42 1002 217 -596 1247 -107 -902
1878i02J590j472o52O88J28J407m80L89J103j220q29j84m42j6p43J171J261k165
$$ -902 688 -784 -1436 -748 -620 787 307 696 1799 579 -250 -434 -876 -892 -1635 -464 797 -1368
1896a368J519J415j986L90J130j765j20l0m10M11J42M12O47L25K10j122J209j40
$$ -1368 151 1566 -420 -30 1100 -665 -785 -815 -1225 -814 -672 -260 387 712 922 -200 1009 869
1914H69j907J178K03k066J241R26l35N33M3Q64j16j433O45k92j224L22L32M43
$$ 869 -1038 140 343 -1723 -482 444 109 642 685 1549 1433 0 645 353 -871 -549 -217 226
1932B26l41J02J483q19p43J459o98p01O79j216K48N00j012J080M50p8j90N12J52
$$ 226 -115 -13 1470 651 -92 1367 669 -32 647 -569 -321 179 -833 247 697 619 429 941 1093
1951A093j728j44J384k352J97J848j457K40J184o83L16k82k18K41p10k44L07l81
$$ 1093 -635 -779 605 -1747 -1550 298 -1159 -919 265 -418 -102 -384 -602 -361 -1071 -1315 -1008 -1389
1969a389R34l71O18J305j126O14M20j117M95r5m28P78o44L15J372j484N95R13
$$ -1389 -455 -826 -208 1097 -29 585 1005 -112 383 288 -140 638 -6 309 1681 197 792 1705
1987A705n24n88k4L90j222m71J509n62j068K009q32n75R33j057K01N10j110K20
$$ 1705 1181 593 569 959 -263 -734 775 213 -855 1154 322 -253 680 -377 -176 334 -776 -556
2005e56M25p22k07L31P41k83k17J561j261r85J421p60l49K32j95Q32Mp52J448
$$ -556 -131 -853 -1060 -729 12 -271 -488 1073 -188 -1173 248 -512 -861 -629 -824 8 12 -740 708
2024G08n84p33J395k82n70k29L39P9o76Q03Q01j098J204k56q52R73q22l89J295
$$ 708 124 -609 786 504 -66 -295 44 123 -553 250 1051 -47 1157 901 49 1022 200 -189 1106
2043A106q47n85J067n85o0KP42r4j244O27k85j399J043nk27P07l68K81n6j266
$$ 1106 259 -326 741 156 96 98 840 746 -498 129 -156 -1555 -512 -517 -744 -37 -405 -124 -180 -1446
2063a446J290K68j056Q48M9j10N0r40J034r6j40J070n31L21r9q77J113o0j271
$$ -1446 -156 112 -944 -96 -47 -157 -107 -1047 -13 -109 -249 821 290 611 512 -365 748 688 -583
2082e83K027R8j673N48ln98q0N60N83r06K40M75j574L47O89p30O58k85n95J151
$$ -583 1444 1542 -131 417 414 -184 -264 296 879 -27 213 688 -886 -539 150 -580 78 -207 -802 349
2102C49p64m34J248n18K24k55l87N34q70M07O89k70q9J68l26N53r34M43J278j835
$$ 349 -415 -849 399 -119 105 -150 -537 -3 -873 -466 223 -47 -136 32 -294 259 -675 -232 1046 -789
2122g89O94Q88j529J69J072l91M98k72N10m72p60R3l30P75Q38r42O13K42j966
$$ -789 -95 793 -736 -567 505 114 612 340 850 378 -382 -289 -619 156 994 52 665 907 -1059
2141a059J201N44j220N92P63l80n70n17M99m08j21J080k08o6k54m55K64j74n17
$$ -1059 142 686 -534 58 821 441 -129 -646 -147 -555 -676 404 196 130 -124 -579 -315 -489 -1006
2160a006J430m67o24J090r39k11Q82k84O75J01k82r2k77Rm12L55J149q66j70J208
$$ -1006 424 -43 -667 423 -516 -727 155 -129 546 647 365 273 -4 5 -407 -52 1097 231 61 1269
2180A269j512J66J230j045k48M36m58k44l99N77L87m69O56l94j44O3n60N16O17
$$ 1269 -243 -77 1153 108 -140 296 -162 -406 -805 -228 159 -310 346 -48 -192 -129 -689 -173 444
2199D44j304Q28M13j339N24K55j76Q78m84K91P3j150l5N20N1K3K54Q79m53j428
$$ 444 -860 -32 381 -958 -434 -179 -355 523 39 330 403 -747 -782 -262 -211 -188 66 945 492 -936
2219i36J425n35q70J575m34n26N83n83J14k1J24P69K7J03k61p47O96j238j22J590
$$ -936 489 -46 -916 659 225 -301 282 -301 -187 -208 -84 685 712 815 554 -193 503 -735 -857 733
2239G33o70o2R23l56m35J77l86P72p51j66P92j223L4M09J30N1j27M17M35j710
$$ 733 63 1 924 568 133 310 -76 696 -55 -221 571 -652 -618 -209 -79 -28 -155 262 697 -1013
2259a013O62O13r94M07Om81Q08L9l31R71q10j54L38k77j86j39P27J41q27Q81K07
$$ -1013 -351 262 -732 -325 -319 -800 8 47 -284 687 -123 -277 61 -216 -402 -541 186 327 -500 381 588
2280E88j060Q14m39j93P50p89P09k46o65N89J37n40Q15P7N01k89m95L48n51k53
$$ 588 -472 342 -97 -290 460 -329 380 134 -531 58 195 -345 470 547 1048 759 264 612 61 -192
2300a92Q58o32L69L40r85P98p1q56Q36K71q20J17J86k19r44K09N85n36L56J043
$$ -192 666 34 403 743 -242 556 485 -371 465 736 -84 33 219 0 -944 -735 -150 -686 -330 713
2320G13j015K60j22p92L94m89k05R31k16K4O74r8l0k45Q2L26o86L90L69n24N33
$$ 713 -302 -42 -164 -956 -562 -1051 -1256 -325 -541 -517 157 59 29 -216 -134 192 -494 -104 265 -259 274
2341B74r7Q4O22p49O01M34r18j8M35p30j17M69M74j8k90P24q76m85N99p68R2Q41
$$ 274 177 261 883 134 735 1169 251 233 668 -62 -179 290 764 746 456 1180 304 -181 418 -350 -258 583
2363E83r52P89O1r63N24K15o16PM30P6l88l01N28n57k78O04k22K42k7k84R37q68
$$ 583 -369 420 481 -482 42 257 -359 -352 78 154 -234 -535 -7 -564 -842 -238 -460 -218 -245 -529 408 -460
2385d60m23Q78n60N06L14m77K63k05M6J64k59N98Q1K5M79m02n83O13j108o8J334
$$ -460 -883 -5 -565 -59 255 -222 41 -164 -118 46 -213 385 466 491 970 568 -15 598 -510 -578 756
2406G56q02L93L87l18K3k38j96k00m51M15K19k63O14l13m30M19p27O52K74o49
$$ 756 -46 347 734 416 439 201 5 -195 -646 -231 -12 -275 339 26 -404 15 -712 -60 214 -435
2426d35K59l3n30M40j23M06K14j09J78k47P7o1m21M23j45P5P47k12p41R43n83
$$ -435 -176 -209 -739 -299 -422 -16 198 89 267 20 97 36 -385 38 -107 -32 715 503 -238 705 122
2447A22q26O97L5n4L03j0q6k6j88K09m60M53m26L0N84n55m26Q59m82m6O49k92
$$ 122 -704 -7 28 -26 277 267 181 155 -33 176 -284 169 -257 -227 357 -198 -624 235 -247 -293 356 64
2469F4J18j57l14K96k96j19M84j17J30Q7k32J29r20N86L80p72Q09O29o72Q6k67
$$ 64 182 25 -289 7 -289 -408 76 -41 89 176 -56 73 -847 -261 119 -653 156 785 113 199 -68
2490f8%k3j95J04P03l79L59l14J2M08q08O36K7o54K45R3m86J17K35k49M14l95
$$ -68 -68 -91 -286 -182 521 142 501 187 199 607 -201 435 462 -192 53 146 -340 -223 12 -237 177 -218
2512b18M90P3o36P3j92J9o4j05P27r6l26R37j119J01M42o76M40J74l97R19j64
$$ -218 272 345 -291 -218 -410 -391 -455 -560 167 71 -255 682 -437 -336 106 -570 -130 44 -353 566 402
2533D02n93J59J20l89J93M47J51o17K02L05p64M20K68k85M37K65o99K82o29J8
$$ 402 -191 -32 88 -301 -108 339 490 -127 75 380 -384 36 304 19 456 721 22 304 -325 -307
2553c07L18j32K08L14j18q9n43o0M75k90J05M27o6j33m12J48J95m73J73N26l94
$$ -307 11 -121 87 401 283 194 -349 -409 66 -224 -119 308 242 109 -303 -155 40 -433 -260 266 -128
2574a28J20K28k60k34p1O09m40k62O67l11j03L47m19J81K26j19J04K68k57Q2L3
$$ -128 -8 220 -40 -274 -345 264 -176 -438 229 -82 -185 162 -257 -76 150 31 135 403 146 228 261
2595B61l30J82j38L72l48k3O05o66j18O13o00J48Q7k87O17k94n01O69k82l59R8
$$ 261 -69 113 -25 347 -1 -24 581 -85 -203 410 -190 -42 45 -242 375 81 -420 249 -33 -392 -294
2616b94L15L74k23l21M74p36K41K0l6K58P1j6L35m63k61L04n18K73L38K31n74
$$ -294 21 395 172 -149 325 -411 -170 -150 -186 72 143 127 462 -1 -262 42 -476 -203 135 366 -208
2637b08r9KK01m07M28M65n97N97l55l35M73n66L36L69m55O84l01m09lJ15K53N6
$$ -208 -307 -305 -104 -511 -83 382 -215 382 27 -308 165 -401 -65 304 -151 533 232 -177 -180 -65 188 244
2659B44r8N54n36J41mn13K35J71k9K28J3m67K54M3n23L67L3k56K3k43M31jK6L68
$$ 244 146 700 164 305 301 -212 23 194 165 393 406 -61 193 236 -287 80 113 -143 -120 -363 68 67 93 461
2683D61p39L47k81m66Q56l63j69O14l71j83K59j07K85lqK3m33j19N5j08L59M4
$$ 461 -278 69 -212 -678 178 -185 -354 260 -111 -294 -35 -142 143 140 132 155 -278 -397 -342 -450 -91 -47
2705d7O10J35o97J53j74o98P41J19j53N65k10J66k62l20K13m2K51L34o42q0J66
$$ -47 563 698 1 154 -20 -718 23 142 -11 554 344 510 248 -72 141 99 350 684 42 -38 128
2726A28o35P66J83m95P78l85n69j43N6J70n1K63J33j39l03K4j40k0L54l31N63
$$ 128 -507 259 442 -53 725 340 -229 -372 -316 -146 -197 66 199 60 -243 -219 -359 -379 -25 -356 207
2747B07m71m9O00m65J99j18K88j64k7l02N46k98J98J30r4K51p06r7M40k69K02
$$ 207 -264 -313 287 -178 21 -97 191 27 0 -302 244 -54 144 274 180 431 -275 -372 68 -201 1
2768AO29o31J15N4l12J14lj40M87m77R9J33m50K67K75K17j05k57P5l89l48K32
$$ 1 630 -1 114 168 -144 -30 -33 -173 314 -163 -64 69 -381 -114 161 378 273 16 91 -298 -646 -414
2790d14K74J80L66J33k89j0n60M9J17o3L36j0J50m48l5L44j56k08Q72n44j81L66
$$ -414 -140 40 406 539 250 240 -320 -271 -154 -217 119 109 259 -189 -224 120 -36 -244 628 84 -97 269
$$ [...]
8191E3
##END NTUPLES=NMR FID
##END=
