##TITLE=1H_12-2022
 CDCl3
 8 sc, 
 18.02.2022
##JCAMPDX= 6.0         $$ Bruker NMR JCAMP-DX V2.0
##DATA TYPE= NMR FID
##DATA CLASS= NTUPLES
##ORIGIN= UXNMR, Bruker Analytische Messtechnik GmbH
##OWNER= root
$$ XWIN-NMR		Version 3.5
$$ Fri Feb 18 11:08:04 2022 Russian Standard Time (UT+4h)  she@DPX200
##.OBSERVE FREQUENCY= 200.131346
##.OBSERVE NUCLEUS= ^1H
##.DELAY= (6, 6)
##.ACQUISITION MODE= SIMULTANEOUS
##.ACQUISITION SCHEME= undefined
##.AVERAGES= 8
##.DIGITISER RES= 18
##SPECTROMETER/DATA SYSTEM= spect
##.PULSE SEQUENCE= zg30
##.SOLVENT NAME= CDCl3
##.SHIFT REFERENCE= (INTERNAL, CDCl3, 0, 15.7039)
##AUDIT TRAIL= $$ (NUMBER, WHEN, WHO, WHERE, WHAT)
$$ ##TITLE= Audit trail, XWIN-NMR		Version 3.5
$$ ##JCAMPDX= 5.01
$$ ##ORIGIN= Bruker BioSpin GmbH
$$ ##OWNER= she
$$ F:/spectra/data/she/nmr/H-F/1/audita.txt
$$ ##AUDIT TRAIL=  $$ (NUMBER, WHEN, WHO, WHERE, WHAT)
(   1,<2022-02-18 11:06:30.43 +0400>,<she>,<DPX200>,
      <created by zg, POWCHK disabled, PULCHK disabled
       configuration hash MD5:
       00 E9 B6 7A A2 85 ED C7 34 08 36 98 17 FE 4E 26
       data hash MD5: 16K
       C4 D2 C5 F5 45 85 A5 70 1A 31 EB 18 4D 8E 4F E9>)
$$ ##END=
$$ 
$$ hash MD5
$$ D3 3E 34 AD 28 7C 15 A8 E6 9D 36 E7 A7 CE 89 62
##$RELAX= 
##$RELAX= 
##$RELAX= 
##$RELAX= 
##$RELAX= 
##$RELAX= 
$$ Bruker specific parameters
$$ --------------------------
##$DU= <F:/spectra>
##$EXPNO= 1
##$NAME= <H-F>
##$PROCNO= 1
##$TYPE= <nmr>
##$USER= <she>
##$AMP= (0..31)
100 100 100 100 100 100 100 100 100 100 100 100 100 100 100 100 100 100 
100 100 100 100 100 100 100 100 100 100 100 100 100 100 
##$AQSEQ= 0
##$AQ_mod= 1
##$AUNM= <au_zg>
##$AUTOPOS= <>
##$BF1= 200.13
##$BF2= 200.13
##$BF3= 200.13
##$BF4= 200.13
##$BF5= 200.13
##$BF6= 200.13
##$BF7= 200.13
##$BF8= 200.13
##$BYTORDA= 1
##$CFDGTYP= 0
##$CFRGTYP= 5
##$CHEMSTR= <none>
##$CNST= (0..31)
1 1 145 1 1 1 1 1 1 1 1 1 1 1 1 1 1 1 1 1 1 1 1 1 1 1 1 1 1 1 1 1 
##$CPDPRG= <>
##$CPDPRG1= <>
##$CPDPRG2= <>
##$CPDPRG3= <>
##$CPDPRG4= <mlev>
##$CPDPRG5= <mlev>
##$CPDPRG6= <mlev>
##$CPDPRG7= <mlev>
##$CPDPRG8= <mlev>
##$CPDPRGB= <>
##$CPDPRGT= <>
##$D= (0..31)
0 1.2 0 0 0 0 0 0 0 0.06 0 0.03 0 0 0 0 0.0002 0 0 0 0 0 0 0 0 0 0 0 0 
0 0 0 
##$DATE= 1645167990
##$DBL= (0..7)
120 120 120 120 120 120 120 120 
##$DBP= (0..7)
150 150 150 150 150 150 150 150 
##$DBP07= 0
##$DBPNAM0= <>
##$DBPNAM1= <>
##$DBPNAM2= <>
##$DBPNAM3= <>
##$DBPNAM4= <>
##$DBPNAM5= <>
##$DBPNAM6= <>
##$DBPNAM7= <>
##$DBPOAL= (0..7)
0.5 0.5 0.5 0.5 0.5 0.5 0.5 0.5 
##$DBPOFFS= (0..7)
0 0 0 0 0 0 0 0 
##$DE= 6
##$DECBNUC= <off>
##$DECIM= 32
##$DECNUC= <off>
##$DECSTAT= 4
##$DIGMOD= 1
##$DIGTYP= 9
##$DL= (0..7)
0 120 120 120 120 120 120 120 
##$DP= (0..7)
150 150 150 150 150 150 150 150 
##$DP07= 0
##$DPNAME0= <>
##$DPNAME1= <>
##$DPNAME2= <>
##$DPNAME3= <>
##$DPNAME4= <>
##$DPNAME5= <>
##$DPNAME6= <>
##$DPNAME7= <>
##$DPOAL= (0..7)
0.5 0.5 0.5 0.5 0.5 0.5 0.5 0.5 
##$DPOFFS= (0..7)
0 0 0 0 0 0 0 0 
##$DQDMODE= 0
##$DR= 18
##$DS= 0
##$DSLIST= <SSSSSSSSSSSSSSS>
$$ [...]
##$SUBNAM2= <"">
##$SUBNAM3= <"">
##$SUBNAM4= <"">
##$SUBNAM5= <"">
##$SUBNAM6= <"">
##$SUBNAM7= <"">
##$SUBNAM8= <"">
##$SUBNAM9= <"">
##$SW= 18.0517287032376
##$SWIBOX= (0..15)
0 0 2 0 0 0 0 0 0 0 0 0 0 0 0 0 
##$SW_h= 3612.71676300578
##$TD= 16384
##$TD0= 1
##$TE= 0
##$TE2= 300
##$TE3= 300
##$TEG= 300
##$TL= (0..7)
0 120 120 120 120 120 120 120 
##$TP= (0..7)
150 150 150 150 150 150 150 150 
##$TP07= 0
##$TPNAME0= <>
##$TPNAME1= <>
##$TPNAME2= <>
##$TPNAME3= <>
##$TPNAME4= <>
##$TPNAME5= <>
##$TPNAME6= <>
##$TPNAME7= <>
##$TPOAL= (0..7)
0.5 0.5 0.5 0.5 0.5 0.5 0.5 0.5 
##$TPOFFS= (0..7)
0 0 0 0 0 0 0 0 
##$TUNHIN= 0
##$TUNHOUT= 0
##$TUNXOUT= 0
##$USERA1= <user>
##$USERA2= <user>
##$USERA3= <user>
##$USERA4= <user>
##$USERA5= <user>
##$V9= 5
##$VALIST= <valist>
##$VCLIST= <CCCCCCCCCCCCCCC>
##$VD= 0
##$VDLIST= <DDDDDDDDDDDDDDD>
##$VPLIST= <PPPPPPPPPPPPPPP>
##$VTLIST= <TTTTTTTTTTTTTTT>
##$WBST= 1024
##$WBSW= 4
##$XGAIN= (0..3)
0 0 0 0 
##$XL= 0
##$YL= 0
##$YMAX_a= 191797
##$YMIN_a= -180591
##$ZGOPTNS= <>
##$ZL1= 120
##$ZL2= 120
##$ZL3= 120
##$ZL4= 120
##$ABSF1= 10
##$ABSF2= 0
##$ABSG= 5
##$ABSL= 3
##$ALPHA= 0
##$AQORDER= 0
##$ASSFAC= 0
##$ASSFACI= 0
##$ASSFACX= 0
##$ASSWID= 0
##$AUNMP= <proc_1d>
##$AZFE= 0.1
##$AZFW= 0.1
##$BCFW= 1
##$BC_mod= 2
##$BYTORDP= 1
##$COROFFS= 0
##$CY= 11.3945322036743
##$DATMOD= 1
##$DC= 2
##$DFILT= <>
##$DTYPP= 0
##$F1P= 2.36226072786647
##$F2P= -0.459571619588291
##$FCOR= 0.5
##$FTSIZE= 0
##$FT_mod= 4
##$GAMMA= 1
##$GB= 0.15
##$INTBC= 1
##$INTSCL= 1
##$ISEN= 128
##$LB= 0.24
##$LEV0= 0
##$LPBIN= 0
##$MAXI= 10000
##$MC2= 0
##$MEAN= 0
##$ME_mod= 0
##$MI= 1.114404
##$NCOEF= 0
##$NC_proc= 0
##$NLEV= 6
##$NOISF1= 3.799351
##$NOISF2= 2.8
##$NSP= 1
##$NTH_PI= 0
##$NZP= 0
##$OFFSET= 15.70392
##$PC= 1
##$PHC0= -16589.47
##$PHC1= 9.60078
##$PH_mod= 1
##$PKNL= yes
##$PPARMOD= 0
##$PSCAL= 0
##$PSIGN= 0
##$REVERSE= no
##$SF= 200.130013532006
##$SI= 16384
##$SIGF1= 3
##$SIGF2= 2
##$SINO= 400
##$SIOLD= 16384
##$SREGLST= <1H.CDCl3>
##$SSB= 0
##$STSI= 0
##$STSR= 0
##$SW_p= 3612.71676300578
##$SYMM= 0
##$S_DEV= 0
##$TDeff= 0
##$TDoff= 0
##$TI= <>
##$TILT= no
##$TM1= 0
##$TM2= 0
##$TOPLEV= 0
##$USERP1= <user>
##$USERP2= <user>
##$USERP3= <user>
##$USERP4= <user>
##$USERP5= <user>
##$WDW= 1
##$XDIM= 8192
##$YMAX_p= 0
##$YMIN_p= 0
$$ End of Bruker specific parameters
$$ ---------------------------------
##NTUPLES= NMR FID
##VAR_NAME=  TIME,          FID/REAL,        FID/IMAG
##SYMBOL=    X,             R,               I
##VAR_TYPE=  INDEPENDENT,   DEPENDENT,       DEPENDENT
##VAR_FORM=  AFFN,          ASDF,            ASDF
##VAR_DIM=   8192,          8192,            8192
##UNITS=     SECONDS,       ARBITRARY UNITS, ARBITRARY UNITS
##FACTOR=    0.0002768,     1,               1
##FIRST=     0,             0,               0
##LAST=      2.2672688,     0,               0
##MIN=       0,             -180591,         0
##MAX=       2.2672688,     191797,          0
$$ Real data points
##PAGE= N=1
##DATA TABLE= (X++(R..R)), XYDATA
0 0 0 0 0 0 0 0 0 0 0 0 0 8 -8 8 -8 8 -16 16 -24 24 -32 40 -48 56 -64 72 -86 97 -113 129 -150 169 -193
33 -193 219 -248 279 -312 351 -392 439 -488 544 -603 668 -738 816 -900 994 -1095 1207 -1329
51 -1329 1463 -1613 1780 -1966 2176 -2413 2686 -3003 3372 -3818 4358 -5036 5912 -7096 8787
66 8787 -11416 16098 -26971 107633 -22859 -99225 191797 9634 -103992 96834 118856
77 118856 -81779 -7808 99855 -60307 -105032 99664 46158 -58039 51675 59199 -42041
88 -42041 -24502 15428 15653 -10674 30652 41306 -62646 -27191 59622 -57372 -46953 101518
100 101518 27139 -81775 13848 39316 -99065 -59454 86663 -43043 -105586 78617 -17274
111 -17274 -164172 32417 70470 -81707 1085 91106 -16804 -58599 23871 10117 -45019
122 -45019 28514 32874 -54248 -6468 7354 -61247 -12917 27989 8012 14676 3479 3045 -2849
135 -2849 -16367 22509 12065 -6754 44276 12458 -47851 -1046 37760 -4778 -18382 55894
147 55894 45136 -53411 -994 37819 -55789 -4508 54352 -40625 -25811 32467 -32251 -47119
159 -47119 20680 29129 -7343 16822 35278 -19891 -2866 31767 -28350 2428 55340 -21702
171 -21702 -32907 14651 -10948 -24306 -3523 19359 15247 -11117 7267 3910 -26308 8335
183 8335 22342 -6241 -829 16039 9703 -29515 -14371 45926 2685 -16657 47600 8215 -24824
196 -24824 22060 -2810 -19592 23506 14280 -22981 -13931 13466 -15192 -31671 23985 12848
208 12848 -19082 24495 -239 -31820 18362 6384 -24319 5234 12484 -7797 -25809 -12704
220 -12704 7084 -14063 -5888 13945 -7138 -554 2580 -15271 -2783 3028 7664 826 -19071
233 -19071 11342 6852 -31674 5960 18000 -9917 10022 8425 -10805 1394 8799 -2248 -12907
246 -12907 13993 19580 -27573 -6017 23138 -17918 -2420 20963 -7232 6503 15470 -6972
258 -6972 -4505 8312 14678 -4404 -9308 19373 -376 -17415 7352 -1751 -1988 9519 -6806
271 -6806 -1616 1983 -1956 1596 -14177 2478 18154 -17363 -9084 12611 -7077 -5117 1750 260
285 260 2937 196 5780 -6397 -6916 22434 -3814 -17832 21845 5474 -14251 5788 1273 -478
299 -478 2998 -1227 152 -5196 6779 3635 -19239 6901 13755 -14570 -569 4501 -2793 3600
313 3600 -7147 -1059 5358 -4733 3770 -5892 -7312 14195 -4909 -11350 8650 2590 -448 -3890
327 -3890 -3021 8763 -4989 -3910 3593 -11216 5173 4775 -19572 3056 10302 -7916 -2106 1324
341 1324 6496 3143 -5419 6564 1166 39 11155 -9009 -1867 17524 -4038 -2943 8098 4396
355 4396 9565 -1264 161 12745 -563 1214 1574 -7057 7526 -1109 -12674 1591 -837 258
369 258 -1709 -8847 9807 3411 -9656 5151 -2230 -1875 5750 -12742 -5299 4213 -8039 -6648
383 -6648 -7090 291 4768 -10413 -923 3482 -6358 4465 -5857 -9214 10145 -4674 -11504 -191
397 -191 -3673 2457 -1390 -5435 10200 3974 -325 3437 -3300 8258 5000 -8290 3650 664
411 664 -2946 387 -9465 5391 12339 -3694 6503 8015 2987 11167 -464 972 13081 1925
425 1925 -2161 -5064 -3343 3695 -10079 -4295 7502 -4902 2316 -795 -12531 6548 3405 -9110
439 -9110 1632 202 -822 -4480 -11184 3689 4545 659 7352 353 6540 7631 -7870 3212
453 3212 7109 -74 3834 -9343 -7323 3484 -11818 -5712 6810 2046 8048 2706 -1997 7949
467 7949 6663 7264 4616 5187 15548 -4119 -12306 7164 -1858 -2032 8184 -2847 3406 4119 -9841
482 -9841 -3459 -423 1984 3189 -8632 -4500 -4376 -12352 -6480 -8300 1657 10790 -9372 -5588 3461
497 3461 -9420 -3083 -3181 -5652 5797 -8817 -18088 -9846 -13063 -7571 -3434 -2932 4802 -702 -754 -1735
513 -1735 -7170 14214 12811 -5121 10734 7083 -8225 -1810 -4041 3848 13802 2696 3273 4749
527 4749 996 1898 -1124 10081 13786 3246 8316 -1166 -7313 11472 3802 1619 20037 13334
541 13334 7181 3815 -2551 11525 10053 739 8354 5223 -3391 -12557 -13824 -312 -4517 -2927
555 -2927 7860 -8330 -5835 3115 -14068 -4170 10627 2615 2082 -6009 -10735 -4128 -10247 -8486
569 -8486 985 4778 2648 -13247 -9084 1521 -11804 -2703 7657 -4292 1257 -4093 -18237 -5719
583 -5719 -1443 208 7053 931 3550 2872 -6524 -3199 3010 12480 8090 -6697 4318 357 -16688
598 -16688 -2522 2319 1673 12208 -130 -4091 3749 -3301 1731 7670 6852 10905 3362 -3724 -6974
613 -6974 -5825 7672 -114 -3545 15128 834 -12785 -1324 -4170 1953 8614 -1405 2953 1333
627 1333 -8784 -6574 -4613 4117 8389 2969 5767 -1865 -2722 6079 -5210 3034 18287 1603
641 1603 -2827 -1989 -8803 118 -2061 -3447 9619 4585 -4168 -5509 -4361 2749 573 4134 9271
656 9271 -2303 1105 -1096 -15361 2030 9756 -2173 4007 1792 -3483 -887 -7635 -1891 7378
670 7378 4266 1390 -6091 -3733 -1793 -11531 -877 5570 -1431 5089 -3950 -11542 2574 -1365 -2948
685 -2948 5817 1905 2831 -2267 -10698 -2315 1299 2070 2430 -254 6078 -1419 -9603 2944 1852 3016
701 3016 10460 -3038 -1806 5089 -7459 -4189 3653 3541 5753 -1317 -3007 -725 -3300 1625 -1066
716 -1066 1642 11062 -3281 -7421 1889 -4398 599 4217 -2597 5763 2821 -6682 -2250 -1576 3395
731 3395 4515 -1862 3507 891 -3838 -1605 -5360 4022 7562 -4987 1213 1465 -6096 1326 -2439
746 -2439 -2010 8759 1081 -3622 -1224 -1509 2132 -2100 522 7147 201 1164 -1112 -6184 6536
761 6536 3141 -4935 6421 2800 -2134 105 -5055 1071 4112 -1339 727 -2192 -845 3 -8436
776 -8436 -763 3844 -2365 912 -3736 -3164 4467 -5464 -2614 5839 -569 1572 -1073 -5362 3018
791 3018 248 -2540 1169 861 4112 -2086 -5313 4866 -81 -606 4542 -3898 2076 4568 -7159
806 -7159 -687 3937 399 1548 -2071 1962 3969 -2826 1767 1686 1424 6443 -2602 -1679 5331 -1653
822 -1653 188 313 -1730 6098 -797 -5062 3335 -101 -450 431 -3377 2344 -28 -4433 -1734 -3896
838 -3896 1212 -226 -8360 1786 1607 -5667 836 -2283 -1414 4554 -3507 -2510 1912 -791 92 -4198
854 -4198 -751 4795 -3233 -810 1652 -1602 4800 -531 -3667 6117 1053 -1204 1375 -2418 3667
869 3667 1395 -4421 2676 1788 501 1612 -2553 3910 3938 -2089 2670 -114 1523 4543 -5249 118
885 118 5469 -2913 315 825 -1116 4273 -864 -2004 2290 417 1547 -3347 -3586 4249 -3452 -4694
901 -4694 1087 -3869 384 148 -6377 2121 2103 -2354 766 -1311 2399 2489 -4426 1152 1949 -181 2335
918 2335 -2655 1788 4970 -2727 1332 1917 -100 5481 -2370 -2863 5621 -1213 -2342 946 -744 2985
934 2985 -627 -2220 2104 -266 2885 742 -3583 5902 1496 -5413 1839 -790 -1091 1951 -4765
949 -4765 -590 1706 -3584 -1610 -2858 231 2451 -4966 -1612 299 -3730 -658 -4555 -2846 3941
964 3941 -4087 -3416 333 -3697 1272 -632 -4443 4108 1473 -2718 -1022 -1472 2826 179 -1868 4473
980 4473 602 904 2858 -3821 4117 7263 -1803 3203 3600 334 2776 -1519 943 5141 1285 1602
996 1602 -536 206 4349 -2408 71 6014 1165 2805 193 -3223 4695 359 -2136 4526 717
1011 717 1103 612 -5132 522 2012 -470 284 -1724 1813 -1398 -8009 33 -73 -2662 2091 -4278
1027 -4278 -3565 1836 -6115 -3851 1745 204 1513 -2420 -3083 48 -3036 -424 -137 -628 5536 -2146
1043 -2146 -5832 1643 -1558 -142 2476 -1589 4004 1472 -5930 -342 35 544 3149 -769 1366
1058 1366 207 -2985 -557 -2550 3105 6590 -2968 398 2938 -4025 461 492 -104 7048 1310 -2807
1074 -2807 201 -971 813 -473 1156 6005 -413 -1553 -586 -4927 2612 2998 -2827 3797 1436
1089 1436 -3257 -1187 -4652 1275 5370 -903 966 1209 -1341 -1371 -3713 2218 4786 331 3025 -1440
1105 -1440 -3557 3022 -2981 -1645 6927 1301 -158 -830 -4993 316 577 -909 2497 1267 1535 -3470
1121 -3470 -6526 1943 284 -1270 3930 -1046 -518 306 -6722 -809 3462 856 3268 -776 -2003
1136 -2003 415 -3631 -1648 2188 2843 3682 -3161 -2882 1345 -4272 -124 3015 -158 4515 -622 -6808
1152 -6808 -104 -290 -661 2729 928 2437 -457 -4120 -1015 -977 3451 3950 -2086 2866 1569 -5562
1168 -5562 -64 7 1317 5939 -659 -1693 879 -3246 -1332 -425 1237 4851 -513 -2189 -1776 -3695
1184 -3695 1432 -635 -1283 6141 -394 -3992 -375 -3610 902 3481 -1011 2725 2005 -2214 -1890 -2651
1200 -2651 2328 3684 -208 2642 -639 -2128 866 -4496 382 6558 -693 -257 40 -3334 561
1215 561 -1277 -705 4390 1482 398 -1823 -3197 1926 -244 -49 4068 250 1480 -635 -6038 1952
1231 1952 2828 -1270 2875 604 -896 -225 -4552 -738 1988 718 1399 -2329 -980 308 -4702 -231
1247 -231 2123 -290 3399 -1810 -4463 2078 -1519 -1820 2073 848 2209 -898 -3625 616 -157 1021
1263 1021 2032 -285 3568 270 -3832 950 -143 716 3647 -2028 247 1857 -3454 -1224 349
1278 349 1258 3165 -1446 -782 673 -1938 149 -1042 340 4747 -1744 -2181 1441 -2104 682 1296
1294 1296 -1290 3265 1027 -2295 -841 -1574 1242 395 -2341 1569 -209 -2233 -767 -3465 1153
1309 1153 2823 -2900 820 1000 -2094 741 -1990 -745 3461 -497 -673 -337 -547 1752 -1503 115
1325 115 3867 368 1304 52 -2307 3168 416 -2556 2426 223 -388 -41 -2881 1169 1579 -932
1341 -932 978 -302 1085 1006 -3066 1075 1790 -843 1541 -1857 -809 2900 -2735 -994 2425 112
1357 112 1433 -548 -1475 2035 -652 -748 -158 -1348 1771 -1878 -3462 1708 -871 -707 1035 -2020
1373 -2020 2007 1655 -2986 822 980 -63 857 -2031 212 1194 -1885 118 -399 594 2895 -2045
1389 -2045 225 2966 -1009 851 173 -1231 3007 -834 -2384 1105 -462 293 -342 -1311 2601 61
1405 61 -1037 840 -1440 1309 330 -3587 1196 452 -2278 346 -1457 271 2443 -1326 329 1714
1421 1714 435 1348 -1583 134 2013 -1861 -674 -554 -1785 1385 -2248 -2313 2508 -908 -634 522
1437 522 -1615 1842 437 -2077 1050 405 423 -97 -1841 2252 1350 -977 2138 -2 1455 2818
1453 2818 -2319 720 2410 -1621 -127 -898 -822 1382 -1718 -1085 833 -26 1425 -748 -548 3180
1469 3180 -744 -472 1205 -1320 1501 -373 -3272 1457 259 -1294 617 -918 1467 1010 -1876
1484 -1876 544 78 288 442 -2507 674 1008 -3188 103 -300 -804 2457 -1448 -987 2421 -801 -485
1501 -485 -252 -462 1414 -1377 -1805 113 -1174 810 -245 -1621 3304 737 -1359 1783 -321 1481
1517 1481 1944 -1852 955 1110 -1833 -830 -1222 463 1344 -1524 513 424 -722 988 -2095 -121
1533 -121 3099 -1696 -811 699 -1727 756 -141 -1058 2560 1109 95 -35 -585 2129 112 -994
1549 -994 2075 -509 -323 -485 -3305 823 1382 -1999 1059 145 -684 648 -1879 -208 2025 72
1565 72 367 -1219 -388 870 -2474 9 1820 -139 1866 -763 -1758 2429 -420 -1003 1980 421
1581 421 561 -494 -2622 52 -87 -124 664 -775 1553 -153 -3268 940 506 221 2128 -1417 -287
1598 -287 1254 -2831 -778 944 736 1897 -692 -632 695 -1201 204 -107 484 2985 -1288 -2005 629
1615 629 -1569 381 1049 -991 2330 602 -2599 -530 -249 954 1267 -506 1085 -289 -1688 -765
1631 -765 -1913 1399 2559 -1839 517 781 -2160 368 -500 116 3556 454 -789 23 -1092 689
1647 689 -740 197 2769 -144 -636 -1290 -2980 1231 10 -1429 2310 11 -1298 -708 -2561 394
1663 394 2127 -149 1223 565 -86 -188 -1909 1372 2293 335 1907 -982 -1493 1276 -2347 -912
1679 -912 2734 193 32 -1327 -2664 43 -803 -534 1602 849 1254 -1033 -1971 1343 175 747 2540
1696 2540 -424 924 352 -3482 -200 1186 268 1402 -648 -465 162 -2100 -488 581 1372 2020
1712 2020 -1579 -758 479 -2355 -3 1003 -183 2625 -114 -2662 316 -491 53 704 17 1500
1728 1500 -459 -2340 -1058 -1219 1361 1283 -1014 1993 640 -2262 551 -20 972 3226 -486 -262
1744 -262 174 -1999 -1003 -1170 32 2073 -523 -707 -839 -1354 1159 -429 -218 3533 140 -1181 -24
1761 -24 -1626 741 1052 -461 1728 874 -299 -366 -1373 1541 1492 -397 1202 -948 -1121 -316 -3284
1778 -3284 -447 2112 -922 266 -472 -1143 738 -929 -11 2198 663 615 -962 -1452 560 -1296
1794 -1296 -404 1311 -511 1219 -303 -2522 1448 1101 -507 1417 9 39 -222 -2584 -679 256
1810 256 143 572 -1133 325 714 -1648 884 1231 469 2309 -807 -1321 1207 -1315 -780 409 191
1827 191 1570 -308 -1118 840 73 933 638 -277 1934 -396 -2192 -76 -1161 -109 811 -1667 288
1844 288 863 -1286 -117 126 951 1601 -771 118 -21 -1266 8 -1686 -400 1969 -1294 -510 912
1861 912 -743 975 427 -410 2079 532 -822 -286 -1015 564 -349 -1372 802 -58 -201 249 -1158
1878 -1158 1553 1574 -940 1007 378 -603 474 -1463 -406 1286 -526 147 -56 403 1636 -387 584
1895 584 1870 -138 877 -488 -1627 1225 -1031 -1983 387 -1041 -146 -316 -1545 850 583 -199
1911 -199 609 -350 879 255 -1926 509 127 -790 586 -1012 139 1542 -1255 177 1195 -126
1927 -126 981 -770 -883 465 -1050 -604 -562 -909 925 -1048 -995 1536 -152 495 1003 -729 1630
1944 1630 785 -1411 358 -218 -175 39 -1435 495 639 -608 653 -98 955 1699 -1040 398 1206
1961 1206 -944 413 -828 -614 1294 -941 -809 712 -136 799 -135 -413 1562 11 -317 243 -1121
1978 -1121 885 -122 -1784 982 212 -648 972 -573 761 1371 -847 506 417 -30 208 -1481 -100
1995 -100 448 -1458 -336 -724 -515 1208 -1158 -764 1460 -508 -7 -17 -1064 860 -440 -1221 268
2012 268 -590 340 -129 -1142 1309 282 -429 1043 -507 603 771 -1908 296 488 -1068 146 -980
2029 -980 -403 795 -1198 -116 520 -6 926 -812 -190 1302 -966 56 490 -492 1598 -111 -1139
2046 -1139 1796 331 59 902 -379 1239 279 -999 304 -460 95 267 -1525 404 337 -1575 457
2063 457 -289 -172 1477 -701 -78 1004 -674 286 -35 -181 1166 -542 -507 143 -886 515 -453 -870
2081 -870 1690 -514 -1069 433 -1152 654 648 -1238 722 471 -427 181 -508 752 1102 -724 808
2098 808 -92 -460 407 -1360 165 1483 -940 -135 69 -932 894 -524 -394 1502 310 262 -244
2115 -244 -645 969 -214 -182 1216 -310 370 -353 -1928 587 57 -1174 691 -581 -723 -81 -1711
2132 -1711 -85 773 179 750 -494 167 774 -1281 595 998 101 1232 -766 -1162 794 -908 -491
2149 -491 715 -147 570 -728 -1497 -110 -474 75 389 -393 1186 45 -1440 852 270 830 1750 -395
2167 -395 847 944 -1372 -50 175 182 1183 -871 -557 -150 -1017 169 -337 416 1976 -805 -540 506
2185 506 -964 514 308 -491 1293 -176 -1280 -383 -738 552 497 -365 1127 -149 -836 -173 -1245
2202 -1245 784 1225 -830 619 196 -772 371 -602 579 2218 155 409 -68 -634 247 -762 -94
2219 -94 929 -597 -165 -984 -1719 888 -258 -220 1784 184 255 185 -1070 622 1059 97 890 -346
2237 -346 -62 -268 -1645 528 748 -68 959 -935 -804 154 -1975 -477 624 -539 177 -1168 -1424
2254 -1424 176 -679 -175 1047 548 1138 -490 -1074 734 -487 146 800 -792 465 -36 -2021 239
2271 239 285 327 1203 -288 576 403 -843 156 3 553 1264 -1013 -266 311 -1164 497 398 497 2031
2290 2031 -64 -494 507 -163 503 464 -62 1185 -299 -870 -207 -730 937 563 -398 1378 88 -957
2308 -957 139 -880 139 890 -1206 -395 -379 -1119 -450 -1021 352 1252 -253 354 -354 -664 878 -678
2326 -678 -342 1512 -663 -489 -235 -1147 606 200 -252 1221 348 214 34 -930 921 384 -209 547
2344 547 -687 -252 52 -1735 550 1095 -264 835 143 -217 938 -584 34 770 21 482 -810
2361 -810 -767 489 -651 252 870 -159 1098 -211 -1371 819 -201 -387 214 -794 43 -580 -1602
2378 -1602 68 -210 87 653 -706 415 437 -1222 488 -57 -9 969 -1026 -463 576 -1031 -137 228
2396 228 29 1280 -288 -421 474 -374 348 15 -528 961 -484 -847 214 -661 396 697 -707 976
2414 976 484 -380 380 -331 610 849 -498 387 118 -316 484 -700 189 1331 -593 324 258 -419 900
2433 900 -138 -416 848 -251 -432 -195 -610 639 -231 -517 749 -128 273 378 -786 889 282 -797
2451 -797 632 -293 -200 263 -938 198 696 -460 226 -297 54 733 -915 -60 362 -673 293 -655
2469 -655 -933 607 -803 -660 343 -589 221 -282 -777 543 -256 -210 8 -581 631 -55 -1043 550
2487 550 -151 -135 634 -840 340 794 -636 442 371 -214 873 -575 -228 498 -599 279 -139 -301
2505 -301 1078 -719 -321 1079 -264 614 367 -397 1199 288 -502 614 119 446 396 -643 684 293
2523 293 -356 267 -647 74 497 -1126 3 122 -762 262 -868 -228 927 -630 -107 360 -140 548
2541 548 -447 -202 785 -358 -80 205 -671 681 -254 -806 903 -283 -212 313 -842 431 532 -552
2559 -552 476 68 358 437 -690 355 502 -390 525 -139 -186 989 -738 -23 762 -348 434 -58 -536
2578 -536 847 -191 -220 371 -97 594 -97 -441 683 -170 -176 492 -664 332 3 -1438 147 25 -523
2597 -523 103 -808 -133 184 -1049 -88 -164 -130 644 -678 151 851 -564 401 222 -100 1039 -402 -656
2616 -656 363 -303 95 112 -505 555 -160 -637 324 -189 447 174 -661 758 101 -584 383 -324 505
2635 505 985 -512 350 570 -407 307 -427 338 817 -560 -51 -182 -697 371 -356 -331 1012 -305 -182
2654 -182 139 -469 671 226 -521 752 18 -429 -407 -656 380 308 -447 439 -205 -4 549 -801 425
2673 425 802 -447 486 -151 -361 756 -372 83 853 138 405 -363 -287 703 -348 131 493 -330 382
2692 382 -477 -1378 411 -19 -228 453 -440 106 -19 -730 468 325 263 623 -554 -105 -57 -1149 27
2711 27 -106 -94 451 -915 -900 190 -881 -8 295 -238 654 -603 -737 4 -515 272 291 -203 852 -282
2731 -282 -555 477 -187 596 931 -447 736 252 -785 244 -69 540 893 -305 411 124 -231 392
2749 392 -62 629 1157 -416 -33 63 -695 442 -78 -103 1033 -89 -354 2 -547 498 362 16 586
2768 586 -161 -399 -354 -956 529 359 -489 631 -477 -609 150 -732 304 749 -275 89 -557 -554 42
2787 42 -793 -22 590 -459 184 -435 -827 769 -226 65 989 -60 248 -351 -902 489 185 -165 495
2806 495 -343 176 -89 -891 336 220 254 711 -570 -128 302 -1028 93 567 84 538 -440 -496 321
2825 321 -273 284 392 275 729 -577 -552 412 -493 308 389 -476 530 -270 -898 158 -98 140 488 -465
2845 -465 114 -360 -794 -46 -369 326 617 -670 8 -35 -693 432 -160 279 1172 -281 -479 156 -413
2864 -413 456 96 -101 714 -180 -443 -22 -439 538 218 -252 638 -200 -338 88 -646 279 575 -352 284
2884 284 -130 -251 251 -313 292 751 -77 507 -173 -237 801 -347 105 863 -221 297 -288 -663 643
2903 643 -91 -182 731 5 225 -441 -451 355 -179 -26 431 -634 238 71 -906 419 165 -249 381 -429
2923 -429 -197 237 -686 67 132 -173 385 -649 -302 331 -468 122 34 -505 420 -553 -829 290 -427 -38
2943 -38 227 -472 260 -54 -652 265 -171 423 279 -454 516 73 -505 578 -12 201 651 -379 188 525
2963 525 -272 439 -41 -33 684 -295 -5 323 -242 386 -270 -278 732 -309 -203 150 -388 367 340 -435 744
2984 744 81 -234 223 -384 394 427 -510 284 -253 -203 458 -750 -24 508 -683 44 20 -349 622 -579
3004 -579 -303 396 -267 216 -76 -276 322 -308 -35 365 -212 539 77 -541 690 161 -272 573 -242 226
3024 226 352 -533 394 293 -111 486 -323 178 378 -617 271 340 -91 525 -348 -166 637 -579 257 274
3044 274 -398 394 -191 -327 590 -116 -107 33 -390 502 -64 -551 459 -512 -111 326 -857 155 80 -660
3064 -660 104 -437 -376 189 -673 -109 170 -471 172 -459 -111 681 -564 -100 431 -476 382 70 -331 741
3084 741 -96 -255 428 -200 423 216 -446 529 -265 -121 52 -396 396 149 -582 436 17 -240 453 -490
3104 -490 51 712 -392 195 2 -179 443 -299 4 755 -302 271 65 -490 638 -380 -139 621 -283
3123 -283 136 336 -637 368 60 -292 327 -336 94 300 -467 423 102 -287 547 -290 52 515 -425 286
3143 286 383 -172 480 -181 -224 406 -309 36 102 -233 445 -310 -599 286 -667 -104 76 -625 443 -165 -721
3164 -721 184 -263 -130 114 -568 8 -10 -636 130 -392 -46 318 -635 226 78 -595 230 -192 -433 616
3184 616 -612 -134 261 -480 184 27 -271 553 -281 -167 83 -320 459 140 -376 777 103 -214 638
3203 638 -245 391 610 -231 498 248 -4 447 -151 555 853 -212 287 39 -124 472 -416 174 782 -421
3223 -421 140 -106 -540 562 75 -268 529 -268 59 -257 -501 419 109 -151 414 -490 17 280 -785
3242 -785 394 237 -482 423 -487 -431 68 -562 6 262 -363 219 -479 -431 207 -497 162 93 -367 469 -494
3263 -494 -723 520 -239 221 438 -334 290 -53 -510 390 -82 109 345 -418 347 -67 -637 421 -257
3282 -257 147 724 -463 -154 45 -487 392 98 157 574 -103 -281 283 -316 325 106 -82 880 -296 -290
3302 -290 245 -378 445 335 -436 444 -58 -510 190 -200 245 248 -430 134 -247 -473 120 -295 339 611 -527
3323 -527 156 -167 -614 383 -336 -98 662 -255 -86 -166 -432 500 47 -88 347 -279 1 -57 -619 566
3343 566 82 -297 392 -596 -347 -17 -656 216 342 -148 309 -295 -135 227 -390 300 423 -138 416 -198
3363 -198 -317 510 -215 284 544 -289 362 -112 -433 478 79 112 417 -430 94 -264 -574 253 -212 119
3383 119 431 -595 117 76 -711 311 96 -89 299 -423 -126 -15 -460 228 161 -21 624 -445 -254 181
3403 181 -550 216 86 -382 344 -350 -569 299 -251 263 188 -276 594 -273 -437 271 -347 396 426 -369 417
3424 417 108 -262 475 -152 375 764 -430 59 -52 -225 492 -295 -114 478 -343 29 -182 -367 509 -112
3444 -112 -113 401 -353 21 107 -469 467 113 -140 237 -235 -82 96 -561 428 276 -122 506 -354 -69 506
3465 506 -662 100 238 -305 197 -69 -214 280 -259 43 174 -333 192 -394 -422 251 -110 99 405 -348
3485 -348 331 27 -579 463 90 78 579 -340 23 311 -295 105 141 80 367 -359 30 161 -505 348 -99
3506 -99 -177 359 -452 -264 348 -533 233 199 -224 577 -88 -298 229 -313 271 41 -403 335 -188 -374 332
3527 332 -321 -70 340 -550 135 29 -491 158 -280 123 336 -522 119 -74 -244 301 -240 -44 383 -311
3547 -311 92 40 -410 347 65 -465 507 110 61 229 -207 377 37 -133 333 -201 77 226 -565 255 247
3568 247 -323 298 -142 -192 536 -373 -25 315 -79 325 38 -10 638 -125 173 385 -152 396 -10 -82 621
3589 621 31 -130 476 -338 300 28 -434 391 -14 -281 64 -486 51 148 -483 219 -122 -125 278 -570 22
3610 22 285 -383 290 16 -232 392 -220 -284 274 -373 65 -168 -366 249 -366 -300 155 -641 -33 -45 -453
3631 -453 56 -195 -375 325 -218 -176 138 -564 78 -55 50 363 -258 -125 369 -373 146 139 -398 290 -90
3652 -90 -158 426 -66 -13 118 -193 325 0 -184 464 -101 37 297 -229 422 133 -323 649 -22 115 398
3673 398 -212 187 433 -9 319 -13 42 388 -228 353 253 -169 274 20 -272 251 -196 41 135 -455 155
3694 155 -105 -517 120 -235 -158 33 -383 192 -48 -350 236 -66 -191 409 -581 115 59 -451 274 -9 -249
3715 -249 222 -300 -180 225 -412 -10 -26 -251 307 -368 -338 342 -455 74 143 -438 395 -100 -379 346 -173
3736 -173 137 247 -378 175 -110 -268 302 -120 225 423 -413 313 -17 -245 269 -32 207 372 -416 -51
3756 -51 58 -267 248 -127 -190 432 -259 85 157 -153 469 1 -75 498 -181 -186 148 -422 354 188 -144 374
3778 374 -99 -72 150 -433 138 261 -242 36 -145 -241 250 -472 105 251 -324 158 -241 -406 369 -56 22
3799 22 204 -155 141 -106 -463 304 -105 63 475 -242 348 -25 -471 337 -84 -309 228 -314 -160 114
3819 114 -389 170 149 -40 263 -240 -75 129 -233 494 186 -80 600 -374 -105 364 -71 169 160 -276 351
3840 351 -271 -531 318 -340 213 140 -300 156 -18 -402 169 -358 67 175 -390 21 -137 -375 111 62 111
3861 111 335 -157 40 -61 -284 290 -10 174 507 -221 65 148 -298 421 48 -203 333 -292 -256 84 -457
3882 -457 306 17 -216 251 -178 -221 344 -376 298 204 -164 308 -157 1 424 -167 201 366 -225 -3 -87
3903 -87 -293 357 -51 6 238 -405 267 -29 -550 191 -187 -15 450 -329 32 87 -315 190 102 -95 321
3924 321 -347 207 186 -295 360 82 -163 283 -345 -101 139 -307 282 156 -220 240 -417 -331 126 -238 102
3945 102 256 -234 294 -168 -387 147 -147 107 286 -220 110 45 -297 448 -4 80 309 -91 -16 48 -288
3966 -288 377 84 -6 379 -534 -183 -38 -434 382 92 -179 414 -419 -115 97 -317 249 -6 -115 328
3986 328 -310 -125 226 -413 431 204 -317 383 -185 -128 361 -245 255 177 -267 -45 -218 -302 285 -402 110
4007 110 81 -394 255 -245 -252 206 -152 61 360 -368 108 132 -302 220 42 -34 335 -116 126 114 -235 307
4029 307 2 58 247 -261 158 163 -269 278 147 -102 468 -165 -67 214 -297 117 218 -54 285 1 126
4050 126 358 -250 395 329 -239 419 -44 -268 442 -112 46 437 -270 230 57 -223 163 -242 -145 123 -335
4071 -335 0 62 -325 237 -261 -127 327 -337 -94 105 -409 177 32 -182 241 -261 7 58 -301 172 19
4092 19 -335 368 -298 -222 128 -460 31 -33 -452 74 -86 -109 161 -392 140 216 -283 241 -83 -135 309 -273
4114 -273 96 393 -146 167 271 -225 426 40 -36 332 -193 122 112 -255 258 -132 -111 175 -169 47 143
4135 143 -259 459 -55 -229 213 -162 -1 322 -207 170 152 -129 218 -250 -193 290 -124 158 134 -225 223
4156 223 -235 -245 193 -153 -84 140 -355 107 -74 -360 167 -451 -199 34 -347 101 -23 -445 284 -276 -73
4177 -73 378 -344 55 12 -298 166 -280 -177 133 -191 1 43 -407 203 -224 -361 125 -344 31 77 -274
4198 -274 190 183 -236 331 -75 -173 231 -112 277 247 -210 260 50 -172 419 -115 234 31 -362 198 91
4219 91 -123 200 -50 -152 293 -224 78 -34 -258 259 -87 -54 212 -95 170 208 -333 280 158 -188 428
4240 428 -193 127 15 -198 281 159 -130 247 -170 -10 223 -357 -5 -114 -321 81 -99 -243 240 -184
4260 -184 123 134 -225 147 -191 -41 283 -362 69 85 -227 158 -74 -248 468 -124 207 419 -414 269 255
4281 255 -307 168 -170 -10 353 -321 -42 -96 -273 249 -47 -233 223 -96 -115 229 -210 19 8 -181 377
4302 377 -200 -199 113 -38 191 195 -207 327 84 -138 71 -116 179 162 -205 98 56 -310 329 -313 49 116
4324 116 -222 32 60 -206 115 -161 50 384 -262 154 -70 -117 435 -32 -132 274 -174 48 124 -397 277
4345 277 179 -75 195 -229 -12 23 -312 263 110 -155 301 -362 -24 231 -140 125 292 -188 359 -193 -102
4366 -102 374 -169 135 201 -246 77 -117 -215 292 -97 56 280 -177 128 -144 -297 448 -136 -5 299 -314
4387 -314 -17 85 -225 389 32 -25 262 -251 25 119 -170 365 125 -31 400 -260 -50 70 -293 305 -33
4408 -33 -303 117 -195 -191 34 -164 69 209 -208 266 -227 -161 343 -284 -19 141 -342 268 16 -134 340
4429 340 -65 186 260 -256 185 -139 -233 307 24 63 341 -278 -50 30 -256 266 -125 -160 285 -267 -84 -46
4451 -46 -366 312 -12 60 351 -244 -127 123 -257 216 171 -24 263 -241 -305 164 -261 131 171 -105 119 -150
4473 -150 -229 110 -154 25 163 -298 60 -88 -275 168 -366 128 401 -348 54 65 -190 198 74 229 416
4494 416 -214 48 -1 -145 264 45 -97 188 -192 21 88 -323 156 6 -148 218 -283 -62 146 -398 116
4515 116 8 -152 238 -166 63 229 -165 160 145 -110 208 -67 -193 278 -155 109 205 -197 173 -185 -82
4536 -82 240 -93 118 156 -197 141 31 -437 141 -262 -56 242 -162 5 158 -217 40 -62 94 246 -241
4557 -241 15 109 -398 307 8 -300 367 -79 -132 138 -211 147 43 -365 27 -258 -209 152 -230 137 217
4578 217 -228 216 -157 -163 319 33 270 39 -223 256 -91 -113 224 -4 -132 155 -104 79 202 -211 157
4599 157 -93 -133 147 -533 -38 23 -300 128 -18 -248 189 -202 65 200 -42 152 155 -64 190 -59 -169
4620 -169 176 -153 104 154 -237 265 -179 -331 232 -218 11 115 -286 114 -276 -209 31 -236 93 145 -302
4641 -302 164 -132 -119 252 -68 40 211 -234 60 119 -256 193 -6 -62 203 -287 78 132 -159 239 -48
4662 -48 -329 174 -133 -187 248 -373 213 22 -150 203 -127 -85 186 -195 219 24 -152 366 -157 -147 292
4683 292 -196 -6 282 -210 353 113 -82 415 -155 2 126 -233 44 -71 -195 227 -46 -101 219 -225
4703 -225 141 155 -177 309 -139 -98 238 -198 116 102 -395 168 -33 -37 282 -279 53 213 -237 109 172 -91
4725 -91 158 -234 -229 141 -315 -11 16 -151 314 -97 -8 1 -131 209 187 -183 136 -63 -218 162 -340 26 341
4748 341 -240 173 94 -181 313 -114 -79 177 -56 140 61 -320 211 -112 -269 232 -321 88 42 -145 118
4769 118 76 -76 223 -155 -32 260 -204 154 55 -154 199 -65 -99 299 -286 22 143 -207 315 -161 -111
4790 -111 232 -227 56 78 -186 212 59 -255 177 5 -36 191 -212 203 163 -262 90 -153 192 108 -162
4811 -162 -69 -5 111 228 -199 -12 218 -145 -46 187 -84 77 63 -222 240 -122 -95 31 -251 342 126 -302
4833 -302 113 -181 -223 62 -195 88 124 -240 277 -111 -33 207 -275 101 339 -118 224 -40 -130 150 -97
4854 -97 -16 252 -269 27 -80 -207 265 -197 41 186 -94 113 61 -247 231 -40 -176 155 -61 93 166
4875 166 -209 197 -14 -187 151 -110 -178 113 -248 226 10 -246 235 -305 -120 266 -378 147 190 -146 220
4896 220 -91 -298 189 -171 218 95 -100 171 -46 -232 148 -46 -194 199 -304 112 -34 -223 109 -64
4916 -64 -1 321 -353 2 191 -147 261 48 -5 257 -164 -76 -73 -288 269 188 -134 240 8 -83 128 -143 214
4939 214 120 -343 150 -91 -161 73 -268 162 -9 -353 72 -232 -137 201 -205 48 163 -128 31 -148 -97
4960 -97 250 -117 14 94 -260 119 -38 -192 269 -69 21 123 -301 -8 63 -369 229 -11 -202 140 -283
4981 -283 -77 110 -236 148 -3 -82 281 -100 80 198 -264 60 65 -276 366 -19 -4 177 -120 -51 150 -139
5003 -139 89 -59 -200 280 -100 -34 1 -211 -18 73 -123 127 -6 -71 194 -164 44 63 -24 173 -22 7
5025 7 407 -98 120 9 -322 323 89 11 251 -201 -142 111 -180 274 19 -48 162 -166 -201 123 -143 113
5047 113 63 -356 8 -162 -95 56 -236 -24 157 -187 53 -92 -141 215 -187 -54 9 -193 116 -168 -170 276
5069 276 -200 -156 -33 -162 132 199 -501 29 -1 -62 139 -168 70 23 -269 71 13 -2 438 -54 163 181 -332
5092 -332 149 88 -139 202 -120 -122 201 -152 12 123 -142 208 -73 -76 246 -53 19 61 -22 186 -153 -175 364
5115 364 -1 -24 251 -132 125 41 -42 181 2 -28 288 -253 176 -6 -351 99 83 -191 124 -205 1 27
5137 27 -174 -4 79 -185 77 -120 -32 203 -286 227 -168 -71 310 -101 -78 226 -164 -44 44 -258 57 27
5159 27 -70 182 -179 -9 166 -234 65 -10 -110 145 -227 -119 21 -245 32 129 8 258 -111 10 142
5180 142 -249 174 30 51 46 -11 67 234 -148 99 45 -283 85 -19 -129 132 -80 87 153 -123 191 87
5202 87 -66 115 -112 -53 236 -182 197 56 -61 190 -149 -22 273 -89 136 150 -109 253 -21 2 180
5223 180 -110 -126 175 -245 113 4 -222 141 -238 -19 190 -235 119 38 -165 210 -168 -157 177 -258 -113
5244 -113 171 -179 113 10 -110 304 -50 -102 268 -239 113 -28 -232 160 -28 -90 125 -296 -118 -73 -131
5265 -131 266 31 -34 107 -172 -41 250 -150 21 24 66 226 -99 -150 182 -337 -11 44 -219 281 -213 -244
5287 -244 176 -27 77 -103 -56 215 -47 -148 184 -124 -63 23 -304 133 22 -12 153 -143 -37 62 -172 104
5309 104 160 -19 293 -144 -8 273 -121 -96 202 -143 122 -28 -50 137 -50 71 -32 -232 202 -76 -202
5330 -202 154 -30 140 78 -87 191 -26 -161 35 -57 -80 121 -139 230 82 -122 185 -68 -72 76 -269 84
5352 84 41 -135 162 -83 -268 100 -299 -179 182 -258 28 172 -223 88 -32 -84 70 -270 76 98 -341
5373 -341 81 -97 -154 88 -126 192 174 8 42 -69 -39 172 -50 49 162 -142 5 -4 -58 155 -183 132 152
5396 152 -146 -23 33 -152 338 170 -137 193 -102 117 -2 -200 303 155 -157 237 -147 -45 -22 -304 73
5417 73 -48 -219 131 -68 -84 183 -225 -106 172 48 92 -187 -123 169 -11 30 156 -272 99 -24 -285 88
5439 88 63 -22 114 16 98 88 -133 111 -71 -131 167 -212 -52 -35 -279 179 -39 60 268 -165 139 212 -23
5462 -23 152 44 -27 147 -198 133 148 -4 123 -23 -149 218 -44 -205 133 -164 -57 256 -57 249 -6
5483 -6 -57 148 -106 289 53 -4 96 111 68 268 50 28 232 -125 126 84 -198 209 -13 -188 200 -191 69
5506 69 -83 -179 55 -91 -238 6 -267 -265 3 -409 169 -37 -158 65 -239 12 161 -94 -40 31 -212 209
5528 209 -20 -74 185 -1 135 77 -81 -3 -116 -187 357 -290 148 149 -152 95 46 -214 114 93 113 138 -85
5551 -85 101 110 -45 296 63 45 186 -93 170 332 -93 140 88 -58 151 -54 9 145 76 206 -30 -137
5573 -137 130 -68 -303 108 -99 -22 175 -233 109 -128 -105 244 -47 -7 50 -82 -103 10 -6 174 -69 -216
5595 -216 108 -206 110 -5 -16 230 -50 10 288 -195 -97 -154 -125 130 -35 -73 211 -171 29 27 -139 242 -67
5618 -67 -241 327 -65 43 87 -261 228 103 -50 69 -72 -39 149 -292 86 -28 -344 -145 -115 -221 103
5639 103 -167 35 181 -124 156 -28 -170 126 -82 -106 108 -185 292 121 -279 272 -167 92 139 -104 184
5660 184 305 4 262 238 40 84 -155 121 108 -197 82 143 -112 233 -17 -3 230 72 228 254 -95 184
5682 184 5 -221 162 -188 0 57 -273 100 -123 -270 25 -42 7 82 -303 78 -14 -163 18 -228 -110 283
5704 283 -344 -68 113 -62 135 -90 -172 230 -23 -29 168 -59 121 -160 -92 154 -89 -96 114 -192 129 10
5726 10 -364 88 -144 55 89 -154 246 34 -89 143 53 65 141 -81 -11 163 -108 183 -58 15 227 -96
5748 -96 64 26 -119 75 -78 -239 146 -114 -30 203 -249 89 -1 -229 71 -35 -52 102 -262 -134 46 -272
5770 -272 121 -63 -105 85 -108 -10 239 -99 125 76 -181 168 -47 -70 13 -232 -11 204 -184 91 -120 -200
5792 -200 18 -99 -32 69 -120 153 -4 -213 44 -24 -167 98 -143 187 -8 -59 189 -85 41 -35 -121 30
5814 30 -42 -253 129 -38 -1 157 -150 -119 86 -90 228 -75 -155 213 -236 -239 59 -31 173 -62 -325 269 -88
5837 -88 67 232 -89 172 99 -213 54 46 -194 199 -200 112 6 -246 100 113 -57 163 -85 8 190 -172
5859 -172 38 -47 -251 160 -80 -103 63 54 -85 87 -53 261 -24 -100 251 -161 -9 50 -258 6 -42 -54 97
5882 97 -119 -82 67 -238 173 32 -179 102 -112 -39 51 -180 -144 -112 -123 214 -110 -136 -45 -199 1 253 -109
5905 -109 268 21 -105 87 -184 -189 126 -213 98 54 -234 134 -88 120 185 -118 88 -39 -147 71 -132
5926 -132 -148 11 1 -24 58 -41 388 92 -164 214 46 -27 231 -108 -19 22 -127 148 -5 -54 48 -78 125
5949 125 229 -139 -14 -142 -51 7 -147 119 40 -48 77 -39 -25 179 -83 61 146 -97 -95 80 -325 121 -80
5972 -80 -255 -19 -80 -10 -37 -62 190 38 -145 132 -288 -217 -55 -439 -145 -158 -343 152 -313 -138 91 -57
5994 -57 5 134 -115 115 -56 -27 43 -4 12 -105 -41 127 66 -85 243 -132 94 137 -26 189 4 -83 37
6017 37 1 86 76 -68 123 113 -145 129 -5 175 167 -138 46 131 -79 32 -106 -162 96 -22 -69 50 -148
6040 -148 263 128 10 267 -50 -15 77 -262 -96 66 -242 -6 -103 -55 113 -157 16 50 -122 4 11 -120
6062 -120 24 -373 7 62 -180 -36 -86 45 199 -183 -146 235 -84 85 139 41 52 -122 -43 -21 -20 140 158 -4
6086 -4 113 45 -169 280 -143 170 118 -253 198 -12 -226 195 -11 -4 72 -257 15 -113 -101 28 -128 -125 111
6109 111 -127 128 65 -123 38 -128 -95 162 16 204 82 17 334 234 -187 95 19 150 90 -193 124 120
6131 120 -355 57 43 -47 104 35 123 114 -215 153 -33 -265 70 -139 -45 254 -72 54 80 -196 226 -72 -108
6154 -108 115 -66 66 14 -137 51 -86 -43 -22 30 -98 -48 -196 20 55 -96 -1 -214 -219 104 -316 16 -240
6177 -240 52 279 -53 42 -11 -19 92 90 -33 293 -49 46 101 -69 6 133 -63 170 70 20 51 -5 -34 125
6201 125 -149 14 -31 -38 109 -71 33 196 -45 8 86 107 228 -238 -32 84 -112 -195 89 -111 189 -7
6223 -7 -184 174 33 3 -91 -165 131 87 -390 127 -60 -75 83 -3 -28 106 -76 117 211 -213 197 -22 -10 222
6247 222 -140 158 53 47 167 -32 -49 352 -179 86 35 -77 184 36 194 17 -43 159 45 -85 262 20
6269 20 -197 113 -225 -26 32 14 9 125 -137 227 -183 -27 212 -146 65 -49 -132 -1 -93 87 183 -97 7
6292 7 53 -274 138 17 -176 -41 7 166 152 -326 86 -12 -275 70 -108 105 72 -35 131 143 -42 54 -85
6315 -85 -38 178 -113 -22 64 -83 42 -207 -20 94 -88 14 85 50 190 -39 -199 47 -80 -59 32 -154 90
6338 90 113 -150 68 286 136 64 104 224 126 -14 102 24 -17 154 -193 -149 34 -116 -17 -4 -172 146 -36
6361 -36 -77 25 85 -16 -178 -100 60 -29 -108 94 -126 208 87 -201 87 -26 -24 60 63 227 185 -271 40 -46
6385 -46 -123 15 -235 -125 185 -119 -109 102 -178 219 -14 -57 84 -143 -214 150 -37 76 56 9 231 -18
6407 -18 173 96 -33 232 -71 -234 163 -99 -165 147 -362 75 34 -112 -18 7 -32 118 -157 92 -32 -180
6429 -180 64 -207 -95 18 -98 -68 65 -201 -5 76 -68 58 43 -100 86 -102 -101 -91 -241 43 -190 -74
6451 -74 -20 -228 119 -37 -78 37 -10 -258 25 -135 -43 168 -115 70 58 34 269 21 -141 67 48 132 179
6474 179 -143 200 80 -84 0 -85 12 59 -67 154 -83 -46 115 -51 162 118 4 210 -22 -64 204 19
6496 19 -236 317 -156 -4 62 -30 55 -92 -128 76 -51 -176 -129 -206 165 80 13 117 -95 -35 110 -112 -37 36
6520 36 -161 3 -17 -62 9 -242 102 28 -119 83 31 -31 164 -70 -79 196 -39 148 -128 -132 114 -12 -32 82
6544 82 -56 -36 62 -266 12 105 -155 129 -286 -67 74 -145 240 62 7 117 -125 168 130 -135 -24 -13
6566 -13 97 72 -87 231 137 -31 161 -11 -34 92 -213 -16 39 -172 96 19 -230 50 21 -128 172 29
6588 29 170 -106 -95 107 45 175 165 -67 88 26 -68 83 -40 83 -17 -59 -25 10 98 -65 -148 44 199 -20
6612 -20 -80 135 -178 -27 -94 -13 178 -46 45 133 -100 -109 -62 -237 153 2 -148 200 80 -49 39 -178 93
6635 93 48 -202 26 -53 -155 120 -175 -126 226 -73 -50 46 -154 122 -170 15 79 -59 139 -23 -262 205
6657 205 133 21 35 -210 94 24 38 -58 49 -120 58 -25 38 236 -213 10 -11 -79 62 -21 5 103 3 114
6681 114 -97 -9 131 157 -221 148 -10 -24 173 4 267 89 26 269 -129 256 -50 -59 153 100 -179 -46
6703 -46 10 -91 104 -89 234 27 -19 79 -125 20 211 106 86 85 -206 188 -137 -6 111 108 -14 38 31 276
6727 276 36 -24 30 -4 78 -24 -127 -122 -115 -137 29 -115 2 77 -78 129 -16 -217 93 21 39 -51 -207 -58
6751 -58 114 -74 -69 -81 -24 134 -228 126 -82 141 -56 77 -233 93 -126 -151 109 -51 -42 130 -128 -239 -45
6774 -45 -86 30 -71 50 201 -55 102 152 -166 118 -82 -55 -1 1 -7 7 -34 86 -73 -49 250 -5 205 86
6798 86 72 -7 -161 -123 196 21 98 -22 -90 187 44 -56 14 136 33 80 -79 31 -6 -26 -47 -151 -41 -30
6822 -30 69 87 97 -175 -31 -29 -36 -52 45 222 113 -5 37 86 -57 20 -35 -199 4 -240 -106 37 -176 -44 20
6847 20 35 89 176 -7 139 -267 137 -35 -79 203 8 -29 109 -15 -30 217 -46 37 -24 59 151 2 16 274
6871 274 -84 68 52 -78 58 97 119 138 85 110 137 4 33 -37 -25 28 -84 -75 59 -138 -3 -187 -50 6 -15
6896 -15 -16 40 -211 121 121 -121 -42 -79 -12 -39 -85 164 -4 12 64 -48 156 -24 38 -25 44 -71 92 21 -145 113
6922 113 -211 -6 -20 -32 140 12 -5 183 -230 8 94 -88 158 -110 -102 101 102 141 53 -35 154 10 27 96
6946 96 -26 -46 145 -168 155 50 -18 65 33 84 5 -103 88 4 -82 -19 -7 26 111 1 -43 100 -30 54 27
6971 27 -46 29 7 -48 8 47 175 58 -32 61 143 -160 -10 -224 98 110 -17 83 78 155 30 -66 35 40 -54 47
6997 47 -44 43 134 -39 -124 122 -14 80 169 -177 117 -124 24 117 83 65 36 -45 -2 -263 -11 8 -72 28 93
7022 93 -118 19 -46 18 -101 -122 -28 162 -43 -59 96 -144 167 -224 -41 154 -110 9 82 -161 51 -126
7044 -126 -73 65 -13 -137 31 -86 88 -71 -24 67 0 -114 26 -119 93 212 -172 40 -167 78 20 -55
7066 -55 70 98 -111 37 -88 -148 90 -168 134 38 -86 -41 -28 83 90 -32 -28 54 2 23 -82 -156 172 77 -71
7091 -71 -36 -231 -78 63 -76 115 6 -216 -62 -35 41 11 -80 63 43 -74 18 -62 -19 71 -141 72 109 -34
7115 -34 -26 -172 -2 88 -50 -57 66 -68 94 12 -112 -52 -84 36 -47 -131 -181 5 -239 111 -104 -9 133 -130
7139 -130 -55 28 -42 -10 -24 -206 90 -60 7 74 -55 -77 -157 -103 137 25 -46 76 -68 89 132 -62 98 -26
7163 -26 -25 77 -147 87 67 -42 116 -80 134 2 -130 -81 176 87 -46 -59 -163 86 -77 8 149 -25 97
7186 97 148 10 67 98 -112 141 26 -13 58 42 -79 56 -94 -101 -28 36 97 -104 211 211 -156 35 136 -116 24
7211 24 5 -69 -25 -81 66 45 -116 49 5 -47 -77 -179 -129 -162 -114 -87 -1 -17 122 -94 17 -41 -202 22 64 40
7237 40 92 -159 -56 -29 -28 16 -150 -86 -136 -239 -146 -67 17 -35 -47 -124 193 -93 -87 -98 -194 67 -114 50 40 -81
7263 -81 -103 27 25 -12 13 -93 116 119 -76 71 -87 19 -29 -143 75 -60 -12 237 -12 3 53 34 12 29 29 70
7289 70 7 -93 22 38 135 -33 -41 112 64 -60 131 -3 -29 127 10 33 -58 -168 37 -205 26 -20 -131 -126
7313 -126 44 88 -65 -66 -81 32 42 28 -119 -43 119 -41 -6 -52 -62 129 178 90 20 75 -138 52 -121 -87 48
7338 48 30 -30 -62 -73 12 -126 -8 122 -23 116 -56 -170 46 -9 -29 8 -143 -70 98 -131 -78 1 -104 78
7362 78 116 -53 89 83 -34 21 -11 29 -31 -38 88 -210 118 -13 -242 9 -101 -27 114 104 -13 73 57 97 197
7387 197 50 32 -133 -22 119 -184 -28 -131 -87 48 136 3 -40 -303 -146 -45 -114 147 -32 -37 -72 85 -42
7410 -42 -69 -106 -95 100 -73 28 -71 5 68 -67 -37 19 -69 10 -1 -8 -108 -77 -32 32 -159 39 15 -224 144 9
7436 9 26 -119 3 175 115 171 108 -113 59 28 -36 46 3 37 41 110 94 111 0 -1 104 17 6 -73 -23 -5 2 161
7464 161 27 -22 59 -147 4 74 -80 80 1 49 80 104 17 115 -27 -41 90 -138 38 67 -132 32 94 58
7488 58 -81 -62 145 23 -113 90 -3 -13 -5 -130 132 162 141 1 29 62 51 -4 252 131 -60 -54 -13 -128 -96
7513 -96 -1 -67 -117 108 99 -155 -147 -6 -85 -28 41 36 -17 -29 -101 16 31 17 69 166 38 96 -154 -85 64 60 178 9
7541 9 6 132 16 -90 -3 -168 86 -119 -226 36 -150 -9 11 31 29 -107 -38 11 97 26 -63 -42 116 -22 -18 -33
7567 -33 -80 -49 187 1 154 -59 -77 -65 50 -131 62 -146 -108 14 -225 -32 -101 -5 27 59 -116 86 -127
7590 -127 -54 -113 -148 -34 4 -91 91 -39 -75 -77 -164 71 31 -85 64 -27 66 105 42 -6 -67 -93 152 99 -34 66
7616 66 -148 -138 41 -6 2 24 -228 74 33 64 186 36 131 183 -81 88 -49 -17 47 -42 -13 94 23 53 115 -24
7642 -24 -2 -64 16 50 -194 21 43 3 98 14 -7 -6 -37 -18 -54 -24 105 86 112 38 -43 -16 38 -37 57 109 22 -46 -73
7671 -73 126 -34 -108 60 -50 -160 40 -12 -30 -9 -67 -31 5 -194 -22 -128 -72 -64 133 -5 -17 -18 86 100 0
7696 0 -80 -166 87 251 -47 4 -52 -112 50 -158 -34 59 -141 15 -74 -69 7 -20 -84 119 -10 -22 59 -53 42 -82
7722 -82 67 96 -37 40 -52 -59 165 6 10 124 -6 160 38 -91 122 31 -136 82 -72 -41 5 -94 68 176
7746 176 -127 105 -5 76 167 -69 -137 36 -43 80 55 -167 245 -78 -131 -40 -49 127 -7 2 21 -79 -94 115
7770 115 -41 17 -28 69 144 -70 42 135 -47 70 82 -48 82 -172 -116 144 -197 8 -60 -13 -61 -137 29 -50
7794 -50 -20 -153 -105 72 61 -83 -68 21 6 -8 142 43 -6 43 83 33 98 -61 150 -34 28 58 -147 60 -96
7819 -96 -140 -38 112 -28 17 116 67 71 -20 -48 -41 -3 189 -172 80 181 -46 61 -7 -89 77 -83 -154 44 -111
7844 -111 200 -75 14 58 107 -89 3 -20 277 13 -63 25 -65 -13 15 -166 -21 -57 -20 169 -173 -42 10 -20 23
7869 23 140 37 47 63 -101 245 -66 19 -128 -13 43 13 96 75 -34 10 104 -19 -70 -56 35 -19 -23 10 52 89
7895 89 -17 -30 63 -9 -97 -142 -51 44 -58 194 17 71 60 -47 4 -110 92 170 -125 30 -12 -150 76 68 -45
7920 -45 -74 -133 93 -199 -97 56 0 -62 -128 -94 -8 224 -146 55 -25 -126 55 13 66 126 -68 84 92 -95 173
7945 173 -6 -117 20 -5 -116 17 -18 -23 -2 -266 61 -92 8 -73 -159 -138 6 106 61 113 4 36 -126 -85
7969 -85 -49 -48 -76 -75 -22 173 -22 -38 39 -266 -12 -210 -119 46 -49 14 -62 7 4 -51 43 81 -106 6 147 27 -19
7996 -19 220 -120 120 28 5 9 -98 16 -4 11 38 65 -42 120 100 1 143 -68 28 -41 -14 6 -33 46 15 23 -61
8023 -61 52 -53 -47 64 51 -58 120 -15 78 -107 187 40 -63 175 -80 67 -13 -37 26 53 45 71 0 -51 145
8048 145 -185 -29 111 -85 193 -101 6 32 -135 -89 -9 -23 50 54 -141 168 23 -117 -20 33 156 95 -7
8071 -7 -76 -46 -14 77 -109 97 -8 0 16 -70 -96 -29 -12 -71 -43 43 -16 -105 123 80 -168 -50 -29 -31 43 -19 -37 6 -20
8100 -20 113 -14 -338 -18 192 -46 114 24 -1 15 55 0 113 -19 69 -90 10 69 32 90 111 -221 63 -83
8124 -83 -71 81 -36 -42 -70 202 146 -49 -151 28 -40 23 55 -32 84 122 13 84 101 -111 17 -5 -73 79 -214
8149 -214 -36 70 -52 181 96 98 64 -11 -110 50 -36 49 61 -124 83 76 101 -54 -87 -25 -55 -73 90 43 -71 -98
8175 -98 -93 -28 98 52 -31 -146 -1 43 96 146 14 -90 -2 138 132 5
8191E
$$ Imaginary data points
##PAGE= N=2
##DATA TABLE= (X++(I..I)), XYDATA
0 0 0 0 0 0 0 0 0 0 0 0 0 0 0 0 4 -8 8 -8 8 -8 16 -16 16 -24 24 -32 35 -40 48 -53 61 -69 77 -88 100 -111
36 -111 125 -140 156 -173 191 -213 235 -259 288 -316 348 -385 423 -466 512 -567 625 -691 763
55 763 -848 945 -1056 1188 -1348 1541 -1786 2100 -2525 3126 -4043 5589 -8654 16877 -80586
70 -80586 -180591 141626 43531 -141217 91984 169801 -70001 -58546 110024 7014 -97139
81 -97139 75206 78617 -60727 22142 48945 -62703 -14377 63566 36308 -3182 30285 64608
93 64608 -33376 -51655 68946 13516 -34134 85107 41124 -66476 27771 74120 -47822
104 -47822 -20214 141896 33676 -111267 58915 55600 -140601 -7129 91484 -72104 -38370
115 -38370 61460 -45766 -80987 35428 39632 -42115 18969 69246 -36329 -40097 16352 -31782
127 -31782 -10288 24520 -24187 -16041 -4558 -28875 -29484 -19937 26996 24646 -30901 7392 19290
140 19290 -45160 -22596 24732 3214 -11962 26568 21494 -52200 -3952 66234 -28974 -14180
152 -14180 89039 -2327 -51132 23950 -8176 -39235 11315 10213 -25118 -4700 14482 -39739
164 -39739 -29065 48169 6281 -15147 48801 4116 -28415 19098 -5300 -19101 18082 17330
176 17330 -8260 -26987 -203 11652 -31976 -6480 37717 5232 -15445 -4530 1992 -12862
188 -12862 -19300 21780 5359 -24277 30622 3641 -45696 26448 33153 -16474 18085 32982
200 32982 -1823 -8773 7206 -486 -11903 24525 12883 -34204 14442 21023 -37327 4944 32521
213 32521 -2995 8773 12423 -4715 -3753 -348 5120 -8920 -1767 20872 -14352 -24088 7347
226 7347 -804 -5469 -1440 3538 12801 -12771 -10635 5853 -18504 2996 15451 -24742 -1943
239 -1943 17347 -19087 -16034 9634 10957 -5712 -3132 13388 -12302 -10400 16813 -19916 -11734
252 -11734 29247 -12156 -22286 11791 689 -7721 -1196 8121 9325 -3471 7019 306 -11518
265 -11518 17643 5925 -15155 11644 8739 -4874 -4012 -4155 12570 1743 -8685 12140 -3174
278 -3174 -6382 11041 -12055 -7682 14483 -1165 -11471 -4826 8477 1077 -18620 7564 10574
291 10574 -14206 9155 3505 -16221 13668 7623 -13091 3162 10234 4439 -9490 -2800 15004
304 15004 -5529 -4430 10311 -8379 3228 9485 -13303 759 8494 -273 -644 -7532 7352
317 7352 7765 -14425 2316 5324 -6386 5254 -4477 -5573 8049 -436 -1555 -3467 1755 13459
331 13459 -10653 -7883 14687 -7046 -6647 3641 -10425 360 2097 -9955 -4261 -1059 5234
344 5234 -4051 -13337 11227 3376 -12944 4624 -2092 -3406 6906 -8341 -2006 7253 143 4207
358 4207 -2645 5024 17074 -3380 415 11546 1394 5156 -1645 -3518 9551 -2370 -2525 2265
372 2265 -4162 11283 3024 -9296 13239 7462 -3449 3960 -2348 3714 3826 -7600 -280 -1906
386 -1906 254 1444 -13097 3715 10336 -9395 773 1380 -5505 3946 -8779 -8685 3554 -5405
400 -5405 -5089 -7646 -7410 6504 -4804 -6083 7249 569 3261 -2076 -9633 6086 -1760 -9135 585
415 585 -7260 -766 342 -14338 2842 9457 -304 6500 3597 6285 8633 -2721 3318 4566 3859
430 3859 8108 -9552 -3324 10774 -8795 -3365 8219 -377 5910 -1122 -8881 1849 -2599 -3190
444 -3190 -3088 -5861 5593 -4218 -12790 2003 625 4995 7839 -2204 10183 6401 -8658 1093
458 1093 -1689 -825 5888 -11505 -8149 1222 -9788 -7686 -1499 6087 10031 -1353 4309 4400 -2731
473 -2731 11381 2989 -2088 17911 4080 -7823 3198 1038 6530 7351 2442 13122 7619 -1237
487 -1237 -1074 -3639 7801 4852 -4933 5478 -2275 -6647 1815 -8538 3235 16380 815 2695
501 2695 2122 -5328 669 -8196 -7613 4791 -3759 -12500 -17565 -13410 -4640 -15311 -5795 8234 -6703
516 -6703 -2330 -2414 -16602 242 3918 -6001 1788 -1433 -5471 -7144 -14500 -3532 4563 3691 2478
531 2478 -6246 2460 465 -16962 585 9472 -1789 5077 -2224 -6902 4337 -1875 4484 16572
545 16572 12684 16165 8899 196 6855 8400 11051 5777 3752 15498 -3986 -16687 4803 2002
559 2002 607 12233 3234 5186 5008 -8613 -1337 5981 6640 7836 -286 -605 -4811 -8229 823
574 823 -5254 3271 17210 -5427 -10293 1453 -8834 -5542 -1474 -2567 6403 -5006 -16035 -8278
588 -8278 -6187 -1668 272 3372 8847 -2950 -3807 -1419 -11768 4744 11270 -7123 -113 -704 -12152
603 -12152 -7509 -8684 655 12929 1222 -2258 778 -742 -2204 -5276 8390 12652 -1684 3684
617 3684 -2601 -13480 4474 2270 -3310 11514 5624 -2451 -4654 -9796 807 3918 -1056 1927
631 1927 123 -291 -8843 -14237 5345 6068 138 10906 909 -2843 4192 -6733 489 11487 3939
646 3939 4345 -2362 -8055 -953 -3100 -1747 3525 7390 8835 -7813 -7959 6972 -3773 -107 11077
661 11077 592 3468 1068 -11819 -1225 4464 2850 6215 2848 3879 86 -6410 -724 -299
675 -299 6428 9358 -7088 -1591 2462 -11360 -3190 2232 1034 8568 -1835 -7211 293 -4055 -2602
690 -2602 634 1441 6034 -2989 -6692 -4948 -6889 4378 1915 -4739 9009 1656 -9500 -342 -2498
705 -2498 1388 8030 -1065 204 2166 -3535 -4496 -4687 5075 7338 -2396 2271 -1427 -5629 3348 -3804
721 -3804 -1872 11041 8 -4181 -1113 -4631 1301 -97 -1768 6286 2566 -722 -3526 -5556 4599
736 4599 1968 -1464 5718 -1246 -2 590 -10025 1865 7511 -3252 1552 753 -2915 38 -5427
751 -5427 -1497 4061 1941 2047 -4985 -2067 4217 -6074 -609 6487 -746 4473 220 -7124 4502
766 4502 2847 -1557 3572 2574 4738 -113 -5505 3167 1630 961 3072 -3177 2579 1473 -7869 -59
782 -59 447 -734 4477 -4680 -2562 4695 -4647 -3011 1203 661 3358 -3387 -3191 1131 -2571 1140
798 1140 -1788 -2904 7839 -1659 -6580 3688 -1434 -824 2206 -3675 1871 1641 -3889 -1777 -2680
813 -2680 2949 2771 -5219 2855 3429 -2175 2009 -1750 1918 6808 -3065 180 3441 -1381 3374 -698
829 -698 -1465 7296 1445 -1073 1698 934 4766 -1051 -2107 4988 -1246 -567 351 -6113 3262 1909
845 1909 -7036 1338 1426 -1867 63 -4024 736 2125 -3207 -365 -2899 -814 2391 -7155 -2059 3642
861 3642 -3526 112 -1540 -2447 4896 -2340 -3527 2815 -1027 936 -1403 -4266 3406 -360 -2964
876 -2964 690 -1207 3983 625 -4419 4764 1677 -1424 3113 -2753 1543 5220 -4413 -345 3531
891 3531 659 1863 -1532 2198 4929 -1252 2078 642 -261 5746 -3352 -3829 4646 -2392 -2522 -388
907 -388 -3420 2557 -764 -4695 1184 -807 370 -335 -4503 2831 817 -4080 436 -1820 1681 2550
923 2550 -5023 2517 4024 -2650 2267 -220 -257 5352 -1810 -2044 1943 350 1036 -3095 -180 5649
939 5649 -1866 268 2888 -1881 5143 1775 -3273 5740 2891 -1508 1040 -1433 2828 1952 -2655
954 -2655 2430 976 349 1056 -4321 1778 3591 -3402 552 -1455 -1887 1610 -6579 -3094 3786 -3517
970 -3517 -2207 -1479 -4054 595 -3231 -3770 173 -1445 479 -4797 -6061 3008 -2980 -4407 2908 -2106
986 -2106 480 1197 -5979 1087 3364 -885 1525 -226 2030 1304 -4533 831 1858 1025 4130 -2424
1002 -2424 59 4640 -3063 546 3723 1483 6176 129 -2612 4849 669 60 3213 2727 5359
1017 5359 1038 -1367 2216 -213 3724 3249 -2511 5299 2247 -6169 218 -542 -406 3798 -2534 -706
1033 -706 1579 -3301 -2789 -2709 1851 4058 -3674 -748 -78 -4780 404 -2091 -1911 5653 -1217 -3514
1049 -3514 -476 -3842 753 788 -2613 3774 1686 -3067 -3225 -3507 2310 313 -2306 3780 -1125 -2713
1065 -2713 210 -6238 638 5658 -2061 715 1165 -2871 -617 -2913 -239 4571 1948 1546 -2760
1080 -2760 -2095 3207 -3329 -699 6397 831 959 -961 -5415 1892 588 -1762 4239 1213 23
1095 23 -899 -5555 -297 1971 1578 2458 -1554 1962 540 -6905 981 3520 488 4960 -738 -2460
1111 -2460 2720 -3417 -1843 4117 3131 3535 -1260 -2347 499 -2531 1098 2046 -184 5708 -852 -6642
1127 -6642 492 -1252 -155 3384 -1068 2511 788 -5906 -1941 307 1977 3337 -757 1296 -277
1142 -277 -4120 -451 -2206 1896 6958 -2288 -2021 1361 -4620 -868 488 -204 5268 631 -3782 -2265
1158 -2265 -2390 808 -708 -80 5103 -853 -2608 -1199 -4948 2390 4151 -1856 3392 2078 -3089
1173 -3089 -826 -3088 1186 5172 491 1053 -141 -1300 -416 -3915 1290 5134 -339 1389 -1737
1188 -1737 -4750 1770 -1982 -2334 5065 1246 -1157 -1744 -4349 533 448 -91 2722 622 1526 -1868
1204 -1868 -5748 2185 1991 -383 4136 -584 -908 1250 -4846 -1161 3592 1060 1996 -1295 -1560 669
1220 669 -3353 -601 2114 1592 3831 -2431 -3170 2205 -2396 -151 3732 -67 3409 751 -4958 315
1236 315 1023 793 2353 68 2683 19 -3706 -558 -890 2052 3314 -2937 687 1530 -4895 -601
1252 -601 177 -13 3735 -1133 -2385 42 -2268 -755 -1109 9 3941 -883 -2225 -594 -2297 2166
1268 2166 470 -1751 4863 824 -3250 301 -1683 789 2550 -1430 1523 889 -1418 -931 -2668
1283 -2668 2083 3138 -1550 1307 -402 -1855 1635 -2832 -879 4853 -578 -719 388 -1444 1581
1298 1581 -434 -326 3656 1028 643 -971 -2533 2199 -346 -1859 2260 -856 -170 161 -4666 688
1314 688 2234 -2006 597 -432 -501 176 -3570 -489 1047 -382 966 -2280 -541 2456 -2821 -148
1330 -148 2604 -126 2427 -436 -2480 2450 -147 -1018 691 -462 1895 -524 -2826 1341 138
1345 138 533 1110 -1840 2557 987 -3368 1152 134 -511 2155 -2200 -237 2571 -1344 65 353
1361 353 1244 2847 -1424 -119 1847 -1357 706 -1207 -1834 2996 -1477 -2719 1192 -1095 434 490
1377 490 -2169 2230 816 -1600 47 -1427 1093 295 -3230 1092 141 -962 1000 -2070 977 3211
1393 3211 -2140 362 1800 -491 1418 -1148 -761 2411 -874 -385 -64 -454 2558 -1065 -807 3020
1409 3020 -444 501 455 -2419 2014 218 -3179 521 -428 -437 194 -2256 1230 1627 -652 1061 -269
1426 -269 1385 2090 -2466 328 1582 -1754 555 -1405 -1623 2152 -2168 -1740 1214 -689 425 -1124
1442 -1124 -1782 1581 -1046 -1266 -511 -1560 1785 -688 -2663 2404 506 -160 2079 -887 1698 2334
1458 2334 -1626 376 749 -82 168 -2290 147 1238 -1760 518 -249 299 3112 -1579 -446 2837
1474 2837 -706 325 46 -1343 2421 -318 -2059 775 -58 723 17 -928 2732 557 -963 867
1490 867 -1444 1208 1246 -3305 879 1021 -1819 415 -907 211 2459 -1115 -188 730 -391 406 -2355
1507 -2355 -704 1780 -2075 -970 -615 -2033 1714 -798 -1542 3116 591 -277 769 -967 1444 953
1523 953 -1469 742 110 322 -547 -2861 1625 1099 -1220 1448 -629 -316 1541 -2911 -552 2067
1539 2067 -929 -420 -631 -975 919 -1264 -83 1589 897 2136 -911 -1194 2554 -718 -525 1718
1555 1718 -714 1165 -121 -3375 713 781 -496 1030 -178 1155 122 -2267 12 -17 635 1405
1571 1405 -2216 -68 1034 -2908 -128 847 207 2938 -320 -1307 1577 -481 -386 290 455 2294 -919
1588 -919 -1809 -147 -1528 983 430 -1393 2776 269 -2588 122 -1034 342 1880 -1103 309 681
1604 681 -1659 -1050 -1228 1476 2444 -671 683 26 -1396 926 -1473 -122 3542 -668 -1052 -155 -1883
1621 -1883 449 -52 -503 2389 919 -438 -1266 -1580 1551 230 -509 2225 -281 -621 -344 -3407 612
1638 612 2377 -960 968 275 -841 -177 -2015 218 2464 1079 1321 -965 -516 1174 -1959 215
1654 215 2658 177 1247 -1052 -3174 748 -773 -1271 1552 455 284 -1039 -2946 -129 169 888
1670 888 1420 -584 1651 143 -3284 893 1418 594 2696 -381 -562 810 -2278 -1035 808 785 1711
1687 1711 -1550 -1831 -452 -1694 -207 80 472 3072 -860 -2299 947 -853 487 1979 -149 1836
1703 1836 330 -2483 -892 -481 1176 1637 -454 1130 -78 -1680 -296 -1626 1095 3198 -1215
1718 -1215 -97 362 -2164 -288 -351 324 2833 361 -799 -718 -1164 438 -651 -127 2254 -599 -1195
1735 -1195 -1404 -2865 998 1273 -833 2041 1098 -756 -177 -1484 893 2246 56 613 -596 -719
1751 -719 -573 -2654 324 1596 -335 1350 -921 -1571 1280 -1194 -786 2273 479 73 -997 -1890
1767 -1890 617 162 200 1769 737 1826 -301 -1824 1757 590 -77 1680 -933 -299 19 -3164
1783 -3164 -668 700 269 1166 -459 -90 746 -1361 58 614 828 1816 -1795 -1461 627 -1895 -336
1800 -336 1023 -289 2150 283 -1896 599 129 236 336 -385 1164 -692 -2160 -737 -1321 785
1816 785 1264 -1699 1059 1204 -1534 295 -174 612 1974 -958 -690 -3 -1261 -154 -838 86 2353
1833 2353 -159 171 654 -525 1760 137 -588 2183 -266 -1331 -278 -1700 232 513 -998 837
1849 837 510 101 0 -1170 1319 1217 -949 470 -739 -1003 450 -2203 -698 1721 -676 86 206
1866 206 -201 1275 -384 -58 1323 -93 292 -1020 -1752 839 -948 -1029 1068 -490 816 476 -1729
1883 -1729 1109 904 -677 522 -555 79 148 -1913 -31 270 92 1028 -861 1041 2269 -521 1162
1900 1162 1391 147 1739 -765 -1335 955 -849 -848 -346 -565 1107 -571 -879 1086 -210 725 411
1917 411 -1253 1206 66 -1839 497 -593 -188 768 -1269 422 1330 -329 403 129 509 1023 -1561
1934 -1561 -428 -163 -1408 81 -1515 -1034 1498 -1071 -566 1083 -477 806 212 -1088 1163 -34
1950 -34 -972 -278 -1080 654 -222 -1661 952 128 56 1030 -902 962 1544 -1182 466 336 -499 592
1968 592 -1185 -486 757 -778 248 -152 -125 1870 -719 -149 1291 -522 485 -297 -1525 1258 -300
1985 -300 -1255 831 35 605 719 -628 1333 998 11 648 -496 836 525 -1872 464 140 -715 659
2003 659 -915 -74 1650 -826 -285 853 -31 699 -897 -759 695 -900 -353 -116 -856 1424 -278
2020 -278 -1014 1439 -175 93 718 -967 1047 529 -1554 -17 -169 -243 104 -1407 65 289 -1043
2037 -1043 132 -789 231 1397 -1639 -376 795 -1075 250 -335 -529 1487 -100 -431 748 -27
2053 -27 1060 271 -200 1498 -75 -484 63 -1270 796 326 -1615 823 223 -939 431 -847 471
2070 471 1154 -494 392 222 13 630 -1176 367 1351 -506 346 -180 -793 1013 -789 -766 1477 -311
2088 -311 -207 -378 -1275 621 -24 -556 609 -58 560 -156 -1306 1119 546 -500 1056 -548 -66 489
2106 489 -1870 -112 867 -263 545 -681 -498 585 -882 97 813 501 1515 -292 -392 1430 -363
2123 -363 242 1160 -146 1201 -306 -1766 343 -268 -423 250 -671 461 -518 -1603 8 -570 795
2140 795 1010 -1142 745 644 -1395 322 211 352 1562 -708 -554 321 -1067 -237 -352 -19 1149
2157 1149 -1013 -1274 -508 -1349 266 -232 -880 1623 -100 -1005 393 -588 931 1448 -172 1167 492
2174 492 -724 -237 -1105 654 980 -870 638 -305 -976 532 -1072 409 2015 -252 116 -83 -1067
2191 -1067 513 -557 -183 1422 150 -156 -690 -1241 833 -217 -305 1170 -497 -84 -316 -2280 493
2208 493 514 -720 950 -274 -164 416 -1137 665 1402 811 1136 -555 -180 595 -1545 -119 808 -367
2226 -367 856 -927 -1525 789 -325 64 1238 425 1125 -199 -1072 678 12 728 983 -528 1197
2243 1197 88 -1464 643 348 630 1536 -575 146 209 -1684 -432 -290 13 845 -1272 -623 -113 -1056
2261 -1056 304 -104 140 1984 -649 -956 53 -1269 0 269 -811 764 -367 -1383 -455 -656
2277 -656 924 879 -293 1076 -190 -852 -73 -1186 469 1187 -1084 211 152 -1078 296 -374 382
2294 382 1920 326 155 -88 -539 572 -530 108 1258 -261 329 -290 -1151 1416 662 -88 1657
2311 1657 289 -211 116 -1210 336 326 -564 289 -745 -307 -105 -1523 407 951 -125 1004 -642
2328 -642 -848 867 -1191 -350 733 -203 486 -712 -977 443 -331 203 851 140 1230 -364 -1383
2345 -1383 724 -373 -273 599 -1029 228 120 -1506 135 387 393 1010 -386 394 629 -959 288
2362 288 -46 164 1185 -985 -118 777 -636 667 667 75 1577 5 -561 368 -445 169 -106 -690 761
2381 761 -543 -1078 -57 -837 785 616 -742 817 85 -923 255 -877 101 674 -972 -121 27
2398 27 -491 118 -561 291 1099 -479 221 -106 -748 689 -819 -886 916 -600 -598 -110 -890 519 190
2417 190 -430 692 -7 324 -58 -886 808 397 -775 544 -491 73 653 -951 601 1135 -306
2434 -306 707 -39 97 936 -594 -85 417 -317 606 -604 -563 968 -570 56 850 -206 1028 448
2452 448 -859 984 241 -172 502 -460 520 333 -733 593 203 288 727 -692 556 800 -744 186
2470 186 -56 -359 685 -868 -647 476 -571 -120 -132 -408 455 -522 -570 229 -819 133 -347 -997 733
2489 733 -375 -810 436 -571 108 470 -1019 559 379 -393 169 -526 240 582 -1008 77 -149 -378
2507 -378 485 -926 -402 923 -713 -204 435 -445 700 80 -420 1022 102 156 382 -296 944 270
2525 270 -342 798 -125 328 382 -1019 559 448 -895 311 -241 -209 491 -790 -95 407 -606 111
2543 111 -444 -68 885 -679 98 539 -535 528 -316 -813 805 -254 -623 392 -483 299 -44 -850
2561 -850 475 -139 -192 341 -486 605 368 -948 709 101 -67 649 -576 126 846 -796 198 222 -111
2580 -111 639 -420 11 734 -253 348 47 -182 1482 -216 -274 811 -274 466 358 -477 748 109
2598 109 -652 63 -597 -34 -97 -1044 91 -265 -829 -51 -731 -89 503 -841 33 279 -435 621 -228
2617 -228 -192 923 -363 -259 2 -552 429 -377 -383 832 -488 -231 -200 -899 652 -27 -773 556 -128
2636 -128 -281 65 -723 470 722 -94 475 136 47 293 -703 404 711 -237 499 -373 -668 596 -886
2655 -886 -268 571 -229 350 -140 -367 628 -194 -120 408 -99 281 -426 -1006 539 -165 -99 455 -400 338
2675 338 284 -952 402 361 -32 640 -269 -52 246 -465 460 460 571 1186 -315 -38 501 -479 274 284 -215
2696 -215 808 -456 -785 136 -415 237 319 -30 749 153 -321 351 -292 581 590 -682 498 8 -960 70
2716 70 -391 140 784 -634 -72 -220 -810 -233 -433 -231 592 -749 -619 -441 -1081 287 -453 -468 890
2735 890 -318 -433 -47 -750 371 320 -435 534 -150 -531 -233 -743 581 699 -278 544 -308 -283 388 -716
2755 -716 505 993 6 283 -182 -536 301 -261 58 945 66 475 -142 -492 614 -196 228 843 -302
2774 -302 505 -96 -1062 542 220 60 647 -214 0 31 -979 299 305 295 384 -919 -243 -70 -1151 150
2794 150 389 -251 634 -668 -761 282 -526 137 424 -45 610 -381 -544 14 -327 264 442 -305 738
2813 738 -307 -906 294 -327 276 793 -542 29 72 -874 -48 -201 352 861 -436 94 0 -412 568
2832 568 -300 315 1172 -523 -21 77 -552 418 142 -27 826 -184 -467 -44 -563 544 168 -294 409
2851 409 -480 -405 -227 -1054 527 605 -702 257 -343 -459 168 -506 224 777 -122 175 -259 -381 486 -395
2871 -395 4 759 -177 275 -348 -718 623 -155 -358 595 -404 -112 -359 -899 216 -60 -196 205 -404
2890 -404 150 14 -881 372 212 91 713 -408 -79 528 -662 257 574 -105 620 -420 -158 449 -226
2909 -226 159 214 137 857 -359 -469 582 -322 248 401 -404 693 100 -557 370 147 297 455 -422 489
2929 489 209 -432 172 -257 378 647 -749 130 339 -485 378 -136 -229 667 -499 -475 -118 -433 61 -333
2949 -333 -499 469 -517 -271 -47 -757 397 63 -673 595 -214 -429 217 -591 244 570 -302 91 106 -166
2969 -166 241 -375 274 486 -375 321 -216 -355 720 -399 -198 663 -378 64 60 -499 630 -54 5 538
2989 538 -123 225 42 -413 819 99 -112 444 -368 235 348 -780 252 273 -377 190 -381 -91 374
3008 374 -564 -9 10 -403 403 -578 -287 316 -718 -72 78 -485 517 -218 -528 382 -109 214 182 -202
3028 -202 433 91 -412 384 -222 252 243 -698 402 159 -599 473 -65 -74 835 -443 242 409 -196 288
3048 288 -167 -31 656 -328 77 248 -225 613 -19 -384 777 -136 -205 420 -396 416 164 -717 414 -35
3068 -35 -388 171 -777 79 26 -822 64 -290 -287 351 -771 -149 532 -606 -23 -34 -351 445 -442 -294 427
3089 427 -153 64 -160 -474 556 -349 -275 278 -519 129 16 -823 425 85 -518 377 -202 -60 218 -607
3109 -607 -21 161 -274 279 -290 23 471 -448 197 239 -168 690 -234 -219 605 -184 46 284 -365 568 -118
3130 -118 -241 453 -146 -61 89 -507 429 -205 -343 518 -139 93 576 -520 168 371 -370 332 9 113
3150 113 667 -321 343 454 -273 542 60 -31 764 -221 -112 396 -436 363 210 -414 685 -99 -357 201
3170 201 -372 231 126 -438 334 -159 -347 18 -780 261 270 -689 340 -198 -569 159 -582 -64 352 -532
3190 -532 -93 -341 -617 162 -602 -154 232 -459 -79 -444 -803 581 -59 -398 333 -428 -125 71 -606 432
3210 432 456 -94 489 -58 233 459 -393 653 286 -32 744 -153 -12 472 -459 221 506 -212 456 -213
3230 -213 -267 512 -285 349 296 -245 473 -195 -489 438 11 296 654 -361 490 173 -564 493 88 312
3250 312 494 -394 -3 223 -526 276 -149 26 496 -742 -217 263 -705 121 -101 -135 610 -537 -386 144
3270 144 -416 140 141 -244 519 -416 -377 112 -468 501 270 -381 466 -111 -459 329 -402 234 576 -463 19
3291 19 -297 -333 168 -356 247 550 -235 67 -168 -558 575 -166 -128 786 -302 45 -62 -556 520 271
3311 271 -231 460 -123 -163 -145 -484 394 70 -203 296 -452 -216 154 -657 339 364 -142 551 -404 -341 300
3332 300 -366 194 358 -68 346 -342 -290 399 -275 190 471 -409 309 -222 -694 501 -153 177 288 -648
3352 -648 -33 -145 -748 239 -78 -4 418 -665 245 -59 -616 409 82 -92 737 -383 -81 288 -334
3371 -334 307 255 31 526 -274 -204 198 -115 430 139 -136 567 -117 -341 249 -359 339 442 -467 427 -11
3392 -11 -456 90 -251 240 526 -264 266 -322 -215 314 -312 368 539 -405 129 -74 -550 328 -125 -284
3412 -284 504 -400 -43 -26 -460 398 -234 -203 287 -325 8 -115 -559 488 262 -275 605 -165 -63 277
3432 277 -549 268 410 -205 275 -312 -202 282 -369 245 332 -240 226 -256 -320 485 -166 -121 475 -210 303
3453 303 -117 -280 481 19 114 401 -257 321 -68 -562 339 -242 95 391 -454 129 381 -517 255 148
3473 148 -132 299 -413 -221 118 -494 76 -24 -255 304 -538 -357 336 -437 301 -32 -386 503 -8 -366
3493 -366 279 -319 193 487 -253 653 280 -83 288 -251 487 277 -307 430 -47 -331 308 -341 -53 418
3513 418 -422 106 156 -250 476 -152 264 421 -384 188 136 -381 375 -68 -229 447 -296 -80 207 -412 326
3534 326 36 -294 22 -280 -4 304 -569 167 7 -401 146 -456 -281 288 -604 -4 108 -434 86 -147
3554 -147 -354 365 -272 46 108 -284 166 -175 -362 305 -185 -93 298 -457 419 289 -430 243 79 -216 188
3575 188 -423 24 194 -531 90 -242 -137 381 -328 -56 382 -468 354 12 -176 549 -163 -90 387 -329
3595 -329 281 142 -163 624 -48 -160 285 -217 74 215 -485 478 -119 -47 404 -209 54 477 -234 316
3615 316 462 -173 347 -302 -2 410 -159 212 177 -250 449 -339 18 485 -399 85 213 -411 205 -146
3635 -146 -633 113 -195 -385 -9 -380 287 -183 -424 162 -296 -280 142 -570 -53 -15 -581 101 -198 -226 263
3656 263 -468 -179 -22 -232 269 -277 -358 221 -388 -124 99 -308 198 64 -489 411 -7 -90 251 -133 338
3677 338 137 -290 307 129 38 309 -192 230 275 -371 449 28 -79 615 -285 63 495 -312 297 254 -141
3698 -141 320 -283 -247 326 -152 250 35 -277 446 -103 -310 396 -102 265 380 -332 218 107 -290 311
3718 311 -180 35 285 -249 33 43 -192 263 -248 127 365 -472 -49 79 -363 217 -152 -359 220 -350
3738 -350 -240 68 -253 263 -304 -365 296 -151 153 38 -415 289 203 -481 284 -68 -205 287 -240 23 323
3759 323 -206 102 -235 -49 196 -353 189 175 -97 169 -364 -252 562 -161 21 528 -35 261 -17 -287
3779 -287 273 117 62 369 -174 123 87 -329 411 49 -109 470 -488 -81 63 -338 317 198 -89 127 -269
3800 -269 -137 195 -347 227 26 -137 430 -402 -323 205 -375 218 324 -286 223 -134 -403 218 -191 159
3820 159 173 -270 114 -256 -329 97 -247 173 350 -452 28 -67 -339 245 -113 139 412 -261 -61 100 -148
3841 -148 350 103 57 292 -304 133 -79 -182 414 24 -152 362 -386 -279 195 -277 237 228 -279 284 -141
3862 -141 -216 145 -283 68 294 -389 311 -270 -216 257 -295 180 415 -279 55 -32 -323 418 -224 102 326
3883 326 -297 118 -171 -347 304 -81 -138 283 -390 53 -117 -366 172 168 -162 338 -162 -262 88 -357 352
3904 352 308 52 361 -359 -136 203 -221 307 184 -154 383 -332 -192 325 -201 109 119 -221 108 -286 -246
3925 -246 13 -211 234 277 -171 42 -100 -262 360 -32 63 162 -291 62 102 -204 221 177 34 364 -149 -157
3947 -157 150 -93 318 9 -77 233 -217 -67 258 -336 330 183 -229 402 -130 -254 259 -128 304 217 -46
3968 -46 439 74 10 414 -230 179 283 -201 227 -180 -224 421 -324 -67 163 -368 24 -127 -266 263 -106
3989 -106 -42 218 -257 228 99 -401 298 -25 -125 359 -301 20 227 -314 329 -28 -95 218 -378 -21 -11
4010 -11 -451 59 38 -245 304 -414 -270 238 -317 -21 158 -336 176 -254 -278 133 -192 155 232 -203 398
4031 398 -122 -295 348 -49 180 362 -382 85 19 -330 315 -171 136 184 -275 53 158 -174 273 -76 -31
4052 -31 207 -230 -24 122 -267 349 122 -226 491 53 -147 257 -162 209 32 -113 383 -136 -152 374 -308
4073 -308 265 251 -263 199 -56 -211 210 -302 125 203 -226 271 -60 -189 285 0 -9 380 -248 157 -20
4094 -20 -386 336 -348 -105 246 -303 8 178 -301 205 -57 -100 97 -369 102 -80 -314 45 -175 -266 337
4115 337 -301 -21 202 -244 -7 117 -213 207 -156 -109 243 -182 205 153 -235 364 12 -362 320 -265 -100
4136 -100 117 -281 303 -76 -232 349 3 85 277 -231 229 159 -120 313 -33 101 315 -213 237 262 -205
4157 -205 398 95 25 450 -64 54 272 -181 121 -151 -243 141 -162 -112 109 -246 120 25 -304 456 -74
4178 -74 -57 256 -269 154 259 -250 123 178 -117 280 -368 153 79 -129 166 -108 -160 277 -268 -90 148 -373
4200 -373 184 54 -401 188 -84 -75 127 -238 105 -57 -154 176 -64 -65 283 -252 176 348 -303 287 81 -45
4222 -45 403 -111 -109 222 -264 -48 -6 -283 206 -172 -146 111 -259 246 63 -323 495 -252 -340 425 -237 56
4244 56 258 -260 238 92 -223 403 -44 9 265 -114 27 -29 -258 225 -160 -185 339 -435 136 115 -241 139
4266 139 -60 -195 360 -285 -163 107 -314 240 23 -83 278 -144 -134 196 -275 155 141 -63 134 -108 -184
4287 -184 214 -334 153 192 -121 193 -166 -181 74 -151 -1 169 -292 98 -288 -207 247 -76 -78 272 -232 -32
4309 -32 43 -184 348 -129 -109 363 -243 61 65 -158 321 -84 -108 190 -265 -96 115 -326 135 93 -285 128
4331 128 -190 -174 120 -234 200 117 -224 179 -235 -209 329 -160 134 333 -200 300 18 -203 256 -271 -28
4352 -28 308 -377 132 -299 -246 214 -185 -28 291 -315 -57 -22 -108 274 74 -50 443 -168 228 171 -221 269
4374 269 90 -140 312 -371 27 188 -312 354 128 -151 150 -296 -132 256 -158 68 99 -291 212 -267
4394 -267 -275 144 -319 163 152 -293 283 -102 -308 456 -71 -90 281 -395 147 -21 -333 332 24 -33 324 -288
4416 -288 98 17 -462 234 -49 -97 362 -187 -142 264 -256 166 58 -268 302 -318 -35 120 -276 144 72
4437 72 -373 289 -174 -256 335 -340 193 130 -193 267 -209 -190 301 -182 123 64 -199 98 -154 -305 284 -192
4459 -192 -62 257 -357 193 22 -165 487 30 -63 407 -163 48 52 -180 176 173 -142 249 -353 -30 193 -328
4481 -328 253 106 -187 273 -207 -150 196 -333 174 55 -303 152 -223 -89 215 -49 18 290 -357 163 -58
4502 -58 -93 217 -356 2 87 -224 64 7 -198 335 -208 12 89 -295 -17 -131 -256 232 28 2 259 -330
4524 -330 72 94 -259 384 73 10 293 -210 62 139 -108 296 29 45 361 -200 110 189 -256 166 65 -166
4546 -166 92 -159 -96 185 -258 89 211 -204 223 24 -288 211 -233 72 75 -414 60 -57 -337 320 -90
4567 -90 59 180 -269 90 -72 -96 181 -102 21 172 -356 154 122 -384 175 -152 -36 336 -345 -75 253
4588 253 -306 436 38 -293 317 -177 58 142 -265 202 165 -214 215 -33 -71 236 -178 172 57 -335 148
4609 148 52 -102 319 -159 21 192 -313 183 -83 -198 282 30 58 279 -214 322 -11 -167 332 0 -212
4630 -212 251 -90 -38 172 -233 162 -37 -32 40 -406 -18 -66 -298 209 -51 -268 236 -152 -55 345 -333 100
4652 100 200 -196 211 -3 -121 212 -193 207 133 -135 198 42 -184 120 -209 54 185 -280 147 160 -278
4673 -278 130 -162 -27 102 -132 4 -49 -373 365 -100 -213 340 -168 -81 210 -134 258 -100 -261 390 -153
4694 -153 197 106 -20 315 95 -211 197 -312 -41 84 -218 126 161 -319 283 -76 -104 223 -290 57 121
4715 121 -366 296 -25 -286 189 -60 227 318 -243 253 42 -245 272 -137 -75 86 -208 -137 31 -304 302
4736 302 42 -70 197 -93 209 121 -297 184 -104 -48 142 -264 32 -10 -202 160 149 -82 213 -8 2 127
4758 127 -200 2 -78 -199 153 -166 -49 247 -168 125 11 -158 202 -15 7 235 -29 19 223 -257 154
4779 154 160 -197 296 -1 -45 280 -172 122 -89 -71 287 78 -159 245 -136 -49 92 -162 79 -23 -196 247
4801 247 -194 -84 9 -349 39 26 -174 366 -189 40 384 -42 44 118 -170 270 24 -78 183 -98 123
4822 123 350 -337 257 -178 -204 232 -90 -6 85 -136 7 22 -123 221 -52 -171 103 -229 34 -46 -323 150
4844 150 -110 105 346 -176 56 223 -235 130 327 -110 252 -183 -4 83 -142 46 34 -276 -56 -268 -186
4865 -186 158 -157 13 221 -154 192 -34 47 289 -44 143 86 -202 182 -38 -149 184 1 212 126 -372
4886 -372 -121 -52 -241 213 -15 -40 250 -304 44 38 -157 172 -33 -24 116 -189 14 131 -38 375 118 38
4908 38 245 -134 -173 286 -162 194 184 -194 151 -196 -234 189 -160 327 89 -147 31 -222 -186 -20 -253 157
4930 157 45 -301 150 -164 -168 258 -12 93 230 -158 -51 -45 -24 317 32 109 211 -233 65 150 -206 83
4952 83 86 -81 93 -224 -188 141 -153 200 -69 -140 262 -249 -112 76 -116 223 215 -293 268 -76 -222 365
4974 365 -170 123 92 -393 129 -156 -79 96 -342 -63 20 -260 6 -22 -185 212 -196 -63 99 -337 103
4995 103 14 -276 272 47 -6 192 -105 107 70 -267 55 123 -32 114 -140 5 17 -291 113 39 -220 131
5017 131 -114 -208 100 -330 296 30 11 246 -190 -251 199 87 243 144 -287 115 -32 -83 341 46 122 303
5039 303 -53 271 -101 -166 130 -58 6 79 -76 -23 -56 -216 160 -88 -80 263 -264 51 76 -250 164 -28 -173
5062 -173 112 -277 38 22 -46 180 74 -212 159 -166 -100 328 -371 86 155 -212 122 -28 -97 154 -130 116
5084 116 3 -301 3 -150 -149 166 -106 21 139 -133 72 -88 -190 184 -51 -122 279 -237 105 152 -96
5105 -96 203 -76 -74 177 -332 20 257 -92 114 78 -154 165 7 23 85 -73 69 190 42 167 -42 65
5127 65 82 -148 85 168 -182 298 -212 32 224 -191 -29 37 -324 32 -119 -113 201 -131 38 138 -280 120
5149 120 -51 -207 225 -84 16 161 -72 -109 270 -249 193 85 -26 46 -128 -110 46 -259 135 46 -136
5170 -136 -53 -307 -129 166 -265 58 -2 -230 113 -186 -108 56 -146 -61 -90 -125 160 -54 -297 241 2 175
5192 175 191 -288 142 57 -97 173 -225 -32 196 -269 175 115 -167 63 -56 101 146 -50 89 49 -304 104
5214 104 14 -59 220 -157 -69 47 -136 31 106 -44 221 -80 54 257 -58 60 80 -185 280 81 -117 313
5236 313 -106 65 -28 -332 124 -25 -156 -3 -56 58 192 -226 172 53 -126 158 -107 -176 294 -218 15
5257 15 -38 -140 164 -62 -162 112 1 40 165 -350 221 -44 -225 109 -226 -15 67 -300 81 94 -61 325
5279 325 -93 -5 158 -230 355 38 -252 169 -45 -19 265 -188 -85 26 -148 60 -58 -168 330 -129 -8
5300 -8 95 -201 33 63 -204 132 -72 -39 54 -228 63 76 -115 -26 4 -61 194 -241 132 157 -96 65 132 -178
5324 -178 85 -76 55 120 -248 257 10 -214 158 -201 -150 187 -90 142 -9 -172 125 -149 -166 232 -243
5345 -243 131 181 -151 -15 16 78 251 -136 40 -32 -196 125 49 -85 226 -114 33 274 -178 104 8 -216
5367 -216 273 -39 -98 275 -120 53 -41 -275 -89 47 -184 214 -51 -20 134 -216 180 -26 -109 63 46 -135
5389 -135 90 -230 61 123 -96 -35 -80 -117 178 -29 74 36 25 248 -1 -67 123 -58 -34 33 -11 212 -31
5412 -31 -145 365 -14 39 38 -362 110 4 -264 245 -97 -113 75 -133 -95 -69 -233 62 -19 -226 138 -208 24
5435 24 11 -173 166 145 -228 268 -32 -151 318 -87 240 140 60 310 -100 -232 -48 -249 47 3 -279 256
5457 256 12 -29 95 -23 5 142 -202 25 -31 -161 88 -17 36 231 -90 21 8 -94 220 0 -25 191
5479 191 -140 -60 184 -76 210 102 -112 200 34 -87 132 -231 331 72 -164 70 24 64 240 -41 175
5500 175 149 -106 169 -16 -167 315 -63 136 159 -128 162 52 -194 245 -63 -133 1 -116 -42 28 -158 227
5522 227 109 -20 202 -94 172 182 -89 -36 104 88 155 -235 -100 18 -201 157 7 -269 -44 -310 -253 80
5544 80 -244 185 -22 -170 -57 -209 -119 62 -186 37 -78 -298 270 -50 -79 164 -80 184 326 -245 91
5565 91 295 -17 83 63 101 258 -154 114 88 -58 94 -78 -35 216 -107 67 -14 -39 279 234 -125 232 44
5588 44 -59 36 -3 286 -30 -20 195 -132 -129 -1 -179 125 58 -129 25 -39 -94 46 -318 36 156 -107 142
5611 142 -184 -55 72 14 -104 129 -151 175 -13 -213 209 -5 86 126 -16 -37 74 -134 292 -146 56
5632 56 134 -101 48 199 -249 64 -174 -42 77 -286 22 29 -246 -18 -70 -75 172 -174 -16 37 -117 169 99
5655 99 -124 89 -138 -100 160 -82 149 25 -100 177 65 -88 70 -38 -56 83 -133 102 61 -224 109
5676 109 -115 -26 154 -116 132 127 -228 183 -19 39 407 -23 30 68 -14 224 -49 -94 148 -93 84 326 -115
5699 -115 199 94 -112 41 90 -13 66 -227 -92 94 -104 66 -31 -35 22 -176 64 26 -262 30 -214 -27
5721 -27 233 -78 112 59 -148 44 118 -274 249 52 -26 93 -164 62 64 -214 122 -38 -33 417 -203 71 57
5744 57 -199 256 112 -79 94 -36 53 347 40 205 120 -236 215 -172 -22 267 -235 -35 -27 -16 34 -30 -95
5767 -95 290 -137 -124 -85 -111 95 -20 -210 143 -4 -109 199 -176 -16 86 -163 27 -71 11 112 -267 65
5789 65 29 -81 187 -108 -170 269 -160 -132 38 -148 113 60 -151 227 -112 -138 274 -185 145 39 -231 192
5811 192 83 -36 137 -46 88 13 -143 205 -76 -11 273 -136 26 118 -36 184 100 -117 118 -62 9 93
5833 93 -196 -6 -36 -239 119 -188 -24 114 -195 213 80 -85 105 141 82 241 -147 122 176 -143 174 3
5855 3 33 172 -162 307 140 17 86 -21 -174 59 -241 -55 107 -147 61 106 -145 219 -77 -115 172 -33
5877 -33 194 95 8 150 29 -192 201 65 46 101 -95 80 146 -179 233 -222 50 72 -140 113 -41 9 188
5900 188 -143 -6 219 -132 71 78 -121 107 36 -48 280 11 -311 52 -310 -30 73 -246 189 -149 -21
5921 -21 129 -34 93 168 -214 69 -148 45 129 -283 -28 218 -150 123 -213 -49 203 -185 -118 142 -76
5942 -76 98 -88 -155 178 104 26 174 64 79 33 6 226 281 4 114 -88 -67 94 -128 174 -161 -115 206
5965 206 -117 -12 130 -49 60 48 52 11 -9 -71 45 -20 73 -48 -63 191 -33 -261 182 -96 -73 14 -238 -42
5989 -42 -47 -186 167 -239 -85 -31 -256 102 39 -88 131 -132 141 298 -191 -120 64 -198 -32 -81 -198 176
6011 176 -276 -86 75 -115 68 -65 63 82 -127 -93 -85 -186 136 -88 34 105 108 -100 215 148 171 202 -126
6034 -126 129 9 -110 17 -60 -95 104 5 3 23 105 249 -56 94 173 -130 22 30 -152 110 -24 -124 62
6057 62 -95 -79 53 -119 85 75 -194 -52 -115 137 103 -146 199 117 52 238 -239 -24 202 -133 285 111
6079 111 -77 98 -135 -117 124 -166 -81 -17 -237 -3 11 -14 219 -112 116 66 30 133 74 -151 55 -60 -30
6102 -30 58 -181 65 210 70 45 32 -48 -17 -203 -235 94 -153 149 3 -23 242 -263 105 184 10 149 -117
6125 -117 -39 204 -187 -134 43 -9 136 110 -144 168 -10 4 -19 -138 143 148 -217 226 87 -141 40 -171 130
6148 130 136 -37 76 -51 35 148 0 62 118 -77 -159 50 -158 224 11 42 83 77 75 -52 -106 42 5 -36 30
6173 30 -134 -62 20 -157 60 -100 -160 218 -155 -119 161 -107 50 -30 -282 122 -263 33 298 -46 -145 47
6195 47 -38 -49 -37 60 201 -12 -109 182 -157 190 71 -213 71 -95 10 141 -33 -82 46 -235 109 132 18
6218 18 103 -155 -30 153 178 223 -56 12 184 -92 67 141 -221 -15 -33 -66 95 -18 -72 5 -189 118 -58
6241 -58 -258 61 12 -67 54 -27 -63 152 -194 151 41 -90 223 -170 -16 23 -167 95 6 -201 100 -175
6263 -175 -102 35 -88 75 -70 -66 150 53 -83 198 -176 75 282 -28 303 29 -194 146 -53 21 18 -61 171
6286 171 -10 76 19 54 -44 129 -158 -50 226 -78 69 -30 -39 -9 112 144 59 -138 -28 3 -154 -13 -40 -109
6310 -109 100 -127 25 -47 -254 190 -65 102 189 6 48 130 -77 91 -127 -87 17 -63 -58 162 -46 99 -86
6333 -86 -182 81 -66 -99 75 -116 -82 87 -58 -3 29 -54 21 -96 200 174 -49 81 -180 25 76 -54 72
6356 72 132 -164 -145 -39 -40 47 -201 193 270 -108 60 -4 -69 63 -88 -110 183 -109 -152 57 -92 197 47 -57
6380 -57 86 -97 90 6 -292 143 122 -139 -73 -186 65 109 -45 71 198 -110 78 -3 -48 -57 -192 -22 -67
6403 -67 -148 -48 -134 73 208 -35 131 36 103 34 38 91 186 -14 -62 91 -2 10 64 -268 15 33 -13 211 -215
6428 -215 159 133 -33 52 23 -66 154 -240 147 181 -52 44 157 -47 194 24 -9 271 -193 52 52 -83 134
6451 134 -193 -83 155 -125 76 -94 -110 -41 -63 -202 -93 -205 63 -183 -189 -11 -74 -243 5 -227 57 75
6473 75 -136 -22 -5 -71 176 -132 -30 177 -138 -135 -17 -4 222 -42 -17 207 -86 -3 180 -5 141 -51 -183
6496 -183 156 11 47 170 65 229 227 143 176 118 -58 34 -179 -20 22 0 91 -106 21 125 -109 64 30 -129
6520 -129 17 -71 -16 159 73 -42 129 -84 47 115 -266 -6 32 -121 167 -244 -16 233 -38 275 -199 68
6542 68 80 -288 -58 78 -163 49 -102 -189 162 32 68 -14 34 -149 -33 -177 133 -44 -148 167 -74 -12
6564 -12 208 -27 33 -76 49 130 -184 96 95 -163 61 73 -27 132 -280 53 179 -133 -137 -79 -182 120 85
6587 85 -88 60 14 -51 -10 -70 -21 14 -162 64 -10 152 47 -92 165 139 -20 190 7 -88 -59 -70 -48 211
6611 211 50 66 -137 -39 123 -129 -9 106 -54 -58 -163 9 102 -43 8 76 -167 227 -22 -191 143 -213
6633 -213 -121 225 -21 46 84 -214 148 34 -129 51 6 -16 1 -135 -24 -33 -123 -40 -108 46 133 -82 1 3 -190
6658 -190 54 -102 72 158 -53 69 -15 93 54 95 -133 77 51 -51 -105 -174 -44 -53 -70 299 -46 -93 81 -87
6682 -87 -111 25 22 -134 -232 60 81 -38 -85 -24 -21 300 -47 26 132 104 64 -86 -315 163 -160 -147 3 -85 -68
6707 -68 141 -47 -69 -7 -47 -145 -112 -36 -6 -168 104 103 -49 151 -126 -151 238 -23 -47 24 -42 14 -42 -51 180 43
6733 43 -5 52 -139 -64 -117 -155 131 -192 -104 138 47 -34 14 -116 175 -108 -89 -24 -151 161 108 -109 200 -30
6757 -30 -16 36 -27 -74 118 -26 41 68 -13 91 -21 -92 -35 113 13 21 -178 17 -71 -30 9 -177 119 60 -71
6782 -71 70 22 -184 51 -41 55 -21 -51 -5 92 -108 54 -83 -135 194 -77 -94 -49 -160 53 -48 -69 112 -44
6806 -44 -119 18 24 25 10 -177 -2 -40 -79 -116 -31 62 170 -49 187 94 96 92 105 121 146 -133 124 26 -111 231 -81
6833 -81 -52 31 37 50 208 -176 63 -33 -175 114 -194 117 -169 -214 36 -54 -159 -20 -110 -108 153 -172 118 158
6857 158 13 249 80 17 142 -44 64 -88 -35 165 -209 -60 192 -2 -49 -58 -127 114 28 -197 144 -68
6879 -68 72 -28 -174 183 7 16 196 -179 130 62 -95 136 83 8 19 158 -98 57 -62 8 79 -49 255
6902 255 81 89 163 -191 -60 122 -97 -146 48 -73 111 -10 -81 4 -99 85 191 -185 58 -157 -102 59
6924 59 -37 -48 -56 -162 42 -286 -46 -145 -320 -181 77 -62 54 58 -120 231 -10 134 8 -104 -12 -76 -176
6947 -176 153 -59 89 114 -90 239 204 -193 60 -26 15 56 -87 154 27 -194 151 1 -38 -7 -175 -18
6969 -18 93 25 47 -68 -195 120 -198 -109 112 -108 -46 110 -125 65 -32 -40 151 -111 37 71 -37 168 -43
6992 -43 -72 104 8 -42 19 -119 -84 127 -131 -24 41 11 102 -28 24 -26 16 78 125 8 98 -49 -174 45 26
7017 26 -121 68 -38 225 -48 69 89 -161 221 -15 4 47 -167 -118 89 26 61 -35 -134 -27 27 -146 81
7040 81 -168 -70 30 -214 -32 -186 -102 25 -28 -63 -8 82 27 -57 -85 -79 -123 -72 230 -29 101 104 -23 27 -21 -40
7066 -40 47 -43 11 87 -191 -12 49 34 -3 -2 22 66 -71 18 38 -120 -147 -83 40 172 -275 -6 -164 -30 73
7091 73 -82 0 -2 -113 77 -18 22 -13 -54 -207 185 -12 -21 30 -161 144 125 -77 49 -32 128 29 31 34 233 -211
7117 -211 90 -37 -203 43 49 -79 30 -307 151 -92 -169 37 -17 -24 99 69 108 144 -161 -22 -12 -54 145 -50
7141 -50 29 77 -177 20 -70 35 -22 -143 -55 52 -82 60 5 -158 77 35 -252 -14 -127 -42 -157 34 152
7164 152 -45 -113 126 -101 54 27 -100 160 79 -142 164 -183 -78 161 -83 -4 47 -177 18 -43 -32 -28 -292
7187 -292 -110 -85 -97 70 25 48 162 29 253 36 -95 -43 -153 -67 191 -136 28 69 -102 18 -162 20
7209 20 -58 40 -93 19 -81 -3 -1 -12 119 75 80 140 -166 -30 89 -99 167 64 -59 36 -121 -11 -64 -58 -40
7234 -40 0 -150 121 82 -19 93 -19 -88 -14 71 71 -185 -21 92 -79 5 -108 -55 23 37 -127 65 -168 -32
7258 -32 10 -102 -94 -48 55 93 13 -48 215 -25 -17 0 184 195 87 -16 154 -75 88 124 -51 -23 -36 -6 67 40
7284 40 11 75 -70 -38 -23 10 16 -57 -65 37 -216 24 8 -54 218 -112 86 67 10 88 40 -133 47 -119 -24 -40
7310 -40 -41 101 39 64 69 11 -162 134 86 47 148 21 26 119 30 -18 6 -47 -51 -76 148 66 -182 10 -68 24 66 -149
7338 -149 -101 -117 31 0 -84 -158 111 5 -8 151 -43 11 210 -50 114 40 45 40 -88 181 76 61 158 24 103
7363 103 30 -302 -59 -31 13 -105 -128 -118 -18 -91 -28 126 -108 80 193 -101 82 -58 101 -38 -83 11 89
7386 89 -24 47 -43 41 213 23 -39 -43 30 81 -123 -22 45 54 73 17 -159 -124 48 -79 18 -114 -127 112 -40 28
7412 28 71 47 32 6 -104 92 -26 -52 -101 -196 61 246 -23 12 -90 -116 8 -137 114 160 -23 24 128 -95
7436 -95 64 -103 90 13 -43 262 -1 16 105 18 123 55 -52 -72 67 28 -23 -64 -14 -95 -25 134 -90 -114 -64
7461 -64 -139 -113 56 -53 -106 -45 -160 97 -45 -118 99 2 -6 141 -99 19 173 31 89 19 -78 201 -21 21
7485 21 -98 -5 162 -94 55 150 -118 -29 174 -44 -65 -38 -15 123 -17 -100 35 53 100 23 -100 -26 -102 161
7509 161 95 -158 84 38 2 39 81 -100 34 -12 104 132 -25 194 -33 31 151 57 -41 38 -102 30 33 -69
7533 -69 47 -91 9 -26 -61 -101 -30 -78 107 -120 113 112 -88 -49 117 50 94 61 31 128 -137 -159 87 -78 53
7558 53 61 -34 -39 -150 -183 57 116 188 -8 76 169 34 -60 -45 -7 179 132 -144 107 -79 -110 35 28 -18 38 32 -31 -45
7586 -45 -6 -23 -18 -34 43 -10 50 -47 -24 -6 56 -120 -104 63 19 76 14 79 40 -58 -13 135 94 52 -100 -44 226 -68
7614 -68 -12 -53 -63 19 -45 -134 -128 -17 -80 -107 112 4 11 -39 70 -215 -26 17 -135 250 -82 -71 152 23 120 1
7640 1 -20 6 -50 -15 96 -180 142 -104 -315 72 -18 16 74 -40 -186 38 46 -122 154 -39 21 -116 -86 72
7664 72 -101 94 20 -117 83 -92 -198 190 52 -7 -57 -60 45 -2 12 124 106 60 58 -106 31 -26 -73 -99 -119
7689 -119 73 138 -57 -54 259 -108 -5 -11 -36 140 -96 -89 194 -31 -48 58 10 -17 98 -60 -6 -87 134 -19
7713 -19 -101 35 -73 10 28 -73 156 151 51 -74 -219 -56 165 -134 -11 121 -112 63 -57 -7 110 -70
7735 -70 -14 -74 42 51 43 -34 137 9 -48 -135 2 163 148 -76 81 -63 -30 -48 -166 -27 -98 -45 34 -50 -14 180
7761 180 -219 -9 173 -81 23 50 51 180 -47 40 -108 -124 -67 46 -81 94 -107 -116 47 61 48 135 -178 -4
7785 -4 -13 -23 80 -50 170 78 184 68 11 51 110 158 180 187 -129 -5 -18 -33 -51 -139 124 186 13 16 42 -70 -119
7812 -119 7 23 51 -89 -119 -51 28 -37 -3 74 17 -106 7 51 -115 21 16 12 -23 -107 -149 83 35 88 176 35 60
7839 60 -44 173 140 -226 -83 -173 91 -19 29 -99 -54 -44 -111 -21 -33 130 87 57 199 45 -82 -44 -96 28
7863 28 49 -46 0 -29 -17 36 -176 -75 43 -127 32 57 -173 145 -105 15 -36 -30 115 55 67 -56 -38 -22 87
7888 87 -54 -21 -37 116 -49 -3 23 168 -37 -7 78 0 10 16 -113 -105 -39 36 140 -131 -169 -161 -45 -27 -228 -14
7914 -14 78 -5 118 53 -37 145 -42 -228 43 -13 -57 -75 -81 95 -77 -129 5 122 -8 -60 -61 134 62 -64 -86
7939 -86 37 -139 77 44 -75 109 -48 -3 -87 -143 41 -67 -66 111 -58 -26 -144 -20 122 -193 -94 61 -163
7962 -163 10 -196 -131 -11 -52 86 6 -59 -81 75 -272 -101 -64 -89 146 -24 -40 -83 -117 -98 43 1 107 -101
7986 -101 -15 259 -170 78 -14 23 -31 -9 -127 -25 -17 40 168 80 71 109 -87 7 -195 15 102 -97 8 -135 15
8011 15 100 -109 -166 85 73 -86 121 91 72 79 2 115 127 29 -73 -87 -61 -11 52 300 -134 -141 -142 -40 -203 160
8037 160 -139 -5 -47 107 162 -111 75 22 -82 4 160 1 39 0 21 43 30 78 9 -47 11 88 3 36 -3 206
8063 206 100 36 92 128 92 79 -67 40 -72 -83 -126 -125 9 43 -117 -142 200 -84 -84 -112 47 31 33 -23 88 -52
8089 -52 22 102 -114 49 38 -200 -22 -43 -76 -38 101 139 8 0 9 66 -10 23 -25 58 94 -176 12 79 86 5 -65 -63
8117 -63 -133 -92 120 -8 97 79 -162 18 16 -16 -100 -149 -16 -36 36 105 35 -178 37 29 -147 42 -97 59 153
8142 153 -3 132 249 -170 -40 -97 207 83 -65 99 106 -161 -66 -108 -87 81 39 13 159 130 -112 -112 -127 -78
8166 -78 -158 -39 196 -83 -48 112 34 158 100 -48 -12 -19 18 181 49 88 -67 -99 258 -113 4 285 143 211
8190 211 24
8191B4
##END NTUPLES=NMR FID
##END=
