##TITLE=1H_12-2021
 CDcl3,8 sc, 
 12.03.2021
##JCAMPDX= 6.0         $$ Bruker NMR JCAMP-DX V2.0
##DATA TYPE= NMR FID
##DATA CLASS= NTUPLES
##ORIGIN= UXNMR, Bruker Analytische Messtechnik GmbH
##OWNER= root
$$ XWIN-NMR		Version 3.5
$$ Fri Mar 12 10:26:15 2021 Russian Standard Time (UT+4h)  she@DPX200
##.OBSERVE FREQUENCY= 200.131506
##.OBSERVE NUCLEUS= ^1H
##.DELAY= (6, 6)
##.ACQUISITION MODE= SIMULTANEOUS
##.ACQUISITION SCHEME= undefined
##.AVERAGES= 8
##.DIGITISER RES= 18
##SPECTROMETER/DATA SYSTEM= spect
##.PULSE SEQUENCE= zg30
##.SOLVENT NAME= D2O
##.SHIFT REFERENCE= (INTERNAL, D2O, 0, 15.7039)
##AUDIT TRAIL= $$ (NUMBER, WHEN, WHO, WHERE, WHAT)
$$ ##TITLE= Audit trail, XWIN-NMR		Version 3.5
$$ ##JCAMPDX= 5.01
$$ ##ORIGIN= Bruker BioSpin GmbH
$$ ##OWNER= she
$$ F:/spectra/data/she/nmr/H-F/1/audita.txt
$$ ##AUDIT TRAIL=  $$ (NUMBER, WHEN, WHO, WHERE, WHAT)
(   1,<2021-03-12 10:24:25.32 +0400>,<she>,<DPX200>,
      <created by zg, POWCHK disabled, PULCHK disabled
       configuration hash MD5:
       00 E9 B6 7A A2 85 ED C7 34 08 36 98 17 FE 4E 26
       data hash MD5: 16K
       6E 5B 51 A5 BD 8E A9 D7 45 95 92 18 AA FA 82 93>)
$$ ##END=
$$ 
$$ hash MD5
$$ F1 92 02 2E 60 D6 9A 05 E5 DF ED 23 05 67 1F 28
##$RELAX= 
##$RELAX= 
##$RELAX= 
##$RELAX= 
##$RELAX= 
##$RELAX= 
$$ Bruker specific parameters
$$ --------------------------
##$DU= <F:/spectra>
##$EXPNO= 1
##$NAME= <H-F>
##$PROCNO= 1
##$TYPE= <nmr>
##$USER= <she>
##$AMP= (0..31)
100 100 100 100 100 100 100 100 100 100 100 100 100 100 100 100 100 100 
100 100 100 100 100 100 100 100 100 100 100 100 100 100 
##$AQSEQ= 0
##$AQ_mod= 1
##$AUNM= <au_zg>
##$AUTOPOS= <>
##$BF1= 200.13
##$BF2= 200.13
##$BF3= 200.13
##$BF4= 200.13
##$BF5= 200.13
##$BF6= 200.13
##$BF7= 200.13
##$BF8= 200.13
##$BYTORDA= 1
##$CFDGTYP= 0
##$CFRGTYP= 5
##$CHEMSTR= <none>
##$CNST= (0..31)
1 1 145 1 1 1 1 1 1 1 1 1 1 1 1 1 1 1 1 1 1 1 1 1 1 1 1 1 1 1 1 1 
##$CPDPRG= <>
##$CPDPRG1= <>
##$CPDPRG2= <>
##$CPDPRG3= <>
##$CPDPRG4= <mlev>
##$CPDPRG5= <mlev>
##$CPDPRG6= <mlev>
##$CPDPRG7= <mlev>
##$CPDPRG8= <mlev>
##$CPDPRGB= <>
##$CPDPRGT= <>
##$D= (0..31)
0 1.2 0 0 0 0 0 0 0 0.06 0 0.03 0 0 0 0 0.0002 0 0 0 0 0 0 0 0 0 0 0 0 
0 0 0 
##$DATE= 1615530264
##$DBL= (0..7)
120 120 120 120 120 120 120 120 
##$DBP= (0..7)
150 150 150 150 150 150 150 150 
##$DBP07= 0
##$DBPNAM0= <>
##$DBPNAM1= <>
##$DBPNAM2= <>
##$DBPNAM3= <>
##$DBPNAM4= <>
##$DBPNAM5= <>
##$DBPNAM6= <>
##$DBPNAM7= <>
##$DBPOAL= (0..7)
0.5 0.5 0.5 0.5 0.5 0.5 0.5 0.5 
##$DBPOFFS= (0..7)
0 0 0 0 0 0 0 0 
##$DE= 6
##$DECBNUC= <off>
##$DECIM= 32
##$DECNUC= <off>
##$DECSTAT= 4
##$DIGMOD= 1
##$DIGTYP= 9
##$DL= (0..7)
0 120 120 120 120 120 120 120 
##$DP= (0..7)
150 150 150 150 150 150 150 150 
##$DP07= 0
##$DPNAME0= <>
##$DPNAME1= <>
##$DPNAME2= <>
##$DPNAME3= <>
##$DPNAME4= <>
##$DPNAME5= <>
##$DPNAME6= <>
##$DPNAME7= <>
##$DPOAL= (0..7)
0.5 0.5 0.5 0.5 0.5 0.5 0.5 0.5 
##$DPOFFS= (0..7)
0 0 0 0 0 0 0 0 
##$DQDMODE= 0
##$DR= 18
##$DS= 0
##$DSLIST= <SSSSSSSSSSSSSSS>
$$ [...]
##$SUBNAM2= <"">
##$SUBNAM3= <"">
##$SUBNAM4= <"">
##$SUBNAM5= <"">
##$SUBNAM6= <"">
##$SUBNAM7= <"">
##$SUBNAM8= <"">
##$SUBNAM9= <"">
##$SW= 16.9725357007746
##$SWIBOX= (0..15)
0 0 2 0 0 0 0 0 0 0 0 0 0 0 0 0 
##$SW_h= 3396.73913043478
##$TD= 16384
##$TD0= 1
##$TE= 0
##$TE2= 300
##$TE3= 300
##$TEG= 300
##$TL= (0..7)
0 120 120 120 120 120 120 120 
##$TP= (0..7)
150 150 150 150 150 150 150 150 
##$TP07= 0
##$TPNAME0= <>
##$TPNAME1= <>
##$TPNAME2= <>
##$TPNAME3= <>
##$TPNAME4= <>
##$TPNAME5= <>
##$TPNAME6= <>
##$TPNAME7= <>
##$TPOAL= (0..7)
0.5 0.5 0.5 0.5 0.5 0.5 0.5 0.5 
##$TPOFFS= (0..7)
0 0 0 0 0 0 0 0 
##$TUNHIN= 0
##$TUNHOUT= 0
##$TUNXOUT= 0
##$USERA1= <user>
##$USERA2= <user>
##$USERA3= <user>
##$USERA4= <user>
##$USERA5= <user>
##$V9= 5
##$VALIST= <valist>
##$VCLIST= <CCCCCCCCCCCCCCC>
##$VD= 0
##$VDLIST= <DDDDDDDDDDDDDDD>
##$VPLIST= <PPPPPPPPPPPPPPP>
##$VTLIST= <TTTTTTTTTTTTTTT>
##$WBST= 1024
##$WBSW= 4
##$XGAIN= (0..3)
0 0 0 0 
##$XL= 0
##$YL= 0
##$YMAX_a= 977888
##$YMIN_a= -899612
##$ZGOPTNS= <>
##$ZL1= 120
##$ZL2= 120
##$ZL3= 120
##$ZL4= 120
##$ABSF1= 10
##$ABSF2= 0
##$ABSG= 5
##$ABSL= 3
##$ALPHA= 0
##$AQORDER= 0
##$ASSFAC= 0
##$ASSFACI= 0
##$ASSFACX= 0
##$ASSWID= 0
##$AUNMP= <proc_1d>
##$AZFE= 0.1
##$AZFW= 0.1
##$BCFW= 1
##$BC_mod= 2
##$BYTORDP= 1
##$COROFFS= 0
##$CY= 11.3945322036743
##$DATMOD= 1
##$DC= 2
##$DFILT= <>
##$DTYPP= 0
##$F1P= 15.9154993809931
##$F2P= -4.1035820241983
##$FCOR= 0.5
##$FTSIZE= 0
##$FT_mod= 4
##$GAMMA= 1
##$GB= 0.15
##$INTBC= 1
##$INTSCL= 1
##$ISEN= 128
##$LB= 0.24
##$LEV0= 0
##$LPBIN= 0
##$MAXI= 10000
##$MC2= 0
##$MEAN= 0
##$ME_mod= 0
##$MI= 1.114404
##$NCOEF= 0
##$NC_proc= 0
##$NLEV= 6
##$NOISF1= 3.799351
##$NOISF2= 2.8
##$NSP= 1
##$NTH_PI= 0
##$NZP= 0
##$OFFSET= 15.70392
##$PC= 1
##$PHC0= -11114.05
##$PHC1= 6.40094
##$PH_mod= 1
##$PKNL= yes
##$PPARMOD= 0
##$PSCAL= 0
##$PSIGN= 0
##$REVERSE= no
##$SF= 200.130013532006
##$SI= 16384
##$SIGF1= 3
##$SIGF2= 2
##$SINO= 400
##$SIOLD= 16384
##$SREGLST= <1H.CDCl3>
##$SSB= 0
##$STSI= 0
##$STSR= 0
##$SW_p= 3612.71676300578
##$SYMM= 0
##$S_DEV= 0
##$TDeff= 0
##$TDoff= 0
##$TI= <>
##$TILT= no
##$TM1= 0
##$TM2= 0
##$TOPLEV= 0
##$USERP1= <user>
##$USERP2= <user>
##$USERP3= <user>
##$USERP4= <user>
##$USERP5= <user>
##$WDW= 1
##$XDIM= 8192
##$YMAX_p= 0
##$YMIN_p= 0
$$ End of Bruker specific parameters
$$ ---------------------------------
##NTUPLES= NMR FID
##VAR_NAME=  TIME,          FID/REAL,        FID/IMAG
##SYMBOL=    X,             R,               I
##VAR_TYPE=  INDEPENDENT,   DEPENDENT,       DEPENDENT
##VAR_FORM=  AFFN,          ASDF,            ASDF
##VAR_DIM=   8192,          8192,            8192
##UNITS=     SECONDS,       ARBITRARY UNITS, ARBITRARY UNITS
##FACTOR=    0.0002944,     1,               1
##FIRST=     0,             0,               0
##LAST=      2.4114304,     0,               0
##MIN=       0,             -899612,         0
##MAX=       2.4114304,     977888,          0
$$ Real data points
##PAGE= N=1
##DATA TABLE= (X++(R..R)), XYDATA
0@%%%%%%qJ6j6K4l2L2m0N6p2R3j17J44j75K07k48K95l46M06m75N53o43P43q50
$$ 0 0 0 0 0 0 0 -8 8 -8 16 -16 16 -24 32 -40 53 -64 80 -95 112 -136 159 -187 219 -256 297 -346 397 -453
29d53R70j107J258j424J611j815K038k285K553k845L164l513L898m318M774n272
$$ -453 517 -590 668 -756 855 -960 1078 -1207 1346 -1499 1665 -1848 2050 -2268 2506 -2766
45b766N816o408P055p766Q547r410J0367j1429J2612j3941J5445j7163J9149k1470
$$ -2766 3050 -3358 3697 -4069 4478 -4932 5435 -5994 6618 -7323 8122 -9041 10108 -11362
59a1362K4223k7548L1648l6839M3642n2944O6392q7475J24926k09049O81912m2806
$$ -11362 12861 -14687 16961 -19878 23764 -29180 37212 -50263 74663 -134386 547526 504720
71E04720j404332J540134j123902L83963J031136j546225M69382L60929l93909
$$ 504720 -899612 640522 -483380 -99417 931719 -614506 -145124 215805 -178104
80a78104O55928n96015k53455M04458K68821j55115m54257L88048l12086M30942
$$ -178104 477824 -118191 -371646 32812 301633 146518 -307739 80309 -231777 199165
90A99165L11931j201301P79189O6454l37761P42684j040232K05262P53057o91803
$$ 199165 511096 -690205 88984 155438 -182323 560361 -479871 -274609 478448 -213355
100b13355M94982m84458j92730Q67699n72474K46295l39908j63740R06568p17744
$$ -213355 281627 -202831 -395561 472138 -100336 145959 -193949 -357689 548879 -168865
110a68865K09734l6975m96431J054730n27262l48925N32349o02994O65791M3398
$$ -168865 40869 3894 -492537 562193 34931 -313994 218355 -384639 281152 324550
120C24550p90429N49506j15888J09846J29483l95159O2093R6701L50955l74458
$$ 324550 -465879 83627 -32261 77585 207068 -188091 -125998 -29297 321658 -52800
130e2800j54232L29773l42434N32298j65586o68357Q25098l62707j5390N31746
$$ -52800 -207032 122741 -219693 312605 147019 -521338 303760 -58947 -74337 457409
140D57409j034443O25686L13518o65245N80341m71808k1327N89294m54038N2222
$$ 457409 -577034 48652 362170 -303075 277266 -194542 -215869 373425 -80613 -28391
150b8391k1868p5852L40047j92169p2254p6188J15462K35647l43504J75868j64093
$$ -28391 -50259 -126111 213936 21767 -50487 -126675 -11213 224434 -119070 56798 -107295
161a07295p813M66115n06785Q9449J27295k12987M13886k90117j60616L04311
$$ -107295 -115108 351007 -155778 -66329 60966 -152021 261865 -28252 -188868 115443
171A15443j98064K25239j05625k41025L05338j44931J67529j16274k12434L52142
$$ 115443 -82621 142618 36993 -204032 101306 -43625 123904 7630 -204804 147338
181A47338j99819J16009K168k94133L43795o9611r3284J41779k78433K24788R3173
$$ 147338 -52481 63528 65696 -228437 115358 45747 -47537 94242 -184191 40597 133770
192A33770k41685J66790j55409R5260J08640j60122O3439j06356J43315L2562
$$ 133770 -107915 58875 -96534 -1274 107366 -52756 10683 -95673 47642 80204
202H0204j55895R8662q3730O8092J02826k03485J03189j6281m1772J98215k48919
$$ 80204 -75691 22971 -60759 7333 110159 -93326 9863 -6418 -48190 150025 -98894
213i8894O2464J02039j25201J51304j29317j3884R5964n8122O3423o9349l8021
$$ -98894 -36430 65609 -59592 91712 -37605 -51489 44475 -13647 49776 -19573 -57594
224e7594J11935n7587K0402j6089o0635J23407q3117L9303j0199q1247J41148
$$ -57594 54341 -3246 17156 1067 -59568 63839 -19278 20025 9826 -71421 69727
235F9727p5251k983K1709n4663P5538j5190m7033M6200m3090L1280L4723q1702
$$ 69727 -5524 -8507 13202 -41461 34077 18887 -28146 18054 -25036 6244 40967 -40735
247d0735N5238l0621K7785J2786o1142N5373l1974J9216R040k9017P855P027M427
$$ -40735 14503 -16118 11667 24453 -36689 18684 -13290 5926 14966 -14051 -6196 831 5258
260E258N559k8605J0894K8090m4777M3018k8903k287K2797j9075K2662l5452K2491
$$ 5258 10817 -17788 -6894 21196 -23581 19437 -9466 -11753 11044 -8031 14631 -20821 1670
273A670O283j3101j052J2073j2135J91J7864k0845J0268j2333K5378k1857P20
$$ 1670 7953 -5148 -6200 5873 -6262 -6071 11793 -9052 1216 -11117 14261 -7596 -6876
286f876J5956j8013J3242j0284J5585k0771J4071P1l845n56j694J4064k2811K1430
$$ -6876 9080 -8933 4309 -5975 9610 -11161 2910 2981 -864 -1420 -3114 10950 -11861 9569
300I569j1662N023n158N340J230r282J3369j4129J7582k1402J8040n292p910J2680
$$ 9569 -2093 2930 -2228 3112 4342 -4940 8429 -5700 11882 -9520 8520 3228 -4682 7998
314G998j1353J0838j2748J1791p294M997r681J4069p436j0627K5003k6678J9854
$$ 7998 -3355 7483 -5265 6526 -768 4229 -5452 8617 1181 -9446 15557 -11121 8733
327H733j5120J0181O78j6220K2263j1907n370R093L677j9101K2242j7400J2292
$$ 8733 -6387 3794 4472 -11748 10515 -1392 -6762 2331 6008 -13093 9149 -8251 4041
340D041o515r053L2186m7214L6652o927j7712K3031j6662J0405k563r418J7749
$$ 4041 -2474 -11527 20659 -26555 10097 3170 -14542 8489 -8173 2232 -331 -9749 8000
353H000j0940j2932M0538m7738K6662O845l1767M7239n1734L7794n431k8478M7997
$$ 8000 -2940 -15872 24666 -23072 3590 10435 -21332 25907 -25827 11967 6536 -21942 26055
366B6055m1097R823K4963l7946L0565r876k4334N9234o5338L7889N770n1110Q0436
$$ 26055 -15042 -5219 19744 -18202 12363 2487 -21847 37387 -27951 9938 15708 -35402 45034
379D5034p0625L0334J2309m9973P2655n2407j681M3536n8468N2844j5866m3081
$$ 45034 -25591 4743 17052 -32921 39734 -12673 -14354 29182 -29286 23558 7692 -35389
391c5389P9891q1776N7507L961q4099J14468q1783L1547K4770q3918R7017n3838
$$ -35389 44502 -37274 20233 24194 -59905 54563 -27220 4327 29097 -54821 42196 -11642
403a1642p15N4954j03364Q6387l22p1207R9489j09777O9923L0578j09581J27941
$$ -11642 -12357 42597 -60767 25620 25298 -45909 53580 -56197 13726 44304 -65277 62664
415F2664j12952M0993P9696j37216R4419l5490k1096R4485j12255M6756J2686
$$ 62664 -50288 -9295 70401 -66815 27604 -7886 -28982 65503 -46752 4 12690
426A2690n1471J10718j20737M0435K9592o4817J29298j54529O0443N5418j19609
$$ 12690 -38781 71937 -48800 -8365 21227 -43590 85708 -68821 -8378 47040 -72569
437g2569J69258j41040k3060J68448j74606J19492j9954j50881K39112j41065
$$ -72569 96689 -44351 -67411 101037 -73569 45923 25969 -124912 114200 -26865
447b6865N188Q4785j77848J90732n7530n5242P3824j13143J34538l2914o3158
$$ -26865 -21677 63108 -114740 75992 18462 -36780 37044 -76099 58439 25525 -37633
458c7633O7458j00415J32461k3036j11511J34166j41949J27938L5703k05049J88691
$$ -37633 29825 -70590 61871 38835 -72676 61490 -80459 47479 83182 -121867 66824
469F6824j11008N5620Q8873k22431J62141m5265j0296J28889k40549J36808M4926
$$ 66824 -44184 11436 100309 -122122 40019 -5246 -15542 113347 -127202 9606 54532
480E4532j18058J90676k44126P9694J58633k21444K04828j64132m5618K60212
$$ 54532 -63526 127150 -116976 -37282 121351 -100093 104735 -59397 -105015 155197
490A55197k10457N9630K156j04544J97606q6746m7139J7028l0175J36340j07057
$$ 155197 -55260 4370 6526 -98018 99588 12842 -34297 -17269 -47444 88896 -18161
501a8161K2578m2393l2430K36120k44211N9902O7159j97158L35040j91811j46999
$$ -18161 4417 -37976 -70406 165714 -78497 -18595 48564 -148594 186446 -5365 -152364
512a52364K86430k43155J75279N2684l34109L03996p1069m7302J48608k69910
$$ -152364 134066 -109089 66190 118874 -215235 88761 17692 -29610 118998 -150912
522a50912J60807N5751p0441N0612j56237J27183L3982m4873L3988j69127J61766
$$ -150912 9895 65646 -4795 45817 -110420 16763 50745 5872 39860 -129267 32499
533C2499M9872j32567J18568j93566J23202J46128k32708J28908j14746M9192
$$ 32499 82371 -50196 68372 -125194 -1992 144136 -88572 40336 -74410 -25218
543b5218J73571k26002Q5758n4578J4114J95555k53414O6648L9269r2800K60864
$$ -25218 148353 -77649 8109 -46469 -32355 163200 -90214 -23566 15703 -77097 183767
554A83767k58439j9167J90092j90899K32716j40133j60899K69081j18998M8616
$$ 183767 -74672 -93839 96253 -94646 138070 -2063 -162962 106119 -12879 35737
564C5737l159j62927J72209R081k9931l6632p6530J48048l9561K7894o4900j13746
$$ 35737 32578 -130349 41860 50941 21010 -15622 -92152 55896 16335 44229 -20671 -134417
576a34417K57473j24342r324N5534k13651K73655k5173j83512J62685j59158J17150
$$ -134417 123056 -1286 -10610 44924 -168727 104928 79755 -103757 58928 -100230 16920
587A6920J27409k61632J18030k0325R912J29874k03669N5363J8874K7664P4861
$$ 16920 144329 -117303 727 -19598 -9686 120188 -83481 -28118 -9244 18420 93281
598I3281j81916O8357K7651j455R3119j90680M9561J01387q2912J14645j57701
$$ 93281 -88635 -20278 7373 5918 99037 -91643 -42082 59305 -23607 91038 -66663
609f6663j1175J75173j15243O6597q8976l4653J62492q3847J8608n9568l0149
$$ -66663 -77838 97335 -17908 48689 -40287 -74940 87552 3705 22313 -37255 -67404
620f7404J60247q6016j5617k260o5697J74995q1329o1765N8637q8625J60435n0363
$$ -67404 92843 6827 -8790 -11050 -76747 98248 16919 -44846 13791 -74834 85601 35238
632C5238j07750Q6986n5046R3394p951j19671P5417j1356M3749J5200j30826Q4241
$$ 35238 -72512 14474 -40572 52822 44871 -74800 617 -10739 33010 48210 -82616 1625
644A625O770O680L5484j36101Q6315K4311k0400L4466j10420O1637N1866m2323
$$ 1625 8395 15075 50559 -85542 773 25084 4684 39150 -71270 -9633 42233 -90
656i0K1740p4557L3355P7731o8716K2417n0647J4758R1603q5218K1078l1475N171
$$ -90 21650 -52907 -19552 58179 -10537 11880 -38767 -24009 67594 -17624 3454 -28021 -22850
669b2850Q9548p9551m019O835p054O7892n0675l1851L2734j4658O0782m7052m2104
$$ -22850 66698 -12853 -16872 -10037 -17091 50801 126 -31725 1009 -13649 47133 81 -42023
682d2023N8311l0062N1434l3639m8275O0139j5820K1089j2943m9001M7404J5179
$$ -42023 16288 -13774 37660 4021 -44254 15885 65 21154 8211 -40790 6614 21793
694B1793k0818O591l6545K9761K1337j8127l293l1641M6879m029j1023L366l6022
$$ 21793 975 7566 -28979 782 22119 3992 699 -30942 15937 11908 885 4251 -31771
707c1771M7068M348l0555J3857j8406J1764L7701m9937O737J3170j4656L7060
$$ -31771 15297 19645 -10910 2947 -15459 -3695 34006 -15931 -9194 3976 -10680 26380
719B6380l3963o985J4307N270M507j5418Q1k706J8146r3j9699J460J4361r008
$$ 26380 -7583 -14568 -261 5009 9516 -5902 -5821 -8527 9619 9526 -10173 -8713 5648 -3360
733c360J3845j3523j6196L4320j9213Q151m115j4342K0383P72r722j897O081o708
$$ -3360 10485 -3038 -19234 15086 -4127 4024 -91 -14433 5950 6722 -3000 -4897 1184 -5524
747e524J4547p256r880O481P234l962m219O736j5022K1159q892n900R136j1025
$$ -5524 9023 1767 -8113 -1632 5602 1640 -2579 4157 -10865 10294 1402 -4498 4638 -6387
761f387J2144k144n852j139R463q530N723r76p367Q453k082J685q241J1483j0267
$$ -6387 5757 3613 -2239 -3378 6085 -2445 3278 2302 -5065 3388 1306 2991 -5250 6233 -4034
776d034O235K956j2914J4418r366L116J509k729j195N485n875K279L102q435J0825
$$ -4034 2201 5157 -7757 6661 -2705 411 1920 -809 -2004 3481 -2394 -115 2987 -5448 5377
791E377j0104P760n550K585J890q530J4214j3976P086K036q240O446J874r070
$$ 5377 -4727 3033 -2517 68 1958 -6572 7642 -6334 752 2788 -5452 994 2868 -6202
805f202R620m390l985J3551j9918J8245r303k886J3828j7771J3760o868J108M976
$$ -6202 3418 -972 -4957 8594 -11324 6921 -2382 -5268 8560 -9211 4549 -2319 -1211 3765
819C765r082P112O83j0233J6557j2262k768J8958k7236K5554j3379n321K2295
$$ 3765 -5317 1795 2478 -7755 8802 -3460 -6228 12730 -14506 11048 -2331 -7652 14643
832A4643k8903K3116o951j1550K0801j6051K982J1073j9819J9534r200o362K1405
$$ 14643 -14260 8856 1905 -9645 11156 -4895 -1913 9160 -10659 8875 -325 -6687 14718
845A4718l0627K8057j3179p512K5354l3416K7439q957j2008K5975k7076J2475
$$ 14718 -15909 12148 -1031 -8543 16811 -16605 10834 1877 -10131 15844 -11232 1243
857A243J0825l0534L4859k0688p409L5837m8783L8568j1852j9349M1673m5185
$$ 1243 12068 -18466 16393 -4295 -11704 24133 -24650 13918 2066 -17283 24390 -20795
869b0795K7893N08k6497L8186k9345L520K3460l7408L3946j5947j1692L6946m7749
$$ -20795 7098 7606 -18891 19295 -10050 -6530 16930 -20478 13468 -2479 -14171 22775 -24974
882b4974M0406j6155j8146M6081n1763L4920m641k8149M8571m2948J4011K2891
$$ -24974 15432 -723 -18869 27212 -24551 10369 5728 -22421 26150 -16798 -2787 20104
894B0104n1452N6534k7940j9415N6314o6863M9818p928l8731O2413n5317K8280
$$ 20104 -31348 25186 -2754 -22169 34145 -32718 17100 9172 -29559 32854 -22463 5817
906E817J1167m5800N1487k9297J08K8058m8607M4726j7287j3528M1401o3164N6552
$$ 5817 16984 -28816 22671 -6626 -6518 21540 -27067 17659 372 -13156 28245 -34919 21633
919B1633j7214k6774N8885p3872N1718N080n4137P0195n7982J3817M9286q2520
$$ 21633 4419 -22355 36530 -37342 14376 19456 -34681 35514 -22468 -8651 40635 -41885
931d1885O4240k0593l1842P9648q4527L8768J1792m5047O8362o1886J8167K0798
$$ -41885 22355 1762 -30080 49568 -34959 3809 15601 -29446 38916 -22970 -4803 15995
943A5995l8025N2855m7249L209L6839m8744N4355m0365j4778O5297p3349O0569
$$ 15995 -22030 30825 -16424 -13215 23624 -25120 29235 -11130 -25908 39389 -33960 26609
955B6609k6729m2264R1832p6540L4599P786o3616R0927m9691r219M5224p7328
$$ 26609 -120 -42384 49448 -27092 7507 15293 -48323 42604 -7087 -16306 28918 -48410
967d8410P9263j5650n3365P3948p5874N7360J1648p3103P1977n0893K9104K6423
$$ -48410 30853 15203 -38162 35786 -40088 17272 28920 -44183 27794 -23099 6005 32428
979C2428p1915N2632j8727M916L2859o9797M6659p345o895M4575q8952O3868k448
$$ 32428 -39487 13145 -5582 -666 32193 -37604 9055 1710 -5185 39390 -49562 14306 11858
992A1858l1539P0652j03123N2566L7009p1401P5828o9513j634Q8269q9095M4173
$$ 11858 -19681 50971 -52152 414 37423 -33978 41850 -27663 -29297 58972 -30123 14050
1004A4050j2841m5411J02028p1607O347J4188m0360P9626n2828n469J5235k9539
$$ 14050 1209 -44202 57826 -13781 -7434 6754 -33606 46020 -6808 -12277 2958 -26581
1016b6581O9464m6868k0516L7824m1256O6463l2346n0215P0497n1637N3761j1969
$$ -26581 42883 -3985 -24501 13323 -27933 38530 6184 -44031 26466 -25171 28590 16621
1028A6621p1527Q1875l7269K4967M782p2372P3364j4476m798K3291p9318P0535
$$ 16621 -54906 26969 -10300 14667 19449 -52923 20441 5965 1167 24458 -54860 15675
1040A5675R047m3444M9231q1204N6127L6603o9630M8187n4261K8498N2933o9891
$$ 15675 24722 -18722 30509 -50695 5432 42035 -27595 20592 -33669 -5171 47762 -22129
1052b2129K2947j5733N720N4532o2292O688L907k554N6496p1097J1785J3270j3651
$$ -22129 818 -14915 -9195 45337 -16955 -10267 -6360 -8914 47582 -23515 -11730 1540 -12111
1065a2111O1628p3457K202L5720k4608M8772n1142k2028N8697k8446K8727k7262
$$ -12111 49517 -23940 -21738 13982 -10626 38146 -12996 -35024 23673 -4773 23954 -3308
1077c308m0663P4920l0869J3340j3588m4855P8554k7650m620K350m5332O8691
$$ -3308 -43971 30949 80 13420 -168 -45023 33531 5881 1261 3611 -41721 26970
1089B6970n181l8946K2335l4758M4143J8011n6852K4022j9017L2995J4913n2200
$$ 26970 21789 -17157 5178 -29580 14563 32574 -24278 -256 -19273 13722 28635 -23565
1101b3565J9134j0205L1684O494m8266J9826k490J8744J6619n9312K2538J7193
$$ -23565 -4431 -14636 17048 23542 -24724 -4898 -7388 11356 27975 -31337 -8799 8394
1113H394r809L2069o0925J4535L5584k2494K4578m6018O076M0861k1383P906k5038
$$ 8394 -1415 30654 -30271 -15736 19848 -2646 21932 -24086 -18010 22851 1468 9374 -15664
1126a5664n597M7678k1927o817n007j5643N2172k2980j6003N582j2686M1296j5332
$$ -15664 -21261 26417 4490 -2327 -7334 -22977 29195 6215 -9788 -4206 -16892 24404 9072
1139I072k1346L674L253K4365j1673j9575N040L175K4633j3331k8299K4766r883
$$ 9072 -12274 -8600 -5347 19018 7345 -12230 -7190 -4015 20618 7287 -21012 3754 -6129
1152f129K3196n378l9974L4815m696N956M346l5129J9784J8216j3372K835j7521
$$ -6129 17067 11689 -28285 6530 1834 7790 12136 -22993 -3209 15007 1635 4470 -13051
1165a3051M557K5397j4409k636j4432J3183J4966j3413J355j7986J7708J3173
$$ -13051 -8494 16903 2494 -142 -14574 -1391 13575 162 1517 -16469 1239 14412
1177A4412j6903l07o082N626J9255j7193r884J1212m579J7612j3308j1328R938
$$ 14412 -2491 -2798 -8880 -3254 16001 -1192 -11076 136 -4443 13169 -139 -11467 -1529
1190a529K350J0298j6138p85K488N181Q727j4685n170J2016q46K909k670j6386
$$ -1529 821 11119 -5019 -5804 -3316 1865 10592 -4093 -9263 2753 1907 4816 2146 -14240
1204a4240K0397k228l455K386j3683J4198K612m137n620O07M625K853j048p563
$$ -14240 6157 3929 474 2860 -10823 3375 5987 1850 -3770 -3163 1462 4315 3267 -4296
1218d296J58P863J813r095N567p952Q582N524j4614Q458n170M854L730p633j117
$$ -4296 -4138 3725 5538 -3557 2010 -5942 2640 8164 -6450 2008 -3162 1692 5422 -2211 -3328
1233c328M866K71o30j45n084N063L62J997q016M835R87m001R572j3258O538K709
$$ -3328 1538 1809 1179 1034 -4050 1013 1375 3372 -4644 191 1178 -2823 6749 -6509 29 2738
1249B738n364N467m417j722O044k413k630M842p321P632l050q47J466l370O977
$$ 2738 -2626 2841 -1576 -3298 2746 333 -2297 2545 -4776 2856 -194 -1041 425 -2945 4032
1264D032q481P367l842k618P944p381K629K889o049M856J022p888J1099r458L884
$$ 4032 -4449 2918 -924 -3542 4402 -2979 -350 2539 -3510 1346 2368 -5520 5579 -3879 5
1279EM267j0489J1820q524L158J427m209N868n364J929K256m798M724o91o235
$$ 5 4272 -6217 5603 -2921 237 1664 -2545 3323 -2041 -112 2144 -2654 2070 1379 -4856
1294d856J1487j1079O222J482j0415J5571j3282O386K363j0153J2039o877m37
$$ -4856 6631 -4448 1774 3256 -7159 8412 -4870 1516 3879 -6274 5765 -1112 -1549
1307a549N831r430P927j10q698J3745j4062P693M326j4972J8073j4319N407N811
$$ -1549 4282 -5148 2779 2669 -6029 7716 -6346 1347 5673 -9299 8774 -5545 -138 5673
1321E673j3322J2603o441j353Q595j1147O538J388q911J4045j4318P260L431j2899
$$ 5673 -7649 4954 -1487 -2840 5755 -5392 1146 2534 -6377 7668 -6650 610 4041 -8858
1335h858J9181j8527Q830N221j5844J8677j2099j879J4407j7591J1443J035j4876
$$ -8858 10323 -8204 626 5847 -9997 8680 -3419 -5298 9109 -8482 2961 3996 -10880
1348a0880K2151j7957N843Q574j9933K2490j4663K209R557j6815J6750r101k223
$$ -10880 11271 -6686 -843 7731 -12202 10288 -4375 -2166 7391 -9424 7326 -1775 -3998
1361c998J1964j6444J3208j489j2326K1162k1229J1242N753k1252K7535k2055
$$ -3998 7966 -8478 4730 3241 -9085 12077 -9152 2090 7843 -13409 14126 -7929
1373g929O533J2690k4742K3323j0590o592K0136k2654J2520L472j8025K5114k0752
$$ -7929 -1396 11294 -13448 9875 -715 -7307 12829 -9825 2695 6167 -11858 13256 -7496
1386g496O077J0961k2714K5178j7783K808J2051k0191K0075j1678l050J6767k1788
$$ -7496 -1419 9542 -13172 12006 -5777 -2969 9082 -11109 8966 -2712 -5762 11005 -10783
1399a0783J5952j791j6206K7992k5713J0684R452k6567L2712k2874J733J8462
$$ -10783 5169 3378 -12828 15164 -10549 135 9587 -16980 15732 -7142 -5409 13053
1411A3053k9005K6014r186j2252K4804k3507J1940N978k2588K7562j9311M611
$$ 13053 -15952 10062 876 -11376 13428 -10079 1861 7839 -14749 12813 -6498 -1887
1423a887J1927k4940K6633j6456K046J2332k3145K3654j1364m739J7997k5712
$$ -1887 10040 -14900 11733 -4723 -2677 9655 -13490 10164 -1200 -5939 12058 -13654
1435a3654J9949K60k0410K9319k7075J2001J3689l2551L2974k0318j11K2753l2438
$$ -13654 6295 6555 -13855 15464 -11611 390 14079 -18472 14502 -5816 -5927 16826 -15612
1448a5612K1800l394j2500K4731k4727Q033J0500j9482K3930k0711K937J5145
$$ -15612 6188 2794 -9706 15025 -9702 -1669 8831 -10651 13279 -7432 -4495 10650
1460A0650k2329K4445j9731J314J8230k3551K0972j2862p489K5388k4254J2065
$$ 10650 -11679 12766 -6965 -5651 12579 -10972 10000 -2862 -10351 15037 -9217 2848
1472B848J660k0676L3325k2510J141J3500k7082L3152j6708p187J8166k3529K4201
$$ 2848 4508 -16168 17157 -5353 -4212 9288 -17794 15358 -1350 -8537 9629 -13900 10301
1485A0301o083j6994K1823j7658J3040N018k5932K5290j3482N044J1986l0614
$$ 10301 4218 -12776 9047 -8611 4429 9447 -16485 8805 -4677 367 12353 -18261
1497a8261K5616p645j769J3570k7759J9902J305r265J4171k2747J1980J2201j9320
$$ -18261 7355 -290 -2059 11511 -16248 3654 4959 -4306 9865 -12882 -902 11299 -8021
1510h021J7484j9718O355J9355k5367J7216j4939K626K1498k4988J0565n010l857
$$ -8021 9463 -10255 -3900 15455 -9912 7304 -7635 -5009 16489 -8499 2066 -2944 -6801
1523f801K3311k2112J616O989j1984K6164k1268m962J6672j7041K4709j7333j0951
$$ -6801 16510 -5602 -3986 3003 -8981 17183 -4085 -9047 7625 -9416 15293 -2040 -12991
1536a2991K1551j3555J4551p771j6580K2289o138J539J338j9639K1904k165m246
$$ -12991 8560 -4995 9556 1785 -14795 7494 1356 2895 4233 -15406 6498 4333 87
1549H7L019j8114K2741l414m867K288j5951K1908p47j1408O633j3993J6075Q371
$$ 87 3106 -15008 7733 4319 -548 1740 -14211 7697 6950 -4458 2175 -11818 4257 12628
1563A2628k3307J3054r829P408J6404k9013J1794r23L37J5824k3541L026Q427
$$ 12628 -10679 2375 -7454 -46 16358 -12655 -861 -1784 -1447 14377 -9164 -6138 2289
1576B289j997R411j5449l692J4970m315O303j3433l265J6405o595O753j5050j84
$$ 2289 292 9703 -5746 -9438 5532 1217 7520 -5913 -9178 7227 632 7385 -7665 -7849
1590g849J6654p811M077j0934k754J8604p183l447j284q200K1264o464j0136N760
$$ -7849 8805 994 5071 -5863 -8617 9987 2804 -643 -1927 -10127 11137 4673 -5463 297
1604B97r345J9550m773j2956O306l987J2643j190j4575N470K247M996K744j7010
$$ 297 -9048 10502 5729 -7227 -921 -4908 7735 6545 -8030 -2560 -313 4683 7427 -9583
1618i583O697N089J033K786j6098Q210M309J648l69j3301Q027N807r92j247r940
$$ -9583 -2886 2203 3236 6022 -10076 -1866 2443 4091 3722 -9579 -1552 4255 3263 2016 -7924
1633g924M653J0744o980R21q017K428J4277j1546J069n108K148J2288q818l418
$$ -7924 -3271 7473 493 1414 -6603 -4175 10102 -1444 -375 -5483 -3335 8953 135 -3283
1647c283j43K135Q100n332p282M172P16P673n741p392O395j181Q286p729n542
$$ -3283 -3426 -1291 6809 1477 -5805 -1633 -917 6756 1015 -6377 18 -1163 7123 -606 -6148
1662f148O819j43M942n662n790O372K819r62j158p606P360L186l255M48p388Q461
$$ -6148 671 528 5470 -192 -5982 390 3209 2247 1089 -6517 843 4029 774 1222 -6166 2295
1678B295J343k788j094m833P220J410l410j457j698L789M374p009P72m88J463
$$ 2295 3638 850 -244 -5077 2143 3553 143 -1314 -3012 777 5151 -1858 -1086 -1574 -111
1693a11N981q862K116r35K524L485p040J459N37K206J215m132j127L642j003K906
$$ -111 5870 -2992 -876 -1811 713 4198 -2842 -1383 -846 1360 2575 -1557 -2684 958 -45 2861
1709B861m472j534N770m073M330m766r95N321l097K246l214m19L468p79j373R53
$$ 2861 -1611 -3145 2625 -1448 2882 -1884 -2879 2442 -655 1591 -1623 -2042 1426 647 -726 227
1725B27k898M667j192k219K664m253O001l076r07K242l941N421k783j264K233
$$ 227 -2671 1996 804 -1415 1249 -3004 2997 -79 -986 1256 -2685 2736 -47 -1311 922
1740I22j882J434J367m099L716j460p87M051o738N900l074R9L255n509M863k349
$$ 922 -960 474 1841 -2258 1458 -2 -789 3262 -3476 2424 -650 -551 2704 -2805 2058 -291
1756b91n58K846l395J590J470l857M412k745q85M655o847O450l530p27L967n930
$$ -291 -849 1997 -1398 192 1662 -2195 2217 -528 -1413 3242 -3605 2845 -685 -1412 2555 -3375
1772c375N592k358q44K580l388K057J191m128M513k970K41M349p839P269m193
$$ -3375 2217 -141 -985 1595 -1793 264 1455 -2673 1840 -1130 -889 3460 -4379 2890 -1303
1787a303K10M739p764O120k637q66M785n828J902K897n414O420m751r39O357q112
$$ -1303 -1093 3646 -4118 2002 -635 -1501 3284 -2544 -642 2255 -3159 3261 -1490 -2429 3928 -4184
1803d184P660m981r95O595p457N917l249j708N798m970J834J138m721O902m294
$$ -4184 3476 -1505 -2500 4095 -3362 2555 -694 -2402 3396 -1574 260 1398 -3323 3579 -715
1818g15p92N048q331R191n154j175N811q402Q274l326l102O023n888L532K023
$$ -715 -1507 3541 -4790 4401 -753 -1928 3883 -4519 3755 429 -2673 3350 -2538 994 3017
1833C017p536P967m346m39O358j0910R641m162j658P106j0039P097j430l514O739
$$ 3017 -4519 3448 -898 -1337 5021 -5889 3752 -410 -2068 5038 -5001 2096 666 -2848 3891
1848C891p012K782L283p229P986n572l20P236j0630R046m442k052Q202r872P325
$$ 3891 -3121 -339 2944 -4285 3701 -1871 -2191 5045 -5585 3461 -981 -3033 5169 -4703 2622
1863B622k547l419P660p201L033K443p296Q983n671q69O953j0788J0498n075k547
$$ 2622 75 -3344 4316 -2885 148 2591 -4705 4278 -1393 -2262 4691 -6097 4401 -674 -3221
1878c221Q620j0797Q472j988n272Q903p464K593L876q846Q764m377j978Q259j1204
$$ -3221 5399 -5398 3074 1086 -4186 4717 -2747 -154 3722 -5124 3640 -737 -2715 5544 -5660
1893e660Q948l033l346Q151r852P061j205m084P558p452K968L118p651R059o461
$$ -5660 3288 255 -3091 5060 -4792 2269 1064 -3020 4538 -2914 54 3172 -4479 4580 -1881
1908a881l73P733j1536J0878n384l170J0088j1957Q133j401n506R388p776K060
$$ -1881 -2254 5479 -6057 4821 -563 -3733 6355 -5602 2531 1130 -4376 5012 -2764 -704
1922g04M200q625R093m268l240Q627j0385Q608l117l896Q406r063O723j833m323
$$ -704 3496 -5129 3964 -304 -3544 5083 -5302 3306 189 -3707 4699 -4364 2359 526 -3797
1937c797P622o333K573K701p894R258n092j675P760j1376J0218l578m671R565
$$ -3797 3825 -2508 65 2766 -5128 4130 -962 -2637 5123 -6253 3965 387 -4284 5281
1951E281j0706P590Jo534P946n764J412M917q781P005k331k459P650j0672P670
$$ 5281 -5425 2165 2166 -4368 3578 -2186 -774 4143 -4638 2367 36 -2423 5227 -5445 2225
1966B225j520k780P161r897O524l00l799O865p628K466M557p576P159m513k276
$$ 2225 705 -2075 5086 -4811 1713 1413 -2386 4479 -3149 -683 3874 -3702 3457 -1056 -3332
1981c332R692j0808O801k341m215J0553r090K826Q85m373P654m705j679M273m931
$$ -3332 6360 -4448 2353 12 -4203 6350 -2740 86 971 -3402 4252 -453 -2132 2141 -2790
1996b790N866k640m032O341o150P031l503m170P301o314N978k263n596Q017m122
$$ -2790 3076 436 -3596 2745 -3405 3626 123 -4047 3254 -3060 2918 655 -4941 3076 -1046
2011a046J213K305q290Q006l96m294O349r728P455J553o211N899p025M918K853
$$ -1046 167 2472 -5818 2188 1792 -2502 3847 -5881 1574 3127 -3084 2815 -4210 708 3561
2026C561o013K681k131J808M347o450J781l72r0O017q616L473o55lN917q946K970
$$ 3561 -2452 229 -1902 -94 4253 -2197 -416 -788 -878 5139 -3477 -4 -659 -662 5255 -3691 -721
2043g21J378j111M796o789l23N714l820L886l781l962R214n254K596k337l948
$$ -721 657 -454 4342 -2447 -2770 2944 -876 3010 -771 -4733 4481 -773 1823 -514 -4462
2058d462Q898l979l4j115k579O178r60l302R89k532N602K21n714L075l471O479
$$ -4462 4436 457 423 -692 -3271 2907 1947 -1355 -366 -2898 2704 2925 -2789 286 -3185 3294
2074C294r10n461L305k607N516r84n386K407K86K342R95p043L040K385r06L360
$$ 3294 2384 -3077 228 -2379 3137 2153 -3233 -826 -540 1802 2797 -4246 -1206 1179 273 3633
2090C633q403L735L151j871K437o904K959L759j725k11l229M98N640k872j377
$$ 3633 -4770 -1035 2116 245 2682 -4222 -1263 2496 771 560 -2669 -2171 3469 597 -780
2105g80o79q61O941m734p40p31j21O168m986m57p79J153M123k943k676J564L30
$$ -780 -1459 -2320 4621 -113 -853 -1584 -1705 4463 -523 -980 -1759 -606 3517 574 -2102 -538 -208
2122b08L212j862m785M437j384L458k211m350M750j131K584k513l273L516J511
$$ -208 3004 1142 -3643 794 -590 2868 657 -3693 1057 -74 2510 -3 -3276 240 1751
2137A751m16j037l227K949K598k924R46m115M254J974l086O39l115M085Q34k404
$$ 1751 1335 298 -2929 20 2618 -306 640 -3475 779 2753 -333 306 -2809 1276 2110 -294
2153b94o82o26K162J898l089p00P08L34L483m909M74J030rL074m895J106O60N96
$$ -294 -976 -1602 560 2458 -631 -1331 -623 -289 3194 -1715 -1241 -211 -220 2854 -2041 -935 -275 321
2171C21J457k889o95K224k0O05j631j970M358j849J412j956j344M155k573J530
$$ 321 1778 -1111 -1806 418 398 1003 -628 -2598 1760 -89 1323 -633 -1977 2178 -395 1135
2187A135j725j144K931m97j141L43j172K346L49k819K174k297L043m77k545K026
$$ 1135 -590 -1734 1197 700 -441 -98 -1270 1076 1425 -1394 780 -1517 1526 1049 -1496 530
2203E30j786K885j391r46Q59n36J153o7j970J645K57j080K515m043K550J71j578
$$ 530 -1256 1629 238 -708 151 -385 768 701 -1269 376 633 -447 2068 -1975 575 746 -832
2220h32K690l741K416j2p56R47j604O09J189j653Q19k70o96K598l205K188o03
$$ -832 1858 -1883 533 521 -235 712 -892 -283 906 -747 72 -198 -894 1704 -1501 687 84
2237H4j442K869l316K617r34r59K128j814O91P43j729J631o01j320L041l210K208
$$ 84 -1358 1511 -1805 812 -122 -1081 1047 -767 -76 667 -1062 569 -32 -1352 1689 -1521 687
2254F87m61j521L138l790K533m06q70J891k268R81Q06j351J237o99j099L018l071
$$ 687 226 -1295 1843 -1947 586 180 -690 1201 -1067 -86 720 -631 606 -93 -1192 1826 -1245
2271a245K551j371j534L898l717K688j315j183L312k341L3J184k141K389o45k140
$$ -1245 1306 -65 -1599 2299 -1418 1270 -45 -1228 2084 -257 -224 960 -1181 1208 563 -1577
2287a577L435l429L045n57k659L377k971K747p86j996K290j604J279K78k488K154
$$ -1577 1858 -1571 1474 917 -1742 1635 -1336 1411 625 -1371 919 -685 594 872 -1616 538
2303E38m21p80K780m904L524n1j978L755n032L210M85k299K629k872P05K236k847
$$ 538 117 -663 2117 -2787 737 686 -1292 2463 -2569 641 1126 -1173 1456 -1416 -711 1525 -1322
2320a322J967o59j664M208l932J938k96k045M333m128J843k35j466L658k984L92
$$ -1322 645 -14 -1678 2530 -1402 536 240 -1805 2528 -1600 243 8 -1458 2200 -784 -392
2336c92J131k153K763j220k054L946l588L070q79l002M836m226K820j92k675L304
$$ -392 739 -1414 1349 129 -1925 2021 -1567 1503 624 -2378 2458 -1768 1052 860 -1815 1489
2352A489k039O94J218l056K471N8j758L451m930L443j10k470L815m499L162K32
$$ 1489 -550 144 1362 -1694 777 835 -923 2528 -2402 1041 931 -1539 2276 -2223 939 1171
2368A171k641K847k425O01K265l437K241n91j761M231m202J954N44k789M615m040
$$ 1171 -1470 1377 -1048 -447 1818 -1619 622 31 -1730 2501 -1701 253 797 -1992 2623 -1417
2384a417J759L23k433L564k886N34J574l015L118r25k124L860m138L181p2l444
$$ -1417 342 665 -1768 1796 -1090 -556 1018 -1997 1121 196 -1928 1932 -2206 975 903 -2541
2400b541M901m076K295J63k898L587k159L21J713k847K213j47j945L500l956K501
$$ -2541 2360 -1716 579 742 -2156 1431 -728 -407 1306 -1541 672 525 -1420 2080 -1876 625
2416F25K62k793M183m249K230Q90k651L085k199M0K274l208K094rk232M082m158
$$ 625 887 -1906 2277 -1972 258 1148 -1503 1582 -617 -577 1697 -1511 583 574 -1658 2424 -1734
2433a734K029R24l224M715m282J706Q99k397L099k189m75K194k372J674O9k687
$$ -1734 295 1219 -2005 2710 -1572 134 1033 -1364 1735 -454 -929 1265 -1107 567 636 -2051
2449b051M105l466J699P93l432M944m065J485Q14k867L497j699p27K413l217K246
$$ -2051 2054 -1412 287 1080 -2352 2592 -1473 12 826 -2041 1456 -243 -970 1443 -1774 472
2465D72L45k958M032l481J794J054l514L965k977J860K86k567K433j070N2J250
$$ 472 817 -2141 1891 -1590 204 1258 -2256 1709 -1268 592 878 -1689 744 -326 -274 976
2481I76k605J929N71k208L355l897K138J074l243M037l720J488J379k587K371
$$ 976 -1629 300 871 -1337 2018 -1879 259 1333 -1910 2127 -1593 -105 1274 -1313 1058
2496A058j798K11K474k599P54N96k139L814l281M18J556k623L749l397R08J317
$$ 1058 -740 -529 1945 -654 100 696 -1443 2371 -910 -492 1064 -1559 2190 -1207 -299 1018
2512A018j747K104j648n97J959j229P10n4k557L677k280P85N11l205M394k241
$$ 1018 -729 1375 -273 -870 1089 -140 570 516 -2041 1636 -644 141 652 -2553 1841 -400
2528d00M97K97k462L420j150r47J203j767J736J135l206K179j565J440J153l415
$$ -400 97 394 -2068 1352 202 -745 458 -1309 427 1562 -1644 535 -1030 410 1563 -1852
2544a852K453j609J634O49l056J813k87L84J011k606O83J806j531K100l117N39
$$ -1852 601 -1008 626 1275 -1781 32 -255 129 1140 -1466 -783 1023 -508 1592 -1525 -986
2560i86K507k332K112k878J195J618j574J092k028N48K214j406k27l0j411L861
$$ -986 1521 -811 1301 -1577 -382 1236 -338 754 -1274 -726 1488 82 -145 -175 -1586 2275
2576B275k173r09J467k251M108k479r29P12m21K345j441j447Q92L40R97j71k765
$$ 2275 102 -807 660 -1591 2517 38 -891 -179 -600 1745 304 -1143 -251 89 1086 915 -1850
2593a850K080m61J288l4l426L192q37P30j2k577K156N82n99l17j073R09J672j837
$$ -1850 230 -231 1057 1023 -2403 789 -48 682 670 -1907 249 831 232 -85 -1158 -249 1423 -414
2611d14N16j469J252J833k658J556k324K022J239k433O21m48O25J301j480p17
$$ -414 102 -1367 -115 1718 -940 616 -1708 314 1553 -880 -259 -707 -82 1219 -261 -978
2627i78J125o54K047j865p74J583p05J938k802K60J105l34J556k027o27J674K2
$$ -978 147 -507 1540 -325 -1099 484 -221 1717 -1085 -825 280 -54 1502 -525 -1152 522 544
2644E44j55l36j844K719m28o58O75k323L079q18j50m23o05J909q21l30j73n21
$$ 544 389 53 -1791 928 500 -158 517 -1806 1273 455 305 -118 -723 1186 365 35 -138 -659
2662f59J153N27j886J341j066J184Q77k910K039j211J088P05k053N38K79M66j65
$$ -659 494 1021 -865 476 -590 594 1471 -1439 600 -611 477 1182 -871 -333 -54 412 247
2679B47o46J7P62n52R31j575L38J647j786J855k230O78R77r91P67j044M02P66
$$ 247 -399 -382 380 -172 759 -816 -478 1169 -617 1238 -992 -314 663 -328 439 -605 -203 563
2697E63o27m96Q36j007J544p37o06J148j802K475k078Q32Q7r36K034j477J4K51
$$ 563 -64 -560 276 -731 813 76 -530 618 -1184 1291 -787 45 132 -804 1230 -247 -233 18
2715A8l41L87P05j684J528r36j11J366k459K777j673N64N04j302J493p29k48L05
$$ 18 -323 64 769 -915 613 -323 -434 932 -1527 1250 -423 141 645 -657 836 107 -141 164
2733A64l11p9N60r39J262q35J14O13j595K239j779Q59j10q16J555j170L39L37
$$ 164 -147 -226 334 -605 657 -178 -64 549 -1046 1193 -586 273 163 -653 902 -268 71 408
2751D08q17M57N74j579J629j011K95J157k495K088j230N05Q33j801J151k50J44
$$ 408 -409 48 622 -957 672 -339 -44 1113 -1382 706 -524 -19 814 -987 164 -86 58
2768E8J37m83n7R38j024J177j391M26J009j718K126k539J279P59j450J421j593
$$ 58 195 -288 -345 593 -431 746 -645 -219 790 -928 1198 -1341 -62 697 -753 668 -925
2785i25O81J132j219P8M34j189K426j618n03J168j469K677j926q9O11o10J364
$$ -925 -244 888 -331 -253 181 -1008 1418 -200 -703 465 -1004 1673 -253 -342 269 -341 1023
2802A023j060l07K55l7Q11k82j459J729j206Q21M99k670L105j525O95K55k185
$$ 1023 -37 -344 -89 -126 685 403 -1056 673 -533 288 787 -1883 1222 -303 392 647 -1538
2819a538K251p06qO10j474P28J176j722J245q53J77J271k171J904j694P64Q38
$$ -1538 713 7 -1 609 -865 -137 1039 -683 562 -291 -114 1157 -1014 890 -804 -40 798
2836G98j828J244q23N50P59r83l7N59j046J788j601OJ560k166K773k467M38J167
$$ 798 -1030 214 -609 -59 700 -283 -320 239 -807 981 -620 -614 946 -1220 1553 -914 -476 691
2854F91j617K096j417n99J568p49J13N47j766K013o50n74J364k438K386j134Q5
$$ 691 -926 1170 -247 -846 722 -27 86 633 -1133 880 230 -344 1020 -1418 968 -166 -81
2871h1N72j317J664q03j87M35q53R39L75j612J532j445Q14J590l277K766j778
$$ -81 491 -826 838 35 -152 283 -570 369 744 -868 664 -781 33 1623 -1654 1112 -666
2888f66M24J714k598J656n59j36J176j480L1R53j324K002j613k61J951k511K461
$$ -666 -242 1472 -1126 530 -29 -165 1011 -469 -438 515 -809 1193 -420 -681 1270 -1241 1220
2905A220j590l96J697j655J335p93k88P48n79J4O90j503J731j281N68Q04k231
$$ 1220 -370 -766 931 -724 611 -182 -470 278 -301 -287 403 -1100 631 -650 -82 722 -1509
2922a509K781j903L03J166j964J936o85n24R94j408N82R03j857J804j041j76J749
$$ -1509 1272 -631 -328 838 -1126 810 125 -399 595 -813 -231 672 -1185 619 -422 -598 1151
2939A151k427K123j182L3J121j701J411o56K36M60p65m0R31j344J219o44m60J704
$$ 1151 -1276 847 -335 -302 819 -882 529 -127 109 569 -196 -236 695 -649 570 -74 -534 1170
2957A170k006J959j535L1J239j457J307q42k29J094q75J07O83j581J864r07o50
$$ 1170 -836 1123 -412 -381 858 -599 708 -134 -363 731 -144 -37 646 -935 929 22 -628
2974f28J734k033J892p49o85J292j528J212n76m19L75p1J14L61r71J303p02k28
$$ -628 1106 -927 965 216 -469 823 -705 507 -69 -488 -113 -184 -70 291 -680 623 -79 -307
2992c07J019k215K578j394R5J001j849J746p20k0L96p06P1J246j662Q48o5n61
$$ -307 712 -1503 1075 -319 -224 777 -1072 674 -46 -66 330 -376 -305 941 -721 127 62 -499
3010d99J462j921J556j064M21J104j724R91n15J4N01m89k75Q09o04Q23o75p14
$$ -499 963 -958 598 -466 -45 1059 -665 326 -189 -175 326 -163 -438 371 -233 590 -85 -799
3028g99J744j636J357j164m8J262j212J200r55j22J189o87k91P31j165J254l24
$$ -799 945 -691 666 -498 -546 716 -496 704 -251 -373 816 129 -162 569 -596 658 334
3045C34j215J570j655J644m66o34N57o42J117m34o41K08J36O52n9j478J309l18
$$ 334 -881 689 -966 678 212 -422 135 -507 610 176 -465 -257 -121 531 472 -1006 303 -15
3063a5r8J072k477K116o38j05R64k083J281L05l44q8M6m93J066m37n4l42j99J636
$$ -15 -113 959 -1518 598 -40 -145 819 -1264 17 322 -22 -110 -64 -557 509 72 18 -324 -523 1113
3083A113j733R80j011N01J255j877P58n36N91N93l70j000Q18l19M89J02j306J581
$$ 1113 -620 360 -651 -150 1105 -772 -14 -550 41 634 264 -736 82 -237 252 354 -952 629
3101F29q07Q43r56j26O09j43Q92j301j14P09J4p4J0j101J334J54j224J228j760
$$ 629 -178 665 -291 -417 192 49 941 -360 -474 235 249 175 185 -916 418 572 -652 576 -1184
3120a184J815q0p71K62m67Q53k72j23m93L41NN52q78J30K10p9J267j998J063k06
$$ -1184 631 551 -220 42 -425 428 156 33 -460 -119 -114 438 -440 -310 -100 -179 1088 -910 153 -53
3140e3j57J025j585N22K77L12l02j5n61O93Q1k7l83m61J398j419J011o09k20J248
$$ -53 -210 815 -770 -248 29 341 39 24 -537 156 237 210 -173 -634 764 -655 356 -253 -473 775
3160G75j091N82p59m9O15L64j118P99n89P23K91r44Q50q44Q87l68l94O24j121
$$ 775 -316 266 -493 -542 73 437 -681 118 -471 252 543 -401 449 -395 492 124 -270 354 -767
3179g67J199l44k20M8L35k43N38r78L92M13o86J005j512J159n25l25J102j162
$$ -767 432 88 -132 -84 251 8 546 -432 -40 373 -313 692 -820 339 -186 -511 591 -571
3197e71J114p27L54J44l43j43M48p88N94K34j062J439j680J208j82m79Q67j047
$$ -571 543 -184 170 314 -29 -172 276 -512 82 316 -746 693 -987 221 39 -440 427 -620
3215f20R64l21p8m3K19m08N58l51k77L06k76J089j582Q89k33j25Q59j230P55k36
$$ -620 344 23 -55 -98 121 -287 271 -80 -357 -51 -327 762 -820 69 -164 -289 570 -660 95 -141
3235a41l3L13l94k64J120q19K56K40j048J674j214O80k88m91R06n83K87m98L82
$$ -141 -174 139 -255 -519 601 -218 38 278 -770 904 -310 370 82 -409 497 -86 201 -297 85
3254H5K27l56k63L08j72N75m5j189J367r27J024m10p32J160j068R19o12k10L89
$$ 85 312 -44 -307 1 -171 404 359 -830 537 -390 634 224 -508 652 -416 503 -109 -319 70
3273G0j3J39Q4r52P12N75r61R57j510J115J40n29O71j575J353q8n0k04l94L74
$$ 70 57 196 280 -672 40 615 -346 611 -899 216 356 -173 498 -1077 276 188 138 -66 -460 -86
3293h6P06o59J30j34m81J814j979O13r8k92J512j639O79m4J12K40m44o06J069
$$ -86 620 -39 91 -43 -524 1290 -689 -76 -174 -466 1046 -593 86 42 154 394 -50 -656 413
3312D13n36L96M0j298J648r80Q03m04n44R57q45J024r24QM74J73l97j68l21O44
$$ 413 -123 273 313 -985 663 -317 486 82 -462 495 -350 674 -250 -242 232 405 8 -160 -481 163
3332A63N29j327R71j203J266op60R78j201Q97l3n07N2Qo5R02j014M5O02o67J310
$$ 163 692 -635 336 -867 399 393 -367 611 -590 307 274 -233 -181 -173 -238 664 -350 -305 297 -370 940
3353I40j685P36J9k41J004j321N06j50K71K71p55L03L61l22J51k43p58J815j315
$$ 940 -745 -9 10 -231 773 -548 -42 -192 79 350 -405 -102 259 -63 88 -155 -913 902 -413
3372d13Q67k30j073J613j154N75j45l28N67l29N5j62l68O92J34r98J329j178P46
$$ -413 454 224 -849 764 -390 185 40 -288 279 -50 5 -157 -525 167 301 -697 632 -546 200
3391B00K22j022R42r18Q72k39r9L0k3J76J35m94L67J39n85J265j614J098n28m50
$$ 200 422 -600 342 -576 296 57 -42 -12 -35 141 276 -218 149 288 -297 968 -646 452 -76 -526
3411e26J278j473R11K0l51O29m71k87O54m50NM42r52J347j114N41l35n1N06p85
$$ -526 752 -721 190 210 -141 488 17 -270 384 -66 -61 381 -571 776 -338 203 -132 -183 323 -462
3431d62P73m71K34N4k27J91Qk13J5M49r33J223j124R47j34o12M16o76P38j16m71
$$ -462 311 -160 74 128 -99 92 100 -113 -98 351 -582 641 -483 464 330 -282 134 -542 196 80 -391
3452c91M78k89L51N4n42M63J12m92Q47j180M25J41l57Q12j073N76JK21k0m49K7
$$ -391 87 -202 149 203 -339 124 236 -256 591 -589 -164 -23 -380 432 -641 -65 -64 157 137 -312 -285
3473b85O97l16J3P8m68R68r97O53n5p51J039r46M59l4j99L94k24k72N04j71j93
$$ -285 412 96 109 187 -281 687 -310 343 288 -463 576 -370 89 55 -144 250 26 -246 258 87 -106
3494a06O14j121R50n43M44k7o46Q20n58P26o76j22L99k74N5N6k50J39L27o66Q56
$$ -106 508 -613 337 -206 238 211 -435 385 -173 553 -123 -245 154 -120 -65 -9 -259 -120 207 -459 397
3515C97q44L80L47q94J046p34M23j21j91J99l8OO3k27l41J129j145R60o11Q1N19
$$ 397 -447 -67 280 -614 432 -302 121 0 -191 8 -30 -24 39 -188 -529 600 -545 415 -196 -115 404
3536D04r16P16l63N3j33M61l84J15J96j27J72m34K02l73R41p73L97M8o09Q92o80
$$ 404 -512 204 -159 -106 -239 222 -162 -47 149 22 194 -240 -38 -411 530 -243 154 202 -407 485 -195
3557a95L64k40j85J49K04J4M5q6r8L83r04O85k12J57l3m56M45l97O17j78n47Q16
$$ -195 169 -71 -256 -107 97 111 156 70 -28 355 -549 136 -76 81 48 -408 37 -360 257 79 -468 348
3579C48j67k36J30j18j78Q27p94L40m85Q0O06p32O23n47M03j89J1J04m4l45N98
$$ 348 181 -55 75 -43 -221 606 -188 152 -333 -253 353 -379 244 -303 100 -89 -78 26 -18 -363 235
3600B35j21n74Q52j031Q67m51k95Q69q11P99m74J56k9J29K48n21J4J23R0o1J93
$$ 235 114 -460 392 -639 228 -223 -518 351 -460 339 -135 21 -8 121 369 -152 -138 -15 75 14 207
3621B07n68Q80m13k74N52q16Q44m07J78l55j59J47L79k03M3q0J03N50q83K62K36
$$ 207 -361 519 106 -168 384 -432 412 5 183 -172 -331 -184 195 -8 35 -45 58 608 -275 -13 223
3642B23j20K24j046J101o74K60j3q2oL4K46M7P1n34Q25j096R98p50J1N49n47P48
$$ 223 103 327 -719 382 -292 -32 -45 -127 -133 -99 147 194 265 -269 556 -540 458 -292 -281 268 -279 469
3664D69m44j40K54r7k48P2m3J53J79n57P13n77M38r6j87K84n89Q54p03K82k5L0
$$ 469 25 -115 139 42 -206 -134 -177 -24 155 -402 311 -266 172 76 -111 173 -416 438 -265 17 -8 22
3686B2o5J8k10K11J77k90N96j149Q95p0k41N59q24P32m08J61O2k26J59j35K19
$$ 22 -43 -25 -235 -24 153 -137 459 -690 205 135 -106 453 -371 361 -47 114 176 -50 109 -26 193
3707A93j38p6Q1N01q51O23l30j31M45r78J032o29L60k59%L43j89Q4k68J63j40
$$ 193 55 -21 60 561 -290 333 3 -128 317 -661 371 -258 102 -157 -157 186 -3 81 -187 -24 -164
3728a64P55q94O66l77j82Q76j496J027l44M0L15m46m4M65l06J20n0m89R92n72
$$ -164 591 -303 363 -14 -196 680 -816 211 -133 -93 222 -224 -268 197 -109 11 -39 -528 464 -108
3748a08K20k30p5P18o96O35q20J62M71n24K34P4l32O86l04m62O12p42J015l00
$$ -108 112 -118 -193 525 -171 464 -356 -194 277 -247 -13 61 -271 415 111 -351 261 -481 534 234
3768B34l50K85o59Q69n64J32j04n3N54l48o6L04k87K27J90r29J040l86k01L61
$$ 234 -116 169 -490 379 -185 -53 -157 -210 344 -4 -70 234 -53 174 364 -565 475 89 -112 249
3788B49r30J017j67R3k45l71N50j0r5J05k41J19M96p01K24l19K50L61o90P55p11
$$ 249 -681 336 169 262 17 -354 196 186 91 196 -45 74 570 -131 93 -226 24 385 -305 450 -261
3809b61N35K5m63L37l0O6J8r9n50L22k72N98l32k32M29l80O51p20j7P28o61O01
$$ -261 274 299 -164 173 143 209 227 128 -422 -100 -372 226 -106 -338 91 -289 362 -358 -375 353 -308 293
3831B93n50q9Q11n41j60M50o90P19km76M86j022J054m95M41k05k73O33l45K4j64
$$ 293 -257 -346 465 -76 -236 214 -476 243 241 -235 251 -771 283 -212 229 24 -249 384 39 63 -101
3852a01j35M91K66q62N82m01J27N36p61N42l27K11O2k72R2j18K99k7j59l50L92
$$ -101 -236 255 521 -341 241 -160 -33 503 -258 284 -43 168 230 -42 50 -68 231 204 45 -305 87
3873H7k08L67l78q8P10j063R31o62R5L83l74L64j52m5J39n0j98K49j96J68K0j19
$$ 87 -121 246 -132 -220 490 -573 358 -304 -209 174 -200 164 12 -33 106 56 -142 107 -89 79 99 -20
3895b0K26n39Q82n86L0j09j85N31j85l91K60L0n0N41r62N65J71l81K18m91M32
$$ -20 206 -333 549 -37 -7 -116 -301 230 45 -346 -86 -56 -106 435 -527 38 209 -172 46 -445 -13
3916a3j45L43j7m95L41p9J22P4n6l35M68l20L97j40k24M34m78L73l68J83q9j00
$$ -13 -158 185 168 -327 14 -65 57 131 75 -260 208 -112 285 145 -79 355 -123 250 -118 65 -24 -124
3938a24L80l96K47L1J28m01K20k56L41q8j70L04l72M38k94J5p7J3Pk3L33l38M17
$$ -124 256 -140 107 138 266 -135 85 -171 170 82 -88 216 -156 282 -12 3 -74 -61 -54 -77 256 -82 335
3961C35m13K12j05j75J81q7L73p90O05k00K10j22l48L51j89K85m10L16l86P85
$$ 335 -78 134 29 -146 35 -52 321 -469 136 -64 146 24 -324 27 -162 123 -287 29 -357 428
3981D28n09p9J49j70K99k96O61r36L24K43j69L00k23m9%K06k22K08m64L09K14
$$ 428 -81 -160 -11 -181 118 -178 483 -453 -129 114 -55 245 22 -27 -27 179 -43 165 -299 10 224
4002B24l86M61n01L00k16j62L89j94J88p3P0l32O74n11K32j98J05O8k58K91n69
$$ 224 -162 299 -202 98 -118 -280 109 -85 103 30 100 -232 442 -69 163 -35 70 138 -120 171 -398
4023c98O44k90J75j55P8j4k52K55j9J21k93M81n12K80pl70M71o21L49J91j80J22
$$ -398 246 -44 131 -24 54 40 -212 43 24 145 -148 333 -179 101 94 -276 195 -426 -77 114 -66 56
4045E6%n22O96j97j22J92l59M26p5k04K22o59O80m70L24K1j61K60q3L9m6J20k49
$$ 56 56 -466 230 33 -89 103 -256 170 95 -109 113 -546 134 -336 -12 9 -152 108 25 64 18 138 -111
4068a11L82m94M19k27J68J51o44N96n12L65nj80K64k6j45r7K63j63J85k27M65
$$ -111 271 -223 196 -31 137 288 -356 240 -272 93 88 -92 172 146 1 -96 167 4 189 -38 427
4089D27m15p5K81m88M35l91K41%k7J10Q3j48J51K9k84K44o17O77k98J29P5m34
$$ 427 12 -63 218 -270 165 -226 15 15 -12 98 181 33 184 213 -71 173 -444 233 -65 64 139 -295
4111b95O95n99J00p2K17j32K8p0N0K53j14M4k30N48l16m95K50q9K83l00L82j23
$$ -295 400 -199 -99 -171 46 -86 -58 -128 -78 175 61 105 -125 423 107 -388 -138 -227 56 -244 138 15
4133A5j42L32n70K56p1J50PJ61l04M37k70k33M03m67M79m06M50j14k12J5N7Q5
$$ 15 -127 205 -365 -109 -180 -30 -23 138 -166 271 1 -232 171 -296 183 -223 227 113 -99 -84 -27 58
4155E8lO3k12M19k29j6j49J22J04k48O13q64N90k35j68K71m35M77k28J90K7J17
$$ 58 55 118 -94 325 96 80 -69 53 157 -91 522 -342 248 13 -155 116 -319 158 -70 120 147 264
4177B64m57N85p09L36J26l61O79q64M45k0j43M03l04L50m82K00j12J23q2J02k68
$$ 264 -193 392 -317 19 145 -216 463 -401 44 24 -119 284 -20 330 -152 48 -64 59 -23 79 -189
4198a89J95j26j84M43o66O39l07O0L44k66k7J32p5LJ70l32L61j50k3j3k99N49
$$ -189 6 -120 -304 139 -527 112 -195 -135 209 -57 -84 48 -27 -24 146 -186 175 25 2 -11 -310 239
4220B39m48N06l24k00K74k10K96l09K48J8k8k67L92k93J22K68p70P40k30K55o7
$$ 239 -209 297 -27 -227 47 -163 133 -176 72 90 62 -205 187 -106 16 284 -486 254 24 279 212
4241B12l44L07m10O44l16j43J09p2j15J31r1m0J51j16K01j96J51j59J03J77m82
$$ 212 -132 175 -235 409 93 -50 59 -13 -128 3 -88 -128 23 -93 108 -88 63 -96 7 184 -298
4262b98M04k69L83k14R1j3o1lJ79j98j93L65m68L45j05k82M64k64J17j53N3L2
$$ -298 106 -163 220 6 97 84 23 20 199 1 -192 173 -295 50 -55 -337 127 -137 -20 -173 -120 -88
4284h8K04l86O10l24J97k42k92M49l32N19n37n0L93m26L38o5k59K76L4O5r8k55
$$ -88 116 -270 340 16 213 -29 -321 128 -204 315 -222 -272 121 -305 33 -32 -291 -15 19 84 -14 -269
4306b69L30L06m88L19m17N02j20j10K55n06N67j98k98l8J12P8L06j66j51K18n21
$$ -269 61 367 -121 198 -219 283 163 53 308 -198 369 171 -127 -165 -53 25 331 165 14 232 -289
4327b89Q53r36L99J82o8Mn21O51j24q6p2r6l0K45p0%j7l02M82n81N50l56J4M59
$$ -289 564 -372 27 209 141 145 -376 275 151 65 -7 -103 -133 112 42 42 25 -277 205 -376 174 -182 -168 291
4351B91k53k6m70N04n7L86n55J07p8pK01j37L97n05L77l4j40R2j32K93Pk64j86
$$ 291 38 12 -458 46 -11 375 -180 -73 -151 -158 43 -94 303 -202 175 141 1 93 -39 254 261 -3 -189
4374a89M61l94J74j7k69J78k48L82m99L86K24l38M42k94O2r4Ol8o8J44L6J2j22
$$ -189 272 -122 52 35 -234 -56 -304 78 -421 -35 189 -149 293 -1 61 -33 -27 -65 -133 11 47 59 -63
4397f3J86j95L18l35J04j36p2J38j01L35k36j0o1J54k9p9m0L22K19m09J28k91
$$ -63 123 -72 246 -89 15 -121 -193 -55 -156 179 -57 -67 -128 26 -3 -82 -122 200 419 10 138 -153
4419a53K48J06l85L55o4p6j08M0M4K4J27j41J72k92P7l33O33n78L58m2n4J85m79
$$ -153 95 201 -184 171 107 31 -77 -37 7 31 158 17 189 -103 -26 -359 274 -304 54 12 -42 143 -336
4442c36M30k35M70k32N3l48K09K48k05m6q9M13j85o8n0R9m5k15J17j01R5j8K31
$$ -336 94 -141 329 97 150 -198 11 259 54 8 -81 332 147 79 29 128 83 -132 -15 -116 -21 -39 192
4465A92k21r5Q4j07M61k36m7p2J66j18j01J47o1p6O3Q5m13N19j50O5n5j87L49
$$ 192 -29 -124 -40 -147 314 78 31 -41 125 7 -94 53 -8 -84 -21 64 -349 170 20 85 30 -157 192
4488A92l57K90l75K40K47l61M3K1j9L5K58l56J55j96K95O4l01K09l76M58k85L1
$$ 192 -165 125 -250 -10 237 -124 -81 -60 -79 -44 214 -142 13 -183 112 176 -125 84 -292 166 -119 -88
4510h8k0q3J16j16L2P4K39k40K19j28p5J12l54L67j13K85j8m54L47k16J45l6J93
$$ -88 -108 -191 -75 -191 -159 -85 154 -86 133 5 -70 42 -312 55 -58 227 209 -245 102 -114 31 -5 188
4533A88l59K95j68L94o81N46k85m2M42l75J61j98K11r2j06K91j40Jj1j20J11j44
$$ 188 -171 124 -44 350 -331 215 -70 -112 330 -45 116 -82 129 37 -69 222 82 83 72 -48 63 -81
4555h1J57j39l18J67M24k35N6l01K0N09l91K15r4J19pn0J58l9j55N6o1k32L89
$$ -81 76 -63 -381 -214 210 -25 31 -270 -250 259 -132 83 -11 108 101 51 209 170 15 71 10 -222 167
4578A67k02J02K02l74L0%K07j07N5n8j37J6K29k43Q0J69m12M40n98M62P7k70K86
$$ 167 -35 67 269 -105 -75 -75 132 25 80 22 -115 -99 130 -113 -33 136 -276 164 -434 28 105 -165 121
4601A21k74J87o0j36J82J70p5k76J12K67m35K1M60m22L02j72l5K73l07K78O3j85
$$ 121 -153 34 -26 -162 20 190 115 -161 -49 218 -217 -196 264 -158 144 -28 -63 210 -97 181 244 59
4623E9J65k45J88j51j63k6L5K01K27n93M89l18K15J7l86M53l45L03k13j70J80
$$ 59 224 -21 167 16 -147 -173 -138 63 290 -303 186 -132 83 100 -286 167 -178 125 -88 -258 -78
4644g8J41k31L17k97J85K3k96K35k76N73j30n31L65l65M76po9k9k05K05k40m8
$$ -78 63 -168 149 -148 37 60 -236 -1 -277 296 166 -365 0 -365 111 104 35 6 -199 6 -234 -282
4666b82K99J27k02K95k98l5K57k89J52j92M1q8p8O08l69L16l07j75J52L09k08
$$ -282 17 144 -58 237 -61 -96 161 -128 24 -168 -127 -215 -293 315 -54 262 -45 -220 -68 241 33
4687C3K67o11L71Q7j91J43m00L14n9j89J35Q9L8j12O3J31l2m29O09m50L80j27
$$ 33 300 -311 60 147 -44 99 -301 13 -46 -235 -100 -11 27 -85 -22 109 77 -352 257 -193 187 60
4709F0k91M58k49J46j71j31K06Q8j43J44q2J00j80m3K92k61R4J97l62M06l78K20
$$ 60 -231 227 -22 124 -47 -178 28 116 -27 117 35 135 -45 -88 204 -57 37 234 -128 278 -100 120
4731A20k45J07J73l48L76k15r1J24K81m38L53j78J02J9l15K04l10M28j21m1J65
$$ 120 -125 -18 155 -193 183 -32 -123 1 282 -156 197 19 121 140 -175 29 -281 147 26 -15 150
4752A50k72k4K50j2k03J10j37L21j24j71j9nK20l70J00L48l28K14j03R3%p1Q3
$$ 150 -122 -146 104 92 -111 -1 -138 183 59 -112 -131 -136 84 -286 -186 162 -166 48 -55 38 38 -33 50
4775E0J21k94L20k90K14rj63J51n18M57p6J35k36M0K83kl38J4K81J2J35k01J5
$$ 50 171 -123 197 -93 121 112 -51 100 -418 39 -37 98 -138 -98 185 183 -155 -141 140 152 287 86 101
4798A01J07l19K00l96K77K7QK50k46o1J54p7P5K38p81M51M6lL4k32P3j5K00k78
$$ 101 208 -111 89 -307 -30 -3 5 255 9 -52 102 25 100 338 -443 8 54 51 85 -147 -74 -89 111 -167
4822a67l3J75j04J33R8p0r7J13o8l0j66M29k30k02M22k15J90l76R0J02p5K0R5
$$ -167 -200 -25 -129 4 102 32 -65 48 -20 -50 -216 213 -17 -219 203 -12 178 -198 -108 -6 -81 -61 34
4845C4l22N8J58MM1N2m8N4k7q2k1K92j09O5j30o6Q0q8O0l32M44k07M74l85o9O
$$ 34 -288 -230 -72 -68 -27 25 -23 31 4 -78 -99 193 84 149 19 -47 33 -55 5 -327 117 -90 384 -1 -70 -64
4871f4r0L39j39N6l90M21k01qM9j9O8M9L2k05J96k72L07j39j0KJ38J2j0j05J09
$$ -64 -154 185 46 102 -288 133 -68 -76 -27 -46 22 71 103 -102 94 -178 129 -10 -20 -18 120 132 122 17 126
4896A26p3J34l01J87k22K96l69M11R2l59K00k79M42j53j17K40k87J55Nl36K01
$$ 126 53 187 -114 73 -149 147 -222 189 281 -78 122 -157 285 132 15 255 -32 123 128 -208 -7
4917gn3O9L27l05K54k95j86K11j56K33j44Q6j99K62qJ0n8j0J80k92M43n27M56
$$ -7 -60 9 336 31 285 -10 -196 15 -141 92 -52 34 -165 97 89 99 41 31 211 -81 362 -165 291
4940B91k57j26M15l75m7R3K97k09k25K02l3k08jJ86j77K81r5Q1j52r0P4J02j6
$$ 291 34 -92 323 -52 -99 -6 291 82 -143 59 26 -182 -183 3 -174 107 12 93 -59 -149 -75 27 11
4963A1j5J20Rl41K70r0%j3%j38K94k71J46m5r4K67k64M36m32L64k89R2r8K18k6
$$ 11 -4 116 125 -216 54 -36 -36 -49 -49 -187 107 -164 -18 -63 -157 110 -154 282 -150 214 -75 17 -81 137 111
4988A11Q0R9m54J00j2l1J21L2K38k75j45PL24o8q9l9J50J6P3r1k75K44j14J1l8
$$ 111 191 290 -164 -64 -76 -107 14 46 284 9 -136 -129 195 127 38 -1 149 165 238 147 -128 116 2 13 -25
5013b5l90L72r5J86k48M81j31%k24K66k05%J05k56J07J56n4j78J64J82k50N3j81
$$ -25 -415 -43 -138 48 -200 281 150 150 -74 192 -13 -13 92 -164 -57 99 45 -133 31 213 -37 16 -165
5036a65R0j7l00K74j29K05J00Q7m01N66n15K44O1k08L43l49K15r4m9J29J5qk76
$$ -165 -75 -92 -392 -118 -247 -42 58 145 -256 310 -205 39 100 -108 235 -114 101 7 -42 87 102 94 -182
5059a82R2K91p2j75J23l61K63j2J3M09l95N2k5N7r4m0j16K42K7n5J7k83K98k28
$$ -182 -90 201 129 -46 77 -284 -21 -33 -20 389 -6 46 21 78 -16 -56 -172 70 97 42 59 -224 74 -154
5083a54M17l20J34L23o13M02k43K67k22Jj30K30k1r6j67k6L12k08L6J42j50J4
$$ -154 263 -57 77 400 -213 189 -54 213 -9 -8 -138 92 71 -25 -192 -218 94 -114 -78 64 -86 -72
5105g2j71K05oJ25R8l03N3o4r7K20Mk94K74PJ14j58R1J62m40N19p06M50l38J66
$$ -72 -243 -38 -44 81 179 -124 -71 -135 -232 -12 -8 -302 -28 -21 93 -65 26 188 -252 267 -439 11 -327 -161
5129a61J66J32l27J88j23J19P0o6N4k46O6J22Q3Q7m50L18J63m15K53m1N6l02J85
$$ -161 5 137 -190 -2 -125 -6 64 -2 52 -194 -128 -6 77 164 -286 32 195 -220 33 -8 48 -254 -69
5152f9J05Q6l96K17k1J02J36j42J86k48J52J12l28NN4L2p6l6K42K3k78K76m60
$$ -69 36 122 -274 -57 -78 24 160 18 204 -44 108 220 -108 -103 -49 -17 -93 -129 113 136 -142 134 -326
5175c26K00M29o73N12k43J20J46k47J31J03l38P6K08j26J58j25N8j82K95k12j22
$$ -326 -126 303 -370 142 -101 19 165 -82 49 152 -186 -110 98 -28 130 5 63 -119 176 -36 -158
5196a58L19j98J26j33n6J75k86K79q4J07j97K89l02R5j03R0J9j67L61j79J02Q2
$$ -158 161 -37 89 -44 -100 75 -211 68 -16 91 -106 183 -119 -24 -127 -37 -18 -185 176 -3 99 181
5218A81k11K50m40K27R3L5k22K41n17R0K48j60L18m28N63l35M6K20j98J31K7k33
$$ 181 -30 220 -220 7 100 135 -87 154 -363 -273 -25 -185 133 -295 268 -67 -21 199 1 132 159 -74
5240g4K75J6l92L38k06R8o8O7l7l14M54l16M3K86k39J38r5j84L07j63k15K12j14
$$ -74 201 217 -175 163 -43 55 -13 54 17 -297 157 -159 -116 170 -69 69 -26 -210 97 -66 -281 -69 -183
5263a83J70j17J24%j91R5p7L06%j54K66l99P1R7L9l18M66j75K36k49p8l0J63K9
$$ -183 -13 -130 -6 -6 -197 -102 -179 127 127 -27 239 -160 -89 8 47 -271 195 20 256 7 -71 -101 62 91
5287I1j39Q3j8jJ00k69M4L58j67oJ38n38K92P8R2P5m00J52M2K48k88JJ37p5P7
$$ 91 -48 35 17 16 116 -153 -109 249 82 76 214 -324 -32 46 138 213 -187 -35 7 255 -33 -32 105 30 107
5312A07N4j37k35M63k75O7J24k47K68l62J16k11K50K3J26j23j20L75j17j06l7
$$ 107 161 24 -211 252 -23 44 168 -79 189 -173 -57 -268 -18 5 131 8 -112 263 146 40 3
5333CJ81k41J23J72r1n9L0j14j02P8O3k2j9m6q5K5K86m00L84m07J71L20m18N96
$$ 3 184 -57 66 238 147 88 118 4 -98 -20 43 21 2 -44 -129 -104 182 -218 166 -241 -70 250 -168 428
5357D28o02J75Q4j08j43j1K17J78k60k5J08k60M42m18J58J54j27K72k01J61k21
$$ 428 -174 1 85 -23 -166 -177 40 218 -42 -67 41 -219 223 -195 -37 117 -10 262 61 222 1
5378AJ90l44qO2k0J19Q2J14n13L66l9J18J96m89L08l1L8r0K5K6n1j30J12j32j75
$$ 1 191 -153 -161 -99 -119 0 82 196 -317 49 10 128 324 -165 143 112 150 60 85 111 60 -70 42 -90 -265
5403b65M31j44J96k44j34K98l77M08n02K52P1J06j23Q6kj48j8r2L82l81J74n8
$$ -265 166 22 218 -26 -160 138 -239 169 -333 -81 -10 96 -27 59 57 -91 -109 -201 181 -200 -26 -84
5425h4Q8J71j99N3P7pp1j3K88m41J44J28n4j15J51n16L58j67L12j69K2M08o10
$$ -84 4 175 -24 29 106 99 28 15 303 -138 6 134 80 -35 116 -400 -42 -209 103 -66 -44 364 -246
5448b46O0J87j93L81j33J5k75n0J93Rk61N97n30J62K89l62L21j65k2oj93J30l9
$$ -246 -186 1 -192 189 56 71 -204 -254 -61 -52 -313 284 -246 -84 205 -157 164 -1 -23 -29 -222 -92 -131
5471a31M01k86j44P8J79j26J11m5q6L3r7L38m04L03k15K8j79K93j06KK83k92O1
$$ -131 270 -16 -160 -82 97 -29 82 37 -49 -16 -113 225 -179 124 -91 -63 -242 51 -55 -53 230 -62 -1
5494ao9L51j31k02k78J82L09j56l9k10K83Q8k1j39m1k56M94m6q9J38j29Q5J9j60
$$ -1 -70 281 150 -52 -330 -148 161 5 -34 -244 39 127 106 -33 -74 -330 164 118 29 167 38 123 142 -18
5518a8J18j92K33q6k19L67n22N58k37K30k68R9k53K54p2m5K33l72K31N3J81m49
$$ -18 100 -92 141 55 -164 203 -319 239 2 232 -36 63 -190 64 -8 -53 180 -192 39 92 273 -176
5540a76J25Pj59M61m59R8K59j71mJ35p1R7j36j28K86k92N7k19L42J83l14M6lj59
$$ -176 -51 -44 -203 258 -201 -103 156 -15 -19 116 45 142 6 -122 164 -128 -71 -290 52 235 -79 -33 -36 -195
5564a95L4L40l53K48j07K1P4k73J77o0O8m8J47L4k97J23J6O5J10j76k41K92j19
$$ -195 -161 179 -174 74 -33 -12 62 -211 -34 -94 -26 -74 73 107 -190 -67 -51 14 124 -52 -293 -1 -120
5587a20j7K56l8m1l5K33l65q3L37k56K77l54L48O5l73L39j62k09L9L02j79l6J6
$$ -120 -137 119 81 40 5 238 -127 -210 127 -129 148 -206 142 207 -166 173 11 -198 -159 143 -36 -72 -56
5610e6O1j47J29J50k65K61k66N5O0o2l0K32l43M00j06j15m0n9K27k32K56k31p4
$$ -56 5 -142 -13 137 -128 133 -133 -78 -18 -80 -110 122 -221 179 73 -42 -82 -141 86 -146 110 -121 -195
5633a95K87k20P2J87k05j15L07p3J06k63j7L71m85J53m6Q0Q7l2Q2j09Q8j60K80
$$ -195 92 -128 -56 131 -74 -189 118 45 151 -112 -129 242 -243 -90 -136 -56 31 -1 81 -28 60 -100 180
5656A80k65j36J42K32l01J04J83j95J91j43o3J38k14J63k49J98J5m8J2K78l23
$$ 180 -85 -221 -79 153 -148 -44 139 -56 135 -8 -71 67 -147 16 -233 -35 -20 -68 -56 222 -101
5677a01M9O7k15M60m18J81j58m1J57J10l8m1J17j58J05j19J73j27l0j21O9K92
$$ -101 -52 15 -200 260 -158 23 -135 -176 -19 91 53 12 129 -29 76 -43 130 3 -27 -148 -79 213
5699B13n14M15RJj39n4P1Q8J35l21K22l5l16J67O9K68l70K47m32M95k82J05P4
$$ 213 -301 114 123 124 -15 -69 2 90 225 -96 126 91 -225 -58 11 279 -91 156 -276 219 -63 42 116
5722A16j87L15m42L51o1r8Q2j46j98J09J10n1J56j3J72m34L41L8j98PJ74j29l9
$$ 116 -71 244 -198 153 92 -6 76 -70 -268 -159 -49 -100 56 43 215 -219 122 160 -38 -31 143 14 -25
5745b5R2nk24J00N6L18l40J44l93O45k16l5J33k72j18K23R6j59K2o8K44k08j80
$$ -25 67 62 -162 -62 -6 312 -28 116 -277 368 152 117 250 -22 -140 83 179 20 42 -26 218 10 -170
5768a70J54l21M55p3M8k6l3r6n3L01m37K80K7j8o8L89k09p3q3j00J64m3O1j76
$$ -170 -16 -337 118 45 93 67 34 -62 -115 186 -251 29 56 38 -30 359 150 77 -6 -106 58 15 76 -100
5792a00P6L17m97R1J45o2K59k04k85J32J96k50K57j27J81l68J08O4j62K83n7k6
$$ -100 -24 293 -204 -113 32 -30 229 25 -260 -128 68 -182 75 -52 129 -239 -131 -67 -229 54 -3 -29
5814b9M8J06j12lP3j8j53J70r2P4J55r3q5k06K80K52n13J5J37o0J30k30K45n3
$$ -29 19 125 13 10 83 65 -88 82 -10 64 219 126 41 -165 115 367 -146 -131 6 -54 76 -154 91 38
5838C8k3K2p4n9M78n85J21J6j81K70j51J17P3j04q5J57q9J96k0j02K02l90J41
$$ 38 15 37 -37 -96 382 -203 -82 -66 -247 23 -128 -11 62 -42 -127 30 -59 137 117 15 217 -173 -32
5861c2p1K55j43Mj0q5J09j21J74r4J26k06J51j57R7K54k89K00l42J99j0k77M30
$$ -32 -103 152 9 13 3 -82 27 -94 80 -14 112 -94 57 -100 -3 251 -38 162 -180 19 9 -268 162
5884A62j76L36k0l94P7j26J27K00j22l28L00K40J43n89L70k2l5J56n33L93k1k8
$$ 162 -14 322 302 -92 -15 -141 -14 186 64 -264 36 276 419 -170 200 178 143 299 -234 159 138 110
5906A10j59m4J28P4k30K06J59n03N45k12l2j11K06r4k73K14j09J26j99L32k30
$$ 110 -49 -93 35 109 -121 85 244 -259 286 74 42 -69 137 43 -230 -16 -125 1 -198 134 -96
5927i6OJ52K2k7k77M13j11L1J15l88L37l89L04o4J49o5j16j17K32M8k06K47j86
$$ -96 -90 62 84 57 -220 193 82 113 228 -160 177 -212 92 28 177 112 -4 -121 111 159 -47 200 14
5950A4j27n9N40k27k60M00m11k6N6j21J09K66k42K67K1k40L9j15KJ26qJ76q7J12
$$ 14 -113 -172 368 141 -119 281 -130 -156 -100 -221 -112 154 -88 179 200 -40 -1 -116 -114 12 4 180 93 205
5974B05l23R8O6j55K41N5k03k63L83j74K86n1q5J10j76ok09L68m64K87k0K53j05
$$ 205 -118 -20 46 -109 132 187 -16 -279 104 -70 216 165 80 190 14 8 -201 167 -297 -10 -30 223 118
5997A18k38K6J94j71n5L28n48N34j01q6ol4K9m1N5n2j26L9R8K85m47J61K7K50
$$ 118 -120 -94 100 -71 -126 202 -346 188 87 1 -5 -39 -10 -51 4 -48 -174 -135 -37 248 -199 -38 -11 239
6021B39l53O0j23L25l10J77P9jk37J86p7n9J35p8J09k56K48j74J3K10k56Q1K10
$$ 239 -114 -54 -177 148 -162 15 94 93 -144 42 -35 -94 41 -37 72 -184 64 -110 -97 113 -143 -62 148
6044A48k62K11j51Q9q9o6J42l4O2k9l03J96L25l99J17o5J85j33p5L97m40M88l60
$$ 148 -114 97 -54 35 -54 -120 22 -12 50 21 -282 -86 239 -160 -43 -108 77 -56 -131 266 -174 314 -46
6067d6N0q9R7k1J02j27K4j37J38N8k92J15M9L5L30m21O7J05m5j43P1L1j02j6n7
$$ -46 4 -85 12 -9 93 -34 -10 -147 -9 49 -243 -128 -79 -44 286 -135 -68 37 -8 -151 -80 -49 -151 -167 -224
6092b24L32k76K96n12J44M66k88J33k64K52j04k2L36l66q9K52l69J01K04p7K72
$$ -224 108 -168 128 -384 -240 226 -62 71 -193 59 -45 -67 269 -97 -186 66 -303 -202 2 -75 197
6113A97r9J69j79k59M93n08L11j1J8q2j40o6L36l16Q3K01m57L95j9J5K01k67m6
$$ 197 98 267 88 -171 322 -186 125 114 132 50 -90 -156 180 -136 -53 148 -309 86 67 82 283 16 -30
6136c0k74M34q5k97M32k55J04p1P9R7Oj30P6j78K1L57o38K72K18k43j04J26N6
$$ -30 -304 130 45 -252 180 -75 29 -42 37 134 140 10 86 -92 -71 286 -352 -80 138 -105 -209 -83 -27
6159b7J57O8j13k47P7M6r0M11l90PK62j83K7k14O22m63j73K26j66J60L6k7O2J86
$$ -27 130 198 85 -162 -85 -39 -129 282 -108 -101 161 -22 5 -209 413 -50 -223 3 -163 -3 33 6 68 254
6183B54k47j2j05oK95j44O6m34K97R6oJ46k61L00k09K02j89r8k42L99k23j14P7
$$ 254 7 -5 -110 -116 179 35 101 -333 -36 60 54 200 -61 239 30 232 43 -55 -297 102 -121 -235 -158
6206a58qL56j93j09P9r6J73m3j21J35q8J49J37j91J69Mk34O2k56L48j99R8o3k02
$$ -158 -166 190 -3 -112 -33 -129 44 1 -120 15 -73 76 213 22 191 195 -39 23 -233 115 -84 14 -49 -251
6230b51O2J64O3k01K79k13K06k45K79k82J26K57m23L94n05J21J08Q9J56k97L52
$$ -251 -189 -25 38 -163 116 -97 109 -136 143 -139 -13 244 -179 215 -290 -169 -61 28 184 -113 239
6251B39l03j58K16J45l45L11r6K0N0k50L52l75K6j8n9M09r2j64J31k6j02K55l22
$$ 239 -64 -222 -6 139 -206 105 9 29 79 -171 181 -194 -168 -186 -245 164 72 -92 39 13 -89 166 -156
6274a56K02k67J44pJ25K38l75K20k15J96k12J13L2j4P5q9K4J06j42p9n6K87k16
$$ -156 46 -221 -77 -84 41 279 -96 124 -91 105 -107 6 38 24 99 10 34 140 -2 -81 -137 150 -66
6297f6m6J18J40k32K12l20L15j95j58N42n51M64m33K6K73j29J14j1Q1m39J39J69
$$ -66 -112 6 146 -86 126 -194 121 -74 -232 310 -241 223 -210 -184 89 -40 74 63 144 -295 -156 13
6319A3K11k06n0J2R5j36l5J35Oo1j06K64k88J74J47l28L24j97R3rr7P7j65N6q7
$$ 13 224 18 -32 -20 75 -61 -96 39 45 -16 -122 142 -146 28 175 -153 171 -26 67 58 -39 38 -127 -71 -158
6344a58K73k73K64k8k42L09l43J20RJ39k59K14j39K99n3j17p0l7K84k96m0k0P8
$$ -158 115 -158 106 78 -164 145 -198 -78 -69 70 -189 25 -114 185 132 15 -55 -92 192 -104 -144 -164 -86
6367h6O4l1J93O7r6p2J35Pk18m2L40q8l22L37k95J74k55j55K71n3L59l70k4Q0
$$ -86 -22 -53 140 207 111 39 174 181 -37 -79 261 173 -149 188 -107 67 -188 -343 -72 -125 234 -136 -160 -80
6391h0k37J69K27m6q0Kk9K13l28J35J48l17M01j66k8k6J82o1o9m7R4p5k6P6j09
$$ -80 -317 -148 79 33 -47 -45 -74 139 -189 -54 94 -223 178 12 -16 -42 140 79 10 -37 57 -18 -44 32 -77
6416g7N7j05J77k48K71O2j49Q9j60J29o2N3J07k06J96J07j00j1L2P3l07L48k68
$$ -77 -20 -125 52 -196 75 137 -12 77 -83 46 -16 37 144 -62 134 241 141 130 162 235 -72 276 8
6439HR9j11K76j97L7Pj0O6r5K0mR3k93J44j53K02l2j95K50m06K20J26Rl60J4J63
$$ 8 107 -4 272 75 112 119 109 175 80 100 96 189 -104 40 -113 89 57 -138 112 -294 -74 52 61 -299 -285 -122
6465a22j8R3r8J13l1P7K5j43R0k0P3k66J97J26K06k04j94J85n0j03Q3M6j40J9
$$ -122 -140 -47 -145 -32 -63 14 39 -104 -14 -34 39 -227 -30 96 302 98 -96 89 39 -64 19 65 -75 -56
6489e6P7J8n4Kj00j00K73rk33J94J08R3k76L12k29n4J7Qj41Q3K31k12L28l47L40
$$ -56 21 39 -15 -13 -113 -213 60 51 -182 12 120 213 -63 249 20 -34 -17 -9 -150 -67 164 -48 280 -67 273
6514B73l17J97j33j54L68m30L60k41J11k7pp5J36r2kJ58l17J61J37j09K18k57
$$ 273 -44 153 20 -134 234 -196 164 -77 34 7 0 -75 61 -31 -33 125 -192 -31 106 -3 215 -42
6536d2J48m13O12l59K22k57J53L9jj11k8J94m15K50j35K91j04k05K11j64K39k1
$$ -42 106 -307 305 -54 168 -89 64 103 102 -9 -37 157 -258 -8 -143 148 44 -161 50 -114 125 104
6558A04R9j8j46k49K59j73L15k45k53M35k61L00k58J24N8m2J5m37L43k26M36l44
$$ 104 203 185 39 -210 49 -124 191 -54 -307 128 -133 167 -91 33 91 49 64 -373 -30 -256 180 -164
6580a64K00K06o10N91p5L42n46J96J7m04M02k36O1j23M4M8J83k03J01j01K5K0
$$ -164 36 242 -368 223 148 490 -56 140 157 -247 155 -81 -20 -143 -99 -51 132 -71 30 -71 -46 -26
6602b6k86L08OOMM6J34j45J8Ol10J27K55j81l1M7j53L38k10J96o2p6n5O3J98k72
$$ -26 -312 -4 2 8 12 58 192 47 65 71 -239 -112 143 -38 -69 -22 -175 163 -47 149 87 11 -44 19 217 -55
6628e5M9j33K3J27J79k64L77m75L39m1l87N32l10R8r4jpJ54k15o6K43k43K06L0
$$ -55 -6 -139 -116 11 190 -74 303 -172 167 126 -261 271 -39 59 -35 -36 -43 111 -104 -170 73 -170 36 66
6652F6j87N43p70O73n21L57j22r4K34k44L04m61L34k40J10j35K02k82K23q9N9
$$ 66 -121 422 -348 325 -196 161 39 -55 179 -65 239 -222 112 -128 -18 -153 49 -233 -10 -99 -40
6673d0K52m57N11k37Q1Mj56L14l92K4Q5K16l86M5qJ06K04m69M20j42M2k6o8L42
$$ -40 212 -245 266 29 110 114 -42 272 -120 -96 -11 205 -181 -136 -144 -38 166 -303 117 -25 17 -9 -77 265
6697B65k90n4Q2p7M0Q3k22L00k84J83m4P6N2k20J99k05J84p1J43j19l0p3K00k34
$$ 265 -25 -79 3 -74 -34 49 -173 127 -157 26 -18 58 110 -110 89 -116 68 -3 140 21 -9 -82 118 -116
6721a16L0J02j80K34J17j31J37l11K24j42j63L36k38J51j42M0O8J34k10K44l91
$$ -116 -86 16 -164 70 187 56 193 -118 106 -36 -199 137 -101 50 -92 -52 16 150 -60 184 -207
6742b07J82JQ8N2j71N9J4j28J83j07K93l69K35l33L45j33j45mP2L49l01R8r1P2
$$ -207 -25 -24 64 116 -55 4 18 -110 73 -34 259 -110 125 -208 137 4 -141 -145 -73 276 -25 73 -18 54
6766E4j60q1j8K23O8j91Q1J31r8k7M1L5k32J94k03J25M6Q7j83p0K26j98L02j38
$$ 54 -106 -187 -205 18 86 -105 -24 107 9 -18 23 58 -174 20 -183 -58 -12 75 -108 -178 48 -150 152 14
6790A4J78k62j41L27k93K54j96L39k86J83j98K31J16l77M7J19j06J77k44K86M1
$$ 14 192 -70 -211 116 -177 77 -119 220 -66 117 -81 150 266 -111 -64 55 -51 126 -118 168 209
6811B09k49J42J2o0r7j75J92J65k79L51k88K7K74j65l20K96j74K49j78j8J13k16
$$ 209 -40 102 114 54 -43 -218 -26 139 -140 211 -77 -50 224 59 -261 35 -139 110 -68 -86 27 -189
6833a89L37p4o8J9Q6J38l75J71j35M2J23O8j88K08k42LK10P4j94m20N94k93K19
$$ -189 148 74 6 25 111 249 -126 45 -90 -48 75 143 -45 163 -79 -76 134 208 14 -406 188 -105 114
6856A14O9k60K3o0K41l83K83j73O7J0K94k96K7J57l58L93j64R0K15m81K26j95
$$ 114 183 -77 -54 -114 127 -256 27 -146 -79 -69 225 -71 -44 113 -245 148 -16 74 289 -192 34 -161
6878a61L30k72J8J26j33QJ68j02J22o8%J5l5K40k43l39J80M8L20k51MJ82j43J9
$$ -161 169 -103 -85 41 -92 -84 84 -18 104 36 36 51 16 256 13 -326 -146 -98 222 -29 -25 157 14 33
6902C3P6j1k05R0P3L12m86K92j24j42J28J3j16j6M6m1j03Q1l2J58J30k47k16L25
$$ 33 109 98 -107 -17 56 368 -118 174 50 -92 36 49 -67 -83 -37 -78 -181 -100 -132 26 156 -91 -307 18
6926A8j09L10m37K09K30k64K89l38l2J21j44k0J12m6J46k01J45K37l73K58n2Q
$$ 18 -91 219 -218 -9 221 -43 246 -92 -124 -3 -147 -167 -55 -101 45 -156 -11 226 -147 111 59 67
6948F7O3l80L06j50K5N4M51m81j01P9p9J38j80L94m52K69j02L5o2j14K62k44K43
$$ 67 130 -250 56 -94 -69 -15 436 -45 -146 -67 -146 -8 -188 206 -246 23 -79 -44 -106 -220 42 -202 41
6971D1Nj81J72r6L04q6J3m32J10r1K79l10J19J50r8J87m3QpK6J8j85O0r1P8J32
$$ 41 46 -135 37 -59 245 159 172 -260 -150 -241 38 -272 -153 -3 -101 86 43 51 44 70 88 -97 -37 -128 -50 82
6997H2J13m36P4J71P2K01q7k26q4L88k82j02K44m4Q8j68J65j97J39k47J42K35
$$ 82 195 -241 -167 4 76 277 190 -36 -120 268 -14 -116 128 84 172 4 169 -28 111 -136 6 241
7019B41l48L21l31o2J84n6L11k57k8O7k63J01K65l43L76k50J10P2j76j08J68K7
$$ 241 -107 214 -117 -179 5 -51 260 3 -25 42 -221 -120 145 -198 178 -72 38 110 -66 -174 -6 21
7041B1j73J25O9r1J29q7N0L2K52m46J50j44P8l4q3L02j43Q7K2q9K05k04m5l7o2
$$ 21 -152 -27 42 -49 80 -7 43 75 327 -119 31 -113 -35 -69 -152 150 7 94 116 27 232 28 -17 -54 -116
7066a16K43n9MK86l69N0j09j61J52j56J72O2p4L41k62o1K52j23j45L42m34O2q7
$$ -116 127 68 72 358 -11 39 -70 -231 -79 -235 -63 -1 -75 266 4 -57 195 72 -73 269 -165 -103 -190
7089a90L05J45j84O9j15J39m7l07J40QP1P4k32J79N7r9J63j91L7j03J4P0j11J47
$$ -190 115 260 76 145 30 169 122 -185 -45 -37 34 108 -124 55 112 13 176 -15 22 -81 -67 3 -108 39
7113C9q2J42j19n1K04m46L54p2K26l43L19j30N8K15l00K14m47K00j33J25K7l7
$$ 39 -43 99 -20 -71 133 -313 41 -31 195 -148 171 41 99 314 14 228 -219 -19 -152 -27 0 -37
7135c7j7p0P8LJ03j74L48j43j10k32K82J13m79L39k14M18k16J10R7j25j19l6K1
$$ -37 -54 -124 -46 -43 60 -114 234 91 -19 -251 31 144 -335 4 -210 208 -8 102 199 74 -45 -81 -60
7158f0R3N4j26K5L55l46J03J12l48N7J00m2K16j04j05J58k37J39k15L98l26l4
$$ -60 33 87 -39 -14 341 -5 98 210 -138 -81 19 -23 193 89 -16 142 -95 44 -171 227 -99 -133
7180a33M40n39M72k83P4N2N3j82J99j01m7k96M6K69m7O2k01K26PMk55K17J50j62
$$ -133 307 -232 240 -43 31 83 136 -46 153 52 5 -291 -245 24 -23 39 -162 64 71 75 -180 37 187 25
7204B5j28L3j0L34k97J38o4J40j65j92J20o8K02k30J40J8r5J00M9j71p4K26j57
$$ 25 -103 -70 -80 254 -43 95 31 171 6 -186 -66 -134 68 -162 -22 -4 -99 1 50 -121 -195 31 -126
7227a26R2j08K44O9j46P0k08M13l34J74ok40J93o7j3j64J21k2J82j55K48k75M7
$$ -126 -34 -142 102 171 25 95 -113 300 -34 140 134 -106 87 20 7 -157 -36 -58 124 -31 217 -58 -11
7250a1J5Q6o9j70m7M22J6k47k25L40J4J04j46R5j50pQ0n5q4k94L08rK98j75k7
$$ -11 4 90 21 -149 -196 226 242 -5 -230 110 124 228 82 177 27 20 100 45 -39 -333 -25 -34 264 89 62
7275F2m5j6j24J53m0K38n1k39J67k52%J34L4Jj19N6p2J30j26J32N2k17J24P5l28
$$ 62 17 1 -123 30 -10 228 177 -62 105 -147 -147 -13 21 22 -97 -41 -113 17 -109 23 75 -142 -18 57 -271
7300b71L57Q0l95J02K83l09J00j8j2J83q7K11k74q9K00j24J4P5J9m07L86k34r6
$$ -271 86 166 -229 -127 156 -153 -53 -71 -83 100 13 224 -50 -139 61 -63 -49 26 45 -362 24 -210 -306
7323c06L37J07k2j95J85j26J03l50M38j76J78l64K53m5J02k14l9J78J17j60j18
$$ -306 31 138 116 -79 106 -20 83 -267 171 -5 173 -191 62 17 119 -95 -134 44 161 1 -117
7344a17J14q4J70j07j08J58j26J31l39M87j48j6j90K60j56n3J79j31j4j19J58
$$ -117 -3 -87 83 -24 -132 26 -100 31 -308 179 31 15 -175 85 -71 -124 55 -76 -90 -209 -51
7365e1L5L1j64M9Q9J18o0Q2j27q0O7j5q3L08k99Q7qm6J17L6l5j56L9J92j22k7
$$ -51 -16 15 -149 -100 -11 107 47 129 2 -78 -11 -26 -109 199 -100 -13 -21 -67 50 86 51 -105 -66 126 4 -23
7391b3Q4j65J51k02O5R9j29J26Rmjm5Q3l7%l3J29j20m2l18L47N4k67M79k56M3
$$ -23 61 -104 47 -155 -90 9 -120 6 15 11 10 -35 48 11 11 -22 107 -13 -55 -373 -26 28 -239 240 -16 27
7417B7r3l4J55n3j91LJ70o2J91r0p8J49o2K8j07J3j41K42p7np3r3L73m50M46j19
$$ 27 -66 -100 55 2 -189 -186 -16 -78 113 23 -55 94 32 60 -47 -34 -175 67 -10 -15 -88 -181 192 -258 188 69
7443F9k13J67R1j14j45J90k6J20l63L08j56J67j35n9rJ15k03n3J88L7K38k57j02
$$ 69 -144 23 114 0 -145 45 19 139 -224 84 -72 95 -40 -99 -108 7 -196 -249 -61 -24 214 -43 -145
7466a45J88j68J05Rj4P7j27K12l21J34Q8P1l4k27K13l9l32K26n9k40M74k04O2
$$ -145 43 -125 -20 -11 -25 52 -75 137 -184 -50 38 109 75 -152 61 22 -310 -84 -143 -383 91 -113 -51
7489e1J8PJ84q1l3j8n6r8J50M3q0N4l12N35m44K95k12K24q8P9q0%l0M6l1l71K96
$$ -51 -33 -26 158 77 44 26 -30 -128 22 65 -15 39 -273 262 -182 113 -99 125 37 116 36 36 6 52 21 -350 -54
7516e4k11L81j05k0P1l15J44K63l7l07KL07k3k7Q7q1nJ1j08Q7R3k36K23j93Q2
$$ -54 -265 116 11 -9 62 -253 -109 154 117 -190 -188 119 96 69 156 75 70 81 -27 60 153 -83 140 -53 29
7541B9l69N76l44J58k73L38o6j99L5J95J50l26p5J87L7j90K06J0N9j84K59k15
$$ 29 -340 236 -108 50 -223 115 49 -150 -115 80 230 -96 -171 16 53 -137 69 79 138 -46 213 -2
7563bPO8j19R6N7l27K0K09j34O2j02M4L49p7k66j41J89r2L38k33O6J9J2l5R1j74
$$ -2 5 73 -46 50 107 -220 -200 9 -125 -63 -165 -121 228 151 -115 -256 -67 -159 179 -54 12 31 43 8 99 -75
7589g5j22R8M4L3r1J97l88L22o8j0M9Ok42L67r3r2J20j42L59k69R1r8J2l9pj18
$$ -75 -197 -99 -55 -22 -113 84 -304 18 -50 -60 -11 -5 -247 120 27 -65 55 -87 272 3 94 -4 8 -31 -38 -156
7615a56J72J16o0k68L9J00k5K2Qo5J29l7R2P1k93L86k22pj84K07N4m33M39JJ02
$$ -156 16 132 72 -196 -157 -57 -82 -60 -52 -117 12 -25 67 138 -155 231 9 2 -182 25 79 -354 85 86 188
7640A88l37K63k45J74p3Q3l2r9L4k1j56K85j98R9j32J3l5L97j81Q1Q3k32M7p0
$$ 188 -149 114 -131 43 -30 53 21 -78 -44 -65 -221 64 -134 -35 -167 -154 -189 208 27 108 191 -41 6 -64
7664f4L00p1k44O0J29k38n4K38k06K92l28J96p7P0j19J8j12K79J58m97J79q4Q0
$$ -64 236 165 -79 -19 110 -128 -182 56 -150 142 -186 10 -67 3 -116 -98 -210 69 227 -270 -91 -175 -95
7687i5K09o8r0j81K13J03L48m33J56j89j81J42R6j2p5J61l46K91p8n5J07J0J68
$$ -95 114 46 -44 -225 -12 91 439 6 162 -27 -208 -66 30 18 -57 104 -242 49 -29 -84 23 33 201
7710B01j95o7J17r8l7K16l38M09J7k81Q9N3M4m37M44J88n68K31J30j78K5q4N7
$$ 201 6 -61 56 -42 -79 137 -201 208 225 -56 33 86 130 -307 137 325 -243 -12 118 -60 -35 -119 -62
7733f2L83j04k78K22o7o0q7O7k11J81K6l6j34K85j9k99K11m0q2J52j73J44k13
$$ -62 321 217 -61 161 94 34 -53 14 -197 -16 10 -26 -160 125 106 -193 18 -22 -104 48 -125 19 -194
7756a94Q3L79l38K75l72K11N3J1j77K13J94l51Q1r7K23j06p0j47L5J38j43J73
$$ -194 -111 268 -70 205 -167 44 97 108 -69 144 338 -13 68 -29 194 88 18 -129 -94 44 -99 74
7778G4M0j22oJ76M9k55k50N49k72o0K37j68Q8o3j18L05j31J28k28o6o5M76k68
$$ 74 114 -8 -14 162 211 -44 -294 255 -17 -77 160 -8 80 17 -101 204 73 201 -27 -93 -158 318 50
7801E0J30r8Q7P8j33j65o5K21l40N54l60n0p6K32M6j37J89n34N83k50J4k6J22
$$ 50 180 82 169 247 114 -51 -116 105 -235 319 -41 -91 -167 65 111 -26 163 -371 212 -38 -24 -50 72
7824G2k48J31J28j31L0l3Q3J01l4q2N8j95L68l04j0J33j70j20L65j09j70J07k1
$$ 72 -176 -45 83 -48 -18 -51 32 133 99 17 75 -120 248 -56 -66 67 -103 -223 142 33 -137 -30 -51
7847e1J73j11J9j61J34Rm5L1n3J48l5O4j20O4j88R5j44K46j40L23J4m14J39J10
$$ -51 122 11 30 -131 3 12 -33 -2 -55 93 58 122 2 66 -122 -27 -171 75 -65 258 272 -142 -3 107
7871A07N8k30j18L03J2k92L07j67j44K57r8o2m4Q5M5J05j5n5k50K83P3k22R1j70
$$ 107 165 -65 -183 120 132 -160 147 -20 -164 93 -5 -67 -111 -26 19 124 109 54 -196 87 160 -62 29 -141
7895a41K10j49K6N1k29N1Q3JR9Pj90L6J25or2K78m26K79o4L6l8N6o0J44k74K27
$$ -141 69 -80 -54 -3 -232 -181 -98 -97 2 9 -181 -145 -20 -26 -118 160 -266 13 -51 -15 -53 3 -57 87 -187 40
7921D0r9J8K75j1m9k87N7K7pQ2J04j40K3r9J0Ko9J47j03j21K04nq3N4M5j91J14
$$ 40 -59 -41 234 223 174 -113 -56 -29 -36 46 150 10 33 -66 -56 -54 -123 24 -79 -200 4 -1 -84 -30 15 -176 -62
7948f2K74j61j4p7Q5K12k47o3L76j67k26K07m77K61p5l7K89j28R8N2j68p9M48
$$ -62 212 51 37 -40 45 257 10 -53 323 156 -70 137 -340 -79 -154 -191 98 -30 68 120 -48 -127 321
7971C21m19N7j72L66j75P2Qn21M00N5n8J46O8p6M8j83Q7K5j34K16l2k12K84k21
$$ 321 -98 -41 -213 153 -22 50 58 -463 -63 -8 -66 80 148 72 120 -63 24 49 -85 131 99 -113 171 -50
7995e0j3M0l0M16l13l40M77n1j76lN3o0M9K5%j17J70k63J72k41L15N0k29N8K0
$$ -50 -63 -23 -53 363 50 -290 187 136 -40 -43 10 -50 -1 24 24 -93 77 -186 -14 -255 60 110 -119 -61 -41
8020d1m9K03mp7nk35R5J12q1J40r2J10r7J56l7k7J39l55J72j76L18j85L1j4l4
$$ -41 -90 113 109 32 27 -208 -113 -1 -82 58 -34 76 -21 135 98 71 210 -145 27 -149 169 -16 15 1 -33
8045c3p1Q3Pm0j6p0K73o19N08j49L5J79O8j69j97J45L93k50j71j15K29j81K68
$$ -33 -104 -21 -14 -54 -70 -140 133 -486 22 -127 -92 87 155 -14 -211 -66 327 77 -94 -209 20 -161 107
8068A07n3k80K76J11r7p9l07L26k1r6L2L1J38j6L7k35L00p5M5p2o5K11l70M12
$$ 107 54 -226 50 161 64 -15 -322 4 -17 -113 -81 -50 88 72 109 -126 174 99 144 72 7 218 -152 260
8092B60j41r7J19l5j85K04q6o4k0M9j79J83j96K78Rj85Q1k61L6K50r9J74j21R6
$$ 260 119 22 141 106 -79 125 39 -25 -45 4 -175 8 -188 90 99 -86 -5 -266 -230 20 -79 95 -26 70
8116G0k13J54J26K05l50J46j56j58J32P8r6l9M1k1J79j67o8r4J42K4Q4M7k00K80
$$ 70 -143 11 137 342 -8 138 -18 -176 -44 34 -62 -101 -60 -81 98 -69 -137 -231 -89 -65 19 66 -134 146
8140A46k44jM6N9r8J14m7l8p2l1M75n24K99j2P9k54j64J71K7J8J00K6j82O5J16
$$ 146 -98 -99 -53 6 -92 22 -25 -63 -135 -166 309 -215 84 72 151 -103 -267 -96 -69 -51 49 75 -107 -42 74
8165G4lj26K52M1j25j74K14k32K25R2l31L50m75q0N5K20J56j42j17O0R7K7M5j8
$$ 74 71 -55 197 238 113 -61 153 -79 146 238 -93 257 -218 -298 -243 -23 133 -9 -126 -66 31 58 103 85
8189H5k99K26
$$ 85 -214 12
8191A2
$$ Imaginary data points
##PAGE= N=2
##DATA TABLE= (X++(I..I)), XYDATA
0@%%%%%%%Pj5J7k5L8m6N6p5R9j28J60j95K38k92L54m21M99n91O94q11R49j105
$$ 0 0 0 0 0 0 0 0 7 -8 9 -16 22 -24 32 -43 56 -72 88 -107 131 -161 193 -228 271 -320 374 -437 512 -593
29e93J275j463J674j908K168k460K782l136L527l957M427m939N501o115O783p517
$$ -593 682 -781 893 -1015 1153 -1307 1475 -1661 1866 -2091 2336 -2603 2898 -3217 3566 -3951
45c951Q321r196J0150j1192J2331j3582J4960j6475J8150k0014K2093k4426K7069
$$ -3951 4370 -4826 5324 -5868 6463 -7119 7841 -8634 9516 -10498 11595 -12831 14238
58A4238l0089L3574l7650M2493m8355N5623o4909P7251r4569J20959j68057L89951
$$ 14238 -15851 17723 -19927 22566 -25789 29834 -35075 42176 -52393 68566 -99491 290460
70B90460j170660R75103K35642r37470J584813j384969j46671J074599o41813
$$ 290460 -880200 94903 330545 -606925 977888 -407081 -553752 520847 -120966
79a20966L04412j32114n66804O72253J10287j48272m84814L28949J19483j27001
$$ -120966 183446 51332 -515472 156781 267068 118796 -366018 -37069 82414 -44587
89d4587N28320j005408K54525Q17792q39616N77811m35866l94741J159706o71953
$$ -44587 483733 -521675 -267150 550642 -288974 288837 -147029 -541770 617936 -54017
99e4017o2654K13043n84748R44488l40981l36495K86932m56964Q63744l77352
$$ -54017 -116671 96372 -488376 456112 115131 -221364 65568 -391396 472348 94996
109I4996m37019N58813n98276P06623R252q97997P63518k67157N3228M89462r58511
$$ 94996 -342023 216790 -381486 325137 334389 -563608 199910 -67247 -14019 475443 -483068
120d83068M08311L20519l07728K62865l94766N5498K17078J33810j74313l75681
$$ -483068 -74757 245762 -61966 200899 -193867 -138369 78709 212519 38206 -337475
130c37475M83173j64341P2583K23187p89031O11688K01663o11997O81506o63599
$$ -337475 145698 -18643 53940 277127 -511904 99784 301447 -310550 370956 -292643
140b92643J8307Q80375q98603K94053Q8757m30726P17561l45438k52778K83889
$$ -292643 -274336 606039 -292564 1489 90246 -340480 377081 31643 -221135 62754
150F2754j64477K71742r5591k33019J21328J2891K44822k87120m2246J69696k15355
$$ 62754 -101723 170019 74428 -158591 -37263 -24372 220450 -66670 -108916 60780 -154575
161a54575M40333l10527k31062M30902k72944K18964l0653l75798M04247q1908
$$ -154575 285758 -24769 -255831 175071 -97873 121091 90438 -285360 118887 36979
171C6979m4000J15437l42422K98768J5445j02698J01001l04754L26301j9512j61357
$$ 36979 -7021 108416 -234006 64762 80207 -22491 78510 -226244 100057 80545 -80812
182h0812J88809l00276K24351J30668k88316J81806j36422K7754K56948l20432
$$ -80812 107997 -192279 32072 162740 -125576 56230 -80192 -52438 204510 -115922
192a15922R3944L5922p5958K05665k01281K3524J5961J8683J18459k04022O6394
$$ -115922 -21978 13944 -62014 143651 -57630 -34106 -18145 538 118997 -85025 -18631
203a8631L4835m2405J37726j70589j230J33591j31443J60189j22242r9247K41625
$$ -18631 16204 -26201 111525 -59064 -60294 73297 -58146 102043 -20199 -119446 122179
214A22179j61566O7478p578j13160J58720n8429j587O59p3250J13951j7597n8972
$$ 122179 -39387 28091 20513 -92647 66073 7644 6057 6716 -66534 47417 29820 -29152
226b9152M9052p5439R5877j4353o5076P6294j05022J09012m965q9334P6732n2518
$$ -29152 19900 -55539 40338 25985 -39091 37203 -67819 41193 36228 -53106 23626 -28892
238b8892M1698K1913p4607M1533K329k0634O1454p8631K0311L1720l3468N0122
$$ -28892 12806 34719 -39888 1645 3974 -16660 44794 -33837 -13526 18194 -15274 34848
250C4848p2467L9146R327k3913L4083l8556R065J3901l59k120j2251o842M1430
$$ 34848 -37619 1527 10854 -13059 21024 -17532 -8467 5434 5075 2955 -9296 -16138 25292
263B5292l8172J0616J4350l8192M6012k6504J2451j3501j529K7819k5956L857
$$ 25292 -12880 -2264 12086 -26106 19906 -6598 5853 -7648 -9177 18642 -7314 -3457
275c457N652J257j3933K4671j8887J737K459M963L142k4184L3117k2347Q628j857
$$ -3457 2195 3452 -10481 14190 -4697 -2960 -501 4462 7604 -16580 16537 -5810 2818 961
289I61L065l728n749J8638j8688J0169r195J6272j7469O715P215j3435J0976r520
$$ 961 4026 298 -5451 13187 -5501 4668 -4527 11745 -5724 991 8206 -5229 5747 -3773
303c773J3389j7745J5391r784N451k933m808J6914k4686K0485j1722O011m782
$$ -3773 9616 -8129 7262 -2522 2929 -4 -4812 12102 -12584 7901 -3821 2190 -2592
316b592J065M501o740L265k987J1591k4815K7789j5982k77R512j4042J9588k4442
$$ -2592 -1527 2974 -3766 -501 -3488 8103 -16712 11077 -4905 -5182 4330 -9712 9876 -14566
330a4566J9564k803j2112R414O865j6875J0443L759j3293J9035k6426L3938k7367
$$ -14566 4998 2195 -9917 -503 6362 -10513 -70 3689 -9604 9431 -16995 16943 -10424
343a0424J392L0085m1813K9350q731k979Q590j1761R977L999k3502L3037j7314
$$ -10424 -9032 21053 -20760 8590 -141 -3120 5470 -6291 3686 7685 -15817 17220 -94
356i4j7199M6488n1578L8335j7511r829L9558n4243M4226j3777k2639M2805l2361
$$ -94 -17293 29195 -22383 15952 -1559 -11388 28170 -26073 18153 4376 -18263 24542 -7819
369g819K593K4094m3296M8008k3378k3820O1954p4936N9906j6152l7637O7153
$$ -7819 -5226 18868 -24428 23580 202 -23618 38336 -36600 23306 7154 -30483 36670
381C6670o8194M8590l672n0010O6830m2070M279L7020p3026O9338k4585k7984
$$ 36670 -31524 17066 13394 -36616 30214 -11856 -7577 29443 -43583 25755 1170 -26814
393b6814P7105j10466Q3690l476o2206Q9270r3859N7470J7745p1655Q3370p1069
$$ -26814 50291 -60175 23515 20039 -42167 47103 -46756 10714 28459 -43196 40174 -30895
405c0895J4489P5770j14435P8232k5005l7384J15054j38245P9711j686p3920J43845
$$ -30895 -16406 59364 -55071 23161 -1844 -39228 75826 -62419 17292 15606 -58314 85531
417H5531j31498K4858O3015q8883R8376o3672l1726R2461q6431P7099l9662n8712
$$ 85531 -45967 -21109 41906 -46977 51399 -12273 -43999 48462 -37969 39130 -532 -59244
429e9244J20803j02208Q4995n0820o3868J59488j43827Q6184j609j40640K10852
$$ -59244 61559 -40649 44346 -6474 -70342 89146 -54681 31503 29894 -110746 100106
440A00106j09653l2872J24325j97804J74602N100j63582J82185j52126P9787P8312
$$ 100106 -9547 -42419 81906 -115898 58704 63804 -99778 82407 -69719 10068 88380
451H8380j74418J22921o9537M2186O0275j40387R0886m1191K7060P3884j74128
$$ 88380 -86038 36883 -32654 9532 69807 -70580 20306 -20885 6175 80059 -94069
462i4069J19803k4650l2675J50348k35612J17664N2710j14273J68996k00600O0087
$$ -94069 25734 1084 -31591 118757 -116855 809 53519 -60754 108242 -92358 -32271
473c2271J13161j42570J46847j51033o467J98352j97814J22647o8034j04533K86084
$$ -32271 80890 -61680 85167 -65866 -72333 126019 -71795 50852 -17182 -121715 164369
484A64369k27144N4293N4484j95385K93366j30178j06158J51784j39060J40409
$$ 164369 -62775 -8482 46002 -149383 143983 13805 -92353 59431 -79629 60780
494F0780J856j50338R5131l2285Q8433m1778q5180Q3302q6559J88239j15506j33093
$$ 60780 62636 -87702 7429 -24856 63577 21799 -63381 19921 -66638 121601 6095 -126998
506a26998K36338k06486J72024K9444l23605L26947q8487q2743K28131l46067
$$ -126998 109340 -97146 74878 104322 -219283 107664 19177 -63566 164565 -181502
516a81502J73128J54746k50419J95538j72006J5383K05667j80589N3780p7182
$$ -181502 -8374 146372 -104047 91491 -80515 -65132 140535 -40054 13726 -63456
526f3456L9853J27542j33591M0652q3690N3752J55557k05947P3686l2992l7407
$$ -63456 -23603 103939 -29652 11000 -72690 -18938 136619 -69328 4358 -28634 -66041
537f6041K42175k47217K0836P8014r6051K17422j93844l3605J19920r4587J85922
$$ -66041 176134 -71083 -50247 27767 -68284 149138 -44706 -78311 41609 -52978 132944
548A32944j65345q5134K07791j49347J57795q0159k01095L12462j54130L9606
$$ 132944 -32401 -117535 90256 -59091 98704 18545 -182550 129912 -24218 15388
558A5388O3588k74822K79279j0623j27675J04779j59306J21363Q8778j30242J3673
$$ 15388 78976 -195846 83433 72810 -54865 49914 -109392 11971 100749 -29493 -15820
569a5820n8374J14450K3416r1323L3936j22680J96378K480j84122J57915j57805
$$ -15820 -74194 40256 63672 -27651 6285 -116395 79983 82463 -101659 56256 -101549
580a01549J25798J31818k97436J50081k649n2975K05552k48290J4912J47167j07191
$$ -101549 24249 156067 -141369 8712 6063 -46912 158640 -89650 -74738 72429 -34762
591c4762J34255j47169l5478J43464n9494P3430j35213l642J33969p4411O7039
$$ -34762 99493 -47676 -83154 60310 816 74246 -60967 -64609 69360 -5051 61988
602F1988j09160m0852J90136j08657K6645k6963j05444K22687r0653m9152L6896
$$ 61988 -47172 -88024 102112 -6545 20100 -6863 -112307 110380 19727 -29425 7471
613G471r5526J73068n0398p6083L6591n9599J41386l6590j07641P5042n8043J07405
$$ 7471 -88055 85013 34615 -41468 -4877 -64476 76910 40320 -67321 7721 -50322 57083
625E7083K902j56974J15005m5813N9164M1804j78362J09102O983m9M7542j39869
$$ 57083 59985 -96989 18016 -27797 31367 73171 -105191 3911 10894 10845 58387 -81482
637h1482O3364N5080l3188L9700j12201M2004Q5261o8742M6859r5550K8511J01454
$$ -81482 -18118 36962 3774 43474 -68727 -26723 58538 -10204 36655 -58895 -30384 71070
649G1070q5383L3947o2430J1955J01025p5070n15j8110o654R8724o8974k4976
$$ 71070 -14313 19634 -42796 -30841 70184 -4886 -5401 -23511 -30165 68559 -415 -25391
661b5391K0949k7500R9770o8911l5341M2758l3094Q6534n6629m9997N7115j7525
$$ -25391 -4442 -31942 67828 -1083 -36424 6334 -26760 59774 3145 -46852 10263 -7262
673g262M2387k3093o1357N7005j405J5313n552p2641P3949n308m804J1118p1068
$$ -7262 35125 12032 -49325 7680 6275 21588 16036 -56605 17344 12036 7232 18350 -52718
686e2718O5915Q452k1938J0155m6186L5972L5751m2493K882j1331Q036L9458l6444
$$ -52718 13197 21649 -289 9866 -36320 -348 35403 -7090 -4208 -15539 -7503 31955 -4489
699d489k463j3405K6152K1285m2022J6828k2952K5591K5208m7758J0482N778n640
$$ -4489 -6952 -20357 5795 27080 -14942 1886 -21066 4525 29733 -18025 -7543 -1765 -7405
712g405L5231l4468k0874M3809k3528K1306j2169k7071L2910k204J815j5365O83
$$ -7405 27826 -6642 -27516 16293 -7235 14071 1902 -25169 7741 5537 7352 -8013 -7330
725g330N364R058L186k1153J104J8143n316k697M187k4486L2290m142j6051J4440
$$ -7330 -1966 7092 10278 -10875 -9771 8372 3056 359 4546 -19940 12350 8208 -7843 6597
739F597j9670J9108M104j3689k404R360l497M307J678j6188J1529M834j732j0025
$$ 6597 -13073 6035 10139 -3550 -5954 3406 -91 4216 5894 -10294 1235 6069 4337 -5688
753e688R640q333P542O666k0603J6397q548M968L416r370Q27P389k686m604Q055
$$ -5688 3952 -4381 3161 9827 -10776 5621 -2927 2041 5457 -3913 -3086 4303 1617 -2987 5068
768E068j2004R565q29j466m225M786R68p529J3490j6547J0528k8o203P530n622
$$ 5068 -6936 2629 1800 334 -3891 895 1863 -5666 7824 -8723 1805 1777 -4426 3104 -2518
783b518O86K481j45n331R412j0056P429k478k248N695q132J0664j2437J1282m779
$$ -2518 -1832 649 504 -4827 4585 -5471 1958 -520 -2768 2927 -5205 5459 -6978 4304 -475
798d75m728J1464j1076M274M558p700K763O038j2684J5363j1949K022J0197j8756
$$ -475 -5203 6261 -4815 -541 4017 -3683 -920 5118 -7566 7797 -4152 -2130 8067 -10689
812a0689K0949j4951L458O253r876J0544q381K162N732j0237P749K839j6554K3659
$$ -10689 10260 -4691 -1233 5020 -4856 5688 -2693 -531 5201 -5036 2713 5552 -11002 12657
826A2657j8199L376J3529k6467K9783k0491K844J5106k5045K0945n465j0586J7817
$$ 12657 -5542 -2166 11363 -15104 14679 -5812 -2968 12138 -12907 8038 2573 -8013 9804
839I804j4979L594J1172k2618K5111j8454K858J6944l1272L2788k2236K512J8265
$$ 9804 -5175 -1581 9591 -13027 12084 -6370 -3512 13432 -17840 14948 -7288 -4776 13489
852A3489l0068K7195j1724r499K6641k9472J4062J1319l4424M2855l0019K79L0576
$$ 13489 -16579 10616 -1108 -10607 16034 -13438 624 11943 -22481 20374 -9645 -9366 21210
865B1210m7541M4364k2467q883L4122m1502K9675l731k3880L7547k9390O595J9286
$$ 21210 -26331 18033 -4434 -13317 20805 -20697 8978 5247 -18633 18914 -10476 -3881 15405
878A5405l8155M2804k7878J52K8996m9214N0842k8055p058L6231m9057M0778j1085
$$ 15405 -22750 20054 -7824 -7672 21324 -27890 22952 -5103 -12161 24070 -24987 15791 4706
891D706k5550M8383m6662K1018K1171n8169O3900l6049o492M7429o9461N6350
$$ 4706 -20844 27539 -19123 1895 23066 -35103 28797 -7252 -13744 33685 -35776 20574
903B0574j6946k3550N0684n6465L2205Q153l6741M4568l6958J0278K6516m8643
$$ 20574 3628 -19922 30762 -25703 6502 14655 -22086 22482 -14476 -4198 22318 -26325
915b6325M9841l7571N889L9659o7774O2673l6270q144N9261p7996N0314l798m2883
$$ -26325 23516 -14055 -8166 31493 -36281 26392 -9878 -18022 41239 -36757 13557 9759 -33124
928c3124P7016o7084R955M7209p5564P5971l8098k8625P2130p0868N0403j5222
$$ -33124 43892 -23192 -13237 33972 -41592 34379 -3719 -32344 39786 -31082 19321 4099
940D099l5179O1705m8933K8902m271l7757O1209m1740J2630J5052n7101P7971
$$ 4099 -31080 30625 -18308 10594 6323 -31434 29775 -11965 665 15717 -41384 36587
952C6587m4387n566M4201q2169Q7078k8555l8373O7176p7275N9467Q750o9408
$$ 36587 -7800 -13366 30835 -51334 35744 7189 -31184 35992 -41283 18184 26934 -42474
964d2474P3089n2450J8531M8980r5705P0909k1684j8050P0284r6929N2360P161
$$ -42474 30615 -21835 -3304 45676 -50029 20880 -804 -18854 51430 -45499 6861 14022
976A4022l4287O1921p3782K4327L1343l9639M5292n1703Q096M4977m9699M9113
$$ 14022 -20265 41656 -32126 -7799 23544 -16095 29197 -22506 -14410 30567 -19132 29981
988B9981n5381O121O4965p8297O3547m7897j9007R7435r1999L6527L948n9927
$$ 29981 -25400 -19279 45686 -32611 30936 -16961 -35968 61467 -30532 5995 9943 -49984
1000d9984J06831o2180k4592N9345p4189Q1782k0262o1603O8805m9790N0809r050
$$ -49984 56847 -5333 -29925 29420 -44769 37013 16751 -44852 23953 -25837 24972 15922
1012A5922n5756N5010l1332L8176o180o0464O2188k3516J4752J8522q2641P4009
$$ 15922 -39834 15176 -16156 22020 15840 -44624 17564 -5952 8800 27322 -55319 18690
1024A8690r734j6649M2702r1410O8479J3048m1043M3569p1766M6713L3740n6276
$$ 18690 8956 -7693 35009 -56401 12078 25126 -15917 27652 -44114 2599 36339 -19937
1036a9937L9277n1583K3645O1392q2431M0744k6283o759Q4438r1244K2952P012
$$ -19937 19340 -32243 -8598 52794 -29637 11107 -15176 -21935 62503 -28741 -5789 1223
1048A223k4069P6365o8573r102L4323k3261N1003m3108k7878M7409k2357M1843
$$ 1223 -22846 53519 -15054 -24156 10167 -13094 37909 -5199 -33077 14332 -8025 33818
1060C3818m0547l0720O1012l3729M0529l4630m0497P4028l0398J5191j0748m9170
$$ 33818 -6729 -37449 23563 -10166 30363 -4267 -44764 29264 -1134 14057 3309 -45861
1072d5861P1275j1405j8193J3281n3318O7060J094m0643K6904m9610O0694P859
$$ -45861 25414 14009 -4184 9097 -44221 22839 23933 -16710 10194 -39416 21278 29137
1084B9137n3876L1925l5515M0192K5898o7859K6159k650O302L9770o6503J2342
$$ 29137 -24739 7186 -28329 11863 37761 -30098 -3939 -6589 -287 39483 -27020 -14678
1096a4678J9287m193L2391n8858J1420K0541J68J9675n2340J2799K5072p629J8944
$$ -14678 4609 416 32807 -26051 -14631 5910 6078 25753 -26587 -13788 11284 3655 22599
1109B2599m5650O89M8797k8895J7336k8359j6623O4092l4131M052j2630j7180
$$ 22599 -23051 -22362 26435 -2460 14876 -13483 -30106 33986 -145 3907 -8723 -25903
1121b5903N6425k3922j3467J443j4153M4302j0300l2778J7838j3996L4542j889
$$ -25903 30522 6600 -6867 -5424 -19577 24725 14425 -18353 -515 -14511 20031 18142
1133A8142m3155K5623q001K3626o38l7753J6950O994J3114o977k6115J2049J0541
$$ 18142 -25013 610 -7391 16235 15597 -22156 -5206 1788 14902 7925 -18190 -6141 4400
1146D400Q236l459l4047K4854Q771o001J2125m3400K7627J7835k0262J2572k7982
$$ 4400 12636 9177 -24870 -16 8755 2754 14879 -28521 -894 16941 -3321 9251 -18731
1159a8731J0209K9890k0809o057r51l674K7968j3896j3256J940L083K1554j9854
$$ -18731 -8522 21368 559 -5498 -6449 -10123 17845 3949 -9307 -7367 -4284 17270 -2584
1172b584k610l209N796K0941k2479m443N537J748J4409j1326j7582J8641l52L921
$$ -2584 -5194 -8403 -2607 18334 -4145 -8588 -3051 -1303 13106 1780 -15802 2839 2487 6408
1186F408k227j9497J7206K460L676j0477p001J2079j83O179j1735p491J4779K411
$$ 6408 4181 -15316 1890 4350 8026 -2451 -9452 2627 2444 8623 -3112 -10603 4176 6587
1200F587o507K037j3026J3062R705j7216P762r585Q244Q584j1199k229M91P231
$$ 6587 80 2117 -10909 2153 11858 -5358 2404 -7181 1063 9647 -1552 -3781 -3290 3941
1214C941p66j430o619J680O559K632j0320K455J628j669J1577j6580M498M444
$$ 3941 3175 1745 -4874 -3194 3365 5997 -4323 -1868 -240 -1909 9668 -6912 -2414 2030
1228B030l577P373r058r39N079K044l859Q75l802L906K183j513k879j472Q273
$$ 2030 -1547 5826 -3232 -4171 908 2952 -907 -32 -3834 72 2255 742 -2137 -3609 4664
1243D664q350P857o551k725J1432r456M168j115l590N767J97o088N800l795J507
$$ 4664 -3686 4171 -2380 -5105 6327 -3129 1039 -76 -3666 2101 2298 -3790 2010 -1785 -278
1258b78L838p571O143m842O049m248o80N062q218R116m778k319O287n106Q33N048
$$ -278 3560 -4011 2132 -2710 3339 -909 -1589 3473 -4745 4371 -407 -2726 3561 -1545 -712 4336
1274D336q725O604J01p448J2257j2010O987J38o156Q589p848N611k117k209M580
$$ 4336 -4389 2215 2316 -5132 7125 -4885 2102 2240 -3916 4673 -3175 2436 319 -1890 2690
1289B690l715R03L278p802P910k069n595J1276j4129J1252k308p344J2741j3473
$$ 2690 -1025 -122 3156 -4646 3264 1195 -4400 6876 -7253 3999 1691 -5653 7088 -6385
1303f385Q558M83q051R304o157M35P113j1799R589k509o668J5415j8130J1389
$$ -6385 2173 2656 -5395 3909 -2248 -1813 5300 -6499 3090 581 -6087 9328 -8802 2587
1317B587J11r941J5993j5255O572L323q966J0556o879j770R800j2221R420k744
$$ 2587 2698 -7243 8750 -6505 67 3390 -5576 4980 -1899 -3669 6131 -6090 3330 586
1331E86p201J5717j7245J2800l522q992J8904j9406J0905J784j3893J8502j1055
$$ 586 -6615 9102 -8143 4657 1135 -7857 11047 -8359 2546 4330 -9563 8939 -2116
1344b116k619J4347j9584J5159j289j3496K2102k1481J1746L257j5760J9623j6068
$$ -2116 -4735 9612 -9972 5187 3898 -9598 12504 -8977 2769 6026 -9734 9889 -6179
1357f179P083M827j3882J5568j0145j86J2454j9527J6386n332r675K2413k5745
$$ -6179 904 5731 -8151 7417 -2728 -2914 9540 -9987 6399 1067 -8608 13805 -11940
1370a1940J6984o68j6489K6828k4326R369R038k1269K2318j1771n552J9565k3315
$$ -11940 5044 4376 -12113 14715 -9611 -242 8796 -12473 9845 -1926 -7478 12087 -11228
1383a1228J5781p40j6131K5946k3758J2318L467j7954K4199j9706P981N884j7590
$$ -11228 4553 3813 -12318 13628 -10130 2188 5655 -12299 11900 -7806 175 6059 -11531
1396a1531K1224j3575j429J6225k4416K1354n409j4845K8375k9936J8310L365
$$ -11531 9693 -3882 -5311 10914 -13502 7852 2443 -12402 15973 -13963 4347 7712
1408G712k3962L2209k4662O788J4038k7211K4735q930r506K2463k5677J5757K778
$$ 7712 -16250 15959 -8703 -1915 12123 -15088 9647 717 -8789 13674 -12003 3754 6532
1421F532j8601K6347k4766J2419O313k0145K4425k1096R342Q522k1366K2609j5154
$$ 6532 -12069 14278 -10488 1931 8244 -11901 12524 -8572 770 9292 -12074 10535 -4619
1434d619l99J9691k9223K1541m176j5893L2831l3880J5230Q635k5747L3440k5264
$$ -4619 -5018 14673 -14550 6991 2815 -13078 19753 -14127 1103 9738 -16009 17431 -7833
1447g833J414J9524k5765K1690q779j2071K5601k2170J1576R79j8156K8386k1737
$$ -7833 -6419 13105 -12660 9030 251 -11820 13781 -8389 3187 4166 -13990 14396 -7341
1460g341Q973L195j9569K9474k0318L689Q803k1553K6937j2220r331K0364k5230
$$ -7341 1632 4827 -14742 14732 -5586 -1897 6906 -14647 12290 70 -9261 11103 -14127
1473a4127K1566L49k3632K8570k3386J4174P923k9009K8222j6150M840J3506k8643
$$ -14127 7439 7788 -15844 12726 -10660 3514 11437 -17572 10650 -5500 -660 12846 -15797
1486a5797K0913l151p163J8701k7610J4574P957j7449K2766k6318J0051J5010
$$ -15797 5116 1965 -5198 13503 -14107 467 8424 -9025 13741 -12577 -2526 12484
1498A2484k1828J9523j9309M538J8492k1380J2641r228l966K4388k2649N969J597
$$ 12484 -9344 10179 -9130 -4592 13900 -7480 5161 -4067 -8033 16355 -6294 -325 1272
1511A272j2123K8925k3834J651Q171j4792K7675k0392m562J3798j3682K0267j1462
$$ 1272 -10851 18074 -5760 -4109 4062 -10730 16945 -3447 -8009 5789 -7893 12374 912
1524I12j3961K1002j3068J2963l074k2761K8675j3459O369L357k5934K8024o528
$$ 912 -13049 7953 -5115 7848 4774 -17987 10688 -2771 3598 6955 -18979 9045 2517
1537B517l168O599k1510J9615M789j3595Q672j5612J2588J1403j9078R164j2428
$$ 2517 -651 5948 -15562 4053 8842 -4753 3919 -11693 895 12298 -6780 2384 -10044
1550a0044J2099R682j9548R470j0639J1597R878k1341P908k757K887J6126k4954
$$ -10044 2055 11737 -7811 1659 -8980 2617 12495 -8846 -938 -3695 -808 15318 -9636
1563i636M260R045q512K0884k4358j488J8027j1930J4658j5970o474J9484o269
$$ -9636 -5376 3669 -4843 16041 -8317 -9805 8222 -3708 10950 -5020 -11494 7990 1721
1576A721K869o450r573J9192k892m054k430r382K0341n247m015k629p719K1490
$$ 1721 4590 -1860 -11433 7759 4867 813 -1617 -10999 9342 4095 80 -2549 -10268 11222
1590A1222p958n560J28o356J7990l170j3298O314n129J2591K628k0452J1263l491
$$ 11222 3264 -2296 -2168 -8524 9466 6296 -7002 -688 -5817 6774 9402 -11050 213 -3278
1604c278P582N236k1329J0094K083L240L372j6458M848R104j936K331j2782J649
$$ -3278 4304 9540 -11789 -1695 388 3628 7000 -9458 -4610 4494 2558 4889 -7893 -6244
1618f244J3696o162K175j1377K954J2598o425P87j0086M861J0942o094k496m950
$$ -6244 7452 1290 3465 -7912 -4958 7640 1215 2002 -8084 -3223 7719 1625 -871 -5821
1632e821K345J2421p543n091J322k389J5350r976o332M943k631J2390p733p468
$$ -5821 -3476 8945 1402 -3689 -2367 -4756 10594 618 -5714 -771 -3402 8988 1255 -6213
1646f213M902J596N544l580r300N987L611J473j495j0695R160J500J183k235r445
$$ -6213 -1311 285 5829 2249 -7051 -1064 2547 4020 2525 -8170 990 2490 3673 1438 -8007
1661h007J0138M52L85k996o035O719M340m259j455l594L598P380p966R16l595
$$ -8007 2131 2583 2968 -28 -6063 656 4996 737 -718 -4312 -714 6666 -1300 -384 -3979
1676c979M023N980q050J090k787N269K856n976n43Q9K538L934n774k552M815j717
$$ -3979 44 6024 -2026 -936 -3723 1546 4402 -1574 -2117 -2028 510 4444 -1330 -3882 933 -784
1692g84N317o534j741N271j876M298o409l27L449L40R82l435j522M444q5j066
$$ -784 4533 -2001 -3742 1529 -347 3951 -2458 -2785 664 1004 1986 -1449 -2971 1473 1388 322
1708C22k80m344P519k722n54Q02n054P594k899n49n2j664L674k93k714J182p37
$$ 322 42 -4302 3217 495 -59 743 -4311 3283 384 -165 -217 -1881 1793 1500 -1214 -32 -769
1725g69J489J867n197L750k370K451J350n610N510m017K571R22m125K923p74j96
$$ -769 720 2587 -2610 1140 -1230 1221 2571 -3039 2471 -1546 1025 1947 -2178 745 -29 -225
1741b25J933l335J097K419m189N130m715J368L058n358N634m723J816J611l866
$$ -225 1708 -1627 -530 1889 -2300 2830 -1885 -517 2541 -2817 2817 -1906 -90 1521 -2345
1756b345L863k299l36L125l593J351J858m857N901m526J395K979o088O604n112
$$ -2345 1518 -781 -1117 2008 -1585 -234 1624 -3233 2668 -1858 -463 2516 -3572 3032 -2080
1771b080J935J824m199M140k035o42L069m108K017J390m345O565o130J998L139
$$ -2080 -145 1679 -2520 1620 -415 -1057 2012 -2096 -79 1311 -3034 3531 -2599 -601 2538
$$ [...]
8191A6
##END NTUPLES=NMR FID
##END=
