##TITLE=1H_116-2024 Bau
 CDCl3
 8 sc, 
 26.12.2024
##JCAMPDX= 6.0         $$ Bruker NMR JCAMP-DX V2.0
##DATA TYPE= NMR FID
##DATA CLASS= NTUPLES
##ORIGIN= UXNMR, Bruker Analytische Messtechnik GmbH
##OWNER= root
$$ XWIN-NMR		Version 3.5
$$ Thu Dec 26 16:18:56 2024 Russian Standard Time (UT+4h)  she@DPX200
##.OBSERVE FREQUENCY= 200.1315
##.OBSERVE NUCLEUS= ^1H
##.DELAY= (6, 6)
##.ACQUISITION MODE= SIMULTANEOUS
##.ACQUISITION SCHEME= undefined
##.AVERAGES= 8
##.DIGITISER RES= 18
##SPECTROMETER/DATA SYSTEM= spect
##.PULSE SEQUENCE= zg30
##.SOLVENT NAME= D2O
##.SHIFT REFERENCE= (INTERNAL, D2O, 0, 15.7039)
##AUDIT TRAIL= $$ (NUMBER, WHEN, WHO, WHERE, WHAT)
$$ ##TITLE= Audit trail, XWIN-NMR		Version 3.5
$$ ##JCAMPDX= 5.01
$$ ##ORIGIN= Bruker BioSpin GmbH
$$ ##OWNER= she
$$ F:/spectra/data/she/nmr/H-F/1/audita.txt
$$ ##AUDIT TRAIL=  $$ (NUMBER, WHEN, WHO, WHERE, WHAT)
(   1,<2024-12-26 16:17:49.56 +0400>,<she>,<DPX200>,
      <created by zg, POWCHK disabled, PULCHK disabled
       configuration hash MD5:
       00 E9 B6 7A A2 85 ED C7 34 08 36 98 17 FE 4E 26
       data hash MD5: 16K
       89 05 EC 0D C8 8F 2C 21 4A 1C 99 20 6F 90 B6 CE>)
$$ ##END=
$$ 
$$ hash MD5
$$ E5 D8 B4 2E DD AE E3 DA F0 7C BB B4 F3 D2 03 D6
##$RELAX= 
##$RELAX= 
##$RELAX= 
##$RELAX= 
##$RELAX= 
##$RELAX= 
$$ Bruker specific parameters
$$ --------------------------
##$DU= <F:/spectra>
##$EXPNO= 1
##$NAME= <H-F>
##$PROCNO= 1
##$TYPE= <nmr>
##$USER= <she>
##$AMP= (0..31)
100 100 100 100 100 100 100 100 100 100 100 100 100 100 100 100 100 100 
100 100 100 100 100 100 100 100 100 100 100 100 100 100 
##$AQSEQ= 0
##$AQ_mod= 1
##$AUNM= <au_zg>
##$AUTOPOS= <>
##$BF1= 200.13
##$BF2= 200.13
##$BF3= 200.13
##$BF4= 200.13
##$BF5= 200.13
##$BF6= 200.13
##$BF7= 200.13
##$BF8= 200.13
##$BYTORDA= 1
##$CFDGTYP= 0
##$CFRGTYP= 5
##$CHEMSTR= <none>
##$CNST= (0..31)
1 1 145 1 1 1 1 1 1 1 1 1 1 1 1 1 1 1 1 1 1 1 1 1 1 1 1 1 1 1 1 1 
##$CPDPRG= <>
##$CPDPRG1= <>
##$CPDPRG2= <>
##$CPDPRG3= <>
##$CPDPRG4= <mlev>
##$CPDPRG5= <mlev>
##$CPDPRG6= <mlev>
##$CPDPRG7= <mlev>
##$CPDPRG8= <mlev>
##$CPDPRGB= <>
##$CPDPRGT= <>
##$D= (0..31)
0 1.2 0 0 0 0 0 0 0 0.06 0 0.03 0 0 0 0 0.0002 0 0 0 0 0 0 0 0 0 0 0 0 
0 0 0 
##$DATE= 1735215468
##$DBL= (0..7)
120 120 120 120 120 120 120 120 
##$DBP= (0..7)
150 150 150 150 150 150 150 150 
##$DBP07= 0
##$DBPNAM0= <>
##$DBPNAM1= <>
##$DBPNAM2= <>
##$DBPNAM3= <>
##$DBPNAM4= <>
##$DBPNAM5= <>
##$DBPNAM6= <>
##$DBPNAM7= <>
##$DBPOAL= (0..7)
0.5 0.5 0.5 0.5 0.5 0.5 0.5 0.5 
##$DBPOFFS= (0..7)
0 0 0 0 0 0 0 0 
##$DE= 6
##$DECBNUC= <off>
##$DECIM= 24
##$DECNUC= <off>
##$DECSTAT= 4
##$DIGMOD= 1
##$DIGTYP= 9
##$DL= (0..7)
0 120 120 120 120 120 120 120 
##$DP= (0..7)
150 150 150 150 150 150 150 150 
##$DP07= 0
##$DPNAME0= <>
##$DPNAME1= <>
##$DPNAME2= <>
##$DPNAME3= <>
##$DPNAME4= <>
##$DPNAME5= <>
##$DPNAME6= <>
##$DPNAME7= <>
##$DPOAL= (0..7)
0.5 0.5 0.5 0.5 0.5 0.5 0.5 0.5 
##$DPOFFS= (0..7)
0 0 0 0 0 0 0 0 
##$DQDMODE= 0
##$DR= 18
##$DS= 0
##$DSLIST= <SSSSSSSSSSSSSSS>
$$ [...]
##$SUBNAM2= <"">
##$SUBNAM3= <"">
##$SUBNAM4= <"">
##$SUBNAM5= <"">
##$SUBNAM6= <"">
##$SUBNAM7= <"">
##$SUBNAM8= <"">
##$SUBNAM9= <"">
##$SW= 24.0689530833862
##$SWIBOX= (0..15)
0 0 2 0 0 0 0 0 0 0 0 0 0 0 0 0 
##$SW_h= 4816.95568400771
##$TD= 16384
##$TD0= 1
##$TE= 0
##$TE2= 300
##$TE3= 300
##$TEG= 300
##$TL= (0..7)
0 120 120 120 120 120 120 120 
##$TP= (0..7)
150 150 150 150 150 150 150 150 
##$TP07= 0
##$TPNAME0= <>
##$TPNAME1= <>
##$TPNAME2= <>
##$TPNAME3= <>
##$TPNAME4= <>
##$TPNAME5= <>
##$TPNAME6= <>
##$TPNAME7= <>
##$TPOAL= (0..7)
0.5 0.5 0.5 0.5 0.5 0.5 0.5 0.5 
##$TPOFFS= (0..7)
0 0 0 0 0 0 0 0 
##$TUNHIN= 0
##$TUNHOUT= 0
##$TUNXOUT= 0
##$USERA1= <user>
##$USERA2= <user>
##$USERA3= <user>
##$USERA4= <user>
##$USERA5= <user>
##$V9= 5
##$VALIST= <valist>
##$VCLIST= <CCCCCCCCCCCCCCC>
##$VD= 0
##$VDLIST= <DDDDDDDDDDDDDDD>
##$VPLIST= <PPPPPPPPPPPPPPP>
##$VTLIST= <TTTTTTTTTTTTTTT>
##$WBST= 1024
##$WBSW= 4
##$XGAIN= (0..3)
0 0 0 0 
##$XL= 0
##$YL= 0
##$YMAX_a= 489830
##$YMIN_a= -506432
##$ZGOPTNS= <>
##$ZL1= 120
##$ZL2= 120
##$ZL3= 120
##$ZL4= 120
##$ABSF1= 10
##$ABSF2= 0
##$ABSG= 5
##$ABSL= 3
##$ALPHA= 0
##$AQORDER= 0
##$ASSFAC= 0
##$ASSFACI= 0
##$ASSFACX= 0
##$ASSWID= 0
##$AUNMP= <proc_1d>
##$AZFE= 0.1
##$AZFW= 0.1
##$BCFW= 1
##$BC_mod= 2
##$BYTORDP= 1
##$COROFFS= 0
##$CY= 11.3945322036743
##$DATMOD= 1
##$DC= 2
##$DFILT= <>
##$DTYPP= 0
##$F1P= 15.6554695791079
##$F2P= 12.8336369535428
##$FCOR= 0.5
##$FTSIZE= 0
##$FT_mod= 4
##$GAMMA= 1
##$GB= 0.15
##$INTBC= 1
##$INTSCL= 1
##$ISEN= 128
##$LB= 0.24
##$LEV0= 0
##$LPBIN= 0
##$MAXI= 10000
##$MC2= 0
##$MEAN= 0
##$ME_mod= 0
##$MI= 1.114404
##$NCOEF= 0
##$NC_proc= 0
##$NLEV= 6
##$NOISF1= 3.799351
##$NOISF2= 2.8
##$NSP= 1
##$NTH_PI= 0
##$NZP= 0
##$OFFSET= 15.70392
##$PC= 1
##$PHC0= -26579.68
##$PHC1= 22.98744
##$PH_mod= 1
##$PKNL= yes
##$PPARMOD= 0
##$PSCAL= 0
##$PSIGN= 0
##$REVERSE= no
##$SF= 200.130013532006
##$SI= 16384
##$SIGF1= 3
##$SIGF2= 2
##$SINO= 400
##$SIOLD= 16384
##$SREGLST= <1H.CDCl3>
##$SSB= 0
##$STSI= 0
##$STSR= 0
##$SW_p= 3612.71676300578
##$SYMM= 0
##$S_DEV= 0
##$TDeff= 0
##$TDoff= 0
##$TI= <>
##$TILT= no
##$TM1= 0
##$TM2= 0
##$TOPLEV= 0
##$USERP1= <user>
##$USERP2= <user>
##$USERP3= <user>
##$USERP4= <user>
##$USERP5= <user>
##$WDW= 1
##$XDIM= 8192
##$YMAX_p= 0
##$YMIN_p= 0
$$ End of Bruker specific parameters
$$ ---------------------------------
##NTUPLES= NMR FID
##VAR_NAME=  TIME,          FID/REAL,        FID/IMAG
##SYMBOL=    X,             R,               I
##VAR_TYPE=  INDEPENDENT,   DEPENDENT,       DEPENDENT
##VAR_FORM=  AFFN,          ASDF,            ASDF
##VAR_DIM=   8192,          8192,            8192
##UNITS=     SECONDS,       ARBITRARY UNITS, ARBITRARY UNITS
##FACTOR=    0.0002076,     1,               1
##FIRST=     0,             0,               0
##LAST=      1.7004516,     0,               0
##MIN=       0,             -506432,         0
##MAX=       1.7004516,     489830,          0
$$ Real data points
##PAGE= N=1
##DATA TABLE= (X++(R..R)), XYDATA
$$ [...]
2290a11J575o80k034K066N2k130J700J713k310l42J714j789j53K042j221j063
2306i71K441j187k240J799J470k190N07K020j847j094J743j079m50J912r38j047
2322a151J686j08k744J738K034k120J05J693j953n90J973j119j001K409l62k381
2338a891J816N20k207O96J946j405n12J577j793l10J914p81q43K359m5k863J193
2355f29J376j834L92K014j854k56J696j798r00K688q4k001J320J570k736K68J766
2372I98j520L42J555j465o41J721p73j924K518N72j910Q10J008j824J15J935j657
2389a40j53K001j149j893K279j56j717J569J311k103J78J024j267R7J704j651
2405f6q72K765j234k458K424J011k485J086J395j832r5J961j744k56K178j004
$$ y = [-111, 1464, 784, -1250, 816, 868, -1262, 438, 2151, -159, -501, 1213, -576, -729, 1313, 92, -971, 1470, 283, -1957, -158, 1312, -878, -371, 1649, -198, -1292, 451, -628, -1078, 834, -104, -1151, 535, 427, -2317, -579, 1455, -665, -560, 1133, -820, -1410, 563, -556, -1557, 852, 490, -1891, -75, 445, -1762, -1066, 880, -525, -1037, 540, -1253, -1563, 351, -430, -1273, 1086, 1041, -1822, -629, 747, -1087, -695, 1319, -535, -791, 905, -893, -1793, 895, 811, -1190, 130, 1700, -1036, -768, 998, -522, -180, 1375, -90, -731, 990, 217, -1707, 811, 1383, -527, 283, 1291, -533, -418, 1517, -140, -293, 1708, 559, -1334, 945, 789, -928, 641, 1952, -151, 27, 1051, -216, -119, 1585, -66, -938, 1827, 593, -1865, 559, 1570, -915, 171, 1566, -266, -361, 1600, -144, -400, 1778, 774]
2421G74j752K037k00k236J248J519j811N60P87j797k48K001j440p53K509n13j989
2438a304J424N70k121R55J561j485k35J500j895o27K470n56j213J437K99k128
2454a348R26M84j267R61J235k071j0K155j646j701K958J61k313J268J014k081
2470a275L52J262j351K77J462j149j063K015r27j383K068N71j909J239K04j855
2486a462J177J241j751J72K255j772j498K072n1j607J307J291j703j2J402j750
2502f89M63J728j480r39J941p32j326J279K98j426J762M06k366J278J357k293
2518g39j89L055j175j680J518q6j535R49J083j291O80P46j943K07J918j585o27
2535f94K254p44j208Q94k01j386J729O22j675M54J439j893j122K840n88j797J720
$$ y = [774, -978, 1059, 859, -1377, -129, 1390, -421, 139, 926, -871, -1119, 882, -558, -1311, 1198, 685, -1304, 120, 690, -1431, -476, 1085, -400, -635, 865, -1030, -1657, 813, 257, -956, 481, 780, -1348, -422, 62, -1205, -244, 991, -1080, -1090, 1065, -581, -2282, 676, 837, -1476, -208, 806, -1275, -923, 339, -1012, -735, 727, -422, -1485, 530, -397, -1780, 288, 859, -1050, 189, 393, -1462, -285, 956, -795, -623, 1632, -140, -1638, 434, 383, -1224, 83, 1374, -329, -341, 1061, -689, -226, 1502, 22, -917, 1024, 292, -1034, 245, 543, -883, 879, 1285, -1081, 197, 1554, -739, -928, 2127, 952, -728, 790, 704, -831, 118, 1201, -90, 590, 1336, -607, -400, 1518, -67, -694, 1560, 816, -392, 502, 301, -1085, 644, 1266, -409, 45, 1484, -409, -1531, 1309, 721, -1076, 644]
2552F44J02j604N62P41j426J018J240j634j11J253j231r58J909j90q52Q87J44
2569D94j984J541P43k740J386K014j772j427J987j98j709J342J043j419O61j62
2585b00j389J019Q90j404L30J554j233q70J881j241p17J939J96k355J389J100
2601H89k690O68K273j035j342J666J48j606R92n7p79J466L47j754K20Q21p29k69
2619g71K016j104j143J636j062r24K227K6k094J636J483k640l62K324j342o63
2635g57J888j38j336J111n02j102J455O22j837J082Q09j609N1J731j160r84K143
2652A467q88j707J860L46k358J069K419k340p09K153r84j035J249K12j214J412
2668I52k22j464J037M41j594P67J389j690k96J327j068p73K297o08j782J863M65
$$ y = [644, 746, -858, -296, 445, -981, 37, 1277, -357, -468, 785, -446, -1404, 505, 315, -537, 350, 494, -1490, 51, 794, -1946, -560, 1454, -318, -1745, 242, 44, -1665, -323, 720, -699, -38, -200, -1589, -570, 320, -1084, -754, 800, -433, -1303, 578, -663, -1380, 559, 755, -1600, -211, 889, -1801, -1133, 1140, 105, -1237, 429, 577, -1029, -37, -94, -873, 593, 940, -814, -594, 227, -502, -771, 1245, 141, -1002, 634, -428, -1352, 875, 901, -1193, 443, 1926, -714, -1076, 1248, -94, -757, 1131, 993, -343, 768, 266, -836, 619, 1241, -596, 486, 1295, -314, -263, 1468, 308, -676, 1467, 579, -1128, 732, 1078, -1280, -211, 2208, -132, -841, 1312, 328, -707, 542, 754, -460, 952, 730, -734, 303, 744, -850, -83, 1306, -384, -680, 647, -421, -1194, 1103, 495, -1287, 576, 1041]
2685A041k421N47K432j756p32J622q39r39J209k47o39J060M8j180O77N44j591
2702a164O34J138j238k61K004j808r41K363p82j758K050J168k316m68J696p53
2718d36o54J447l73p04J216q53j105J661O1j613J463N99j640M01J171j354M0J743
2736A070j401j038K088k79k040J547J586k074j54J868j443p19J573o36k82J548
2752A214j000r44J224J70k008J294J492j814M31J169j765J07J658q96j317K392
2768A407k27k319J057J377j534J03J338p16p61R97p83p29J992o60r93J197Q5j723
2786h92J063J054j667M68J416j868n12K191j047j350K040L93k246P17J321j670
2802e89LJ289j025J61Q86r70m99J513p49j189J912l1j699P71Q09j543K88J783
$$ y = [1041, -1380, -833, 1599, -157, -889, 733, -106, -1045, 164, -83, -722, 338, 386, -794, -117, 427, -1164, -530, 608, -630, -891, 1113, -695, -1636, 727, -55, -1813, 237, 1405, -911, -1379, 317, -436, -1090, 357, -16, -720, 496, -357, -1462, 199, 260, -1353, 110, 709, -931, -530, 641, -713, -673, 1070, -331, -1369, 719, 440, -1600, -53, 1533, -541, -695, 1173, -270, -989, 584, -52, -334, 1214, 214, -730, 494, 664, -1344, -50, 1442, -372, 59, 1228, -537, -430, 1228, 332, -985, 1407, 1180, -1139, -82, 1295, -239, -136, 1202, 486, -275, 722, -61, -790, 1202, 542, -451, 746, 831, -892, 171, 1225, -442, 26, 1442, -426, -938, 1253, 206, -1144, 896, 1289, -957, -240, 1081, -589, -586, 703, -322, -161, 725, -245, -744, 769, 20, -1169, 743, 712, -987, -216, 593, -950, -662, 1121]
2820A121j454n11K087j117k005J960P90j641M40J032j249j44O10p70L80J144j207
2837e34o88J626l19j842J972M47j896J193O93k012K64J702j108o71J997m72j614
2854a262J219Q10j519M70N49r07N70O81j523K03J663j128p87J895j82j809J402
2871C45M33j475P37J032j684J10J503j191p97J743p9j366O99P72j290L23P95o33
2889b3K21R63j527j12J605r65r63J828j26j661J475rj477Q55J376j930L41J660
2907A531j323j281J775Qj141J038L22j174O92J60j292P86J243j301m96J543r93
2924I7j347J916R2j433J254K48j774R03J339j712l56J890r52j298J538p3j464
2941a132Q25O49r75R33K72j594K69J757j579l09J754p49j352J195K11j435J062
$$ y = [1121, -333, -844, 1243, 126, -1879, 81, 871, -770, -330, 702, -547, -691, -81, -851, -471, 673, -534, -1222, 404, 85, -1757, 215, 662, -1234, -41, 652, -1360, -1096, 606, -502, -1173, 824, 352, -1262, -43, 767, -752, -282, 267, -640, -70, 611, -912, -709, 954, -174, -961, 934, 752, -1057, 345, 778, -697, 40, 1072, -612, -502, 1001, -190, -987, 756, 677, -689, 10, 782, -508, -185, 610, -23, 198, 1161, -366, -478, 1127, 162, -801, 1027, 901, -760, 715, 706, -771, 84, 1460, -470, -129, 1531, 208, -1073, 702, 710, -431, 607, 929, -245, 447, 607, -685, 101, 1344, 43, -453, 1090, 97, -1250, 666, 758, -675, 579, 827, -947, -44, 1295, -417, -773, 1117, 165, -1133, 405, 332, -1132, -307, 342, -633, 300, 572, -1022, -753, 1004, -575, -884, 870, 121, -1231, -36, 175, -1260, -198]
2958a98P24j415M76J266j515n36J569n64o67R48J01r83L96N26p96R80J67j393
2976i14L56J343j346m64J642n15j182J455k17j235J063P14j630N26J601j538k90
2993f31J169m55q82J116l2q15Q22k23j013J224P49j902M17J694j396q55J509l99
3011I7n49J424l40j413J035O33j644M41J886j651m61J228k80q00J104k56q38J574
3029A190n55j014L90J102j604L01J504j159q04J490n27j034J612n07j236J056
3045B05J328j985r0J313j059k81J453o33m95N41l78n90J173J02j452Q80J103j925
3063g90L8J407o03n45J327n41j456J359n1q96J019O71j323N4N36p72j33P95k00
3082a04p80J569m96j456J509Q4j471P56J209j127q43J765r80l94J142n95r84J539
$$ y = [-198, 526, -889, -413, 853, -662, -1198, 371, -193, -860, 88, 189, -794, -398, 128, -668, 312, 479, -914, -558, 785, -561, -1025, 617, 102, -1080, 375, 158, -1077, -14, 700, -930, -404, 1197, -341, -631, 538, 83, -799, 317, 285, -530, 292, 69, -944, 280, 1029, -873, -456, 1238, -158, -1013, 496, 97, -452, 972, 632, -781, 254, 887, -757, -316, 1570, -81, -542, 686, 406, -394, 710, 454, -384, 1190, 635, -379, 11, 1113, -491, -190, 1314, 155, -649, 841, 314, -720, 892, 385, -851, 205, 1533, -452, -542, 771, -288, -569, 884, 251, -244, 297, -81, -671, 502, 604, -848, 32, 1135, -790, -752, 655, 52, -493, 834, 293, -1163, 196, 145, -751, 268, 939, -384, -330, 206, -566, -699, 96, -104, -884, 685, 189, -1267, 242, 326, -1145, -389, 820, -307, -1150, 615, -365, -759, 383, -212, -1196, 343]
3100C43j59j498J268R26j549J18J082o96n60R55m17n65J446m84j130J024N56j261
3118f01M61J172j266l46J305r28m53J322j34j233J156K70j722Q31J070j094k0
3135b10J008q83k1O33n55q46J603J10j563J128M53j334M89J023r47j47O07n34
3153A4p11J429j53j190J009M42j169N57K35m92j29R46p12k76J218j037n41J154
3171E94m21q61P71R31j529K91Q93j123J04J139r31n54J578n32j233Q46N56r83
3189d64N9P46n91LO33p96k22J095k27j321J615l36j087N44J047j386J61J089j463
3208i01K13J188r84n88J625l78j505J002N13r36L08P55n60j03P93r93j4R65o26
3227b26o10J317N2j111L65O05j014K72J003j127j93J333r98m11J057K38j479P43
$$ y = [343, 184, -1314, -46, 880, -669, -551, 531, -165, -725, 230, -187, -752, 694, 210, -920, 104, 660, -601, -140, 1032, -234, -580, 725, -203, -656, 666, 532, -701, 455, 725, -997, -166, 904, -190, -210, 798, -85, -106, 527, -28, -874, 729, 839, -724, 404, 857, -477, 12, 1035, 88, -59, 548, 14, -697, 732, 579, -611, 398, 840, -329, 228, 463, -29, -158, 788, 76, -200, 1018, -19, -560, 594, 173, -688, 83, 1014, -515, -224, 669, -454, -350, 789, -142, -696, 882, 350, -883, -37, 519, -464, -405, 341, -250, -247, 386, -410, -632, 463, 236, -1085, 530, 194, -893, -349, 698, -688, -527, 562, -901, -688, 500, -484, -1072, 553, 175, -1330, -328, 185, -751, -443, 312, -248, -351, 442, -551, -565, 400, -226, -836, 481, 533, -578, -213, 392, -622, -350, 653, -474, -667, 666, -332, -743, 314, 552, -927, -184]
3245a84R26j188M05N23r13K69J309j303m27J548r06q48J274K04j284R69L74j125
3263c77L12P38q43k09J692j427p00J054O45j159N57M73r76rP97j118R15M79q17
3282B7n83J213l73j179J083K57j001O67O24j277P32P19j246q3J481o87p15R81
3300F40j26j106R63j2q37N82N75j291K98J020j206k3J125k78j268R73L03j111
3318g79P85M58q86r1J222j066m17J336m80q51J053j19j089R59L4p23L54R75j373
3337f98N2J078o18p07J104j08r29J119o2r55L63P36j080P4J369j159m62J270m94
3356a07r31J448j10p83P50k38n42K79Q15p88k13J175r73l11P60kn63Q17J15j040
3376d42M09P20j351K57J068m33q47R81M0q10P00j15o11R89m0r99M95Q80j391P3
$$ y = [-184, 742, -446, -41, 482, -431, -162, 1147, -156, -583, 965, 59, -789, 485, 689, -595, 374, 748, -377, -65, 673, -170, -379, 1313, -114, -814, 240, 885, -274, 283, 756, -220, -229, 568, -550, 365, 844, 27, -556, 657, 284, -895, 188, 445, -556, 111, 735, -542, 190, 909, -337, -420, 1061, 374, -341, 640, 514, -592, 371, 359, -478, 104, 679, -612, -314, 706, -500, -523, 602, 324, -944, 29, 332, -779, 6, 464, -422, -513, 709, -357, -774, 562, 82, -769, 284, 165, -924, 35, 69, -654, -300, 675, -698, -646, 432, -186, -893, 211, 103, -826, 293, 231, -724, -361, 375, -705, -631, 738, -421, -883, 387, -107, -1038, 410, 300, -483, 267, 29, -513, -234, 581, -207, -420, 755, -218, -529, 231, 229, -334, 483, 598, -442, -33, 687, -664, -407, 661, 228, -619, 362, 402, -408, 292, 177, -434, 555, 515, -484, 11, 891, -500, -427]
3396d27J140o41m12Q44l24k02L89M39j513Q95P10j243K43R53q03n79J387n75n30
3415b49L96J95p85R92J94j557O16J263j218l19J328m79r89J147k71j061R76J27
3433C06j225P09Q92n72m64R31k03j094Q46J63q84R89j31q19Q22L06j322K64J014
3452E28r93j92P68j67p46J211%j130Q03M00j420L69R50q08k43N98mk68L65k06
3472a85m87R42q5j280J032O59j082j7Q90n56n19R35m2q25R61l79o42Q71K42j135
3492g02J68Q95l11m97R82o79n6M69q8j008J006J32q07M66O79q23j49Q02q27J8
3512c30R45j43q77P81K12j055P90K82p70J52R33q61j47P24l83l68P74l08j050
3531f99J059j9p04K91J015r34j32O77l85n57R72m93o13J396l79j029O54L45q00
$$ y = [-427, 713, 72, -340, 504, 180, -22, 367, 806, -707, 188, 898, -345, -102, 851, 48, -531, 856, 281, -249, 147, 342, -443, 549, 743, -814, -198, 1065, -153, -472, 856, 377, -612, 535, 264, -797, 179, 306, -919, -210, 682, 110, -354, 577, 374, -720, 126, 289, -595, 394, 263, -556, 266, 572, -750, -486, 528, -465, -657, 111, -56, -802, 409, 409, -721, 82, 482, -938, -569, 381, -427, -670, -72, -76, -344, 21, -185, -672, 270, 185, -1095, -63, 596, -486, -503, 387, -169, -688, 247, 205, -620, 341, -38, -680, 191, 433, -702, -534, 361, 50, -447, 535, -144, -200, 269, 181, -827, 179, 311, -496, -30, 649, -174, -323, 479, -348, -330, 615, 472, -405, 376, 588, -467, 323, 605, -165, -13, 920, 59, -88, 636, 253, -115, 659, 351, -699, 360, 341, -363, -72, 943, 9, -123, 554, 169, -388, 584, 91, -522, 874, 495, -534, 120, 465, -335]
3550c35L79M35j018N32N80p93l82J425q38n29R48j7j085M51J194j348J29P28n13
3569e7l18Q71o28m66J004k9q97J85M91o70J43N02m39J59M36p10j90Q41m00n38
3589g10Q14K44q51P3P55j031K00Q90k01r94J180o45p59J416l6r47O57J52k43p
3609d3M56q20L15O08p96m59J016k00j169J193J71o32K84M82m72n28J268n05o21
3628d52J259k56j075O83K62m37J97p4j60K42L07p73K94L51k07m13P81l88l12J47
3648b4P77r56K91M68p55K32J89k07l26Q34j94n22J97J71k17o9L07o36L71N65n85
3669h9J5N77j47o24R79n40q77R90K58j013K07R26r50J42P44l38q95J369n94q53
3689g13P15M71p63O1L16n54J56P96n47n95R53o25m80R33j02m21L99N5k44L5J62
$$ y = [-335, 44, 479, -539, -7, 573, -220, -602, 823, -15, -544, 404, 387, -698, -247, 947, -401, -272, 456, -57, -375, 496, -132, -598, 406, 377, -520, -335, 156, -514, -371, 131, -308, -149, 287, -423, -613, 228, -172, -710, 104, 348, -503, -430, 325, -706, -506, 384, 183, -811, 369, -276, -1035, 381, 345, -602, 55, 207, -36, -43, 413, -407, -92, 516, -280, -739, 277, 77, -1092, 101, 272, -360, -76, 406, -66, -594, 674, 169, -452, 807, 551, -524, 159, 421, -16, 181, 107, -53, 189, 496, -277, 17, 368, 161, -252, 529, 141, -171, -24, 753, -203, 88, 556, -199, 33, 222, 15, -311, 523, 329, -193, 4, 175, -42, -111, 196, -440, -69, 496, -89, -74, 503, 356, -268, 711, 171, -706, 284, 542, -471, -264, 662, -288, -146, 598, 260, -635, 734, 140, -713, 2, 473, -290, -229, 87, -467, -311, 485, -62, -657, 296, -329, -809, 124, 22, -399, 0, 55, -189, -154, 8]
3710Hm52%N10l09n00P28J35r78P11K62l43L64J64o88k9Q41j041K00J178n69r89
3731g97R27O4n66J35O29q38L58K42m68M0M17j38o44P83j59l20L14M00p51N80O9
3752B77o44r2Q82l44l87Q69o39k31N51Q9p96L50M81l33J3O12n01m86Q78k43m77
3773a71L61K26m47J14K58n58J33Q16r60O3M98k47l94N94J13o03L59J58n33O14
3793C94N7p17K62P86o47l12N98o02r3L26K91o26M38J06n55K60K69n01j03P43n74
3814b00l63Q38k98k21K2L00m41L40M40m93p33J377q03j04N95m09k43M70j5o36
3834e77R04m5q54O16M33r04j28Q32j68l66M49j27n07N80p6n48N02K21n96k05J058
3855D94o62o5O47o58k01P40k35m37P41j81p29M31M97p57J72P91m98l62M60Q0q60
$$ y = [8, -444, -444, 66, -243, -743, -15, 120, -858, -147, 115, -228, 136, 300, -388, -417, 424, -617, -417, 761, 192, -797, 130, 194, -372, -237, 392, -446, -88, 154, -314, -274, 143, 5, -639, 144, -15, -335, -21, 379, -372, 208, 277, -367, -459, 423, 79, -308, 561, -78, -309, 242, 331, -465, -115, 366, 33, 46, 658, 157, -329, 549, 306, -171, 190, 416, -31, 83, 341, -217, -84, 732, -228, -165, 333, 86, -308, 286, 399, -204, 155, 313, -220, 394, 451, -266, -4, 782, 135, -177, 421, -181, -274, 52, 343, -283, 155, 261, -294, -34, 235, -266, -369, 374, -200, -563, 275, -23, -244, -222, 78, -363, -23, 417, -76, -809, 568, -235, -339, 256, -153, -396, 74, 59, -577, 327, 282, -572, 44, 477, -427, -555, 277, 109, -257, 192, 65, -442, 138, 62, -486, 16, 237, -359, -564, 494, -168, -233, 414, -244, -445, 295, 60, -377, 364, 183, -546, -115, 382, -375, -203, 588, 90, -272, 188, 268, -592]
3876e92Q51K8n16L82L54o54R9L24k68l90O61m32K44L18l7m98N03J82p57K30Q44
3897H76n33p18J012n33m29Q04J6o18M28J38q15K81Q60r16K00K31r9o6J02j9n96
3918c94O41K87p36J63O08p77j45Q59n76l14P21j62l60L43P2o67N45k7l92R2M70
3939B51l43K3L38l69m10L95jk61N30j69p12O61N07r31J2O51l49k08P73k53o68
3960e33Q91m71m53L86K41l98J02N73o65r7O79m71j09K28L07p76P90K1p06M35L38
3981C12o18J25K20m03J41M41p7n15Q65j62p91N92M27q56kO00k82r1J61k32j54
4002b99M50J23p27P34J73r04M56N88n51k0M80m28Q8N53p68j97N29o1n61N79J38
4023C75p81N87j8j05J8J53j76l03Q97l38j018J131K15j059M23M54q26O04J42l91
$$ y = [-592, 259, 287, -229, 153, 507, -147, -48, 276, 8, -382, 279, -153, 91, 409, 372, -126, 377, 559, -198, 32, 876, 343, -375, 637, 104, -325, 479, 495, -123, 305, 443, -372, -91, 769, -147, 53, 284, 185, 119, 221, 202, -394, 247, 534, -202, -39, 569, -208, -353, 506, -70, -384, 337, 175, -185, 158, 230, -437, 108, 81, -311, -219, 251, -92, -69, 269, -100, -510, -115, -116, -377, 153, -16, -728, -67, 440, -491, -479, 172, -177, -385, 388, 135, -533, 358, -113, -566, -180, 61, -337, -235, 338, -327, -424, 255, -216, -325, -97, 210, -566, 224, 245, -461, -26, 312, -306, -181, 39, -364, -223, 218, 141, -374, 491, 329, -462, 130, 557, -299, -301, 299, 17, -74, 87, -145, -299, 151, 274, -453, 281, 454, -450, 6, 594, 43, 23, 503, 75, 163, 716, -52, -249, 280, 219, -342, 237, 375, -406, 181, 163, 58, 76, 229, 53, -250, 647, 309, -709, 422, 637, -422, 1, 455, -371, 233, 375, -16]
4043a6l08R03l50o94P81m05k92J73K18k85M53J51l45j19N37m52o9N70o56m66R77
4064C06J99p11j03M32m51M66L03o02K83L38n14k26J91L4r5l7L59n94J40K81k30
4085b31J24J90j58l74L71K96p03P20j17p06Q51M5o84L98K79r15J03O34m39J28
4105a88J75J88k70P9Ok96L41K80n30j62O85m02j3J02P7m20M37M29q67M91j74k48
4127b80J12P27n84l24Q70p24l2N60j35k97L40J97n99O1N12m75q6M94l57m19J052
4148F13m59l82N52J93q08K77L05m46L74J4l39l3N01m3m48K41n5l12M66q1l21J06
4170h5N24m49Q3K80o93L4M81K70p83O61j76m52L33L48p13P6O84o45J49L77j49
4191A55m83O27k67j95K8K39m23K50N18p64l79Q99l95MK92j42k18J71Q9l71M00
$$ y = [-16, -324, 579, 229, -465, 316, -89, -381, -208, 10, -275, 178, 329, -16, -135, 402, -50, -119, 451, -205, -671, 306, 505, -206, -309, 123, -328, 138, 441, -161, 122, 460, -54, -280, -89, -55, -150, -187, 172, -422, -282, -1, -231, -107, 83, -75, -449, -78, 218, -485, 235, 118, -588, 263, 308, -376, 22, 301, -614, -511, 123, -316, -188, -13, 175, -95, -16, -10, -306, 35, 315, -215, -377, 308, -94, -107, -5, 72, -348, 89, 518, -349, 142, -32, -280, -168, 559, -25, -349, 521, -203, -235, 325, 190, -107, 233, 430, -169, -108, 404, -71, -157, 337, -20, -439, 613, 154, -228, 324, 517, -291, -14, 291, -155, 219, 233, -106, -139, 362, 319, -129, 112, 57, -255, 211, 130, -191, -85, 439, -10, 73, 353, -340, -306, 175, 445, -338, 323, 147, -305, 28, 376, -337, -261, 423, -222, -73, 304, 155, -328, 299, 32, -163, -135, 104, -319, -69, 449, -315, -694, 205, -190, -186, 106, -36, -254, -83, 6, -365, 35]
4212C5K79n95p4K72M1l76M26k04m41O01J50l61K32K08n79J11P50o49j06N28j76
4233G2k42K70J98q46P13J68m71P6J69n2j56O56o13j34L09p9n08P28M71q73K28
4254H4N91r09m4L54j76M82k8k72k93L06n7k02L28L11n85K66J43j93l97R95o20
4275H4k79M85r2p86R50ln71L06N85o07JJ54j18l54M60j03l06O07k63l77N29j82
4297A20j77K93L10q84K7M84N7l03J74J85o17M47L21r03M49O21q60L75p1j21k22
4318b95P82n29j89K24J26m47K74K44m38m75J053m96J26J98m59k70Q46l06n22P49
4338A96j83k10k52Q60p41K18M01l24K9J96k37k11K98on59N02K88m43J46N91m12
4359A47j83M92k70n25O75k04n49M30K62m38K91N6k10k2j71k7M13o7O1m42M56K43
$$ y = [35, 314, -281, -355, -83, -42, -418, 8, -196, -637, -36, 114, -247, -15, 193, -386, -275, 475, -174, -280, 248, 72, -170, 100, 298, -548, 165, 333, -138, -62, 107, 55, -101, 555, -58, -192, 117, 38, -470, 258, 729, -144, 84, 675, -234, -278, 76, -100, 382, 354, 82, -211, 95, 38, -164, 164, 475, -110, 156, 299, 106, -291, 704, 84, -195, 290, 198, -588, 362, 359, -212, 94, 679, 72, 73, 227, 109, -245, 215, 112, -194, 413, 150, -227, 302, 120, -57, 236, 546, -338, -311, 173, 230, -73, 101, 286, -331, 116, 437, -466, -17, 604, -256, 119, 48, -73, -295, 487, -42, -231, -7, 119, -328, -54, 190, -248, -723, 330, -166, -40, 158, -301, -571, 275, -31, -553, 196, 13, -197, -449, 411, -330, -112, 289, -35, -6, 190, -47, -258, 40, 34, -525, -23, 265, -178, -32, 559, 147, -36, 456, 186, -339, 336, 132, -417, 13, 275, -163, 128, 184, -26, -48, -219, -246, 167, 100, 161, -281, 175, 418]
4381D18n88L03n8p1N1K37o99k1P61k92m13O01P1n80J73M09n52r1P06k89k76O21
4403D21m65j83Q05l36k70K20J96o56K91J71o26N63L43k80n64Q22n42m01Q65J44
4423E18q96N86K45n66l8M67m03n5K41r9l73O97k27k97K67J86m89J88J45k88J73
4444a8J75j83p6J13J33n63M81j94l05M00L21l23j40K74O1m56M62k29j53M88l34
4465f6l32K75K86m58L48j7j86m3M98n48J78N66q14Q3L01j7k10o0K02l21K23J07
4487eL6k58N92m58j73K77K9k52L55K24q93M14M91n39K02L50m98n8L04k26M0J88
4509A42N0j12l32M12l46N28j9m48o9L71rk34K46J44m87L79J03j73K1J95l71J28
4531A19K61l40k76O24m80k28M93Lj69K95j15k94K29K74m99kN18o88j68L91L80
$$ y = [418, -170, 133, 75, 4, 55, 292, -407, -428, 333, 41, -372, 229, 300, -280, -107, 302, -250, -341, 365, 76, -200, 421, -44, -227, 578, 242, -28, 192, 388, -268, 23, 194, -432, 131, 474, 194, -370, 452, -90, -491, 374, 518, -378, 208, 453, -113, -151, 316, -87, -142, 99, 0, -373, 324, 97, -200, 67, 253, -236, -48, 97, -191, -18, 157, -26, -102, 11, 144, -419, 62, -132, -437, -37, 284, -39, -179, 95, 156, -300, 162, -67, -220, 268, -66, -398, -123, 163, -295, 53, 36, -150, -193, 305, -243, -65, 501, -313, -230, 71, 54, -156, -216, -14, -335, -112, -5, 31, -227, 365, -93, -266, 11, 40, -212, 143, 367, -526, -112, 379, -160, 42, 392, -106, -164, 140, -86, -46, 142, 192, 80, -252, 160, -186, 342, 323, -125, -194, 177, 168, -66, 180, 324, -163, 216, 319, 146, 167, 362, -9, 119, 380, 40, -236, 388, -92, -320, 173, 176, 7, 302, 187, -107, 122, 396, -103, -105, 413, -275, -443, -52, 328]
4552C28m24L32o0k40R5J66m26J44O53p45r0N85l98m54P97j93k42j68M18k28Q9
4573f1M18j57j70K9K9m46K78K40k61J33L35m20J70K36l20p6J74j45m91Q60k59
4594I6l55L03Ln19M98J02m44J06M47m92k5N78m32k98O17j03m42K66J49o77N81
4615d1L26n82K97M22k49m46J13K87o08P72j98q6j02L48l53j68N11o47N31K06m28
4636i5k17O93l57J81M9m6k74P5J07j01j18L23l45j36K20K42m23O24k7p03N11L6
4658B19j76JO21j015L75K30j88j04l4L25n40Q3M48o02K57L00j36k97J67J37l35
4679b64L37Q6l76L01Ll61M03kj41K6L05j67n89N98m18O2L62q2m17J33J93m5j96
4702b49M25k38o1K04K66q12M91r5k97K39J69j35J45j60k89L03L92j92k30J29J18
$$ y = [328, -96, 236, 176, -64, 31, 197, -229, -85, 568, -177, -267, 318, -80, -534, 263, 70, -172, -340, 78, -150, -61, 357, 200, 30, 59, 88, -358, -80, 160, -101, 32, 367, -53, 117, 353, 33, -43, 131, -14, -505, 355, 96, -259, 44, 47, -472, 26, 128, -316, -210, 237, -255, -280, 298, -134, -432, 185, 82, -360, -94, 55, -622, -41, 285, -297, 0, 422, 173, -273, -160, 127, -481, 291, 93, 7, -95, 253, -100, -268, 243, -404, 127, 333, -95, -312, 381, 24, 205, 254, 208, -66, 9, 116, 15, -103, 220, -125, -261, -41, 201, -222, 402, 375, -328, 183, 219, 43, 44, 665, -350, 25, 255, 67, -37, -71, 254, -286, -203, 245, -357, -100, 200, 64, -233, -66, 71, -264, 73, 159, -217, 84, 87, -274, 129, 127, -14, 12, 317, 150, -439, 159, -259, -197, 165, 83, -334, -201, -8, -53, -249, 176, -62, -123, 81, 347, -465, 26, -69, -366, -127, 42, -93, 52, -108, -397, -94, 298, 106, -124, 5, 123]
4723A23k94L60K8j74k54O70p90k59P49k57j34L13n2j88N81l4o92M51j23j41K53
4744A36N9P3o41N74k00j92K06j8m92O34j11m44L72K63j14m40N39k97M5L05n81
4765c24M04Q6L54p81O06j82l67L18mJ48l86M61o29J91M10k06k57N95k91m19K57
4786a6M27o51N21Q0l28k08L69l8k61J54J92l86N0K44l87L97k59Q7K7K54n0k68
4808e0L23R3k22p3L21q10R0O24o43J24K52k44l80O94K38m21kj67m3L7L05l32N20
4831B34j85j44j64M62k64k23L10L42o19L71l55j67M90k96k79L94L29k98j40L32
4851A30k11K5L27k58j89j5J41N7j4J85k60l37L48k5k62L41O9j55rM43n88K21J67
4874A31k38J52L8K38o98O30l21l01L87mM9J4Ql17M0N84m10j54N46j16p04N35K36
$$ y = [123, -171, 189, 217, 43, -211, 459, -331, -590, 159, -98, -232, 81, 29, -159, 422, 388, -304, 147, 24, -117, 136, 195, 268, -373, 201, 1, -191, 15, -3, -495, 139, 28, -416, -44, 219, 105, -335, 204, -93, -48, 257, -324, 80, 166, 520, -261, 345, 163, -204, 114, 110, 258, -128, 333, -296, -105, 305, 99, -158, 437, 146, -273, -16, 411, -240, 281, 361, 33, -175, 194, 156, -105, 49, 241, -145, -95, 149, -238, 159, -100, -13, 14, 268, 218, -50, 273, 366, 144, 71, 392, -418, -328, 296, -347, -223, 29, -215, -595, 99, 337, -84, -86, -253, -296, -259, 46, -286, 234, 49, -95, -259, 203, -61, -284, 26, 368, -251, 120, -235, -402, 88, -208, -487, -93, 236, -62, -202, 130, -81, -56, 271, 13, -176, -191, -50, 7, -7, 178, -82, -419, -71, -96, -358, -17, 52, -103, -112, 331, -257, -36, 131, -107, 45, 83, 321, -377, 253, -68, -369, 18, 14, 63, 77, 85, -232, -192, 392, -18, -172, 374, 258, -446, 89, 325]
4897C25l59K22k60L8Q4M49o61k10O14j73k73K71M7k12L73j19n08N11J16n93M09
4918I1J56k21j61O21o14n3L69P0l75K45j07m35L51Q2j60Q1J64k35K19k2K32m57
4940a59L50j62j48J40K66m40nM42m94j05N25j91k40M08J9m43K09R8m11L33J15
4961A07l01j18M15j48j32J45J15l76L74j1o07M58L09l05p1L30m27k0N27j02N1
4982B13r7Pk00k8O4J45j14J23m0l60M57m58j55P81j36k22q6R2k20L92N8k97J95
5005A14J3j63k5J42j85k5R5K21m42L28K47o01L35j70j04J85O4J50l64lM95m87
5027a80M0ON0N9L21q9l52L57r2o6K64Q3l02k00J40LK44pl27Q9J83k02j98N87j57
5052B54n15L20k58j9R9K54j31L0J64k71k18L87J05l69K44k95J08M48m21m22P22
$$ y = [325, -34, 188, -72, -34, 50, 499, -162, -372, 242, 69, -204, 67, 114, -98, 275, 156, -352, 159, 275, -318, 91, 247, 26, -135, 486, -128, -181, 188, 258, -117, 128, 21, -414, -63, 19, -141, -60, 104, -131, 88, 66, 298, -159, 191, 29, -119, 21, 287, -153, -158, 284, -210, -315, 210, 19, -221, 187, 206, -237, -28, 70, -341, -8, 107, -194, -312, 103, -45, -177, -32, 83, -293, 81, 70, -537, -79, 230, -75, -146, 184, -243, -263, 264, 162, 213, 116, 123, -77, -105, -41, 104, -10, 113, 73, -287, 170, -288, -443, 338, 202, -20, -106, -14, -234, 158, 216, -81, 114, 127, -36, -61, 81, -104, -129, -34, 187, -255, 73, 320, -281, 54, -116, -220, -35, 29, 179, -185, -188, 307, -180, -140, -134, -84, -25, 296, 207, -145, 212, 120, 54, 318, 401, 99, -101, 39, 42, 286, 279, -48, 41, 224, 22, -176, 411, 254, -261, 59, -199, -218, -119, 135, 4, 34, 198, -73, -291, 96, 201, -168, 76, -219, -111, 337, -84, -506, 216]
5073B16p2k81K47j09j70J34L36k31k08L43m4m89j1N35j71m2M6K0j03K9J8k74L49
5096F8k33l62P82j14o61L91j6J00j42K16k00j12L42J14k85L00n32K49M42j68k2
5117A57k50K48l74j61M79l34j00N02j3k40N33m77Jk73P29n17O4O8o4J78L75k65
5139B66j13l00K85j74O1J53J45Qj08rk40K54l73K90NJ83o24M69K40n39J55J24
5161A58j62J02K7j47k5J16K73m34M97l78k22L99M82l69n26M34n35K2M86k88K33
5182A43j48J62j57l00K46l00K73L58j56j69p4K66k4j41J45k74M39P7l82r8K4j4
5204a04k07L80r6o9K18j67k48K64j76j18K38J40j78r4K92r4J13L9j54J55k57J22
5226ak07M90j50k99j44N26k62N6R2o32M84k5J51k70K24L10m05M44k90j66LK46
$$ y = [216, 144, -137, 110, 1, -169, -35, 301, 70, -138, 205, 161, -328, -339, 196, 25, -17, 29, 49, -54, -25, -7, -281, 68, -165, -527, 255, 141, -520, -129, -145, -45, -187, 29, -171, -283, 59, 173, -112, 188, -344, -95, 347, 179, 157, -93, 155, -219, -380, 99, -235, -335, 167, 154, -86, 447, -30, -29, -302, 427, -90, -26, 42, -22, 156, 531, 266, 153, -147, 138, -36, 25, 178, 323, 331, 223, 214, -26, 228, -145, 145, 150, 333, -291, 178, 418, -121, 34, 158, -4, 98, 125, -22, -47, 69, 342, -92, 405, 27, -195, 204, 686, 317, -209, 225, -310, -288, 198, -90, 143, -5, 157, 0, -300, -54, -354, -81, 277, 121, -48, -122, 144, 120, -21, 124, -150, 289, 366, -16, -114, -90, -104, -311, 69, -27, -96, 122, -45, -293, -29, -205, -323, -85, 55, -123, -217, 75, -19, 94, 133, -21, 134, -123, -1, -208, 282, 132, -167, -311, 215, -47, 9, 101, -531, -47, -72, 79, -191, 33, 343, -62, 382, 92, -74, -71, 175]
5248A75j06j24m7M3n3J36P8l95L09j20K12l23L69j66j15K97l21L74j1J5m76M37
5270A88l00P0j70M90m85L17L03n45J03L60l82J0L17k66j23K08l01K38J62P5l7
5291B32n81P63n48lK17J90l51M53j14l77n8L13l82k09N40J7l52K62M5q7J19q9
5313@n01M26N8L10n34M48j76q8L25n43L21P0l05J00K93K19m50JP3k82K30Q0k90
5336b15l01P73qJ39m81J46k56J43N77q23L39J16k06mN0k48k79M42J61l51K60K24
5358A98j1m07K53k97J73K6L35m89K51qk25M99k05l30J96K47n08M08n5K50n45K89
5380D5R2j58J52P4l40M7J45J92K0l13j77K51J89J12o18N90k06l96M11k72K24l4
5402C0J88m68N7K55m92M36K6r9m4m7K99j00j44L51j55q1J68l90M02J48l48k2K14
$$ y = [175, 69, -55, -102, -59, -112, 24, 102, -293, 16, -104, 108, -215, 154, -12, -127, 170, -151, 223, 212, 227, -249, 188, -112, -42, -212, 278, -207, 110, 413, -132, -29, 331, -51, -41, 276, 10, -113, 95, -206, 32, 194, 269, 232, -349, 414, -134, -137, 80, 270, -81, 372, 258, -119, -177, 136, -246, -455, 85, 102, -250, 12, 57, -30, 89, 0, -501, -75, -17, 293, -241, 207, 31, -57, 268, -275, 46, 116, -189, -89, 204, 423, -27, -26, 47, -235, -5, 75, -215, -516, 257, 249, 388, -93, 53, -203, -60, 517, -306, 33, 149, -57, -61, -11, -259, -538, -96, 65, -286, -26, 198, 187, -220, 33, -264, -91, -65, 270, -219, 32, 24, -201, 298, 93, -237, -41, 206, -302, 106, 51, 301, -244, 45, 137, -21, 131, 205, -135, -88, 57, 249, 269, -44, -221, 30, 219, 331, -287, 303, 97, -299, 112, -160, 64, 30, 218, -250, -193, 62, -430, 6, 32, -67, -111, -158, 141, 41, -103, 248, 93, 12, 180, -210, 192, 340, -8, -30, 184]
5425A84k23rK42j03n38N62J25l68j10J90Q3Kj45k17L64j8M17n52K32K43n94M81
5447B48N8n35P2K06P2r4Q8j66nj30J79j57K7J68o0l42N93k76k92M17l31K00n1
5470a11J77m92K19K21l20M44J21l13KK00k84K22J68k5m41J85R5o9J3Jq5j27Rq5
5494b75M35k3k13J31j17J44k92N53l45m13L19N84p66mM50k76J59q5L85n75K75
5515E1K18m77L98J33m37L12K63o22j31O03o4k74L54l88K01j3L06m49nL30k80k89
5537b60J99oo3J24N7m6K02k06M24n37K30j06r2O16m48q8K36k04P5P2j10K1Q9Q0
5561B59n35J53K89k18J50K4j62j10L22j85j12M38K7n21m4L48j90j31O24k33l19
5582a26P4j55o9K69K0m05N79R6n04M22j51J13m6Q3k02j05J46J04l86P6q7K29k22
$$ y = [184, -39, -48, 194, 91, -447, 115, 240, -128, -238, -48, 35, 37, -108, -325, 39, 21, 438, -114, 118, 361, -233, 248, 306, -229, -157, 49, 121, 27, 115, -51, -56, -186, -7, -164, -137, 31, -29, -371, 222, -54, -346, 71, -260, -60, -111, 66, -426, -207, 14, -306, 138, 259, -54, -52, 148, -136, 86, 254, 229, -212, -27, 68, -1, 12, 13, -72, -199, -190, -275, 160, 137, -76, 55, -62, 82, -210, 343, -2, -415, -96, 488, -278, -282, 168, -108, 51, -34, 351, -224, 51, 269, -208, 190, 323, -114, 198, 461, -161, -292, 311, 247, -27, 327, -61, 140, 127, 433, -16, -21, 309, 29, -260, -61, -67, -130, -6, 51, 5, 207, 1, 425, -112, 118, 12, -80, 536, 88, 0, 236, 32, 107, 179, 69, 90, 179, 259, -276, -123, 166, -52, 98, 122, -40, -150, 172, -13, -125, 313, 340, -181, -225, 123, -67, -198, 426, 193, -126, -52, -207, -276, -7, 13, -392, 187, 283, -221, 201, 50, 163, 117, 200, -2, -107, 39, 143, -243, -167, -254, -25, -247]
5605b47J17n8J39R0J53n04O35l75J95R2k69m6L7L15k77k6L81o02M68j33j89k3
5627a27M17k30L55l86J73j66j60L25k96Q3M1J73m84M74P3k67k32P66n66J25k3
5648F8j10p0pL77n80M17k58M33j06l08l0K08K86m67j8O57l80j28K13j97j72M74
5670C02k34l04L70j63R6P1j07m9p5k3K42l44N29R1m75L44k15k44P29k21m25j01
5692b06K67j05K38j5l91j39L89j44j17K58l09Q5K10k93k9K33K1j95p0M65j29l21
5714b97q0L32K2k2J4l5K40k11J33k54J01m3k8mJ53l75k3L46j10p9M26l69L98M0
5738B75k69P1K09o68Q8K97J93l52K75o2l0K8Q2l26J82J93rl61L39J43m25J12K29
5761B14l2l04N3q3j1k17M82Qo1k24k6K48l45K14K23K9l21K38J67n80L56J63r2
$$ y = [-247, -130, -188, -49, 41, 194, -310, 325, -50, 145, 237, -32, -78, -41, 274, -3, -29, 352, -250, 218, 85, -104, -127, 290, 60, 415, 29, 202, 36, -124, 201, -95, -12, 29, 202, -282, 192, 265, -2, -234, 532, -34, 91, 68, -42, -112, -119, 258, -322, 95, -163, 270, 164, -144, -174, 34, 320, -147, -165, 492, 112, -16, 197, 0, -172, 302, 68, -236, 134, -29, 67, 138, 31, -18, -93, -116, 126, -218, 311, 402, -73, 271, 56, -188, 541, 320, -105, -206, 61, -44, 194, 179, -212, -351, 38, -106, -223, 35, -274, -189, 21, -272, -301, -68, -47, -242, -312, 153, 24, -297, -377, -45, -23, -45, -31, -66, 174, -37, 96, -158, -57, -100, -128, -132, 21, -354, -377, -31, -141, -220, 206, -163, 235, 275, 6, 77, 286, -382, -294, 3, 196, -156, 119, 57, 27, 55, 137, -189, -7, 186, 177, -184, 155, 298, -127, -15, 214, 182, -122, -69, -152, -163, -380, 102, 110, 49, -175, -201, 47, -298, -84, 139, 168, -153, 85, 252, -328, 28, 191, 99]
5784I9J07Q3r0k82L55l75j13K28L62l82m5K98j59l21K28J17l91O18k32m7j22L69
5806C05m48L8P9k1N7J37l91J43J73m5r6J37o5n8o4L90l97R2L90r05K70O94l55
5829F0L2J57J43q69M21L02k61l33N96j95k19M75n97R8K8m2L5K03J90m14K16m2
5851a6k89K55j65L00k5q7L75o24J49Q0J0K02k03l09M75l14L98j55N9k15K72k41
5873f8j46q9M68j60j52L64rl83j91M64Oj49K14k57j80L4P80p81M06o5o4pj17O1
5897b1j60P2N60p58M64J10n45J46K25k37n7J87K06k91L16J45m65N46p86k7M25
5918E5k11q2J48L42q7k42M02l76k49K96J39Qj06m8L8j07N89n63M62m2k12m74N14
5941A94j80l23K34j8m1K68K00m24L20l92l6k72O74m12K11o2K06k18K22j59j76
$$ y = [99, 206, 289, 199, -83, 272, -103, -216, 12, 374, -8, -53, 245, 86, -235, -7, 110, -281, 337, 105, 58, -64, 305, -143, -105, -26, -47, 10, 147, -244, -101, 72, 27, -69, 68, 3, -55, -119, 271, -126, -34, 356, -549, -279, 415, 60, 92, 249, 392, -477, -56, 246, -15, -348, 248, 53, -166, 309, -288, -190, -162, -204, -169, 34, 224, -190, 26, -16, -305, -50, -215, 85, 60, -27, 348, -276, -127, -47, -37, 165, -38, -347, 128, -186, 212, 57, 116, -99, 173, -68, -214, -303, 165, 5, -147, 217, 208, -175, -366, 98, 104, -45, 169, -88, -268, -234, 546, -235, 171, 106, 42, 35, -82, -21, -181, -109, 451, -307, 157, 267, -278, -132, 93, -144, -201, -14, 192, -99, 217, 362, -103, 443, -343, -370, 55, -156, -238, -90, 252, 165, -77, 325, -51, -300, -4, 135, 143, 37, -11, 27, -80, 509, -54, 408, 366, 154, -320, 194, 14, -309, -75, -93, -134, 134, 334, -90, 230, -162, -198, -470, 204, -208, 3, -59, 147, -71, 151, -8, -184]
5962a84P4K73k52J7J02m23K74J8J09l10M10k45k87M15O2r0k72O75j56l10K82j11
5984G1k58j39K70l4J37kQ5M4l04O4p7J11j11m7K13j15R8K96k39k47K11K36m21
6007a58K68J1R2l98N41l14j07K57pk87P8K55k63K21nj15j71N28n41j10L45j54
6029c4J11M7J06k06J71K1k26m9K74k41P1o3J88n43N14L5m63N15j62n72K41R7j95
6052c63N96r2r4m1L1L77o55J10L31l59K6K28kj67L22k46j72L05k24l06P43k69
6074G9l71K00P3R5K6k10n9K54K13m60k1n9L99m24M07Jn07K28J23j47k89P17l78
6097a10m4K76k54J33q3K55O3j44k99L16RM6m9r7Qk66J47K01j9j87K41J6j57%Q5
6122H7k20J28R6k11M09m69p4N2O69n04j2J82K00l05J23m7q2K51j64n7r9Nl7J55
$$ y = [-184, -110, 163, -89, -72, 30, -393, -119, -101, 8, -302, 108, -137, -424, -9, 53, -37, -309, 366, 210, -100, 182, 71, -187, -326, -56, -90, 47, 45, 130, 174, -130, -66, -143, -32, -143, -190, 23, -92, 6, 302, 63, -184, 27, 263, -158, 110, 121, 213, -185, 356, 42, -65, 192, 185, -102, -24, 231, -32, 189, 184, 69, -102, 426, -115, -225, 120, -34, 77, 124, 230, 24, 195, 216, -10, -59, 215, -26, 45, -18, 170, -373, 141, 176, -287, 228, 66, -506, -265, -168, -363, 233, 141, 47, 6, 37, 414, -241, -131, 200, -159, -133, 95, 93, -74, 248, 2, -170, 135, -89, -395, 348, 79, -292, -92, -19, 76, 102, -108, -167, 87, 300, -160, -181, -240, 159, -265, 142, 143, -364, -136, -13, -160, -449, 268, -110, -154, 122, -132, 1, -82, 173, 236, 92, -207, 109, 118, 164, 115, 18, 26, -240, -93, 108, 89, -98, 143, 159, 2, 2, 87, -133, -5, 91, -120, 289, -180, -254, -202, 467, -37, -49, 133, 333, 28, 151, 104, 22, 273, 109, 52, -47, -42, -79, 76]
6146G6mk87L87j42J59l80M50l08j97K94rJ95m48L05m9l09M26Q1j76O2J72m46M09
6169B61M1j91K7j32J74l47m5L05j98j6N10m83P6J94k72k02M52n3p3M9n8l84L95
6192C0k44j43M84K61o65L74J80q6j82M3j86ql1K57j43K45J0l63J23L0j21K13P5
6215A53%m09M26N2j45k43M13l09K11j83l54M26k14J79m24L15K24q4r5L46o74K98
6237i1J99N9k78K03k30R2O5m9p6J16k8j26J19M5k09J81J19l51J87K76k02j10K77
6260A88J3k60J07P3K4j08j46P2P7m2j1o7K18l52K53KK40m96O3L19l09j12N10n62
6284c06L36k0Q5j95L20r9k2l0ll42L80J68j09j34J23j12l27N93k93J70N2l74K19
6307H0n0L8q1K15j15l08R6J33j4J8J89l11q8K30J8j71m3J30n5j48L41m49K76J08
$$ y = [76, 72, -215, 172, 30, 189, -191, 259, -49, -246, 48, 39, 234, -214, 91, 42, -267, 159, 240, 64, 126, 298, -148, 261, 302, 111, 138, 6, 180, -167, -212, 93, -105, -121, 389, -94, -18, 176, -96, -298, 154, 101, 28, 77, 19, -365, 30, -214, -357, 127, 388, -277, 97, 277, 191, 9, 52, -134, -142, -173, 84, -59, 186, 196, -167, -44, -14, -135, 78, 153, 153, -256, 170, 222, 77, -166, 247, -62, 149, -34, -388, 38, -176, 3, -421, -106, 118, 34, -61, 285, -389, -91, 108, 167, -111, 92, -138, -46, 19, -30, -106, 10, -18, -144, -25, 20, -189, -8, 111, -240, -53, 223, 21, -89, 188, 201, -59, 48, 121, 145, 37, -109, -37, 40, -2, -13, -80, 138, -214, 39, 41, 281, -215, -152, 167, -142, -254, 256, -306, 30, 10, 95, -100, 220, 121, 99, 69, 66, -276, 104, 272, 163, 29, 152, 40, -287, 306, 13, 183, 235, -139, 80, 30, 68, -13, 202, 87, -221, -125, 8, -6, 12, 201, -110, -198, 32, 50, -121, -164, -34, -89, -237, 104, -345, -69, 39]
6331C9o7k95L34n3k45J33J61N9po2l77K37%R4qL71l37l72N02J00l54Q8J93M1m4
6356A31j31j01J40j89L49m28L10l26J53K62k46l06L18J44j18Q5K67j16m03L75
6376A70l40J17l7J79k90J49L8J85j50J18j89m1J66j1j20J12N2l21K60K19m51K85
6398A00K80j9m70J41K1q7K76n54M06m1J48q5k91L68m2k78K29m9k72J26J04m71
6420d60O39l42j05L11N4m8J65M7l62n9Q11n67n05M29j3r9j01L79o8q6J47k85R1
6443b7j68j8J10J97J14k08k57J52k50K39L56m76l63M92j97K26J85l19L59k79N0
6464h2J2J18K32j28j09J07k57l55M74L4K01O5o10K03L0Q9r2jL38mm15J15m47L78
6488a04J19j35q3JN28k70k40K87j02p7K11j17J30k20Q1j20K03K49m90o9M11k09
$$ y = [39, -28, -323, 11, -42, -287, -154, 7, 66, 59, -3, -380, -143, -143, -49, -57, 314, -23, -395, 107, 207, -147, -59, 134, 175, 131, 0, -101, 39, -150, 199, -229, 81, -245, -92, 170, -76, -382, -64, 80, -38, 47, 314, 198, -205, 170, -170, -53, -90, 89, -201, -52, -14, 171, 21, 139, -50, -91, 75, 64, -56, 56, 108, -213, 47, 266, -185, 100, 380, 361, -109, 32, 53, -34, 242, -312, 94, 53, 201, 116, -175, 193, 151, -127, 102, 53, -219, -93, 11, -460, 179, -163, -268, 43, 97, 49, 214, 261, -101, -160, 651, 84, -421, 8, -5, -104, -205, 174, 106, 20, 167, -118, -27, -195, -213, -103, 94, 208, 0, -257, -105, -355, -116, 240, -236, -599, -107, -304, -78, 107, -212, 147, -132, -82, -70, 48, 280, 152, 43, 150, -107, -462, 12, 46, 247, 312, -298, -95, -65, 24, -68, -69, 269, 265, -150, -35, -482, -104, 15, -120, -203, -202, 326, 56, -184, 103, 1, -76, 135, 18, 148, -72, 9, -111, 92, 341, -149, -218, 193, -16]
6510a6k5K19m44J95J71k80K39J09k16O6L25m84n7jJ57Q6L4j12j25K03JK94k77
6533F2J37J01l86K55K8l01M4K31k02J02K52m22p6J40N0k31K94M5l31L38K07l06
6555C1l14L26q8L19l08J77j69O1J03l91M26l66K01r1M02p10J50K85J63l71O1K14
6577A11j91r6K56Q0l23O0o3K03J80k68J55k1m3j78R4J11k85qJ63j60J11L9pk15
6601b95M84J18l57O8J34m51K29Q7k56L11l6o2q0J58k64mM87l21k59J77M21m59
6623a70K84J92o06J10L95l15J68K55m60j30L72p1J0j55L09l73J93J8m8K78k24
6644C2K52m45j59M73j0J3m8o2j23J52o3o6J87j89K33J51k06j48J28J08k21m9R0
6667C0k0J25PP8k27J06Pl44K22j13K06R0R8k12j79K15r5n4K81l26N5J57l09L37
$$ y = [-16, -41, 178, -266, -71, 100, -180, 59, 168, -48, 18, 343, -141, -198, -199, -42, 44, 78, -34, -159, 44, 45, 339, 62, 199, 300, -86, 169, 197, -104, -60, 171, -31, 71, 323, -99, -175, -35, 15, -216, 78, 123, -208, 130, 337, 31, -283, 43, -45, 274, -34, 143, -26, 35, 138, -253, 173, -193, 8, -83, 319, -391, -241, 44, 207, -164, -103, 111, -80, -176, 80, 160, -163, -103, -166, 37, 217, -51, 104, 83, 40, -138, -44, 67, -218, -226, -63, -223, -112, -73, -80, -295, 189, 307, -50, 18, 152, -299, -70, 17, -239, 72, 36, -26, -106, 52, -212, -216, 271, -50, -309, -132, 289, -170, 114, 306, -300, -190, 205, -110, 58, 313, -147, -277, 95, 24, 34, -121, 188, -185, 8, 26, -22, 256, 32, 284, -161, -320, 153, 143, 156, 108, 46, -77, 75, 12, -54, 133, -56, 177, 328, 122, -26, 102, 210, -11, -60, 30, 10, 135, 142, 220, -7, 99, 106, -238, -16, -129, 77, 167, 265, 53, -126, 89, -6, -60, 221, -105, -50, 107, -202, 135]
6691A35K27M2k85k65K70k54q7N5o0n3L25N6j96L48l98K08j00M5k13L37Kl69J65
6714f5K0J3p9K35k19J03J50l2l33J31Q1m56L01j01M69n41K74q3J89j94j3K02K13
6737B65l56J20p5K70m44M2Q3J12L4J04n5m3l40L63l7j7j39R1l59L45o2l81P65
6760B86k71jk92M58o06N42l0k14o0L74k87L79l22P6J21k18K51k39N5j92K10j1
6782IL15l40j87L94p2l00J9J70l77N19l16O3K07r7j66m6K56qk68J20J47m42M01
6805AM9k24L23m6q7m1L49n0m67N31o10L47R7j24M3M1j8m63L03L20n34M23l1o91
6829e59L73R3L27k53K63m93J83NM38n48M14l70J93j73M6j55L8J45Q1k28L30J9
6851A69m55r2L01k17Q0J28KJ93k8k03K12K8k33K89m08N49k89j23Rrj78M79l53
$$ y = [135, 362, 404, 119, -146, 124, -130, -217, -162, -222, -275, 50, 106, -90, 258, -140, 68, -32, 13, -200, 137, 139, -230, -65, -45, -32, -111, 124, -95, 8, 158, 126, -207, -76, 5, -451, -150, -251, 218, -323, -49, -132, 57, -137, -150, 52, 265, -91, 29, -46, 224, -220, -178, -95, 17, 51, 155, 100, 57, -283, 80, 43, 26, -113, -22, -381, -36, -98, -479, 286, 15, 14, -278, 180, -426, 116, 86, -128, -188, 186, -101, 278, -44, 32, 153, -65, 186, -53, 2, -190, 20, 9, 324, -16, -203, 191, 119, -181, -162, 8, -369, 150, -166, -103, 104, 7, -159, -205, 51, 43, -225, -105, 42, -400, 1, 50, -174, 149, 103, 16, -25, 324, 274, -193, 338, -272, 75, 172, 48, 91, 132, 114, -349, -46, 274, -260, 163, 132, -559, -186, -93, 234, -19, 244, -249, -66, -61, 377, -171, 243, -127, 66, -107, -61, -216, -178, -33, 48, -180, 150, 169, -286, -378, -77, -294, -214, -86, -84, 109, 81, -122, 90, 118, -115, 174, -234, 315, 26, -97, -88, -97, -275, 204, -149]
6874a49n4K31P3m7N8K4k02J2J88J69n99N86k38pK17k42q1K87n18K56q8J69l10
6897b65K69L65m02L98j79l32M00p8k00k8N1K99n82M58k72J87N6j14l2O0k2q6j40
6920a89K39k37l8K60Q0j38Qk26M61j1J2o56J95K68j1j12JP9k74K74K73j37j40
6943a9K40k18K3O6q3J63l5k16Q3o9K13p9L36k36o51L52L04j98j94J29l2J70J75
6966B24J16m89N7J57j08J65k14m42l3M68k89J72L41k13J06j19K45k8j91K61k11
6987b5j23K64oJ32j82P7J78l79J1K6j95P40o05l9K63m8Q1J16l20K12J81k59p9
7010B1J10j64j1N2J36k03P9P3k64j2L82q6m15J36L06j08J84j27j31K11L38n38
7032c1l45N70l63K46j70K71o11O98n5j65N0%l29L2L59k17j02L27k58J2K4J72l23
$$ y = [-149, -203, 28, 101, 54, 112, 136, -66, -54, 134, 303, -296, 290, 52, 45, 262, 20, -61, 226, -292, -36, -124, 45, -265, 4, 369, -33, 365, 186, -146, 254, 176, -24, -52, -1, 298, -284, 174, -98, 89, 145, 31, -1, 59, 37, -49, -189, 50, -187, -225, 35, 115, -23, -15, -241, 220, 209, 221, -435, -240, 28, 17, -95, -94, -15, -289, -15, 258, 121, -19, 221, 3, 26, 92, 9, 172, 137, -79, 4, -65, 148, 69, 405, 169, -482, -130, 174, -24, -218, -89, -121, 49, 224, 340, -149, -92, 65, -43, 122, -92, -534, -567, -99, -388, -216, 125, -88, 18, -101, 144, 116, -75, 186, -25, -148, 116, 110, 242, 60, 137, 315, -64, -53, -27, -222, 518, -87, -126, 137, 89, 170, 286, -34, 178, 359, 100, 21, 131, -33, -44, 8, 144, -59, 20, 93, -171, -183, 199, 113, -302, -166, 140, 32, 216, 89, -42, 169, 507, -31, -376, 194, -169, 77, -93, 178, -433, 265, 210, 45, 95, 95, -234, -202, 157, -60, -162, 165, -93, -81, -57, 115, -208]
7055b08m7M23l28K56k34k38L27L6Lj03L17q0l16K12o9J5j05K50j47m26M99m00
7077c63O8K55j0J10K4P5n1Kj91j16M00k82J16j89K45j90j65M17j45oj21J70l71
7100c18J01K03k00L60k46R4K7J30l58J48N9j35J05Pj01P9rj1Rj16K14N9p8J69
7124A92j0l76M81j42l94L04o8r8o9K89j40r1J98l84K83j72K30o8J13j79l4p0M64
7147B59n4l51N67l05l51M76k73r1M8K38m71N76m4k84n4L02q2j63L79m52j57N48
7169B61k79n9M4KL2j86N24l75k01L81l27L2j11P6M8j54N52l94j57M18L7l45K52
7192G1l04P7L64k1k19k81K95J18k2j26K68k95j07J94J24J20k60O1j4k1O0l1k61
7215b10r1O5M85l54j6L06j82j19J82J2l86K28J19j84l1oJ03j48K80r0p8K35k09
$$ y = [-208, -255, 168, -160, 96, -138, -376, -49, -13, -10, -113, 204, 124, -192, 20, -49, -34, -139, 111, -36, -462, 37, -363, -295, -40, -50, 60, 84, 159, 108, 110, -81, -197, 203, -79, 37, -152, 93, -97, -262, 155, 10, 4, -117, 53, -318, -217, -14, -214, 146, -100, -6, 21, 151, -207, -59, 0, -135, -30, -23, -124, -45, -54, -65, -56, -172, 42, 101, 23, 192, 182, -194, 287, 145, -249, 55, -13, -111, -180, 109, -31, -122, 76, -308, -25, -197, 33, -35, 78, -101, -135, -205, 259, 205, -146, 421, 116, -235, 241, -32, -123, -75, 163, -308, 268, 224, -60, -114, 188, 106, -57, 322, -130, -287, 261, -18, -77, -33, -31, 1, -185, 339, -36, -237, 144, -183, -151, -262, -186, -138, -292, 260, -134, -291, 127, 164, -181, 71, -233, -156, 208, 187, -32, -313, -18, 100, 78, -48, 220, -75, -182, 12, 136, 256, -4, 57, 43, 22, 82, 51, -210, -301, -236, 249, -105, -121, 185, 3, -116, 66, 78, -308, -80, 39, -145, -176, -182, -79, -227, 53, -37, -115, 120, -89]
7238h9l25M26N1k05M0L15j21l76M06p9j03J37j14j02L36p7l70K63K44l31j93N84
7260C17o6j96J70j03nq8O2j92K09q0j68J3j22K04L5K24M6j84J10j61J60jo6l89
7284b71K54j19P7j04M31p7Q6L3k03k91M47k42j58K37k7j78Q0K68o60N55j7k19
7306i8L90n62J32k61N64j99O0M6j27K89k6k43pJ64J1j22k63L07l31K63k11J05
7328a19r3K54O5P8n3J32l26m35M42n7k77K92K17k6Mj33J18j26L02r01N19K76l43
7351a90O2J24j10M0J82N2l27K49p5j83J13K49m66L12j76j50K2K43L13l27O0M86
7373E03k49k82L6K00j85l20O54o11J74K10m61J69K98k07k06P84m90J46l0K50m31
7394d8L36m89k9K06J92k44K8l8K42nl1J18l88M58l10j40J69j99J76K5p3K56j18
$$ y = [-89, -414, 12, 63, -142, -102, 213, 92, -284, 122, 43, -60, 77, -37, -139, 197, 120, -250, 13, 257, -74, -267, 317, 251, 55, 225, 122, 117, 29, 91, -101, 108, 28, -140, -127, -249, -45, -10, 214, 260, 76, 186, 25, 185, 184, 118, -271, -17, -136, -59, -163, 268, 191, 277, 310, 107, -184, 263, 21, -137, 100, 73, -105, -25, 243, -417, 138, 121, -98, 292, -270, -138, -399, 165, -34, 26, 72, -55, 234, 208, -35, -42, 122, 133, 11, -252, 55, -276, -13, -224, -119, -212, 42, 107, 185, 132, 264, -62, -497, -55, -112, -389, -97, 120, 94, 98, -35, 83, -43, 259, -642, -123, 153, -190, -128, -4, -114, -74, 108, 160, -167, 82, 7, -176, -63, 186, -280, 32, -144, -294, -272, -29, 284, -43, 17, 503, 254, -28, 8, 208, 23, -297, 357, -254, -80, 130, -331, -162, 136, -71, -277, 507, 17, 163, 133, 383, -48, 288, -201, -230, -24, 168, -76, -48, -86, 156, 151, 120, 238, -150, 308, -2, -142, 27, -172, 4, 29, -44, 212, 94]
7417I4j6j58J5P7k89J1N09l72j22K87J46k78n8K50j30K68k60j34J40P1k8R9K09
7440C31m78k10N51r9l97J6L29j65j25N77l66j42qK47k17J75j25J41M1j15k71L6
7462b74K76J83l67L17k19p4J90J09m5k36J47k83M51R7n97K15K76j33k63L67M1
7483A78n03L73Nk55J63K68m46k49M53m7l0O61n76K34l45j9L55j93q2j85Q6M20
7505B66m21J40N06m18K2j27j0j44K41r6rL5O6P3j51J01q3j41K76K9k22J19L92
7528D44m82K33l31R3O1K74k34j68K71j91K61N2l17J02J69j50j97J59J61o01J97
7549a94J91JJ01L89m91M4J04k0j67J38k3J13j95J79J4r3j02Q5l3j97K28l0J20
7572A62j45o7L21m86L44k73R4P0j34K92m27K15R0K1l86M01J51m49J81N2L5m1R4
$$ y = [94, 78, -80, -65, 12, -277, -266, 243, -129, -251, 36, 182, -96, -154, 96, -34, 234, -26, -160, -20, 51, 23, 122, 331, -147, -357, 194, 95, -302, -286, 43, -122, -247, 330, -36, -178, -186, 61, -156, 19, -106, 35, 76, -39, -310, -274, 2, 185, -182, 135, -84, -158, 32, 141, 96, -140, 7, -276, 175, 272, -325, -110, 166, 33, -230, 137, 178, -325, 48, 53, -202, -39, 229, -217, -466, -13, -60, -90, 571, -5, 229, -116, -135, 220, 27, -55, -240, -154, 266, -155, -15, 491, 73, 95, -32, -42, -186, 55, -41, -50, -15, 51, 124, -27, 74, -9, -150, 126, 155, -67, 52, 444, -38, 195, -136, -43, 18, 292, 58, -110, 161, -30, 231, 283, -34, 68, 237, 87, -110, 49, 210, -391, -194, -3, -2, 99, 488, -3, 41, 145, 125, -42, 96, 73, 186, -9, 170, 184, 91, -11, 74, 41, -156, 72, 42, 162, 17, -50, 271, -215, 129, -144, -50, 20, -114, 178, -249, -34, 56, 77, -309, 92, 243, -206, -25, 27, 62, 21, 115]
7595A15k24l1K02k59K41m6k37K28J91j02J64l40M80k14k45L4j76J21M40j44l17
7616a19J07k12K9K52J86Q7l11K09r8n31N68j36j0j54o3N1PJ87l69K32L19n4k23
7639d6K26Q7k08J58k00j16J09N4j52J92j05K6J44Ql06K36nj36j98K67j4qJ59O0
7663B32k69m7P1Q9k82K42k05O7L72k05j91J68j43L0J57j84J50j71L5j4L0N4M53
7686D39m22L5j29j45M28l53Lr3L23k9m21L9J62J17KK65j84k35Q7rK8L05l70R9
7710e8J29j01qn4N1K41m03K69m4k43L72Mj85o5N9P8K44l7l93J43J31k16J31l33
7734b88K02L65j00j42r8J7M11j79k32P9q7K16n5j84K20j67j00Q7K98j88l60N84
7756B99j84k98K38n5j11N67m42P3j45q9K40j04J30n12J61M07l7j03k7L40k42j70
$$ y = [115, -109, -140, 62, -197, 44, -2, -239, -11, 180, 78, 242, -98, 382, 168, -77, -43, -219, -98, 342, 198, -119, -12, -224, -195, 57, 243, 330, 19, 228, 130, -401, 167, 31, 21, -133, -196, -145, -138, 49, -320, -88, 231, 177, -46, 180, 267, 59, 217, 17, -99, 10, 64, -88, 104, -1, 25, 169, 177, -129, 107, 102, -34, -232, 35, 21, 13, 172, 232, -37, -84, -13, 76, -206, 36, -169, -102, 270, 65, -126, 42, -101, -71, 86, -98, 52, -119, -84, -98, -68, -14, 439, 17, 52, -77, -222, 206, -147, -144, -237, 86, 57, -364, -325, -163, -46, -44, 221, 37, -198, -111, -120, -92, 213, -157, -58, 71, -30, -38, -92, -41, 200, -203, 66, 22, -221, 151, 155, -30, -95, -36, 42, 286, 249, -144, -1, 130, -86, 45, -288, -86, 279, 179, 37, -61, -44, 367, 188, -44, 35, -52, 164, 109, -75, 145, -22, -122, -35, 263, 75, -285, 299, 115, -183, 55, 0, -111, 456, 14, 87, -58, -147, 93, -11, 119, -393, -232, 175, 138, 35, 8, 348, 106, -64]
7778f4J10j52K28K08j61k94L17k62K9j4QK21l01J46Lj19K11n08L05L06R3k19P5
7801A66j18k80K7L9J66k09O56q81N11l7Pq5J21k98L01k09N3J14l46M00N7o9J00
7824A86n13L62O3r3k10K90j99K08Q0k71J34j9J90k03j11k28N06k26K81j47l70
7845b90K79kj2r5L74n97M99j53j17j93P11n57K00J00K52n96J30J09q9K10m8j21
7867fm6J09j76L5O7r1J23O7q4j13K20r3l8k0J99Ml47k6L32j87M9J52O3l76K66
7892H3k86L84J38m12J73M7k54k16N68k78K10J82l17j02l1O1J3J98J04j60Q1j45
7914D1J60l45L00K5n7M2J25l81L13j79q1J96K12l50J04Jm8k52K33J20l75K15j18
7937i9k27J42K79j10l8l4P3kJ0M1J06pJ15om46J14l21M78q9j96K17J28Q1k50r6
$$ y = [-64, 46, -106, 122, 330, 169, -125, 192, -70, -41, -55, -47, 174, -127, 19, 22, -97, 114, -394, -89, 217, 310, 91, 166, 48, -232, -205, -166, 0, -209, 447, -434, 77, 40, 47, -38, 83, -215, 86, -123, -70, 44, -302, 98, 155, 86, 186, -327, 35, 98, 5, -205, 85, -114, 94, 174, -97, 37, 18, 208, 5, -106, -334, 172, -54, 227, 80, -290, -11, -13, -25, -120, 254, -343, 156, 3, -114, -307, 404, -153, 47, 147, 399, -197, -67, 42, -47, 163, 115, -6, -52, 57, -119, -84, -17, -108, 15, 82, -2, -115, 105, 12, -26, -46, 153, 157, -190, -216, 116, -71, -22, 130, 193, -183, 83, -203, 181, 319, -93, 80, 127, -127, -343, 225, -53, 157, 339, 22, -80, -111, -50, -37, 161, 265, 105, 186, 41, 201, -144, 156, 181, 124, 166, 291, -90, 223, 44, -37, 159, 371, 21, 125, 126, 78, -174, 59, 179, -196, 19, -99, -326, -184, 95, -15, -53, -87, -14, -16, -6, 35, 141, 134, 249, 243, -203, -89, -410, 68, -21, -217, 0, 128, 209, -41, -137]
7962a37K27K94l89J24k99M96l74p1j42J13J31k24L09k17j04L45p5j77L09l73K6
7983b08J35o3N70m31K07j8n98P39j61j15J7j66k6N5L32l08k97L60J2k03J54k87
8005c00J13R7K18q0J41r6j47L95l75L89n10J79L08p6j68j04l20J58J01J97r1L28
8027C57l92R3o0N0%m1L7N6j56K38k98J02N5l94J64K62N0l21Q3M10k17K7l9j05
8051c9K20r2pj12Qj18J11L2O9P8MK1k29J33J28l35R2J87R2l20r3K99l21L38o0
8076H6o3J4j16J17k63K13j51L63n1k4j88J94N8l31K45m29L07l45L89p4K28J27
8098C06m58n1M91j3l16J60q7k17L86j08o4J50k12N9q8K57J36m59K32l13P9P5j18
8121a73J74j85M75l65o5L70l14K80p9qj3J99M3p4j68j53m5J4j33N23p9l90J70
$$ y = [-137, 90, 384, -5, 119, -180, 316, -58, -129, -271, -158, -27, -251, 58, -159, -263, 82, 7, -170, 139, -234, -208, -73, -136, 434, 3, 210, 192, -406, 333, 172, 57, 74, -92, -118, -63, 269, -39, -336, 24, 36, -167, -13, -300, -187, -90, 128, 48, 189, 93, -54, 341, -34, 355, -155, 24, 332, 256, 88, -16, -336, -178, -77, 120, 29, 357, -35, 58, -2, 48, 48, 7, 44, 100, -56, 182, -116, -14, 41, -353, -189, 73, 123, -198, -115, 295, 78, 105, 66, -39, 181, 89, 82, -30, -22, -140, -29, 3, 72, 150, 154, 175, -54, 79, 207, -128, -36, 151, 243, -77, -170, 129, -192, 146, 86, 23, 37, -79, 38, -225, -12, -163, 200, 149, 125, -63, 131, 189, -142, 103, -326, -19, -364, 25, -49, 179, 306, -152, -203, 288, 275, -41, 119, 32, -185, 201, 93, 29, 179, -33, 26, -62, 195, 331, -128, 104, -209, -130, -55, -173, 1, -184, 291, -74, -139, 231, -83, 197, 118, 110, 97, 296, 339, 265, 97, -56, -101, -87, -220, 303, 224, -166, 4]
8144Dj56K1K5L48j84j44N1l06l4J35L30j97K29k3N4m63J06J62ok7MK74l31K11
8168H3j85J95l6k18J5K60J5r3K91m00L11l11J3L01m77L74j59j99J90mO5k66J39
$$ y = [4, -152, -131, -106, 242, 58, -86, -35, -341, -375, -240, 90, -107, 122, 99, 153, -310, -204, -42, -48, -75, -71, 203, -128, 83, -102, 93, 57, -161, -146, 114, 129, 36, 327, -73, 238, -73, -60, 241, -236, 138, -21, -220, -30, -34, 31, -235, -96]
8191i6
$$ Imaginary data points
##PAGE= N=2
##DATA TABLE= (X++(I..I)), XYDATA
0@%%%%qJ6j6K0k8M0m9N7q0J04j21J45j77K17k57K98l53M16m83N56o41P37q42R61
28E12j089J233j393J567j759J969k200K455k736L041l375L743m147M591n082N626
44B956o232O910p669Q528r513J0650j1979J3557j5469J7847k0892K4949l0661
57a7018L9366n4378Q7227k78339K15489M97483o06600k06429M85890R5060n37007
68b79256O3603M87597q5459m77267J45862M18706j42433l90978J54635K84097
78A79107j64040j68071K47461P3941k95821n8845K66958L4910j52107Q783O1356
89C3632m5860p426K3320j6983J7398K4974m9206J8006Q3483p6187j38557R7896
101c5510J71573q0599j50642R2212J16474j53774j21675K22905J42990k69455
$$ y = [0, 0, 0, 0, 0, -8, 8, -8, 12, -16, 24, -25, 32, -48, 56, -65, 80, -97, 120, -137, 161, -192, 224, -259, 297, -344, 393, -449, 512, -577, 656, -737, 830, -929, 1040, -1160, 1295, -1441, 1600, -1775, 1968, -2179, 2412, -2670, 2956, -3276, 3634, -4035, 4493, -5020, 5630, -6349, 7208, -8261, 9586, -11306, 13643, -17018, 22348, -32030, 55197, -223142, -7653, 489830, -116770, -323199, 162691, 257751, -279256, -215653, 271944, 186485, -290782, -144920, 273786, 131353, -259625, -104990, 179107, 15067, -153004, 94457, 168398, -127423, -186268, 80690, 115600, -36507, -27724, 33632, -12228, -19654, 3666, -13317, 4081, 29055, -20151, -2145, 81338, 5151, -133406, -35510, 136063, 55464, -95178, -2966, 113508, -40266, -161941, 60964, 203954, -65501]
111f5501j21731L23033N6778l90337J0944M23216p8536l91366J71974L33688k70832
122A330k90128L20438K44056l21234j72147L23799J04048l45036o8436L45095
132A41785L3322l14583M4194K87882j38915k79756J94738K43365k05913j58873
142a52754K05981O8217j99927j3355J61364j9489j08044M5279Q3144m4898q7440
153f1922M794P1429L2622k9604k3631L83p655n006N131J3312L1906q191p1178
166d7610J6790J01762n6490j36786R7182J52231j16543j13456J38427L5843j82257
177a10907K0815K14664l5357k00692M3759J59936o9964j35077R6867J24799j16150
188g307j00855J49379O9199j99614m8702K23706K7120j97777L0742J53091j07438
$$ y = [-65501, -187232, 135801, 192579, -197758, -186814, 236402, 157866, -233500, -61526, 272162, 1330, -288798, 31640, 275696, -45538, -217685, 106114, 210162, -134874, -203310, 141785, 175107, -139476, -95282, 192600, 53685, -226071, -31333, 212032, 6119, -152754, 53227, 121444, -78483, -91838, 69526, 50037, -58007, -12728, 70416, 25518, -61922, -57128, 14301, 46923, 17319, -6312, -5929, -13584, -18590, -13459, -147, 31759, 23568, -47610, -30820, 70942, 14452, -122334, -25152, 127079, 10536, -102920, 35507, 71350, -110907, -90092, 124572, 89215, -111477, -67718, 92218, 22254, -112823, -15956, 108843, -7307, -108162, 41217, 110416, -89198, -137900, 85806, 112926, -84851, -54109, 98982, -8456]
199h456j25840J51598J05732j46189o8111J26576L1387j14226j8598R6569J5987
210D6429p3061P877P1076l9026r0098M6129R1626l5197n0265L6705L15m5211K4077
223h624L0893k8715P162L1792l2884j9331L5695j8583l7582N5035M6076n5424
235E510l8025L6947P748l3562J0865M8197l152n4263m269N5498j4468p0128M0694
248a2408Q8861n5282p7149P0757L4220r9821K012J19895j7038j04082K8812P0785
260D9562m8077n3670N2693N0647l9465m0505L6470K5741n9522k7353Q0494L3154
272F0169p6172j3359N9429k8763n2950N5437M2999n3943j6274M5288j0799l9634
284b8572J0125K3496L663J191m350o524n910j7560L437L8200O819l1899n87J1919
$$ y = [-8456, -134296, 17302, 123034, -23155, -91266, 35310, 66697, -47529, -66127, 30442, 46429, -26632, -18755, 52321, 13295, -76803, -30674, 60952, 25755, -24510, 12195, 12510, -32701, -8624, 22269, -6446, 716, 32508, -376, -19707, 15988, -2595, -40177, 14858, 60934, 5510, -32515, 4432, 12180, -21382, -10517, 37680, 34528, -19735, -24004, 31494, 17026, -53102, -12408, 76453, 21171, -55978, 14779, 48999, -50822, -48810, 71085, 54047, -50035, -21223, 49562, 1485, -52185, 508, 51155, 11690, -28815, 7655, 33396, -26126, -53479, 27015, 60169, -16003, -29362, 30067, 1304, -51646, 3791, 46790, -7153, -23427, 21861, 11062, -28572, -18447, 5049, 8712, 9903, 5553, -971, -6881, -24441, -21004, 17196, 24015, -7884, -8471, 3448]
298C448j6506k591J5642l311N486J5826k1842j7105K2626r015k6500M2093L6382
311D4633m9424k9749L6201J809k9191J8360L0575j2004k2296q83J1187n9j9265
324b0106O005M1420m045m5488Q963K6929l4180p761N8088K240n3567Q858L0131
337A7487k7903j6508L3721J5571j7185q846M195K679j1680j3596K4651L3855k6085
350A0356l1407K5759P728l6897J2354M2597j3561k4788J3105m08j6555O545Q384
363C212L075J3613o271k3856M368R648j3307Q943K5311j1646j7112P128n868j0745
377a3507J6923R665p536P245k768k2393M028J3069j0637R421K4201k1002k3302
390a6593J9644O68k3222J7694K7320j5509j5614M741l694l872M146L124J4221
$$ y = [3448, -13058, -15649, -7, -3318, 2168, 17994, -3848, -20953, 1673, -7342, -33842, 8251, 44633, -4791, -34540, 1661, 3470, -25721, -7361, 23214, 11210, -11086, -11969, -782, -841, -20106, -14101, 27319, 23274, -22214, -13251, 13678, -20502, -28263, 29825, 32065, -21502, -12644, 17487, -10416, -26924, 6797, 22368, 5183, -3663, 532, 3211, -8469, -22065, 2586, 36441, 10356, -21051, 4708, 12436, -24461, -12107, 30490, 16929, -7859, 5246, 4838, -11717, -5172, 3212, 6287, 19900, 13629, -10227, -5859, 3789, -9518, -575, 24736, 13090, -4022, 3106, -2762, -13507, 3416, 13081, 5545, 12790, 10022, -12371, -8343, 4726, -5911, 3510, 27711, 6709, -16593, 3051, 3719, -19503, -1809, 25511, 10002, -5612, -871, -4565, -8437, -4291, -1167, 13054]
403A3054O872k8069j1568K5935m711k3810K5839K5322k8827j5900J7265o973j2057
416a7628J8012J1012n382j754j0014j0844J1487M205o901J4776P840k3070l817
429a2078J4056j4677n494K9298M369k1413J983K631j5513M323J6901k26J862o67
443E355j7528M95J5593j2590o035K8913L125k7301J376R913j5137K608K1266N01
457A0554o191k475j4618o87J8960l259q672J8125K250k3560J211J0517j1131M109
471d867K0190m950r672K480j2523n989K1952O517j1956P342P99j9849L755J4317
485G546j1084J180K1364o766j9354N464J406r038J1385J3577m913n177p520r915
499a1845J2843R934j5407N072K2422j6802k2853J7263O599j9429J2627K3009j4206
$$ y = [13054, 19926, -8143, -19711, 6224, 1513, -22297, 3542, 28864, 37, -15863, 1402, -5571, -17628, 384, 11396, 6014, 4260, -5754, -16598, -5111, -906, -7807, 6969, 14809, -8261, -12078, 1978, -12699, -18193, 11105, 15474, -5939, -3956, -1325, -16838, -12515, 4386, 4160, 6022, 5355, -12173, -11678, 3915, -8675, -14710, 14203, 17328, -9973, -8597, 1316, -13821, -11213, 10053, 10554, 4363, 1888, -12730, -13417, 5543, 2284, -6388, 11737, 13987, -9573, -8362, 2155, -8976, -4867, 15323, 10373, 701, 3181, -9342, -15331, 6621, 13138, 1182, 8524, 9323, -10526, -6771, 7546, -3538, -2358, 19006, 12240, -7114, -1650, -244, -9282, 2103, 15680, 10767, 5590, -1930, -11845, 998, 10932, -4475, 597, 23019, 6217, -16636, 627, 7226, -12203, 424, 23433, 9227]
512I227j6266L373l259J874J4262o11o712M202n500r164P543k02m707J4652O426
527A5138j7866j609N451j7189M725L0776m814k4639P673M346j6320Q187J5911
540I770j0871k725J2535p576j1830M333m21pJ4558L426j0879o616r028J88K2109
555F966M099j9635O980J2222k2350o942K6505m893j9924K0322J6213k4096j1258
568a5791J0300k418L025J6843k278j4332l982p9M178P084k550p15R337q277j1538
583a1193J3400l37k0991J7019K9374k0848k3780J7106J949j7269J6958J9068j7142
596C314j1279R638j716n867N450K906J498N064l558o112k101q067O407K2133m277
611A3433j9538R312M827k2627P305K6983j3210j6145K0589L240k5087K472J4256
$$ y = [9227, -7039, -3666, -6925, -5051, 9211, 8600, 1888, 6090, 590, -8574, -1031, -1233, -5940, 8712, 15138, -2728, -4337, 1114, -16075, -11350, 19426, 14612, -10027, -2354, 1992, -14328, -6141, 9770, -1101, -3826, 8709, 1133, -10697, -6364, -6785, -6792, 7766, 11192, 313, -6303, -15331, -15143, 6966, 11065, -8570, -1590, 10632, -11718, -18660, 7845, 2952, -16972, 3350, 19563, -4533, -15791, -5491, -7909, -4884, 11959, 9681, -4651, -8633, -8712, -4534, 2550, 0, -715, 8622, 345, -11193, 2207, 1870, -19121, -2102, 27272, 6424, -17356, -250, 1699, -15570, 1388, 20456, 3314, -7965, 1673, -43, -5910, -460, 2446, 3944, 9008, 5450, -662, -2763, -10830, -4423, 17710, 13433, -6105, 3207, 8034, -14593, -7288, 19695, 6485, -9660, 10929, 14169, -10918, -8446, 5810]
624E810n806L859J3125j0706j5729L501N963L020L290q70L9q22j1821J568J5069
639I490j0311j2291K6909J1421l5918q080K7182p051j4598K6236Q597l0853o004
652a5271J9285k074p734O582M328k341k007k743o71m117n329J4928J7479j7709
666B606j8289J4125O59j5363J8097J8987k5250j2166K2324j922j8265R934R224
679D701r417P105Q956j6664j1916J0358O829K145M783l376p939n992j024J3439
693A988Q220j7351l917K4781n700k8766J2248K0026k0287j886L1835q674l4523
706b2006Q771K0560q244k474J3275m384j3318J460P958Q38p327n16J5793L293
720A3679k1021l350J6938q856j0093K7758P340l3062l360K3588p969j1400J7478
$$ y = [5810, 4, 3863, 16988, 6282, -9447, -5946, 17, 3037, 6327, 5457, 5496, 4674, -7147, -5579, 9490, -821, -13112, 13797, 25218, -10700, -18780, 8402, 1351, -13247, 12989, 21586, -9267, -15271, 4014, 1940, -5794, 788, 5116, 2775, 768, -1975, -2646, -6763, -12092, 2836, 20315, 2606, -15683, -1558, -899, -16262, 1835, 20822, -4428, -16594, 5730, 3808, -14457, -4523, 4701, -4716, 2389, 11345, -5319, -17235, -6877, -48, 2097, 6880, 3504, -4435, -10427, -11451, 1988, 10208, -7143, -11060, 13721, 8021, -20745, -8497, 11529, -8758, -10644, 21191, 12517, -22006, -13235, 7325, -919, -3393, 9882, 5498, -7820, -6360, 1598, 2436, -4891, -5407, 10386, 13679, -7342, -10692, 6246, -2610, -12703, 15055, 22395, -10667, -14027, 9561, 1592, -9808, 7670]
733G670L914j4615M871N912j3454k068J1983J504j86L006n638q460j641N584J2445
748A0827O00j5845K432J5004j4210j4771K2625Q230k2949P214K2737k1668k1682
761b1456K2084J1852j4218M617J0274j5045j0281J2035O345n437l441N839O592
774I760r063j2642R870R173j4559K586K5707j2664l0797J4439K1051j7334m002
787h475K1861p510j8765J0363P070j2358J254J1540j298l187k85n685l072K233
801f314O755R063m302j5846M449J1146j3004l660K2144l078k0909J2549J3359
814A2352k3548p006K4068J469j2558Q237J746j7135Q90J5562N86o202J104K061
828A626r15p241j261J1008P22j1557R910J3876k1238j6432K4354R318j9551P794
$$ y = [7670, 11584, -3031, 1840, 7752, -5702, -7770, 4213, 5717, 5531, 8537, 2899, -5561, -7202, -1618, 10827, 11427, -4418, -1986, 13018, -1192, -15963, 6662, 14892, -8057, -843, 21894, 226, -21456, 628, 12480, -1738, 2879, 13153, -1892, -12173, -138, 6207, 770, -2671, 3168, 9760, 697, -11945, -2075, 7098, -7461, -4875, 20832, 8168, -22629, -8190, 12861, -4473, -8475, 13386, 5876, -12889, -2526, 4544, -7814, -6560, 4980, 3682, 495, 210, -5475, -8547, -6314, 441, 9504, 5202, -10644, -6195, 4951, -8053, -11713, 10431, 7353, -13556, -1007, 12352, -11196, -18202, 5866, 7335, -5223, 3014, 4760, -12375, -11485, 4077, 4663, -1539, -435, 1626, 711, -6530, -7791, 3217, 3939, -7618, 2292, 16168, -5070, -21502, 2852, 12170, -7381, 413]
842D13J5436j9180j2499J8878M283j2751N824Q970p603l985K277j924j119K928
856e2O331N031r213j2506R142Q590j1913L158J8508j2024j8593J6296Q264j9307
870h288K007J9789o637r725P863l592j0587Q182R341l365j718m75m383j086P81
885a893J850P510k238r557Q044N188j8021k703K2569k003j5673J1639N759k1131
899a0660q08J9529l142r144Q739P05j0715R76M872k028P24K843K378m93q979n794
915a0997J1929L683j0599O909J1333j7300j1576J9758L028j6501P959J3449j2214
928a139p450Q150k917m133Q735L465m179o72l584l979N015K265m45N419k629r515
944g593N717M270j1390K951J6305p312j0865J0426n51j4392Q014J3179p439l476
$$ y = [413, 15849, -3331, -15830, 3048, 7331, -5420, 404, 9374, 1771, -2214, 63, -1861, -2980, -52, 6279, 11310, 2097, -10409, -1267, 7323, -4590, -1432, 17076, 5052, -13541, 2755, 11019, -8288, -6281, 13508, 6871, -2854, 5009, 1417, -9170, -988, 8353, 4988, 3270, 2795, -1588, -2674, -1893, -43, 7467, 5229, -4328, 3716, 8904, -9117, -11820, 10749, 8746, -6927, 4712, 10471, -10660, -11468, 8061, 4919, -4225, 4514, 5219, -5496, -4520, 352, -1676, -952, 1891, 4269, 3776, -5203, -10997, 932, 4615, -5984, 925, 12258, -5042, -16618, 3140, 6168, -10333, -2374, 11075, -1139, -8589, -439, -3356, -7489, 1246, 4711, 532, -140, -3724, -7703, -2688, -423, -868, 4551, 1922, -7593, -1876, 2394, -8996, -6045, 10260, 2948, -7917, 2509, 1958, -12434, -4420, 8759, 1320, -2156]
958b156O231o315n739P609K797l474L308J517l644r64m074j23J0020R1q446P806
974D444M201j8072j261K0302l081j3105J1344N772j5361j848J0201k377j786O330
988E703j040l940l09l687O29P395q14j787M866n455r315Q658M876r347N104J0863
1004A2400j0806r032J0340k40q310Q280O714q811l28K140p380K051Q111k957j900
1019B72N352l992o851L544J130j36O429k365o852N435K77j2209O034J4555r117
1034A506q159J1566j939j3532O175R040m984j25M573n826l553K937j546K107N884
1049D124l717k166L806o332m751J0767J840r642P304O357j4666l805J3145j534
1063G30o522Q541J880q626j15K191l104M683M007n442J215L669q068k503Q341
$$ y = [-2156, 4075, -2240, -7979, -370, 2427, -1047, 2261, 3778, 134, -830, -4904, -5027, 4993, 5084, -3362, 4444, 8645, -9427, -10688, 9614, 6533, -6572, 4772, 10544, -4817, -6665, 3536, 1159, -627, 5703, 4663, 723, 414, -3273, -2644, 4751, 3937, 2150, 7016, 1561, -7754, 904, 5780, -3567, 1537, 12400, 1594, -7438, 2902, 2662, -5648, 2632, 9346, 535, 207, 2347, -5033, -2982, 5129, 2172, 272, 5624, 1632, -5219, -1675, -545, -681, 5748, 3383, -3469, 1966, 2243, -9966, -3932, 10623, 1506, -6653, 4913, 2974, -10558, -4383, 4657, -327, -452, 4121, -1705, -5258, -2321, -3867, -1760, 4124, 407, -1759, 2047, -4285, -9036, 1731, 3571, -6071, 1233, 7590, -7076, -10881, 2264, 730, -5792, 2749, 4629, -3997, -4112, -1921, -5025, -342, 3665, -1777, -562, 3107, -4961, -7464, 877]
1078H77Lj770N797l936p364N681J048p178Q539P676j1120l449R961n845p095R686
1094A511M611o083J640J189p014R29N253j877K010L536o104j540L557m565N79
1109b368R445l632o682Q928K21j4761M461J3596o685m590Q578k453r402L714M556
1124B926k140L390J44m982K615N86o675K841P250l749n91M015p028m858R104j33
1140B715n532P883L088j3420O04R511n896l873R657K76o474K467r11n583M598
1155h90M266l154J999J029p250m29M767k180J410N561o163m043Q620l877j0062
1170a0396J0125Q377j0944o08Q341p463p025Q795M109m278J793r85m365K295Q11
1185a418k815M291K989m936J546J548q118Q64J0205l626m936R866k882j3243O385
$$ y = [877, 880, -890, 4907, 971, -6393, -712, 336, -6842, 1697, 9373, -1747, -5196, 4765, -1080, -8175, 1511, 6122, 39, 1679, 2868, -4146, -3217, 2036, 159, 2169, 5705, -399, -1939, 1618, -2947, -2368, 7077, 3445, -3237, 5691, 5912, -8849, -4388, 9208, 2523, -2067, 6511, 4058, -5344, -1630, 2926, 786, 4176, 4320, -662, 1953, 2539, -4136, -1295, 5955, 2206, 1615, 5630, -1398, -6256, 2848, 2715, -2817, 5066, 8154, -5266, -4662, 4849, -1047, -4920, 4737, 5013, -1461, 1006, 95, -5488, -890, 3376, 222, 2221, 3250, -4000, -4429, 338, -1842, -432, 5129, -1034, -5077, 3543, -334, -10396, -271, 8106, -2838, -3446, 4895, -2568, -9593, -798, 3311, -967, 826, -159, -4524, -2229, -1418, -4233, 58, 3047, -1889, -343, 1205, -6913, -6049, 4156, 530, -4406, 5460, 2578, -10665, -4280]
1200d280J0181p740k165R328l535o321L724o31k420N348J459l275K293j714o472
1215f220L887N478l122J687K887q062k17Q075n471m780J1469J797j1953L469P031
1230E955r972j909J1632P11o316J468p77l827L375J946j423K858j130l517K851
1245A925K78p062N166P977p937j470Q641p340r966J2068P565j1035m12Q165n859
1260G04n242N801O33k084L160p49k055J819l783l199P244K900n159K258m3q122
1276e917L210Q192o475k585R770l420j0497P525M510r977J923J0270l695o677
1290c843L031j053k204N011J095k158J065l004k087L863m54m570P155K778r422
1305d797J923P271r980m354J5058J601j2437K655O599p929j648P799J50l130J004
$$ y = [-4280, 5901, -1839, -4004, 5324, 1789, -4532, -808, -1439, -3859, 1489, 2948, -327, 1966, 252, -6220, -2333, 3145, 23, 1710, 4597, -3465, -3682, 4393, -1078, -5858, 5611, 7408, -4545, -1076, 5955, -4017, -5926, 5706, 6417, 101, 1569, 792, -3035, 340, 2286, 863, 3721, 2591, -926, 1925, 2203, -4859, 307, 8284, 347, -1123, 7518, 178, -9788, 2280, 9845, -1190, -1602, 6563, 704, -4538, 1263, 1896, -188, 2972, 2223, 168, 1987, -1796, -4995, 2249, 5149, -10, 2248, 2205, -5917, -2707, 5485, -990, -3575, 6195, 2775, -7722, -197, 4313, -5664, -3741, 6529, 2834, -3843, -812, -1865, -4069, 942, 2037, -121, 944, -2060, -4147, -284, -738, -5308, 1847, 4625, -4797, -2874, 4397, -5583, -9937, 5121, 6722, -5715, -3060, 3539, -4390, -6038, 1761, 1911, -1219, -215]
1320b15r56m86J528l943L90P498j148n794L737q51p432O500P439p764q13P359
1336E049o326o348R784J657q417M556O588o612l352L333j414O71M602j368k106
1351B97J318l832n02N705p28l928O133p38q442N286M752r620Q25J2881m576j0712
1367e881O711L792q190K424P597l052l517J49k52J417M58l275K586N622n690m244
1383c345O056k204n604Q433M172r484P35N583o755k718J0200j048p092M106L142
1398D177o309q07L479j397K412K181m081r53J558l982Q42P462k818m145M229j955
1414a07n627N842K997p735K950Q734q000o532Q148M50o095N305M232n191k856
1429c485J356p14K840P99l615K914L065o890j193O810l319l599Q449N10r521L093
$$ y = [-215, -1171, -1657, -129, -4072, -3682, 3816, 2668, -3126, 611, -240, -7672, -1172, 6267, -1497, -2310, 5049, -1277, -7625, 2159, 3816, -4601, -45, 6543, -69, -3421, -88, -1502, -831, 3771, 2403, 297, 1615, -2217, -2719, 2986, 2258, -1670, 4463, 3725, -4717, 569, 5321, -4299, -3474, 9407, 4831, -5881, 830, 4622, -3568, -1144, 6453, 3401, -116, 33, -219, 1198, 1656, -1619, 967, 6589, 899, -3345, 2711, 507, -5097, 3336, 7508, -1976, -1241, 4342, -2413, -5131, 5069, 4021, -3071, 1035, 4177, -2132, -2939, 540, -857, 1555, 3736, -345, -1298, 260, -3722, -2880, 4582, 1764, -2381, 1848, -107, -5734, 108, 3105, -4630, -1680, 7054, -946, -7478, 670, 1120, -4975, 330, 4562, -629, -3485, -2129, -2843, -3, 796, -2819, 95, 3160, -3730, -4923, 1887, -1432, -5031, 3418, 3928, -5593, -2500]
1445b500M550o789J264Q804m121n715M320J092m125J769J903r49L002j385m429
1460c309K614J746n312L793P048o237m290N273j359m141O658J577o638L119L894
1475D436o970j522P181j958k782N548k24n667N04J083j25M035k10m500K223K233
1491C285o238J053P260m706k299O941k429p144M780K790n898L678O033o869l894
1506c657N199k89k808L251P21j609J796k801k863N182J94n621N583M320q416k621
1522d439P011k441l475O501P94o709K498K008n145J714M876l259j075L314k559
1537c86k775K610o53k03M854k480n325M373J588o652L316O313n303k646N420l023
1553i72m226N230J046l883L908J631o885Q4N004k085q46L997j805j789J221k195
$$ y = [-2500, 2050, -4739, -3475, 5329, 1208, -4507, -187, 905, -3220, -1451, 452, -497, 2505, 1120, -3309, -695, 1051, -4261, -468, 6580, 343, -3947, 1326, -33, -4174, 2484, 4061, -2577, 542, 4436, -2534, -4056, 3125, 1167, -1615, 3933, 3709, -1958, -1454, -371, -496, 3539, 3329, -1171, 1052, 3285, -2953, -1900, 5360, 654, -1645, 5296, 2867, -4277, 503, 3293, -2605, 1073, 7106, 237, -3657, 1542, 1253, -1555, 1696, 2417, 808, 2604, -197, -3060, 2122, 2316, -3305, 2278, 6598, -1818, -4439, 2572, 131, -3344, 3157, 3951, -2758, -260, 1748, -3397, -1683, 3193, -66, -1141, 2173, -386, -3161, -551, -1204, -1407, 3447, 967, -4358, 15, 1603, -5049, -1733, 4580, -723, -3369, 2051, -972, -5198, 32, 1078, -2805, 1103, 2734, -4151, -4067, 937, -1148, -1994, 2003, 198, -1591, -370, -2565]
1569b565r12N634j290m449N473J665q932J353P306l719k354N822j578n210L165
1584e91J299l663L374L076m582L43K033l096j6L176j425N16L666m889l545O409
1600B085K9o135N466M117o732j496N810l352k023M824k87k603K938j443m363L418
1616B53K795l298J484K468l965o54K644k396L38N052k925m026N298m61o804L480
1632g17N976m937q58M327l709l104M322l55j530L615k96m819J683J857l663K095
1648a13K919l154P46K210n107q03O114j847m359N765R90p057P45M903k896j239
1664b183M606j910k276K263k438j880M533O47l536K504R28n004J555L032k887
1679b046J184M025m668k711N157j289m698N423L280n904j03L299l224o57L740
$$ y = [-2565, -3477, 2157, 867, -3582, 1891, 3556, -5376, -4023, 3283, -436, -2790, 3032, 1454, -3756, -591, 708, -2955, 419, 3495, -1087, -744, 1289, -1807, -1823, 1353, -72, 444, 4110, -779, -4324, 2085, 2114, -4021, 1445, 5562, -1170, -2666, 3144, -208, -2231, 2593, 2306, -297, 2641, 1198, -3165, 253, 3048, -250, 1234, 3702, -263, -917, 1727, -669, -331, 4721, 1796, -2230, 3068, 2607, -4197, -717, 5259, 322, -536, 3791, 82, -3022, 1300, 945, -585, 3030, 2734, -2085, -402, 1455, -2208, -113, 2806, -348, 398, 2608, -2499, -3302, 2812, 965, -3394, 2371, 3361, -3696, -2951, 1952, -944, -2183, 2423, 513, -1763, 500, -1938, -3818, 715, 1362, -2174, 330, 1258, -3746, -2191, 841, -2046, -862, 3163, -1505, -4216, 941, -348, -5046, 377, 3657, -2247, -2350, 949, -2275, -2932, 808]
1694H08j344k99L042k590l570L827O91l204L430K049m538O59J662m068J257N881
1710C693l842k646N296p72o297L516L966l846O55L002l064j070K264k087K77M385
1726C430j699l637L405j046l518L338K731l665J513K646m878o93N293k720k566
1741b066O033m24n411J350K511l216J646K649k211j97K104l746r09M947j996k259
1757a195M100n39m378J784J810l311K321L839m459j926M643k467l673M855J502
1772B906m052J366J560l362O78J559k079J944K818m231j696L969j395l131M481
1787A335P26l739J419J461m276J422L628k741j055M580k503m188K673J903k729
1802b084K080J330k665J24J411l126J424L672k861j508L988j939l890L774P30
$$ y = [808, -536, -835, 2207, -383, -3953, -126, 565, -2639, 791, 2840, -1698, -1039, 623, -3445, -2188, 3693, -149, -2795, 2501, 1729, -4568, -1052, 2914, -932, -277, 2725, -339, -1409, 855, -1232, -955, 3430, 1731, -1906, 1499, 453, -3065, 273, 3004, -661, 852, 3498, -1380, -2073, 3220, 500, -2066, 3967, 3543, -1868, -518, 1993, -1223, 423, 3072, 861, 664, 2768, -978, -1887, 3060, 1064, -1195, 2905, 2366, -2012, -228, 1582, -1729, 592, 4431, -28, -1954, 2689, 222, -3451, 1404, 2906, -1146, 220, 1780, -1582, -904, 655, -1424, 520, 3338, -893, -2589, 1380, -15, -3146, 1335, 2061, -1678, -259, 1202, -3074, -1652, 1976, -765, -1820, 2760, 257, -3931, -1258, 645, -2084, -4, 1326, -1339, -1215, 196, -2930, -1506, 2166, -695, -2203, 1785, -154, -4044, -270, 460]
1817D60l111L256J830n387M26L775k521j325M789m87l878J408R77k172J692O34
1833C66j382K054J140m629K13M467k951j662N173j075l777K123R60l261K503K789
1849C051l801N80L106l635k007M249j73k116K620Ml427J899N73k402K472K386
1865C379l728k66K913k438j886M194l95k736L350j57m738K196L106l210n7L839
1881C366k137l286K541O23j792J866K66j788K148m50m008J889L500l480j47M122
1897C233k761l515L318R59k479K494R01l963J274K252l666j83M130j451j493J995
1913A045p90k941K327N44j919K841N39m185O16L249l189j6L620j596k236K989
1929H98j315l125L085K028l553J450K723l818j653L332J42j314J679p97j223J840
$$ y = [460, -2651, 605, 2435, -2952, -2526, 1249, -1272, -2597, 2192, 1705, -2173, -765, 212, -1960, -268, 366, -1016, 1038, 2178, -2451, -2238, 2229, -722, -2384, 2789, 1714, -2063, 60, 1020, -2241, 262, 3051, -750, -170, 2936, -699, -2706, 1543, 1370, -746, 1874, 1878, -1549, 350, 923, -1479, 993, 3379, -349, -615, 2298, -140, -2026, 2168, 1773, -963, 2387, 2230, -2508, -312, 2794, -416, -473, 3366, 1229, -2057, 484, 1107, -685, 1181, 1447, -341, 1807, 1357, -2651, -762, 2738, -742, -889, 3233, 472, -3043, 275, 1234, -1245, 1249, 2150, -1813, -539, 1713, -1953, -2136, 1994, 543, -950, 1045, 255, -2686, -359, 185, -1734, 1107, 1646, -2539, -1923, 1326, -1863, -1879, 1741, 145, -2091, 898, -417, -3542, -457, 1571, -1982, -532, 2191, -1627, -3280, 52, 194, -1120, 559, -238, -1461, 379]
1945C79j050k103L243J278l410P81L252m005j452M177q00j498K688n55l379K375
1961g9J516l469J467L043k152j273J967j247j854L058j3j022K090j107l690K618
1977a47K095k848R31K790k771j133K868j495k172L973L7l244K233J203m246N83
1993a343L846j502p53J446j467p19J591q20o26K916n42l584K764J363m185M16
2009a199M054j797j326K320j652k875L462P83k694J749J730l602r0K370j585k24
2025e76K072q61q54J979k398j644L483N29l527J971J573l283m02K994j919n16
2041a379L182j510k331K422j94l220K318K748k327n09J252j765o53K121o90o92
2057a227K767j869k721L232L31l299K138K566k547p01K112k476o67L344j78k401
$$ y = [379, -671, -2774, 469, 1747, -1663, -882, 2370, -1635, -3087, 1090, 290, -1208, 1480, 925, -2454, -79, 1437, -2032, -565, 2478, 326, -947, 1020, -227, -2081, 977, 964, -58, 2032, 925, -2765, -147, 1948, -900, 31, 2821, 50, -1083, 1785, 290, -1882, 2091, 2128, -1116, 1117, 2320, -1926, -1343, 2503, 1001, 248, 1694, 227, -492, 1099, 279, -347, 2569, 2027, -1557, 1207, 2570, -1615, -1199, 2855, 1058, -268, 2052, 400, -2475, 987, 1770, -924, 825, 2555, -1047, -1137, 1233, -352, -576, 1496, 635, -219, 1760, -638, -2282, 1201, 1730, -1797, 174, 1747, -1536, -1938, 1056, -863, -1379, 1803, 293, -2038, 384, 190, -3030, -712, 2036, -291, -800, 452, -1313, -1966, 155, -535, -1227, 1540, -329, -3050, 182, 513, -2786, -648, 1918, -629, -1330, 782, -1694, -2361, 983, 805, -1596]
2073a596K236K74l328J228K241k010N34J393j738K75J494k590o54M182q33l208
2089b100K657J060l786J322K786k321J28K562k706r44K848j247j858K874Q46k800
2105f79P71J046k331J034K437j908K27J219k461j078L831q60l069L328J243l373
2121f23M21J776j946p7L067j941j244K523j313k469K394J353k141R40N50j822
2137e52N36R06j662O81K662k194k219L272m53k989K130K242k400k09J619k518
2153a148k23K566j277j328K877n93k975J999M38j916J538J120k520J188R85k680
2169a949L63L419j902j987L202l67l218J560J515k262J230J782k274m48J985j614
2185i65j319K849J71k535J674M08k050J140J236k122J336J829l027o34L106j410
$$ y = [-1596, 640, 914, -2414, -1186, 1055, -955, -421, 972, -766, -491, 1003, -1587, -2241, 1941, 1108, -2100, 557, 1617, -2169, -847, 1939, -382, -254, 2308, -398, -1342, 1506, 259, -1599, 1275, 2121, -679, 92, 1138, -1193, -159, 2278, 370, 597, 1816, -645, -1723, 2108, 1248, -1821, 1507, 2750, -623, -202, 1574, -372, -449, 2618, 677, -567, 1956, 643, -1826, 568, 1921, -220, 720, 1270, -552, -16, 890, -772, -91, 2571, 377, -1842, 1430, 977, -2012, 118, 2360, -40, -249, 1370, -1148, -1371, 1195, -82, -1410, 1467, 874, -2101, -102, 336, -1580, -42, 1078, -1442, -254, 731, -1949, -1586, 1833, -69, -2056, 1146, 779, -2439, -879, 636, -1626, -396, 1386, -888, -1336, 649, -965, -2284, 565, 736, -1799, -125, 283, -1767, -627, 609, -1513, -177, 1652, -1375, -2009, 1097, -313]
2201c13k186L003Q58k622P43Q41j855Q53K205j924k07K163j800j671K595j52j575
2218a044K367l01k068J169M99k226J757K741k926j191L080j252k465K577O38j846
2234d91J543R34k787P52J548j731O8K485j355k029K291o30j483K007K95k078J722
2251A061Q72l261P38K504j977n70K852p08k904J709K71j555J851L89j851N79J259
2268A259k131m51K835j001j290J801m37k376K117J99k178K231J393l353P7K789
2284A484k102j266K810p7k172J359K21j940J250J086j945R32J551k059q03K055
2300C84p12j158K300p05j772J899P4k442J457J696k061k75K487j607j498J973
2316D0K49j425J547J03j860J380N20k557J180K339j986o91J834j150q60J815j98
$$ y = [-313, -2499, 504, 1362, -1260, -517, 324, -1531, -678, 1527, -397, -604, 1559, -241, -1912, 683, 531, -1044, 1323, 1022, -1046, 123, 622, -1604, 153, 2894, -32, -1223, 1857, 605, -1860, 717, 1355, -491, 1052, 1986, -801, -49, 1499, -232, -164, 2321, 966, -1063, 1228, 598, -885, 1122, 1417, -661, 1061, 1933, -1328, -590, 1914, -63, -633, 2219, 1511, -1393, 316, 587, -968, 883, 1272, -579, 0, 1259, -872, -1323, 1512, 511, -779, 1022, 585, -1791, 326, 525, -1653, 578, 1971, -1382, -1305, 1484, -618, -1884, 926, 849, -1323, 36, 257, -1683, -433, 653, -1292, -360, 1191, -868, -1671, 384, -328, -1486, 814, 109, -1663, 236, 310, -2132, -675, 1021, -1040, -1315, 1172, -435, -1933, 40, 289, -1136, 411, 514, -1346, 34, 554, -2003, -823, 1516, -470, -1161, 673, -477, -1337, 478, 280]
2333B80j663K285M1k679J129J970j994o12K576j015r62J528r70q14J759P8j921
2350i84J861Q23k950P64J907j493k27J914j020j398J766p13j084K139M91k337
2366e41O74J787k207n38K147p13q82J722j035j262J783nj903K057J301l087K08
2383d94J929j715q98K696q00j143J592o19k372K428P79k509J022J861j835n65
2399f43J101n79o13K044r01j557J742K01k915K009J757k124k4J551j550r73K141
2416F67j151o31J950m38k001J335Q47k091O36K082j478m62J125j413k47K086r58
2433a42j298J978J58k876J306J784k302M31J989j434p16J555j006j063J668P23
2449G55k102J202Q13k009M55J297j091M86J310j512o43K416j364j922K777N95
$$ y = [280, -1383, 902, 943, -1736, -607, 1363, -631, -1243, 1333, 318, -644, 884, -86, -900, 859, 937, -984, 877, 1700, -1250, -486, 1421, -72, -299, 1615, 595, -803, 963, 250, -834, 1305, 1796, -541, 133, 1920, -287, -825, 1322, 609, -273, 1449, 414, -848, 935, 930, -973, 1084, 2385, -702, -494, 1435, -280, -1178, 1518, 718, -425, 1167, 548, -1824, 604, 1383, -1126, -104, 1757, -78, -643, 458, -121, -734, 1310, 409, -1148, 594, 795, -2120, -111, 1646, -478, -502, 1049, -501, -1474, 667, -484, -1115, 835, 397, -1604, -269, 578, -1513, -877, 1205, -273, -735, 390, -1023, -1270, 816, -142, -1440, 538, 696, -2180, -874, 910, -1392, -961, 1028, -406, -1122, 433, -573, -1636, 32, 755, -1347, -145, 668, -1341, -886, 411, -680, -194, 1116, -396, -1039, 1377, 13, -1909, 868, 1463]
2465A463k517M82J892j737l96J979q77q43K129j543j067J941P0j977J400J337
2481A736k156M69R13j564L86J829j241j280K467o20k608K537O90k123R70J521
2497A926k118m22J414r90k47K168j122j561J768j1j906J407P69j338P15L94j692
2514h46M60J716j176j370L140o92k877J578J008j683N90J244r62o00J469j769
2530g70n4J489m61j146J536r4j871N40J254j670R11J845k468l58K340j623j368
2547a968K718J88k384J046J069j987M15J096j090R7J784j260r88J538o92r68J604
2564B18J4j264J224Pj591O50K236k649m6L024k044j990K438P05k456J429R42j078
2582b31m27J010j222N11J407j057q83J971j141j240J757N0j594J961N32k389P07
$$ y = [1463, -1054, -572, 1320, -417, -813, 1166, 289, -554, 1575, 32, -1035, 906, 976, -1001, 399, 1736, -420, 49, 962, -602, -216, 1613, 372, -908, 1559, 939, -1669, 868, 1558, -565, 405, 1926, -192, -614, 800, -190, -437, 1731, 609, -952, 816, 805, -1101, 306, 1075, -263, 452, 846, -846, -386, 1330, 154, -1216, 1924, 1232, -1645, -67, 941, -742, -152, 1092, 130, -470, 999, -770, -824, 665, 204, -942, 594, 500, -1371, -831, 423, -1247, -336, 1509, -959, -1317, 1023, -600, -1968, 750, 938, -1446, -400, 669, -1318, -903, 193, -897, -800, 984, -276, -1264, 274, -418, -1386, 218, 232, -1032, 192, 199, -1392, -742, 1494, -1155, -1201, 1823, -221, -2211, 227, 932, -1524, -95, 847, -231, -658, 352, -870, -359, 1048, -9, -892, 1079, -62, -1302, 455, 505, -1089, 872, 1404, -985, -278]
2599b78J593j771m20K643r13k139J874N71j801P47J074j224L97J034j919K91J727
2616A486j573o68K186p09j406J387j76j324J584O61k107M04K247k320j058K622
2632A236m02j771J405M61j430M36P59j146O99J101j924k21J996j507q69J991m89
2649C25q75J277p4k093J170J575k004L10K077k128j085K025k49j251J000O64j490
2666h26J000J89j693P19J510j868K07J624j169q50J255l26j233K045j82j926J467
2683e7J065k227l15K544j267j112J874j54j848J129M26j183J145L51j230N71J106
2700H18j360l47K104j348o84J153m27j411J855N82k367J481J609k099o74K125
2716A010p21j098J513J70j571P98L1r17J262O78k125J264J021j806k62J679m18
$$ y = [-278, 1315, -456, -876, 1767, 854, -1285, 589, 1160, -641, 106, 1180, -44, 353, 1387, -532, -241, 1486, -87, -755, 1431, 722, -684, 703, 527, -797, 787, 1448, -659, -255, 1992, -328, -1386, 1236, 834, -937, 468, 929, -501, -65, 694, -452, 247, 1348, -576, -797, 1199, -308, -1177, 814, 325, -550, 727, 653, -1440, -270, 1305, -699, -389, 1688, -440, -1525, 500, 251, -1000, 0, 664, -826, 174, 363, -1330, -611, 899, -969, -762, 862, -307, -1157, 98, -228, -1461, 584, 402, -1524, -57, 1008, -1219, -1534, 1010, -257, -1369, 505, 351, -1497, -368, 58, -1125, 20, 371, -859, -288, 818, -542, -889, 1215, -133, -817, 336, -91, -1502, 353, 935, -1432, 49, 1658, -441, -1115, 1010, 289, -809, 704, 874, -697, 101, 132, -785, 477, 1155, -970, 294, 1315, -491, -753, 926, 508]
2733E08j196J975o02j928J661Q30k263J107J706j829q11J895o29j051J414p0j027
2750c10J253m36j138J198M75j756P95J474j528o04J791j174r37K037l79j823J519
2767D57Q43k485Q13J669j314o67J501o17j188J007J02r27J530j02j525J032N81
2784G10j700M61J353j316m56J831j323j030K039m67j591J521R34k095L03J811
2800I85j501n47J809o30r66J225r42p66J617j1j363J119Q30j857J96J359j248
2817f91k35J948j139j010J863k44k174J662J118k180M72J416j098o81J495q50
2833c28j48J217k14j664J648j02j573J456P29j450Q9J255j205l96J679n90j445
2850a042K107j62k187J130J322j176k68J289q96j64Q09r50p8J400m86j292J528
$$ y = [508, -688, 1287, 685, -1243, 418, 1248, -1015, 92, 1798, -31, -842, 1053, 424, -627, 787, 717, -310, 943, 507, -631, 567, 1042, -714, 81, 1555, 27, -577, 1214, 40, -897, 1140, 761, -1062, 457, 1300, -1185, -372, 1297, -17, -684, 817, 200, -988, 19, 121, -806, 724, 622, -903, 129, 710, -990, -529, 824, -492, -948, 883, -440, -1470, 569, 102, -1489, 32, 966, -1129, -826, 985, -516, -1063, 746, 116, -850, 375, -567, -1333, 284, 273, -1090, 29, 859, -998, -802, 557, -691, -926, 1022, -117, -1127, 736, 492, -1682, -20, 1098, -1082, -610, 806, -292, -973, 522, -328, -476, 741, 527, -1137, 511, 409, -1164, 292, 1021, -429, -340, 915, -290, -686, 993, 403, -1042, 1065, 903, -1284, -154, 1168, -8, -276, 1013, 117, -47, 762, -188, -266, 1134, 648, -644, 884]
2867H84%j766J012J313j520r5J618j267p16J440k87j469J658M02k092J125O53
2884H93j295M03P43o95m68J176r49k07J341n89j121J510M85k141R14Q47j415L11
2902b57J209j084p04J841q36j758J835N15j810P43P52p82j62R62j232K69J218
2919G19j190p38J605l24j605J449R83j754M45R77j726K1K034j260j173K401q87
2936b3j265J059O57j213O22M51p30N27K82j506O29J232j104p73J797m78j330R50
2954b16N85j115R09N88j171l12J488q45r70J996m13j410J090M49j443P49N65q40
2972c16K73J107j467k7J675j186j066J920l39j455J194J28j082O56J322j656M
2989c15J354o88j114J141M21j272J334R6j498O60N34j316Q52R17j276k75J791
$$ y = [884, 884, -882, 130, 1443, -77, -172, 1446, 179, -537, 903, 616, -853, 805, 1207, -885, 240, 893, -402, 1, 744, 49, -419, 757, -192, -399, 942, 353, -768, 742, 1227, -914, 0, 847, -568, -257, 952, -132, -836, 1005, 169, -1589, 246, 761, -1049, -306, 446, -336, -498, 464, -768, -499, 719, -471, -1209, 396, 72, -1533, -84, 899, -855, -410, 567, -1159, -1138, 896, -364, -1537, 864, -23, -1288, -229, 428, -785, -163, 288, -442, 85, 367, -1139, -510, 722, -382, -1155, 642, 164, -1166, -216, 369, -746, 163, 751, -420, -732, 756, -89, -1059, 937, 524, -886, 204, 653, -790, -41, 524, -316, -43, 1064, -403, -430, 1245, 59, -1007, 913, 574, -881, 313, 441, -641, 15, 1337, -319, -315, 1039, 351, -763, 378, 799, -473, 861, 957, -541, 119, 653, -663, 189, 1106, -170, -445, 1346]
3006A346j032j169J603p0j336J450l06j247O33J014j442K32J635j086r68J409
3022F66o5j404Q73L59q66O83K15j503O93J033j034n92J748o78j167J280K63j209
3040g05P76N91j377J46J301j408n03J573k69j104J389k70r35R56n8r85P84O79
3058E81j593N01J399j546l44J407r7j053P15J53j160P35R46j279L13J159j078
3075b41j055J897r15m89J099k5q57R08q5j176J100P37j549K57J373j233p20J774
3093H00j35j255J073k2j051O03N23j219O05J448j465n37J441o67r11J238nq92
3111d28J086J97j355O90N95j387J08J655p37p19J156m70j112J318K03j323P31
3128B08J226j948J94J000m09o94J197n24o40Q41o0j119J291K99j624Q73J090j589
$$ y = [1346, 314, -855, 748, 678, -658, 792, 486, -761, -128, 886, -556, -324, 1311, 225, -743, 666, 601, -803, 70, 429, -437, 246, 461, -1042, -349, 684, -350, -942, 806, 128, -1039, 241, 504, -705, 71, 662, -715, -569, 732, -676, -1179, 394, 125, -979, 410, 140, -795, 161, 103, -882, -98, 581, -1012, -511, 888, -658, -1002, 405, 308, -745, -30, 123, -1037, -302, 644, -635, -322, 837, -241, -1296, 601, -314, -803, 296, 271, -586, 322, 237, -939, 161, 898, -651, -394, 979, -254, -974, 800, 665, -590, 483, 461, -590, 13, 536, -683, -78, 1370, -95, -632, 809, 142, -769, 469, 464, -428, 658, 855, -500, 190, 785, -602, -494, 1161, 424, -295, 861, 391, -721, 597, 800, -523, 208, 1434, -514, -320, 680, 271, -423, 774, 250, -390, 451, 391, -728, 563, 862, -762, 111, 1201, -388]
3146c88p3J044m25m16Q50l58r98J062J37j314J202P07j466k31J230q50k29R06
3164C90n24p41J242j35j412J356M39j298L11J198j517l18J244o44n12Q46K06j122
3182i91P01P94j365L09J181j115J66R24q81m19J020n96m58J371l50j038P12L23
3200B88j209L74J287r72n26J156r76LJ307l38j222J043M08j385N52J172j110j35
3218b83J045m49r80J130l12n16J219k91j053P53J068j815K29J013n82k50J110
3235A036n99r75J629p58j142J181L03r12J01J001j036J8R17r32J21O88n48m02
3253c09J040j9j289J161J10q12K27O76j027j04Q67l78o63R95k2j264O98J174j513
3272d52m4J099q85P8Q19r17j83R89k99q06Q92n0j266Q30Q97j247p3J336j168j13
$$ y = [-388, -461, 583, 158, -258, 592, 234, -764, 298, 435, -879, 323, 1030, -436, -667, 563, -287, -516, 390, -134, -875, 367, 232, -1180, 176, 615, -683, -372, 826, -691, -1009, 235, -409, -921, -75, 131, -991, -290, 504, -861, -552, 629, -486, -320, 604, -277, -696, 324, -272, -730, 641, 291, -747, -35, 288, -921, -547, 740, -232, -758, 398, -578, -575, 732, 394, -828, 215, 623, -762, -210, 962, -148, -283, 762, 313, -667, 463, 151, -365, 854, 563, -490, 263, 1331, -484, -255, 758, 176, -74, 1036, 437, -538, 1091, 333, -809, 372, 675, -237, -136, 865, -171, -153, 764, -168, -47, 641, 93, -309, 731, 712, -577, 584, 694, -118, 109, 785, -242, -346, 521, 143, -520, 475, 453, -811, -113, 1061, -452, -496, 603, -282, -204, 615, -302, -485, 504, 205, -601, 291, 241, -1025, -195, 702, -545, -618, 718, -450, -563]
3292e63J237r10n52J162k28j267R01Q02j447N67M01m30J52N36r06j99J074n63
3310b33n24J369J83j575M30P65j196O00O46p55p9O51j79p99R29P8j076N70Q75
3329F80j267L10O65p99M27P25r30k67J026l63q92Q70r2o94O28L14q71K31J130
3348H31q83l97J147m52j158J522l8q51L96O05o56O1J44l64L94O58p41o01J227
3367H44m44q37Q18J97q40M96M98j134N43Q87j272J55R32l88q58M30M47j079N69
3386c6P59j167R18J33q59l8J011j023m23J236l40n44N06M89j321Q92N44j094j9
3405c76J220j170o88J474J08j167Q54L03j214M81M41p85K89Q74j015j73Q84o44
3423c04n05J022m9j037R47J2q60N21O72j088L8J448j018p14R98p1p86P51Q0o76
$$ y = [-563, 674, -236, -788, 374, 146, -1121, -220, 582, -865, -298, 103, -327, -175, 361, -545, -744, 330, -233, -757, 612, 795, -780, -350, 415, -781, -181, 465, -290, -369, 282, 103, -696, 233, 311, -765, -195, 680, -587, -277, 388, -411, 16, 741, -189, -456, 570, 207, -685, 185, 93, -601, 27, 341, -530, -299, 831, -52, -449, 698, 246, -912, 610, 572, -279, 117, 722, 66, 127, 271, -93, 301, 959, 218, -383, 844, 400, -437, 381, 578, -262, 234, 732, -402, 141, 1028, -244, -89, 843, 455, -403, 27, 474, -605, -36, 723, -444, 474, 607, -252, -290, 721, -302, -725, 511, 171, -373, 133, 622, -699, 193, 737, -357, -376, 844, -326, -1014, 460, 568, -599, 255, 558, -656, -175, 266, -519, -230, 644, -371, -544, 340, -304, -809, 213, 164, -873, 74, 86, -774, -253, 419, -669, -631, 817, -201, -915, 83, 12, -774, -23, 57, -619]
3443f19N73M60j147M70Q97j163J72J146p82p19J118r3j051Q08K93r75O55M11o60
3462b06l23J291r26r4M83j69l68O03J9l56M58k60q76P93M34o21m65J386l15j040
3482e52R81k55o53N34O86j229N41O12p87l07J195n88l29R32n15m83N80m1n48N79
3502C53P77j213K88P67j170j6P95mj028R59j20r04O72M69j275L65J046p83n08
3521e30P37l1o14P46J7p55O78J25r39P89K94q38J30R39p79m61Q23m20l38P86l34
3542B5o78O70J82r58O06P72r21j19P40l46n40P09k82j57R93m92q38N99K94r92
3562g33K79J187q98m26P78o2q72P69J63o35M64O08r71o8J075q03k53P57j61o66
3582d68P07j4r57J011K92j284Q74K33n70k76Q11l95n69J044k72n79N60Q5q22P48
$$ y = [-619, -46, 414, -733, -263, 634, -529, -357, 789, 7, -712, 406, 313, -738, 70, 363, -612, 43, 454, -206, -529, 762, -164, -258, 225, 56, -312, 291, 310, -46, 412, 152, -724, 69, 503, -118, -583, 803, 488, -552, 429, 174, -479, 55, 741, -488, 53, 665, -122, -429, 766, 178, -151, 781, 266, -217, 363, 322, -226, 353, 1130, -83, 205, 972, -198, -214, 581, 577, -451, 508, 388, -516, 156, 625, -650, -285, 761, -22, -530, 207, 176, -438, 308, 325, -430, 248, 373, -566, 223, 517, -321, -191, 748, -31, -492, 331, -89, -427, 359, 25, -653, 17, 199, -759, -153, 619, -302, -421, 319, -27, -567, 142, -140, -297, 696, 204, -634, -35, 259, -733, -454, 733, -165, -591, 187, 125, -747, 22, 185, -450, 14, 622, -349, -417, 658, -145, -398, 359, 198, -468, 239, 225, -732, 279, 571, -713, 161, 394, -176, -452, 359, -36, -605, 439, 167, -412, 148, 233, -589, 159]
3602A59M22p57k00J027p80j99Q16n25j04R57q01l14Q34j93p22L69Q21j075Q8O27
3622D50o58l4Q88l97l28L98K21j014N05P44j038J64P35p23k19J167j074K3Q47
3641F57n12l93K08O26j060K78M96n96k36P85k28j45N80k87p78J075k52o09K79
3660a12O54p91q3N13j06k15L62l54n09J060k84p37P40R3n86N9N80o10N6O45n50
3681a75k52O32j92q68Q79L90q41K16O31j013J77O15l63j43N99m02m34O71P8p61
3701e56O23L62p50L30L86q12k38J052m17k82R12m35p74O98J61o34J74N33l57J17
3721I3N42j029K66P19p01l70J082j08r21M10N08o96J4P14n31l35Q76m82n02P87
3741C36J36p94L62O45j111M03N02n88L8R64r59k49J038o59m79Q16l6n73J98M96
$$ y = [159, 581, -176, -376, 651, -129, -328, 488, -37, -141, 816, 15, -299, 535, 342, -380, -11, 810, -265, -177, 450, -208, -242, 646, 249, -79, 319, 540, -474, 31, 775, -263, -99, 636, -87, -306, 861, -213, -190, 657, 145, -248, -40, 586, -474, -196, 300, -296, -532, 253, 25, -120, 460, 173, -605, 470, 218, -391, -112, 542, -249, -332, 181, 75, -140, 222, -132, -641, 419, 135, -602, 138, 231, -355, -296, 284, -326, -270, 375, -175, -427, 205, 13, -855, 24, 414, -427, -211, 420, -593, -416, 199, -164, -307, 292, -110, -544, 127, 205, -556, 67, 429, -321, 9, 395, -417, -655, 397, -20, -302, 610, 175, -599, 99, 260, -374, -200, 333, -24, 93, 635, -394, -128, 591, -110, -480, 602, 494, -427, -17, 491, -205, -191, 523, -8, -343, 533, 51, -451, 336, 472, -322, 40, 685, -426, -23, 479, -109, -71, 893, -66, -315, 723, 64, -415, 401, 365, -208, -10, 486]
3761D86q72L96N04n42j87O43o17o00J033O3q22N06M47m25l45N23m89K05N00o33
3781b26P9O78l04r50R71p0o53O30N7m33J55K49q14J34J046n08o04P06J10p94P01
3802A60q4n66K82M50r22N85M64p52j62Q32l82m90P02k7m18J06J74k81L46M37n31
3823g7j28O14k89m49M48Pp25M93J32k14K90J10n16P5L81l40l13J103m37n39M68
3844I4K01n33P34R1r26L07P56o24n22P75n10RL55qq9J88K57p04N91j77l05j31
3866a71Q99r17n9Q34j97o13O32M31j084K10O14q61J30R73o67l19O37n67l35M21
3886iN37l91k05N58q17K93J88m96k27R06o18Q7L91j75n66P16j51m71Q64J79j028
3907d35L1R59p40k85J222n18n36N47r1p07Q13m33K02k18L02m39k3Q75k57o43L41
$$ y = [486, -386, 10, 514, -28, -215, 428, -189, -789, 244, 307, -515, -9, 438, 13, -332, 191, -298, -93, 407, -226, -147, 531, 227, -723, 248, 178, -475, 155, 212, -221, -66, 183, -631, -497, 549, 41, -563, 143, 253, -541, 160, 76, -490, -208, 242, -680, -95, 369, -383, -545, 287, -95, -585, 117, 90, -328, -222, -48, -329, 17, 454, -77, -205, 409, 120, -329, 119, 126, -599, -106, 26, -188, 102, 212, -304, -229, 152, -188, -501, 602, 165, -374, 94, 295, -238, 496, 587, -339, -32, 724, 100, -422, 353, -157, -148, 207, 199, 110, 298, 555, -149, 442, 265, -40, -171, 728, -189, -248, 586, 389, -224, 408, 839, -245, -35, 579, -282, -152, 821, 154, -165, 472, -95, -430, -9, 528, 137, -68, 490, -327, -34, 154, -342, -569, 337, -281, -194, 197, 22, -544, 172, 21, -450, 414, 593, -435, -404, 555, -185, -470, 752, 234, -302, 245, 154, -553, 260, -173, 29, -189, 113, -326, -349, 526, 269, -374, -33]
3928c3L74j105Q72p0m24K24M90m95l17P92j99m43O49l07n27O39J0n51O02J2n57
3949c64l38J121o53j26M50L6k90L80j60m36K69M70q99O25J47n5m01N65m49n10
3969f18P98J92p47M34K98m25K24J75m31k46R51n89j42N81k95n77P84j09o13P28
3989C73M08j076J05O38n77KO34n31k32Q55n10k95R18m91n27J62O36q43Q7P52n63
4010g5j33Q51k44p86R51l19p82O39N04j049K11O37m55m67P52m37M9M62pn44N86
4031C44k68n76N37L66p79o3P50m77r4O00n06m3M97k53n65M63L42o47J80O47n29
4052g4l75P04o72mQ30m40n70O85m0m83J69M25o05j38O73l79K09J81k85j93N56
4073A74l00m92Q08K03o44lM64n85K63L29l82l72Q59m27n00P79O5p44M66M09l97
$$ y = [-33, 341, -764, 108, 38, -386, -162, 328, -167, -484, 308, 109, -334, 315, 8, -519, 120, 130, -421, 181, 193, -364, -702, 419, -234, -360, 90, 126, -164, 216, 56, -380, -111, 359, -540, 85, 232, 177, -224, 341, -108, -618, 180, 372, -375, 59, 357, -68, 156, 331, -100, -346, 605, 16, -126, 455, 160, -417, 367, 258, -355, 373, 781, -295, -190, 448, -129, -127, 507, -24, -256, 599, 89, -206, 712, 221, -306, -144, 492, -351, -264, 488, -75, -208, 643, 399, -387, 564, 245, -537, 102, 606, -443, -232, 405, -50, -517, 235, -202, -153, 309, 302, -242, 344, 76, -500, 37, 403, -376, -439, 311, -166, -260, 340, -166, -209, 288, 35, -530, -67, 275, -372, -192, 455, -74, -449, 255, -417, -421, 409, -31, -601, 84, 44, -439, -270, 155, -450, -588, 85, -294, -85, 96, -189, -382, 174, -126, -618, 190, 393, -251, -254, 210, -375, -112, 217, -165, -537, 322, -105, -605, 174, 239, -505, -39, 370, -27]
4094b7j7M27m79Q3N54k81q07O81q0Q1j33K34m27j09P67q15M49M33o71J2O75m12
4116A38m03Q14nn82J8M89r71M28M14m81J77M21k98m36P79l49l91M00J28k36M1
4137I5M86o90j8O18n48m26J076l99k76L45j01m87J55K63l83J3M61r3l99O88k03
4158A77p17K88N91m02L5P2l61K25L46m94R1M66l48j77K46q8n42L84O16o82M48
4179A74K5m45m74J026m82m51P45l15l53M76j31j15L73o5j77j38N76o04mM99k44
4200a04l38P26q5m93K96K44n56K07K72l22jL80l85m44P76k45l94M43j24o2P3K29
4222I3k21L01K47n82J86L61Mp51O86j44o52N24k44l7J54N53q11J42L93J15q43
4243e26Q68j62k30K13K83l60Q1m2m97O05K76n89k04O98l04k39O21j76n47L97j8
$$ y = [-27, -44, 383, -96, -13, 541, 260, -547, 134, 54, 135, 2, 236, -191, -300, 467, -348, 101, 534, -137, -125, 550, 138, -265, 549, 544, -38, -20, 469, -502, -74, 340, -141, 36, 457, 159, -277, 502, 153, -238, 162, 290, 54, 95, 581, -109, -127, 491, -57, -483, 593, 194, -82, 263, 162, -325, -170, 93, -290, -277, 184, 91, -308, 380, 177, -540, -252, 339, -63, -28, 44, -317, -92, 254, -240, -149, 317, -31, -208, 38, -50, -592, -208, 408, -274, 174, 199, -246, -720, 306, -176, -627, 118, -197, -550, -74, -205, -320, 53, -12, -189, -327, 249, -355, -359, 140, -104, -442, 284, 199, -294, 2, 246, -310, -103, 169, -153, -154, 226, -159, -603, 173, -72, -466, -23, -147, -209, -136, 93, -128, 173, 420, -162, 24, 385, 389, -362, 324, 180, -472, 52, -192, -229, -75, 478, -333, -191, 202, 317, -526, 342, 180, -50, 163, 446, 86, 167, 125, -372, 233, 509, -80, -284, 414, 110, -129, 492, 316, -231, 166, 148]
4264A48k58j64O44m07M3L07l75j82J25M27n31M01j53m10K04P18q51L97R4k93k35
4285c51M48J51l93N07m72m05L62L71p93N71L63m92j81M72on61N26m9l77M35j45
4306a9m11O64Mo87N2M97l94l81J045l72j88K81Q8m11J19L79q21L20L64n62M65
4327C2j2J61m25L16k98l19P89m8p36N08K45n08O1P26m75j00N46k27n80N69m3n28
4349c46K05M29m55O5K69j38k8M43l00l18L51j09k39M02L56q35K83J20k31k4N49
4370D49l60l73N99k82k43L28L30o72M06J26p55P1P60l41m12K53n5J01k0K39m79
4391c30O98l16n30K92M90p33L95L57n63j83R58o08j90N16j19l40L84K91o39l5
4411b05M05j30k27M17l37p1L59j39k68K55j9m65L61L00p81J15M72j25o08P82q
$$ y = [148, -110, -274, 370, -37, 6, 313, -62, -244, -119, 308, -223, 178, 25, -385, -181, 537, -314, 83, 177, -116, -351, 97, 248, -145, 362, -110, -515, -153, 218, -575, -4, 359, -133, -314, 158, 152, -409, 117, 68, -309, 126, -19, -430, 234, 238, -449, -397, 100, -294, -675, 370, -2, -190, 91, 179, -232, -113, 266, -555, -235, 129, -433, 32, 20, 181, -244, 72, -226, -545, 244, 196, -540, -32, 213, -295, -234, 492, 17, -83, 463, 236, -344, 225, 182, -346, -141, 288, -167, -102, 167, 29, 1, 444, 144, -174, 177, 68, -171, 231, 587, -248, 35, 155, -76, -100, 449, 89, -284, 315, 33, -210, 118, 448, -224, 182, 308, -447, -376, 384, 43, -369, -116, -171, -70, -90, 149, -330, 368, 52, -478, -186, 304, -429, -34, 323, -240, -423, 535, -73, -263, 253, 134, -206, 178, 469, -170, -205, 200, 70, -157, 260, -77, -148, 211, 72, -196, 59, 40, -425, -64, 236, -545, -430, 42, -83, -691, 91, 83]
4432H3m47N61o2n46M05K50j87l42P52p64o7M41k63O2N53m61O6J1K15n97K62M51
4454C76k95m8L09k49m00M76l6l64K40P7m43N67o6k01K12J04n09r6O33l01R3J35
4476B14j10j63L06J57m77L46M3m85J98N50n51k17P60m68j85M76j73l76N12l2j53
4497A72l05M68k29n41O92L9j048J049Rm35J82K77o54J41L82k8n95P63k56l03L34
4518A14M50r73L11M70m26k68L53K86n71M57k20j46R5J26l58O20m33r8M86k8l77
4539a30j6K67k84j53R32j081N18J88l92j77N33K0l59k02N72m98K99K3p4l25L57
4560A8m2j74N29j43l63K33K90k35J41j8o54L08M60l51j18J34L22o90K04M26o42
4581c65N22l0k04m0M46m42j10L44K68p70M59K32l11M0K09j74l38O00l82j83N24
$$ y = [83, -364, 197, 135, -411, -6, 244, 57, -285, 467, -297, -364, 77, -186, -124, 429, -32, 34, 45, 260, -337, -75, 376, 81, 33, 342, 93, -307, 169, 133, -231, 9, 86, -357, 210, 144, -57, 155, 259, -250, -346, 287, -14, 79, 214, 104, -59, 247, 404, -73, 273, 316, -169, 29, 579, 28, -189, 571, 103, -82, 394, 221, -155, 357, 325, 172, -133, 335, 106, -435, 257, 296, -752, 297, 306, -129, 53, 330, -324, -183, 199, 171, -424, 339, 83, -220, 114, 564, -409, -98, 372, -54, -322, 31, 317, -254, 203, -17, -163, -68, 58, -300, 320, -113, -211, 275, 247, -130, -146, 121, -163, -316, 616, -465, 53, 241, -151, -328, 205, 225, -134, -336, 236, -262, 37, 60, -14, -339, 18, -24, -198, 331, 188, -175, 58, 348, 113, 254, 236, -418, -110, 350, -1, -119, 15, 337, -353, -149, 277, -365, 157, 127, -77, -117, 329, -113, -223, 121, 389, -381, 78, 310, -1, 39, 248, 74, -264, 336, -46, -229, 295]
4602B95j64j66L69j17j0k71K32l03M8L26k55j2M61n42P4N19m01l52L51L9j88J84
4624A17J37m37J11J82j10j02M58l35k26K91J12m30L06K44m10K36Q6n55R7O85k68
4645A89j38n1K70m12L20j20j23L82l92j79J67O31p28Q0P0k22K2M79j9n76K80R1
4667B1l13L76J75k65j48K44N7m13M57k97l13P6L50l19K72J22l98R9O14k99l07
4688b09L50J4l65J98k26J93m8J07l47L31L57m19j51L76k4n78N31J20l65J43K38
4709B26n48N28k36m97J5Q52j81l46N38j36j39o9L52o78J62K51k26O9L23j63j14
4730a7N23m21n18P63j8k49p3K04o60O17R1n34o1Q27m88r9L23J74o02M18qk11Q
4753a1O35n36M0r4l7j39L38k06k49N34j21j99J88q7k13J42N46n53j20L94j91m32
$$ y = [295, 131, -35, 334, 217, 207, -64, 168, -135, -87, 239, -16, -28, 433, -109, -35, 484, 83, -269, 82, 121, -67, 117, 254, -183, -72, 110, 0, -102, 356, 21, -205, 86, 198, -232, 74, 318, -92, 144, 230, -325, -228, 457, 189, 51, 0, 270, -142, 178, 58, -65, 317, -75, -254, -87, 544, -184, -104, -34, -256, -234, 245, 226, -350, -70, 21, -292, 84, 259, -6, -154, 90, 147, -266, 191, -106, -419, -343, 7, -312, -40, 82, -316, -217, 397, 98, -209, 141, 155, -210, -12, -238, -45, -93, 14, -333, -2, 355, -64, -215, 161, 137, -441, 90, 210, -155, -12, 226, -322, 206, -30, -527, -512, 340, 159, -187, 351, 215, 76, 7, 359, -319, -157, 94, -132, -63, 260, 97, -17, 506, 85, -433, 330, 312, 63, -10, 194, -466, 151, 242, -292, -353, 474, -14, -113, 210, 384, -218, 200, 192, -19, -11, 624, 88, 128, 34, -3, -142, 196, -10, -259, 275, 154, -45, 143, 56, -157, -15, 531, -22, -142, 252, 61, -371]
4775c71O33J5q66O25J16l91K09N66m14m33N13j5m23M00K42n00J31p2l06n8M02
4796Cj63l7L54j57l85N65J56p58O09k92m70P67K10o85J19L89l50o9K99m16K64
4817d7K49m23q4N60m03k74M72O4k56J78LQ4n25M57j2j56L27l83qL35M17j054L45
4840a34K97k41L13j54j53M7J11Q8l36L23N1l24J35N15p41j7M46m02j5N55l87l72
4862c95M09j3j26L33L25o25k37O86n34K72M8R5l10O59n00j97L38K46o81N32k36
4883H9j74M1L06k15l18N30j07m16M74J02l14K02N3m84r5M50j58j52J79J50k0p7
4905D6K7k89J98K98p90N74Q7j80L6O4J1j40K77k98k97M58j75j90J84J52k71K7
4927a91O39n22o7M35k86k24L62j10m34N61j45k48J72K16o14L64Q7j8l54N78m46
$$ y = [-371, 262, 277, -589, 36, 152, -239, -30, 536, 122, -311, 202, 187, -236, 164, 406, -94, 37, -35, -341, -399, 3, -160, -197, 157, 0, -385, 180, 336, -422, 187, -105, -575, 192, 402, -283, -164, 225, -125, -194, 105, -311, -47, 202, -221, -305, 255, -148, -422, 50, 114, -142, 36, 39, 123, -402, 55, 43, -113, 214, -169, -177, 158, 575, -479, -134, 163, -78, 235, 81, -72, -25, 86, 174, -162, 161, 212, -112, 23, 538, -203, -220, 226, -176, -191, 364, -23, -395, 14, 1, -125, 208, 533, -92, -329, 357, -177, 95, 143, 238, -72, 587, 87, -110, 228, 474, -207, 325, 89, -85, -44, 262, 47, -271, 259, 152, -264, 210, 312, -2, 200, 253, -231, -326, 124, -34, -186, -7, 143, 123, 46, 73, -216, -18, 280, -510, 64, 151, -29, 7, 71, 82, -58, 219, -79, -376, 82, -93, -283, -99, 53, -218, -191, 448, -74, -141, 294, 8, -216, 146, 36, -398, 163, 18, -230, -58, 158, -456, -92, -5, -23, -377, 201, -245]
$$ [...]
8191A77
##END NTUPLES=NMR FID
##END=
