##TITLE=1H_115-2024-Bay
 CDCl3
 8 sc, 
 26.12.2024
##JCAMPDX= 6.0         $$ Bruker NMR JCAMP-DX V2.0
##DATA TYPE= NMR FID
##DATA CLASS= NTUPLES
##ORIGIN= UXNMR, Bruker Analytische Messtechnik GmbH
##OWNER= root
$$ XWIN-NMR		Version 3.5
$$ Thu Dec 26 14:41:00 2024 Russian Standard Time (UT+4h)  she@DPX200
##.OBSERVE FREQUENCY= 200.1315
##.OBSERVE NUCLEUS= ^1H
##.DELAY= (6, 6)
##.ACQUISITION MODE= SIMULTANEOUS
##.ACQUISITION SCHEME= undefined
##.AVERAGES= 8
##.DIGITISER RES= 18
##SPECTROMETER/DATA SYSTEM= spect
##.PULSE SEQUENCE= zg30
##.SOLVENT NAME= D2O
##.SHIFT REFERENCE= (INTERNAL, D2O, 0, 15.7039)
##AUDIT TRAIL= $$ (NUMBER, WHEN, WHO, WHERE, WHAT)
$$ ##TITLE= Audit trail, XWIN-NMR		Version 3.5
$$ ##JCAMPDX= 5.01
$$ ##ORIGIN= Bruker BioSpin GmbH
$$ ##OWNER= she
$$ F:/spectra/data/she/nmr/H-F/1/audita.txt
$$ ##AUDIT TRAIL=  $$ (NUMBER, WHEN, WHO, WHERE, WHAT)
(   1,<2024-12-26 14:39:53.87 +0400>,<she>,<DPX200>,
      <created by zg, POWCHK disabled, PULCHK disabled
       configuration hash MD5:
       00 E9 B6 7A A2 85 ED C7 34 08 36 98 17 FE 4E 26
       data hash MD5: 16K
       0A 2E E2 C4 A6 F9 B0 EB 33 44 76 0B 5F 19 F9 7A>)
$$ ##END=
$$ 
$$ hash MD5
$$ E6 D4 BB 5E B1 86 09 EF 74 B5 8C 66 EE 67 A5 C6
##$RELAX= 
##$RELAX= 
##$RELAX= 
##$RELAX= 
##$RELAX= 
##$RELAX= 
$$ Bruker specific parameters
$$ --------------------------
##$DU= <F:/spectra>
##$EXPNO= 1
##$NAME= <H-F>
##$PROCNO= 1
##$TYPE= <nmr>
##$USER= <she>
##$AMP= (0..31)
100 100 100 100 100 100 100 100 100 100 100 100 100 100 100 100 100 100 
100 100 100 100 100 100 100 100 100 100 100 100 100 100 
##$AQSEQ= 0
##$AQ_mod= 1
##$AUNM= <au_zg>
##$AUTOPOS= <>
##$BF1= 200.13
##$BF2= 200.13
##$BF3= 200.13
##$BF4= 200.13
##$BF5= 200.13
##$BF6= 200.13
##$BF7= 200.13
##$BF8= 200.13
##$BYTORDA= 1
##$CFDGTYP= 0
##$CFRGTYP= 5
##$CHEMSTR= <none>
##$CNST= (0..31)
1 1 145 1 1 1 1 1 1 1 1 1 1 1 1 1 1 1 1 1 1 1 1 1 1 1 1 1 1 1 1 1 
##$CPDPRG= <>
##$CPDPRG1= <>
##$CPDPRG2= <>
##$CPDPRG3= <>
##$CPDPRG4= <mlev>
##$CPDPRG5= <mlev>
##$CPDPRG6= <mlev>
##$CPDPRG7= <mlev>
##$CPDPRG8= <mlev>
##$CPDPRGB= <>
##$CPDPRGT= <>
##$D= (0..31)
0 1.2 0 0 0 0 0 0 0 0.06 0 0.03 0 0 0 0 0.0002 0 0 0 0 0 0 0 0 0 0 0 0 
0 0 0 
##$DATE= 1735209593
##$DBL= (0..7)
120 120 120 120 120 120 120 120 
##$DBP= (0..7)
150 150 150 150 150 150 150 150 
##$DBP07= 0
##$DBPNAM0= <>
##$DBPNAM1= <>
##$DBPNAM2= <>
##$DBPNAM3= <>
##$DBPNAM4= <>
##$DBPNAM5= <>
##$DBPNAM6= <>
##$DBPNAM7= <>
##$DBPOAL= (0..7)
0.5 0.5 0.5 0.5 0.5 0.5 0.5 0.5 
##$DBPOFFS= (0..7)
0 0 0 0 0 0 0 0 
##$DE= 6
##$DECBNUC= <off>
##$DECIM= 24
##$DECNUC= <off>
##$DECSTAT= 4
##$DIGMOD= 1
##$DIGTYP= 9
##$DL= (0..7)
0 120 120 120 120 120 120 120 
##$DP= (0..7)
150 150 150 150 150 150 150 150 
##$DP07= 0
##$DPNAME0= <>
##$DPNAME1= <>
##$DPNAME2= <>
##$DPNAME3= <>
##$DPNAME4= <>
##$DPNAME5= <>
##$DPNAME6= <>
##$DPNAME7= <>
##$DPOAL= (0..7)
0.5 0.5 0.5 0.5 0.5 0.5 0.5 0.5 
##$DPOFFS= (0..7)
0 0 0 0 0 0 0 0 
##$DQDMODE= 0
##$DR= 18
##$DS= 0
##$DSLIST= <SSSSSSSSSSSSSSS>
$$ [...]
##$SUBNAM2= <"">
##$SUBNAM3= <"">
##$SUBNAM4= <"">
##$SUBNAM5= <"">
##$SUBNAM6= <"">
##$SUBNAM7= <"">
##$SUBNAM8= <"">
##$SUBNAM9= <"">
##$SW= 24.0689530833862
##$SWIBOX= (0..15)
0 0 2 0 0 0 0 0 0 0 0 0 0 0 0 0 
##$SW_h= 4816.95568400771
##$TD= 16384
##$TD0= 1
##$TE= 0
##$TE2= 300
##$TE3= 300
##$TEG= 300
##$TL= (0..7)
0 120 120 120 120 120 120 120 
##$TP= (0..7)
150 150 150 150 150 150 150 150 
##$TP07= 0
##$TPNAME0= <>
##$TPNAME1= <>
##$TPNAME2= <>
##$TPNAME3= <>
##$TPNAME4= <>
##$TPNAME5= <>
##$TPNAME6= <>
##$TPNAME7= <>
##$TPOAL= (0..7)
0.5 0.5 0.5 0.5 0.5 0.5 0.5 0.5 
##$TPOFFS= (0..7)
0 0 0 0 0 0 0 0 
##$TUNHIN= 0
##$TUNHOUT= 0
##$TUNXOUT= 0
##$USERA1= <user>
##$USERA2= <user>
##$USERA3= <user>
##$USERA4= <user>
##$USERA5= <user>
##$V9= 5
##$VALIST= <valist>
##$VCLIST= <CCCCCCCCCCCCCCC>
##$VD= 0
##$VDLIST= <DDDDDDDDDDDDDDD>
##$VPLIST= <PPPPPPPPPPPPPPP>
##$VTLIST= <TTTTTTTTTTTTTTT>
##$WBST= 1024
##$WBSW= 4
##$XGAIN= (0..3)
0 0 0 0 
##$XL= 0
##$YL= 0
##$YMAX_a= 355919
##$YMIN_a= -541053
##$ZGOPTNS= <>
##$ZL1= 120
##$ZL2= 120
##$ZL3= 120
##$ZL4= 120
##$ABSF1= 10
##$ABSF2= 0
##$ABSG= 5
##$ABSL= 3
##$ALPHA= 0
##$AQORDER= 0
##$ASSFAC= 0
##$ASSFACI= 0
##$ASSFACX= 0
##$ASSWID= 0
##$AUNMP= <proc_1d>
##$AZFE= 0.1
##$AZFW= 0.1
##$BCFW= 1
##$BC_mod= 2
##$BYTORDP= 1
##$COROFFS= 0
##$CY= 11.3945322036743
##$DATMOD= 1
##$DC= 2
##$DFILT= <>
##$DTYPP= 0
##$F1P= 15.6554695791079
##$F2P= 12.8336369535428
##$FCOR= 0.5
##$FTSIZE= 0
##$FT_mod= 4
##$GAMMA= 1
##$GB= 0.15
##$INTBC= 1
##$INTSCL= 1
##$ISEN= 128
##$LB= 0.24
##$LEV0= 0
##$LPBIN= 0
##$MAXI= 10000
##$MC2= 0
##$MEAN= 0
##$ME_mod= 0
##$MI= 1.114404
##$NCOEF= 0
##$NC_proc= 0
##$NLEV= 6
##$NOISF1= 3.799351
##$NOISF2= 2.8
##$NSP= 1
##$NTH_PI= 0
##$NZP= 0
##$OFFSET= 15.70392
##$PC= 1
##$PHC0= -26573.28
##$PHC1= 13.78744
##$PH_mod= 1
##$PKNL= yes
##$PPARMOD= 0
##$PSCAL= 0
##$PSIGN= 0
##$REVERSE= no
##$SF= 200.130013532006
##$SI= 16384
##$SIGF1= 3
##$SIGF2= 2
##$SINO= 400
##$SIOLD= 16384
##$SREGLST= <1H.CDCl3>
##$SSB= 0
##$STSI= 0
##$STSR= 0
##$SW_p= 3612.71676300578
##$SYMM= 0
##$S_DEV= 0
##$TDeff= 0
##$TDoff= 0
##$TI= <>
##$TILT= no
##$TM1= 0
##$TM2= 0
##$TOPLEV= 0
##$USERP1= <user>
##$USERP2= <user>
##$USERP3= <user>
##$USERP4= <user>
##$USERP5= <user>
##$WDW= 1
##$XDIM= 8192
##$YMAX_p= 0
##$YMIN_p= 0
$$ End of Bruker specific parameters
$$ ---------------------------------
##NTUPLES= NMR FID
##VAR_NAME=  TIME,          FID/REAL,        FID/IMAG
##SYMBOL=    X,             R,               I
##VAR_TYPE=  INDEPENDENT,   DEPENDENT,       DEPENDENT
##VAR_FORM=  AFFN,          ASDF,            ASDF
##VAR_DIM=   8192,          8192,            8192
##UNITS=     SECONDS,       ARBITRARY UNITS, ARBITRARY UNITS
##FACTOR=    0.0002076,     1,               1
##FIRST=     0,             0,               0
##LAST=      1.7004516,     0,               0
##MIN=       0,             -541053,         0
##MAX=       1.7004516,     355919,          0
$$ Real data points
##PAGE= N=1
##DATA TABLE= (X++(R..R)), XYDATA
0@%%%%%%%Qj6J6j6K1k9L2l2M0m8N6o9Q2r7J08j24J45j68J92k17K46k79L13l49
$$ 0 0 0 0 0 0 0 0 8 -8 8 -8 13 -16 16 -16 24 -24 32 -37 45 -52 56 -68 77 -91 101 -116 130 -149 164 -185
31a85L94m42M93n48O10o79P51q32R23j023J131j249J383j535J707j898K117k373
$$ -185 209 -233 260 -288 322 -357 394 -438 485 -538 593 -656 727 -808 899 -999 1118 -1255
49a255K671l026L460m001M692n611O905q856J2094j8404L5002j56070m08654L91635
$$ -1255 1416 -1610 1850 -2151 2541 -3070 3835 -5021 7073 -11331 23671 -132399 -541053 -149418
63a49418M08592j81161j82150K71890J18708l67270k48144K91850K94741j35563
$$ -149418 259174 78013 -104137 167753 286461 -80809 -328953 -37103 257638 122075
73A22075j69555J25335j552k99288n6370L32136J26004k14733p2770J13361q4285
$$ 122075 -47480 77855 76303 -222985 -279355 52781 178785 -35948 -108718 4643 -79642
84g9642j82271J01888K59075J359j84249R435J33636j00584j59777K00830K84865
$$ -79642 -261913 -160025 99050 100409 -83840 -74405 59231 -41353 -201130 -300 284565
95B84565j49131k70299J34085K03513j88353j89722K37319K46861j95273k70358
$$ 284565 135434 -134865 -780 202733 14380 -175342 61977 308838 113565 -156793
105a56793J16364K03770j50260j94146K00719K25552k22694k71377J55545K07304
$$ -156793 -40429 163341 13081 -181065 19654 245206 22512 -248865 -93320 113984
115A13984j27380j04705J84827R3939k12094j46385J52164J51200q1827p1970
$$ 113984 -13396 -118101 66726 160665 -51429 -197814 -45650 105550 23723 -48247
125d8247J18032L4135j88139n7477K03053O9935j67905l5684J25234m8353j59196
$$ -48247 69785 103920 -84219 -141696 61357 131292 -36613 -72297 52937 4584 -154612
136a54612O3153J90644k2185j73021K946J38483m8086j67823Q5383K37101n2559
$$ -154612 -91459 99185 77000 -96021 -93075 45408 -2678 -170501 -85118 151983 99424
147I9424k29110N0140K01143n9301j56881R8874J66336q7335j63609O2718J49547
$$ 99424 -129686 -79546 121597 62296 -94585 4289 170625 83290 -80319 -17601 131946
158A31946n1453j29020P6129J29053j11351j56381J03007J33433j15759j17958
$$ 131946 80493 -48527 27602 156655 45304 -111077 -8070 125363 9604 -108354
168a08354J11698R4169j08627r1632P9158O9100p3639n6086Q9222O1489j01498
$$ -108354 3344 97513 -11114 -102746 -23588 45512 -28127 -84213 5009 66498 -35000
179c5000o1258J09694M5994j11969o849J37905k927j45529l439J31405J0650j09407
$$ -35000 -96258 13436 59430 -52539 -59388 78517 75590 -69939 -73378 58027 68677 -40730
191d0730n558J05230l953j27336m076J37409N463j32842J0612J18342m4216j20898
$$ -40730 -46288 58942 54989 -72347 -76423 60986 66449 -66393 -55781 62561 18345 -102553
203a02553N4804J18485m3687j01706L7152R2113l1769q7386L8552R8619m1927
$$ -102553 -47749 70736 27049 -74657 -37505 54608 22839 -64547 -25995 72624 30697
214C0697j02155N1054R8155n6460p6934O7875N8398p2204m7551O5782L8848o2818
$$ 30697 -71458 -20404 77751 21291 -55643 12232 70630 -1574 -49125 16657 55505 -7313
226g313m5142N4351M4548o0705m5960P1564M0246q7327l3822R2068K2381q8185
$$ -7313 -52455 1896 46444 -14261 -60221 11343 51589 -35738 -69560 22508 44889 -43296
238d3296j1400P6530L795o3682L711O7692P065o6431j0731P0706P959p5853N522
$$ -43296 -54696 21834 25629 -38053 -34342 33350 40415 -26016 -36747 33959 41918 -33935 -28413
251b8413Q2586j7687q1860K4897P3315k3290n7690J7980M0136k2928m6277J5873
$$ -28413 54173 36486 -45374 -20477 52838 29548 -28142 -10162 29974 7046 -39231 -23358
263b3358N3527r628n2150J6859M8123l3717m5930M6640M1405m8111l0848M4108
$$ -23358 30169 20541 -31609 -14750 33373 -344 -46274 366 41771 -6340 -37188 6920
275F920K6715k8802j6975K6576K1203k7710k9007K9109K9436l6709k3127M4494
$$ 6920 33635 4833 -12142 14434 35637 7927 -21080 8029 37465 756 -22371 22123
287B2123J1934m9494k167M2999j0322m2028N565L2482K032k5451p206K7009Q031
$$ 22123 34057 -15437 -17604 25395 15073 -26955 -21390 11092 13124 -12327 -19533 7476 15507
300A5507l4558n209M3140J441m0635R294L4521j6162k3134K0213J7479j4243j6229
$$ 15507 -19051 -24260 18880 20321 -20314 -11020 23501 7339 -15795 4418 21897 7654 -8575
313h575K169J5507K283k1003j693K3852q716k9227J3490K2247j9009j2511J9742
$$ -8575 -6406 9101 11384 -9619 -11312 12540 3824 -25403 -11913 10334 -8675 -21186 -1444
326a444M168j3691J184P097J965j885p237L757J6052m850j3612J5354R834k2300
$$ -1444 2724 -10967 -9783 -2686 -721 -2606 -9843 -6086 9966 5116 -8496 6858 16692 -5608
340e608l318K1453m570j6274O037O506n794k273j516J009O763p911j2770J1941
$$ -5608 -8926 12527 7957 -8317 -2280 4226 -1568 -3841 -5357 -4348 2415 -5496 -18266 -6325
354f325R351j5909J070J7991o052j1529J0565N680o085J875M76j944P276j815
$$ -6325 3026 -12883 -11813 6178 126 -11403 -838 4842 -1243 632 1108 -836 6440 4625
368D625r709R136Q006j4192k111J3256o029r185P773l01q152N058J670m606O894
$$ 4625 -5084 4052 12058 -2134 -4245 9011 2982 -6203 1570 1269 -6883 -1825 -155 -4761 2133
383B133K552r111N095P254j0273M5J1710n702n609J0928N7p087O852J723r035
$$ 2133 4685 -4426 669 7923 -2350 -2305 9405 3703 -1906 9022 9079 1992 8844 10567 1532
398A532J893J643q153L668N676q307N73R415q307o603J0357j898j0772O604N826
$$ 1532 3425 5068 -3085 583 6259 -2048 -1475 7940 -367 -6970 3387 1489 -9283 -2679 3147
413C147n958L496N156m421L207L343q869J117J0064p186o007J1358n15r615N328
$$ 3147 -2811 685 5841 1420 4627 7970 -899 218 10282 3096 -2911 8447 7932 -1683 3645
428C645K492r480J585L347p755Q20O736o152o64O944n881l831Q448k403p292R823
$$ 3645 6137 -3343 -1758 1589 -6166 -5346 1390 -4762 -5426 1518 -4363 -8194 254 -2149 -9441 382
444C82L236r956M904Q673q183k566P432l379l498M292k551j96O538o956p369J0541
$$ 382 3618 -6338 -1434 7239 -944 -3510 3922 543 -2955 1337 -1214 -1410 5128 -1828 -9197 1344
460A344N47j4035M748J0625q320l712Q676j024l324L865k533j483O201k956l456
$$ 1344 1891 -12144 -7396 3229 -5091 -8803 -127 -1151 -4475 -610 -3143 -4626 1575 -1381 -4837
475d837J0336J97j1383P094Q205j2188l253J1530l443q379M289K437k367J952
$$ -4837 5499 5696 -5687 1407 9612 -2576 -5829 5701 2258 -6121 -1832 605 -1762 190
489A90l392k449O328l962r057J0783P080j3855O98J5557n234j1765Q795P786m925
$$ 190 -3202 -5651 677 -3285 -12342 -1559 5521 -8334 -7636 7921 2687 -9078 -283 7503 2578
504B578l323l05L696O327o465p017J3131N200j7068k33J5800p615j2483J0481
$$ 2578 -745 -1050 2646 8973 2508 -4509 8622 13822 -3246 -3479 12321 4706 -7777 2704
518B704P275r075l247M155L014k69p420j573J3837j55j8322M642J7335j0582j1279
$$ 2704 9979 904 -2343 1812 4826 4557 -2863 -4436 9401 9246 -9076 -4434 12901 2319 -8960
533h960J5755N700j5085l417R136P36n043k295N874Q765j0161j5322J4789J6132
$$ -8960 6795 12495 -2590 -6007 3129 3865 -1178 -3473 2401 11166 1005 -14317 472 16604
547A6604j9200j1098K1566M405k2627j75J8312R74j1164k331P142L748j1463p624
$$ 16604 -2596 -13694 7872 12277 -10350 -10525 7787 8761 -2403 -4734 2408 6156 -5307 -12931
561a2931J8454Q948k3935n076K6428k615k6870P050K2893q412j7214N291J4063
$$ -12931 5523 14471 -9464 -14540 11888 9273 -17597 -10547 12346 3934 -13280 -7989 6074
574F074n00j3970j895J7487Q91k1955M708K3947j2723k3173K0551K0618k2972
$$ 6074 5574 -8396 -10291 7196 8087 -13868 -9160 14787 2064 -21109 -558 20060 -2912
587b912j5640K0639J2026j8207j3620J4833J8816j2977k2632J6225K3386k2035
$$ -2912 -18552 2087 14113 -4094 -17714 -2881 15935 2958 -19674 -3449 19937 -2098
599b098k1603K7308J5938k8559p302K8323K572k5632k171K2671O047k2037j1181
$$ -2098 -23701 3607 19545 -9014 -16316 12007 14579 -11053 -13224 9447 15494 -6543 -17724
612a7724K3627J2047k9837j0464L4981N559l5462K11L0194q016k6050J0437K3053
$$ -17724 5903 17950 -11887 -22351 12630 18189 -17273 -17062 13132 5116 -20934 -10497 12556
625A2556p116k0488N434K3396m582k8261Q347L5772j1365l5910J8110L2986k1566
$$ 12556 5440 -15048 -9614 13782 9200 -19061 -10714 25058 13693 -22217 -4107 28879 7313
638G313k5128K4580K0729k3293j8703J8561J8416j7799k1267K0021K4823k6852
$$ 7313 -17815 6765 27494 4201 -14502 4059 22475 4676 -16591 3430 28253 1401
650A401k7765L1891K4121l6014j9050L5217J1759l1909q052K7990Q950k4105j0815
$$ 1401 -26364 5527 29648 -6366 -25416 9801 21560 -10349 -18401 9589 18539 -5566 -16381
663a6381K2693J1049k6465p870L5226M192m1753r97M1300m285l6232R342L0925
$$ -16381 6312 17361 -9104 -16974 18252 22444 -19309 -20306 20994 16709 -19523 -10181 20744
676B0744j2167l1000O727L1043p61l0085J220L1000q871l5485J6252L7820j9956
$$ 20744 8577 -22423 -15696 15347 14586 -15499 -14279 16721 7850 -27635 -11383 26437 6481
689F481l1705K4373K4920k7532k1765K6327K4721k0007k6833J6285K6943k0661
$$ 6481 -25224 -851 24069 -3463 -25228 1099 25820 5813 -21020 -4735 22208 1547
701A547k9299K7136L0783k9418k7673K7387J5022k8902o700L0269O216k7009r511
$$ 1547 -27752 -616 30167 749 -26924 463 15485 -13417 -20117 10152 16368 -10641 -20152
714b0152K2434R416k4551q039L4424J0181m0998j0007M0930M378l5865N819L4291
$$ -20152 2282 11698 -12853 -20892 13532 23713 -17285 -27292 13638 18016 -17849 -12030 22261
727B2261r274l3101N155K8608j445k5767M018L0215q575l9357R287M2376j1816
$$ 22261 12987 -20114 -14959 13649 12204 -13563 -9545 20670 12095 -27262 -17975 24401 12585
740A2585l8372J7105L1870k1058k7970J9415K5926j3793k1951J1183K1623j4175
$$ 12585 -25787 -8682 23188 2130 -25840 -6425 19501 5708 -16243 -5060 16563 2388
752B388k4289K0307K8254k3532k5574K7336J9550l0418j3579L0105J0818k5620
$$ 2388 -21901 -1594 26660 3128 -22446 4890 24440 -5978 -19557 10548 21366 -4254
764d254r635K1659R267k1774j1358K5619J2502l1081j1427L5691O098l7715l94
$$ -4254 -13889 7770 17037 -4737 -16095 9524 22026 -9055 -20482 15209 21307 -16408 -16802
777a6802L6968k747l3175K957K8486j345k6619j343K9202L331l2109k615L4076
$$ -16802 20166 17419 -15756 -12799 15687 14342 -12277 -13620 15582 18913 -13196 -15811 18265
790A8265k242l3619Q390L0148j3871k5282J5475K0581j4180j8237J1460J7349
$$ 18265 16023 -17596 -9206 20942 7071 -18211 -2736 17845 3665 -14572 -3112 14237
802A4237j1050k0863J3942K4929j8625k6967K2072K4129k4205j7194K5341R954
$$ 14237 3187 -17676 -3734 21195 2570 -24397 -2325 21804 -2401 -19595 5746 15700
814A5700k4902p936K2494Q942j8853j0094K0264J0696k6505j2651L2220J3099
$$ 15700 -9202 -17138 5356 14298 -4555 -14649 5615 16311 -10194 -22845 9375 22474
826B2474l3715r246L1981K702k9320L21K5362J085k0733l284J7134L003j9280
$$ 22474 -11241 -20487 11494 14196 -15124 -14803 10559 11644 -9089 -12373 4761 7764 -11516
839a1516j499K5234j61k7803L697K5946j0048k2241J4561J9553j3001j5907R445
$$ -11516 -13015 12219 12058 -15745 -12048 13898 3850 -18391 -3830 15723 2722 -13185 -3740
852c740J2478p212j3377Q630J7758j0358k1057J3162J9019j8477j4488K3435J1280
$$ -3740 8738 1526 -11851 -3221 14537 4179 -16878 -3716 15303 -3174 -17662 5773 17053
865A7053k3045r372J7830O675j3701n951J4380J0572j6818j4454J7878J4416j9242
$$ 17053 -5992 -15364 2466 9141 -4560 -10511 3869 14441 -2377 -16831 1047 15463 -3779
878c779q537K2688K628k2469M15J8799j414j3104J670J1347%j2752l132J5718
$$ -3779 -12316 10372 13000 -9469 -9054 9745 8331 -4773 -3103 8244 8244 -4508 -7640 8078
892H078L880j8250m65J9280m502j8267P961J4118r753r685R138P332o735q058
$$ 8078 11958 -6292 -6757 12523 8021 -10246 -2285 11833 2080 -7605 1533 8865 2130 -5928
906e928M118J0491m173j3644O771J6338j0409j6361J2368J2303j2708o789J1978
$$ -5928 -1810 8681 4508 -9136 -2365 13973 3564 -12797 -429 11874 -834 -7623 4355
919D355L168r862l720N712O431m700q432O538R725j1069q956J3963N489j5016
$$ 4355 7523 -2339 -6059 -347 6084 1384 -7048 -510 9215 -1854 -10810 3153 8642 -6374
933f374j408J3661j179r346J025N202M95l569k600N939M157r812m029J2573J567
$$ -6374 -7782 5879 4700 -4646 -3621 1581 2076 -1493 -4093 1846 6003 -3809 -7838 4735 6302
948F302j2927L097J1199o863q612O660N174l915l766Q24M919J226q623j961J0825
$$ 6302 -6625 -3528 7671 808 -7804 -1144 4030 115 -3651 -2827 2092 3318 -5305 -7266 3559
963C559j156j1094N805R280q864o304Q484K993n972m51K670Q56p97l811J397P523
$$ 3559 2403 -8691 -2886 6394 -2470 -8774 -290 2703 -3269 -3720 -1050 -194 -991 -4802 -3405 4118
979D118l387q342O947O766q918l500R223j01o321K441L644j578j253j142P07M363
$$ 4118 731 -7611 -664 6102 -2816 -6316 2907 2806 -3515 -1074 2570 992 -261 -1403 -696 3667
995C667k531n501O444M152q527r30Q603k217o646M659L339l759o86M00QK699j232
$$ 3667 1136 -4365 2079 6231 -2296 -3226 5377 3160 -3486 1173 4512 753 67 467 475 3174 1942
1012A942l714M422J465p215J523Q029m479n958N810J897n095J035K635j891O0
$$ 1942 -1772 2650 4115 -3100 -1577 6452 1973 -3985 1825 3722 -1373 -338 2297 406 466
1027D66m03k003L999J878o394P12N949m143l237O475L82n742J875K757k753J095
$$ 466 63 -1940 2059 3937 -2457 -1745 4204 61 -3176 3299 3681 -2061 -186 2571 -182 913
1043I13J455k762J481J999m325R05M806m345k766N762m23n206L217K322m477P66
$$ 913 2368 -394 1087 3086 -1239 -334 4472 127 -2639 3123 2700 -2506 711 3033 -1444 -678
1059f78K461k772L58J915l358K62L936l401k486N339q61m916L559J987m616J178
$$ -678 1783 -989 -631 1284 -2074 -1812 2124 -1277 -3763 1576 715 -4201 -642 1345 -3271 -2093
1075b093L222k756m3K430l497j92M400k656k505M474m30m371L274J775m402J597
$$ -2093 1129 -1627 -1670 760 -2737 -2929 1471 -1185 -3690 784 354 -4017 -743 1032 -3370 -1773
1091a773K506l382K86L014k887l65L987k431k640M548n26m088L297K073l873J804
$$ -1773 733 -2649 -2363 651 -2236 -2601 1386 -1045 -3685 863 337 -3751 -454 1619 -2254 -450
1107d50L096l805k43L527k250j457L506j877j904M405r24m002L576J300m811J770
$$ -450 2646 -1159 -1402 2125 -125 -1582 1924 47 -1857 2548 1624 -2378 1198 2498 -2313 -543
1123e43L568l601q10L656k411j389L476j052k391L640j041l344L749J784m599
$$ -543 3025 -576 -1386 2270 -141 -1530 1946 894 -1497 2143 1102 -2242 1507 3291 -1308
1138a308J468L656m191r44M322j870k140K949m97k151K509k66k918L042N39m480
$$ -1308 160 3816 -375 -1319 3003 1133 -1007 1942 1445 -706 1803 1537 -1381 1661 2200 -2280
1154b280K633L555m779n96N119k398l425L954O02k815J746L87j970K217K81l363
$$ -2280 353 3908 -871 -1467 3652 1254 -2171 1783 2385 -430 1316 1703 -267 1950 2231 -1132
1170a132K868K362n288K38N036l120l767N114N98m638J024J527j723J114j0k494
$$ -1132 1736 4098 -1190 -952 4084 964 -2803 2311 2909 -1729 -705 822 -901 213 203 -2291
1186b291K581J335m973J374M731m241l181O391k34n963K693L719l000j325J723
$$ -2291 290 1625 -3348 -1974 2757 -1484 -4665 1726 1492 -4471 -1778 1941 -1059 -2384 -661
1201f61l98J454m99l872L073L830n714j940P764j653o818L779M336m566j354L590
$$ -661 -1059 395 -104 -3976 -903 2927 -2787 -4727 3037 1384 -5434 -1655 2681 -1885 -3239 351
1217C51j80j027q82j230L049K114n648K74O946k961o769N631M460o484r91N195
$$ 351 171 -856 -1738 -2968 81 2195 -3453 -3179 3767 806 -5963 -332 4128 -2356 -3347 1848
1233A848j080k567R05P34J269l24l674J898N145m744m657P518K727q825P81P632
$$ 1848 768 -1799 -894 -160 1109 785 -2889 -991 4154 -590 -5247 2271 4998 -3827 -3046 4586
1249D586k493n266K561K474m44j461j849L481K894o099k637Q401O91r052K693
$$ 4586 2093 -3173 -612 1862 1418 -43 -1892 1589 4483 -1616 -4253 4148 4839 -4213 -1520
1264a520P991n155n237N135K649k993j651Q12K159P12m909q9P208k322p732N365
$$ -1520 6471 1316 -3921 1214 3863 870 -781 31 2190 2902 -2007 -2096 5112 2790 -4942 423
1280D23O459p751m060P809J301n888L31L558L69j974l196K028N741m057n491O887
$$ 423 6882 -869 -4929 2880 4181 -1707 -1376 2182 2551 577 -2619 -591 5150 1093 -4398 2489
1296B489M029r603j742R561l89p679J987N091k383l856m36M296L011n575m375
$$ 2489 6518 -3085 -4827 4734 4345 -3334 -1347 3744 1361 -2495 -2931 1365 4376 -1199 -5574
1311e574P648J945r882Q32J0378k857q449M214M911m395l009L167L409o28m918
$$ -5574 2074 4019 -5863 -5031 5347 2490 -5959 -1745 3166 -1229 -4238 -1071 2338 1710 -3208
1326c208l62O897j059q696M407Q933o909p764Q034M255p665j811O122J818m207
$$ -3208 -3570 3327 2268 -6428 -2021 6912 3 -7761 273 4528 -3137 -4948 1174 2992 -1215
1341a215l179K424M875l300o166O616O584r581m953J0438K172r797R96Q752j519
$$ -1215 -4394 -1970 2905 -395 -6561 55 6639 -2942 -7895 2543 4715 -5082 -4086 4666 3147
1356C147o558k63N081J981m735l445P379K997j0083j706J1448q85j0515L880Q067
$$ 3147 -3411 -3674 1407 3388 -1347 -4792 2587 5584 -4499 -6205 5243 4358 -6157 -2277 5790
1371E790n212n681M385M355j963m664N49O774m64q665K307R983m857r393Q125
$$ 5790 578 -5103 -718 3637 1674 -2990 -2441 4333 3869 -4796 -2489 7494 2637 -6756 1369
1386A369P069q708m696P655K279n469k314M118L959m120o051M728P432p624o345
$$ 1369 8438 -270 -4966 2689 4968 -501 -2815 1303 5262 1142 -4909 -181 7251 -373 -6718
1401f718J0238M217j1384j772J0043k73p498J141N981M7n504k720O533L932q454
$$ -6718 3520 7737 -3647 -5419 4624 4351 -3147 -2006 3975 4022 -1482 -4202 2331 6263 -2191
1416b191k643J0497M44j2064K024J0212m250p073M799M871l970m460J635N214
$$ -2191 -4834 5663 6107 -5957 -3933 6279 2029 -5044 -245 4626 656 -3804 -2169 3045
1430C045m65o602J303Q907m281r893O368R193p796n976Q096K891o949k783N037
$$ 3045 2580 -4022 -2719 6188 1907 -7986 -1618 7575 -221 -6197 1899 4790 -2159 -4942 95
1445I5L396k880n130L213O400n849p346Q115O082r330l134R601J66q752Q95O540
$$ 95 3491 611 -4519 -1306 5094 -755 -8101 14 6096 -3234 -6368 3233 3399 -5353 -4458 2082
1461B082k4m041j428L857K807n887l454Q617K391r314l29R371l036q040M841N712
$$ 2082 2058 -1983 -3411 446 3253 -2634 -6088 2529 4920 -4394 -4723 4648 1612 -6428 -1587 4125
1477D125m371l373K706L319j386n309M72P802o47q540L031Q467o457p277P980
$$ 4125 -246 -3619 -913 2406 1020 -4289 -3817 3985 3338 -5202 -2171 6296 -161 -7438 542
1492E42N422o177k988M545J261k987k475K579N235k974o776M593O101p212m240
$$ 542 5964 -213 -3201 1344 2605 -382 -2857 -278 4957 1983 -4793 -200 5901 -1311 -5551
1507e551Q808K053q044J30N499j183l449O28L039J541l153l507M843L041o946
$$ -5551 3257 5310 -2734 -2604 2895 1712 -1737 -1109 1930 3471 318 -3189 1654 4695 -2251
1522b251j338Q816q18q122L003N298l698l300L080K388r63l093j114M102J008
$$ -2251 -3589 5227 4409 -3713 -710 4588 890 -2410 670 3058 2095 -998 -2112 1990 2998
1537B998o064J246P722l354p899M890N493n526k160M401P63k752j191R83K915
$$ 2998 -3066 -1820 5902 2548 -5351 -461 5032 -494 -2654 1747 2510 -242 -1433 -450 2465
1552B465n60m854J669N701l804m977N424K589o462k9N719j343m102J026J668L59
$$ 2465 1905 -2949 -1280 4421 617 -4360 1064 3653 -2809 -2838 2881 1538 -2564 -1538 130 489
1568D89j225j765K252L148m776l088O580J224o631J090N817l164l469K939J761
$$ 489 -736 -2501 -249 2899 -1877 -4965 1615 2839 -3792 -2702 3115 -49 -3518 -579 1182
1583A182j851p01k5J894J250m127j710O209j8o125K469N022m205l166M449O25
$$ 1182 -669 -1370 -1395 499 1749 -2378 -4088 2121 2103 -4022 -1553 3469 -736 -3902 547 1172
1599A172k491M13O05K49N56k289j18L963r39m624L553L420n090j427M980m03l327
$$ 1172 -1319 -906 -301 -52 504 -1785 -1903 2060 1121 -3503 50 3470 -1620 -3047 1933 1530 -1797
1616a797J880R85r55j27n49O9K676j716l173L757K355n304l87N096j715l352K890
$$ -1797 83 1068 113 -14 -563 -494 2182 466 -2707 1050 3405 -1899 -2286 2810 1095 -2257 633
1633F33J489k465q3M26J51J592q29k451K784J265m071M89M779k412l322L380M66
$$ 633 2122 -343 -426 0 151 1743 914 -1537 1247 2512 -1559 -1070 3709 1297 -2025 1355 1821
1650A821k338J110J100j362O37o4j413J799Q13l342P73L340k498k101L494n3l646
$$ 1821 -517 593 1693 331 968 904 -509 1290 2103 -1239 -466 2874 376 -1725 1769 1716 -1930
1667a930J924J727j934K09O59j555J310Q63k599O92K842k430k058L828l91k979
$$ -1930 -6 1721 -213 -4 655 -900 410 1273 -1326 -634 2208 -222 -2280 1548 1157 -1822
1683a822J730J254k172N98J264j844N65J187k013J57K561k373j273K885n82k326
$$ -1822 -92 1162 -1010 -412 852 -992 -427 760 -1253 -1096 1465 -908 -2181 704 122 -2204
1699b204J880J168k713J022J637j967R3J896j877q7K428j945j174K741o06k456
$$ -2204 -324 844 -1869 -847 790 -1177 -1084 812 -1065 -1152 1276 -669 -1843 898 292 -2164
1715b164K182J063k767N52J668j767J85J490j579k38K036j404j402L215o54k605
$$ -2164 18 1081 -1686 -1134 534 -1233 -1048 442 -1137 -1375 661 -743 -2145 1070 416 -2189
1731b189K118J474k752R59J472j704j06K058j517n81K099j420j122K463l05k447
$$ -2189 -71 1403 -1349 -390 1082 -622 -728 1330 -187 -768 1331 -89 -1211 1252 947 -1500
1747a500J915R34k630R29K034k122m5J800j436o39K370j417j053K368m46k021
$$ -1500 415 1349 -1281 -352 1682 -440 -485 1315 -121 -760 1610 193 -860 1508 1062 -959
1763i59J900J086k599Q61J819k110j83K210j529r60J914p13j082J794l38k259
$$ -959 941 2027 -572 289 2108 -2 -185 2025 496 -464 1450 737 -345 1449 1111 -1148
1779a148K104Q66k831J134J803k313l75K440j193j365K148m90j705J869k11j893
$$ -1148 956 1822 -1009 125 1928 -385 -760 1680 487 -878 1270 780 -925 944 733 -1160
1795a160J930N30k306Q40J763k256k60K393j451j201K091m88j909J610L82j847
$$ -1160 770 1300 -1006 -166 1597 -659 -919 1474 23 -1178 913 425 -1484 126 508 -1339
1811a339J331O55j947Q85J501k016k74K596j748j373K282l68j817J765K67j972
$$ -1339 -8 647 -1300 -415 1086 -930 -1204 1392 -356 -1729 553 185 -1632 133 400 -1572
1827a572J256P31j759O84J393j971J2K387k076r82K636o24k179J901P45k093R69
$$ -1572 -316 415 -1344 -660 733 -1238 -1226 1161 -915 -1897 739 115 -2064 -163 582 -1511 -542
1844e42R40j469K04J574j600j60K054j733p94K546r90k189K117R32k122N38J459
$$ -542 398 -1071 -867 707 -893 -1053 1001 -732 -1526 1020 30 -2159 -42 890 -1232 -694 765
1861G65j555J97J406j346K30J605j628q33K574p38k126K303Q64k922R35J865j491
$$ 765 -790 -593 813 -533 -303 1302 -326 -1159 1415 677 -1449 854 1718 -1204 -269 1596 105
1878A05o59J470q60j55J315j181m67K065j102j767K407N42k745J156J918j792
$$ 105 -554 916 56 -99 1216 35 -432 1633 531 -1236 1171 1713 -1032 124 2042 250
1894B50q79K008n93o61R29n28l35J419j097j376K481K18l058J338K134k601p44
$$ 250 -629 1379 786 125 1054 526 191 1610 513 -863 1618 1836 -1222 116 2250 -351 -1095
1911a095K432o95j003P49j12m66J047r74r66K468l91k698J879K143l052o12K609
$$ -1095 1337 642 -361 388 276 -190 857 -117 -1083 1385 994 -1704 175 2318 -734 -1346 1263
1928A263m19j710J370J42j012O39o97l47J550p15k168K389J323l422k82L489j373
$$ 1263 844 -866 504 646 -366 273 -424 -771 779 64 -2104 285 1608 -1814 -2096 1393 20
1945B0k099J794R96j728K54K46J94P68p47j057J919N63l555J086L213j927k481
$$ 20 -2079 -285 711 -1017 -763 -517 -323 445 -302 -1359 560 1123 -2432 -1346 1867 -60 -2541
1962b541L031O90k825L05J171m3K16r85n16K075k44k705J355L128k853j639L238
$$ -2541 490 1180 -1645 -1340 -169 -212 4 -981 -1497 578 334 -2371 -1016 2112 -741 -2380 858
1979H58K16l071J281K130j210q11L90j13J079n37j650J760K240l451j007L881
$$ 858 1074 -1997 -716 1414 204 -607 -217 -330 749 212 -1438 322 2562 -889 -1896 1985
1995A985p98l499K118K322j940j288J564L57m04m87p61K173O45l245q4M052j331
$$ 1985 1187 -2312 -194 2128 188 -1100 464 821 417 -70 -831 1342 1987 -1258 -1342 2710 1379
2012A379l529K926K343l464p26K259O0j188r7L31J332k17k900J087L194k580k528
$$ 1379 -2150 776 3119 -345 -1071 1188 1248 60 -37 294 1626 1409 -1491 -404 2790 210 -2318
2029b318L623J386l819j70L028j004j511Q98Q11j21l34j339J252J584k605j145
$$ -2318 1305 2691 -1128 -1298 1730 726 -785 113 924 803 469 -870 382 1966 -639 -1784
2045a784L912m2m322J193L508k199k054J970J000p92j010k78R75R12k254l92L389
$$ -1784 2128 2086 -2236 -1043 2465 266 -1788 182 1182 390 -620 -898 77 989 -1265 -1657 1732
2062A732p17l879K103K930k902j871L286P64k504l47J083P48j79j853M96K595
$$ 1732 1015 -2864 -761 2169 -733 -2604 682 1446 -1058 -1405 -322 426 247 -1606 -1110 1485
2078A485j448k964K512K515l653n83L481m83k899R23J521l96p57l85J145J213
$$ 1485 37 -2927 -415 2100 -1553 -2136 1345 862 -2037 -1114 407 11 -746 -1131 14 1227
2094A227k038j921L346J330l725j76L856j309k892J850J537j395l63N54O42L41
$$ 1227 -811 -2732 614 1944 -1781 -1957 1899 590 -2302 -452 1085 -310 -673 -119 523 864
2110H64j912o61L227K52l773O81M004k612k698K886J746k501l53J495J63n77r18
$$ 864 -1048 -1709 1518 1770 -2003 -1322 2682 70 -2628 258 2004 -497 -850 645 808 231 -687
2127f87L84J962n94k807J965K687l328j864L774O27k837l4K430q86r40l7O17R71
$$ -687 -303 1659 1065 -1742 223 2910 -418 -2282 1492 2119 -718 -752 1678 792 -148 -185 432 1403
2145A403q31j801K024J318l023o89L944k95l579J409J940j504j435J358P82J78
$$ 1403 572 -1229 795 2113 -910 -1599 2345 2050 -1529 -120 1820 316 -1119 239 1021 1199
2161A199j208r32J591Q78k852K57L468j566k874K188J913k807q02K467M5q75p33
$$ 1199 -9 -941 650 1528 -1324 -1067 2401 835 -2039 149 2062 -745 -1547 920 965 90 -643
2178f43J35J278k00k257Q31K804j831k403K804R96l145N25K368q83j512P39L24
$$ -643 -508 770 570 -1687 -856 1948 117 -2286 518 1514 -1631 -1106 1262 379 -1133 -394 -70
2195g0J58m65j056J204J890k247j710K971N41l452R45K782j653j327J307L07o40
$$ -70 88 -377 -1433 -229 1661 -586 -2296 675 1216 -2236 -1291 1491 -162 -1489 -182 125 -515
2212e15q8j92Q82P88k206m75K829k51k901J796K063k317r46J802O7j078M58K03
$$ -515 -603 -795 87 875 -1331 -1806 1023 772 -2129 -333 1730 -587 -1533 269 336 -742 -284 -81
2230h1K52K28j291q7K133o69k276J994J550k675o18K549l08j679Q96P66n36l3
$$ -81 171 399 -892 -979 1154 485 -1791 203 1753 -922 -1540 1009 701 -978 -82 684 148 115
2248A15m28m0J503p63j320J654J164k823j95K743r92j426J607M03j229O8R9l1
$$ 115 -313 -353 1150 387 -933 721 1885 -938 -1133 1610 618 -808 799 1202 -27 41 140 109
2266A09J156p72j350J603O96k278L93K185j469j249K046rj621P82M36n07K70k8
$$ 109 1265 493 -857 746 1442 -836 -443 1742 273 -976 1070 1061 -560 222 658 151 421 393
2284C93p28J200j42j716O21J767j551p95J776j25j765R21J010j076K42J74o98
$$ 393 -335 865 723 -993 -372 1395 -156 -951 825 700 -1065 -144 866 -210 32 206 -492
2301d92Q03J15j486Q56J477j670p90K113n06j832J444P24j291K72M28p39N17L32
$$ -492 311 426 -1060 -204 1273 -397 -1187 926 420 -1412 32 756 -535 -263 165 -574 -57 275
2319B75j219M23J210j321o52J981q14j622J633Q00j561J87R89r31J33P28p36J12
$$ 275 -944 -521 689 -632 -1284 697 -117 -1739 -106 694 -867 -680 309 -622 -489 239 -497 -385
2337c85R88j248m59J840p61j280J746J55j723O88J002j106j97J222q65r3J025
$$ -385 603 -645 -1104 736 -25 -1305 441 596 -1127 -439 563 -543 -740 482 -383 -476 549
2354E49j108l54J636p62q58J225L54j798R36J097j427P8R54n53j78R99p58m28
$$ 549 -559 -913 723 -39 -897 328 682 -1116 -180 917 -510 -432 522 -31 -209 790 32 -396
2372c96J102n41p83J292N7j475O28J054j310K10J302r69k68J071p32l42Q72l05
$$ -396 706 165 -618 674 731 -744 -116 938 -372 -162 1140 171 -97 974 242 -100 772 467
2390D67o86J010m6j395J024P87j384P7J056o91m93J216n28o76R70l38r30J141
$$ 467 -219 791 745 -650 374 1161 -223 -146 910 219 -274 942 414 -262 708 370 -560 581
2408E81J36j177P40N48j183K44R64j022l90J196o97m65J126l13p62R15J50j351
$$ 581 717 -460 280 828 -355 -111 853 -169 -559 637 -60 -525 601 288 -474 441 591 -760
2426g60Q74P50j524M12Q01q43m30J501n91q46R90k74j017J091N52j450M16Q58
$$ -760 114 864 -660 -248 553 -290 -720 781 190 -656 334 60 -957 134 686 -764 -348 510
2444E10j361K04J210q86o11J273m47q46R60J44j214J011K64j106N64Q44j271o
$$ 510 -851 -647 563 -323 -934 339 -108 -954 6 150 -1064 -53 211 -895 -331 513 -758 -764
2462g64J204q53l82R61j93q37R24Q2r24O45N39j011K99P73j073l5J252q69l97
$$ -764 440 -413 -795 166 -27 -864 60 142 -782 -137 402 -609 -310 463 -610 -645 607 -262 -659
2481f59J046k03r47J081M3j079P95N09j004J53J037r88r7J042p43m81J082l10
$$ -659 387 184 -763 318 361 -718 77 586 -418 -265 772 -216 -313 729 -14 -495 587 277
2499B77q09J127L9j243J010M70j433N29O98q70P2P86n61m09J209k70j052J101
$$ 277 -532 595 634 -609 401 871 -562 -33 665 -205 -133 653 92 -317 892 622 -430 671
2517F71J70j270M85Q79r91P2O27o91k06J134o84m61J143o07q18J006M10j449O87
$$ 671 841 -429 56 935 -56 16 643 -48 -254 880 196 -265 878 271 -547 459 869 -580 107
2536A07R95j561N4J147o80j80Q14p26l54J065n13p61J099N8j373P91Q88j326R6
$$ 107 1102 -459 -405 742 62 -118 696 -30 -384 681 168 -593 506 564 -809 -18 870 -456 -360
2555c60R63o47l52Q07m07m45O52m13l59Q69j64j044P96P30j545K57J311r82n24
$$ -360 603 -44 -396 411 4 -441 211 -202 -561 308 144 -900 -104 626 -919 -662 649 -333 -857
2574h57J112k04p46Q00o5p54P95L0j074P92P68j483L85J273j189k87J077n4j173
$$ -857 255 51 -695 105 40 -714 81 111 -963 -171 597 -886 -501 772 -417 -704 373 319 -854
2593h54Q67K53q78O98l8p45Q79K35j547O96J263q96q53J603k82j226J011K61q98
$$ -854 13 266 -612 86 48 -697 182 417 -1130 -434 829 -67 -920 683 401 -825 186 447 -451
2612d51K55K99o19N40M39j095L83J155j178m64J555l07j224Q01M31p38K02N22
$$ -451 -196 103 -516 24 463 -632 -249 906 -272 -736 819 512 -712 89 520 -218 -16 506
2630E06n04M60jq52O82O56j289n0J415m74j329J086O38j376M96O07n00r4L29m24
$$ 506 2 462 461 -391 291 947 -342 -392 1023 549 -780 306 944 -432 64 671 171 77 406 -18
2650a8M36M32r13j12J003l76j312J364L54j325J66J013p85j42L70p8L00J63q50
$$ -18 418 850 -63 -175 828 452 -860 504 858 -467 -301 712 -73 -215 155 77 377 540 -310
2669c10L7J070r15p44J552K55j752N71J120j161m7O56p7m27J71l67J92O38q11
$$ -310 -273 797 -118 -862 690 945 -807 -236 884 -277 -324 332 255 -172 -1 -368 -176 462 -349
2688c49n03J552m4j680O53J008r64m29J149m45m07K40o7R3L33o36j65J400m77
$$ -349 -852 700 656 -1024 -371 637 -327 -756 393 -52 -459 -219 -286 -193 140 -496 -661 739 262
2707B62j655J189R74j577j82J545l83r06N90J61l45L91k54r2R95p22j053J178
$$ 262 -1393 -204 770 -807 -989 556 173 -733 -143 18 -327 64 -190 -282 713 -9 -1062 116
2725A16R22j843J34J741r35r36P36M77o69M92k00l34Q44o51n54R91M96j572L34
$$ 116 1038 -805 -671 1070 135 -801 -65 412 -257 235 35 -299 545 -106 -660 331 827 -745 -411
2744d11J468r19r33J384J43j139N75J98j83r5N3n86Q93M13j531P68J173j285q27
$$ -411 1057 138 -795 589 732 -407 168 366 183 88 141 -445 448 861 -670 98 1271 -14 -841
2763h41J597j52r56O53M64p76J31p9j73J018n37p87P00J013j536n03J597k16j308
$$ -841 756 604 -352 301 765 -11 120 41 -132 886 349 -438 262 1275 -261 -764 833 617 -691
2782f91Q48O94r28K1L65r9j4L8r08J023O09j690j14J965q19j073J009M98j240
$$ -691 157 851 -77 -56 309 210 196 234 -674 349 958 -732 -846 1119 300 -773 236 734 -506
2801e06P2Q63n73J37j3j43K91K71r43P8J509j040j031J543J87j510K76J052o42
$$ -506 -434 429 -144 -7 -20 -163 128 399 -544 -466 1043 3 -1028 515 702 -808 -532 520 -122
2820a22j99J75k90K25J06o63L45J000q86o97J241J83j582O61J466j197k79P00
$$ -122 -321 -146 -436 -211 -105 -768 -423 577 -309 -1006 235 418 -1164 -503 963 -234 -513 187
2838A87m18K40P9n32L57P32j165k70J268k39j350J021R76j298k03R46k49l71L07
$$ 187 -231 9 88 -444 -87 645 -520 -790 478 239 -1111 -90 886 -412 -615 331 82 -289 18
2857A8l44L47M24n51o36J356m28j021R41Q43j322j75J262m67o12N72J03p6K04
$$ 18 -326 21 445 -106 -742 614 186 -835 106 949 -373 -548 714 247 -365 207 310 234 438
2876D38n99k01J149n39j145J462M44j481k1J063n10k13O46j42k65L58l59r2N15
$$ 438 -161 -362 787 248 -897 565 1009 -472 -493 570 60 -153 493 351 86 444 85 -7 508
2895E08l10n86R84L12j566M68J061q04o19J202o1o81M56m59J1N05k77n42Q39J15
$$ 508 198 -388 596 908 -658 -190 871 67 -552 650 589 -92 364 -95 -84 421 144 -398 441 556
2915E56j211N33J035j187n05J363j49p90M13J93m21J87Q3l95M26J58r53N11J072
$$ 556 -655 -122 913 -274 -779 584 435 -355 58 251 -170 17 100 -295 131 289 -664 -153 919
2934I19j292j37R70m66o32P23K68n59%M37n90L03J24p41O22N86j224k2J041j55
$$ 919 -373 -510 460 -6 -638 85 353 -206 -206 231 -359 -56 68 -673 -51 535 -689 -711 330 175
2954A75j021O87L95q80M79N05n78k38N22o53N28M09j007J00R22n66n61Q79L79
$$ 175 -846 -159 236 -644 -165 340 -238 -476 46 -607 -79 330 -677 -577 345 -221 -782 97 476
2973D76r51K74L48n47J96M33l17kM57q30K0J011o86n06R88K14j005M49L89p06
$$ 476 -475 -201 147 -400 -204 229 -88 -90 367 -463 -443 568 -118 -624 364 578 -427 22 411 -295
2993b95M7O80p06J72O29q22R8O35l73n17J078j11j008L62Q50j093K03P21n57J5
$$ -295 -248 432 -274 -102 527 -295 -197 438 65 -452 626 515 -493 -131 719 -374 -171 550 -7 8
3013HN13m81r0O94k77o90N94K20q25N93K99q50J81O89o56j58N21j89j80N20l78
$$ 8 521 40 -50 644 367 -323 271 491 -334 259 558 -292 -111 578 -78 -236 285 96 -84 436 58
3034E8n30J028k57q34N87K31n30O5R09q47q7L68l79q1Q01l73o02P47j86o92P38
$$ 58 -472 556 299 -535 52 283 -247 -182 727 -120 -207 161 -218 -299 502 129 -473 274 88 -604 134
3055A34K66q64K28O16m40k75M97m04r9M84j22m97M48J53n61M14K78q21K80P52
$$ 134 400 -464 -236 380 -60 -335 162 -242 -341 143 21 -476 -28 125 -436 -22 256 -565 -285 467
3075D67p30m65J047l39l98O17j51o98Q47M7p68N83R7o74L75N86q16j53Q96m25
$$ 467 -263 -728 319 -20 -418 199 48 -650 197 244 -524 59 156 -518 -143 443 -373 -526 370 -55
3095e5l56O62m0o76O21j04o09N32K51o09Q7O80o09j47R90n46n31P67Po28M96O5
$$ -55 -411 251 211 -465 156 52 -557 -25 226 -383 -296 384 -225 -372 618 72 -459 308 315 -313 183 248
3117B48m85K78K43n13O6P32p82O0O99k90n41M04K07n46L64L58o74K70L72m67j02
$$ 248 -237 41 284 -229 -163 569 -213 -153 546 256 -285 119 326 -220 144 502 -172 98 470 3 -99
3138i9M94k75n16R79l49o03P17n1n40O23J11p36J84N76n62P4K09m25R2N29l21
$$ -99 395 120 -396 583 234 -369 348 297 -243 380 491 -245 -61 515 -47 27 236 -189 -97 432 111
3159A11m10O48o0p18N79J64n80K98K63n89J92N37o56L2N37l46m64P09O7p48M58
$$ 111 -299 349 289 -429 150 314 -266 32 295 -294 -102 435 -221 -189 348 2 -462 247 314 -434 24
3180B4K13p66L47M59o50J02O88n16n4O64l69o96P27J2o64L64N05r32L53M48n63
$$ 24 237 -529 -182 277 -373 -271 417 -99 -153 511 142 -554 173 185 -479 -115 390 -542 -189 259 -304
3201c04J8M94j87n42O18m0m95L60R1n09L57L51r50L49P16o51j41P82l88n40Q89
$$ -304 -286 208 21 -521 97 57 -438 -78 13 -496 -139 212 -738 -389 327 -324 -465 317 -71 -611 278
3222B78l30j89L07j9l40K76L64o88J88M63m50j11Q57m28o01P32o9m44M39L4l55
$$ 278 -52 -241 66 47 -293 -17 347 -341 -153 310 -140 -251 606 178 -423 309 240 -204 235 269 -86
3243h6J56K49o10K94N07o68kP38l96m33O45J2o35K60N02m16J13K5m79P7O06l14
$$ -86 70 319 -291 3 510 -158 -160 578 182 -251 394 406 -229 31 533 117 230 255 -224 -147 459 145
3265A45m79P44p9o25O32j18m58M22K23n55K51L39n69K11M51q56M3Q96o70l37P90
$$ 145 -334 410 331 -294 338 220 -238 184 407 -148 103 442 -127 84 535 -321 -278 618 -52 -389 401
3286D01P7r26O28J91n48P4L12l23K29J66m74m6O32l37n02N82j8m70L42J02l07
$$ 401 478 -448 180 371 -177 -103 209 -114 115 281 -193 -239 393 56 -446 136 118 -352 -10 92 -215
3307b15N1K48k05J9M50p45K3P13m42n40J097k08p42L32N41q73J27M72k21P4P8
$$ -215 -164 84 -121 -102 348 -397 -374 339 -103 -643 454 246 -496 -164 377 -496 -369 103 -118 -44 34
3328C4k25p7L24k62m39J013l74o33O89L07q48K78N21n33J4K78k47m9M29k13j82
$$ 34 -191 -268 56 -206 -645 368 -6 -639 50 357 -491 -213 308 -225 -211 67 -180 -229 200 -13 -195
3349a95N66l70l80N68J90p69mQ88p34j07N42j22p8K95l24j29M66J10q28M00L36
$$ -195 371 1 -379 189 379 -390 -394 494 -240 -347 195 73 -5 290 -34 -163 303 413 -415 -15 321
3370C21o89K62Q86p50m28O85o1l63L88j05o6r5J40n16N99J24n53L00K77l52j97
$$ 321 -368 -106 780 30 -398 287 226 -137 251 146 80 -15 125 -391 208 332 -221 79 356 4 -193
3391a93N15j44m31L33J28n6l7n6l71N08l7m96L71N99q86K3P29l30n72N77J69m86
$$ -193 322 178 -253 80 208 152 115 59 -312 196 159 -337 34 633 -253 -230 499 169 -403 174 343 -143
3413a43J07J37l05L91J03n39J81N25q68M2P25k17p33P75N3m93N4L69m28K98K33
$$ -143 -36 101 -204 187 290 -249 -68 457 -411 -369 356 139 -594 181 234 -259 -205 164 -264 34 267
3434B67n65L89K0n54R9O14l40m68O63K57r94M53K54j80m2J48k91J29K00l74m5
$$ 267 -298 91 111 -443 -344 270 -70 -538 125 382 -612 -159 95 -85 -127 21 -270 -141 59 -315 -360
3455c60P62n20m29O74M4o84K34O04m68r7L56k16R4J01m23K34M12n77o0N22J58
$$ -360 402 -118 -547 127 171 -513 -279 325 -143 -240 116 -100 -6 95 -328 -94 318 -259 -319 203 361
3476C61p64K66M27m96p9M84l69J34K74m45K05J65l51k28Q28j87p40N03N45n74
$$ 361 -403 -137 290 -206 -285 199 -170 -36 238 -207 -2 163 -188 -416 412 225 -515 -12 533 -41
3496d1j32L95m0j67J66k0j05L9R7j99L16l26l57O21J03m91l2O65l58j85J67J60
$$ -41 -173 222 182 15 181 161 56 95 192 -7 309 -17 -374 247 350 -141 -173 492 134 -51 116 276
3518B76l57J66j08m6L84l9n01M86L04q27L56L89l50l19K76K80m69M05k95k28N25
$$ 276 -81 85 -23 -69 315 276 -225 261 565 -262 94 483 133 -186 90 370 -99 306 11 -217 308
3539C08l19l47Q30o9q30K79M57m78r0L55n5l63L87K3k38K09m8k79M00nn83L08
$$ 308 -11 -358 472 403 -427 -148 309 -169 -259 96 41 -322 65 88 -150 59 11 -268 132 127 -456 -148
3561a48L97n05r1O35k18n04N11n0k72J78J40k64J71K04n60K87M27n83j16Q14l26
$$ -148 249 -256 -347 288 70 -434 77 27 -245 -67 73 -191 -20 184 -376 -89 338 -245 -361 453 127
3582A27o36M86J54l00K8L11l13k6K43k93R9L93n48OO02l19m75O91m9o60M81K34
$$ 127 -509 -23 131 -169 -141 170 -143 -169 74 -219 -120 273 -275 -269 333 14 -461 230 181 -479 2 236
3604B36l62J28N5j25m6M29k98k65O28j76m11M07j57m33M09L01m76J45M52n52J32
$$ 236 -126 2 57 -68 -114 315 17 -248 380 204 -207 200 43 -390 19 320 -156 -11 441 -111 21
3625B1J01k59k0L65j93j39L81j45k17P1N23n36M9L39k45J3J33j10p1K18k69j42
$$ 21 122 -137 -157 208 15 -124 257 112 -105 -34 489 -47 2 341 96 109 242 132 61 279 10 -132
3647a32L21N6l78K34N35p54J46M47n74j34M81l62J50L17l81k42M57k46J3P1P7
$$ -132 189 245 -133 101 636 -118 28 475 -99 -233 248 -114 36 353 -28 -270 187 -59 -46 25 102
3668A02k66j5M77k85j56K09J35n79L95M1k28K87M7o75O17l6l53%L03n0k49N09
$$ 102 -164 -179 298 13 -143 66 201 -378 17 58 -170 117 164 -511 106 70 -283 -283 20 -30 -279 230
3690B30k94k63M08Ol46L81L8n34M86K00n10N5K58l66o6N11k27j32K20j07j47J92
$$ 230 -64 -327 81 87 -259 122 160 -374 112 312 -198 -143 115 -251 -317 194 -33 -165 55 -52 -199 -7
3712gl0j89K98J02o17L17M68o48L9K44j01k22K31K25l62N07k76r4J09K55m46K28
$$ -7 -37 -226 72 174 -443 -126 342 -306 -267 -23 -124 -346 -115 110 -252 255 -21 -115 -6 249 -197 31
3734C1K84m47kL68q9m36L16J21j96J24K57m35J23L83m46j33N43m51OL33l52n5
$$ 31 315 -132 -134 234 145 -291 25 146 -50 74 331 -104 19 402 -44 -177 366 -85 -79 254 -98 -153
3756a53L75N9n26N66j08k42k5M13k99j11L12k34R2J02k89k1L03j42j42K59k1k02
$$ -153 222 281 -245 321 213 -29 -54 359 60 -51 261 27 119 221 -68 -89 214 72 -70 189 168 -34
3778c4J25J90l50M4M83o25j17M70n7m81L95J88n59L59L54n67J09M09l38j18L56
$$ -34 91 281 -69 -25 458 -167 -284 186 129 -352 43 231 -328 31 385 -182 -73 336 -2 -120 236
3799B36l12k37L96k00j35L43p9j54K18J0l66K06L07m72J15K05j90j40M08j80j32
$$ 236 -76 -313 83 -117 -252 91 12 -142 76 86 -280 -74 233 -239 -124 81 -109 -249 159 -21 -153
3820a53L98k50k68L30J85m02J7M61o20P2K65k02j29M40l90n4M22J16n99L92J3
$$ -153 245 -5 -273 57 242 -160 -143 318 -302 -230 35 -167 -296 144 -246 -300 122 238 -361 31 44
3841D4k88L02J58m17p2M63l54q5K97R5n10M10J55n69N87j93k70J6L62k68K25J73
$$ 44 -244 58 216 -201 -273 190 -164 -249 48 143 -367 43 198 -371 216 23 -247 -231 131 -137 88 261
3863B61k13j94M21j55j12J85n6m16K78J18j50K4J69r2l26O10l22m6K29j22l14
$$ 261 48 -146 275 120 8 193 137 -279 -1 117 -33 -9 160 68 -258 352 30 -16 213 91 -223
3884b23N37j01k58M3K98m79J71J92j33j11J16J7l13M16k89j0K06J90m64L05qk92
$$ -223 314 213 -45 -2 296 -183 -12 180 47 -64 52 69 -244 172 -117 -127 79 269 -195 110 102 -190
3906a90P7K96j94P0J86l10j71L23Pk92J43J81l35J25M53m45J04Q1j40n5K01o8
$$ -190 -113 183 -11 59 245 -65 -236 87 94 -198 -55 126 -209 -84 369 -76 28 109 -31 -86 115 47
3928D7m13M71m1l49K99J18j56j28L38m07J75k2j97L33K97l39l95M22Rn56N64J20
$$ 47 -366 105 64 -285 14 132 -24 -152 186 -221 -46 -68 -265 68 365 26 -369 53 62 -494 70 190
3950A90m10K48K02l84j21L91j39k99O86l96l64K57J18j93J16K84m62J15J42p4
$$ 190 -220 28 230 -154 -275 116 -23 -322 364 -32 -396 -139 -21 -214 -98 186 -276 -161 -19 -93
3970i3j43L61j95j07L62k85q5L98j11k13mK92m08J43K59o1k19l3R3J5J79j46N6
$$ -93 -236 125 -70 -177 185 -100 -185 213 102 -111 -115 177 -231 -88 171 110 -109 -142 -49 -34 145 -1 55
3993E5J35p4k43RM49n92K29L77j14l90Q0J69j68K25J2k46J18K22m67K60K21l20
$$ 55 190 116 -127 -118 331 -261 -32 345 231 -159 -79 90 -78 147 159 -87 31 253 -214 46 267 -53
4015e3j52N68m62M3R0j15K3L6P1j40N28l13l24M31J9m72J15L07k57k23L74k24
$$ -53 -205 363 -99 -56 34 -81 -58 -22 49 -91 437 124 -200 231 250 -222 -107 200 -57 -280 94 -130
4037a30j60L48J29k27K17o9l39L52j42l06K30L58m15k8M60p6m37M06q1j98K17
$$ -130 -290 58 187 -40 177 108 -231 121 -21 -327 -97 261 -154 -182 278 202 -235 171 90 -108 109
4058A09k22r0J01K21k90R9L57m87M8K70j27k25K76R8l86K00J78l82L40J17k59
$$ 109 -113 -203 -102 119 -171 -72 285 -202 -154 116 -11 -236 40 138 -248 -48 130 -252 88 205 -54
4079e4m6N2j60J03L64l48k84M13N7k56Q6K58l70R8K56n02K73K49l57mM52l78k34
$$ -54 -100 -48 -208 -105 259 -89 -373 40 97 -159 -73 185 -185 -87 169 -333 -60 189 -168 -172 280 -98 -332
4102c32M14pm57L51K47l90K15J06l45K56L6r5j82M57l46J03N9mj05j1J80k94p7
$$ -332 82 75 -382 -31 216 -174 41 147 -198 58 94 -1 -183 274 -72 31 90 86 -19 -30 150 -144 -221
4125b21M65m02O0K66k81l1M37k61p8L43k33l11K51L93p06L27K21j90j50K04k7
$$ -221 244 -158 -98 168 -113 -144 293 32 -46 297 64 -247 4 397 -309 18 239 49 -101 103 76
4146G6j55K33k56L4K62r5l10M15K9k55j06K77j97j92M69k34P1N9p9l09M23r9l34
$$ 76 -79 154 -102 -68 194 99 -211 204 233 -22 -128 149 -48 -240 229 -5 66 125 46 -263 160 61 -273
4169b73M45q2l45R8L87k69j67K03J80l35J35J26m13K74P3m21M84J15n12K88J98
$$ -273 172 90 -255 -157 230 -39 -206 -3 177 -158 -23 103 -310 -36 37 -384 100 215 -297 -9 189
4190A89k89m6L34k19k49L06r6j20N0J88j55j3J02j89K77Oj37j85L63j39k03J58
$$ 189 -100 -146 188 -31 -280 26 -70 -190 -140 48 -107 -120 -18 -207 70 76 -61 -246 117 -22 -225 -67
4212f7J4J5R0N5k69J15J73m05j3M50j79k69O06k70j06R6J84l62J45L3j93J66K12
$$ -67 -53 -38 52 107 -162 -47 126 -279 -292 158 -21 -290 316 46 -60 36 220 -142 3 36 -157 9 221
4235B21l08K3L61k88m7L29k60j59K60J45m08J98R7l26%M03m05L46P6l46M5K29
$$ 221 -87 -64 297 9 -38 291 31 -128 132 277 -131 67 164 -162 -162 241 -164 182 258 -88 -43 186
4257A86j21j97J87J83l70J05N12n53K88k55k17L85J61k59%K25m7n29M00J23l58
$$ 186 65 -132 55 238 -132 -27 485 -68 220 -35 -252 133 294 35 35 260 213 -316 84 207 -151
4278a51j9K54n6q3J80Rj73M5k44N1L50k44l9L81k47k63L35R2l00n8K95k70q0M46
$$ -151 -170 84 28 -55 125 134 -39 6 -238 -187 163 -81 -120 261 14 -249 86 178 -122 -180 115 -155 -235 211
4302B11j73k04J63L1l1L1p0k99K20K07l22N6L77l66L41K13l10k41K41j80r4L28
$$ 211 38 -166 -3 28 -3 28 -42 -341 -121 86 -236 -180 197 -169 172 385 75 -166 75 -105 -199 129
4324A29m5l61L99J5k73j9L08k48l09M49O7j47J1R7k00K0J47k92K14J46j70J18
$$ 129 84 -277 122 137 -136 -155 153 -95 -404 45 112 -35 -24 73 -127 -107 40 -252 -38 108 -62 56
4346E6J14j88n7K83k33q4L23r1k88M74k89k76O7M13m87M40Q4m23J17K40k64j2
$$ 56 170 -18 -75 208 -25 -109 214 123 -165 309 20 -256 -189 224 -263 177 261 -162 -45 195 -69 -81
4368h1J61K3k96M36j77k35K52M6o9R0O9k70o1M42m02m9K36k57j14N51m24M5J69
$$ -81 80 103 -193 243 66 -169 83 129 60 150 219 -51 -112 330 -72 -121 115 -142 -256 295 -129 -84 85
4391H5J50l73J49L32k65LQ0l7l08L24j55j2j7O8j70J77L0l13K7M02k26O6J4j50
$$ 85 235 -138 11 343 78 81 161 124 -184 140 -15 -27 -44 24 -146 31 61 -252 -225 177 -49 17 31 -119
4415a19M6K42l2l50J13J06j95J40M5q4J01J62l21J03K63j85k70K75R8l26J53N6
$$ -119 -73 169 137 -213 -100 6 -189 -49 -4 -88 13 175 -146 -43 220 35 -235 40 138 -188 -35 21
4437B1l50K45J67k99K37K2j10p0K87j08q0J5K8j64J11J57l21P2K72j32j50K80
$$ 21 -329 -84 83 -216 21 43 -67 -137 150 42 -38 -23 5 -159 -48 109 -212 -140 132 0 -150 130
4459A30k00k24L37j90l20N47J8k58K7J35j25R6K11l81o4L93l53nK21L0k02J82
$$ 130 -70 -294 43 -147 -467 80 98 -160 -133 2 -123 -27 184 -197 -261 132 -221 -226 -5 25 -177 5
4481Eo2Q4Q5j82k89L01J50j72k13M50j55q3J89O8k51Q8j86O3L24j86j56J01KJ10
$$ 5 -57 27 112 -70 -359 -58 92 -80 -293 157 2 -81 108 176 -75 13 -173 -110 214 28 -128 -27 -25 85
4505H5r2J67j55p5L60j72j32J85j46j22J47J4q3J6J10k81O2J97j27j02L03j79
$$ 85 -7 160 5 -70 290 118 -14 171 25 -97 50 64 -19 -3 107 -174 -112 85 -42 -144 159 -20
4527b0j13J47J03m30M69o7k28J20J48q5j83M5L72m05L85j39m56L67j43J56K7J96
$$ -20 -133 14 117 -313 156 89 -139 -19 129 44 -139 -94 278 -127 258 119 -337 30 -113 43 70 266
4549B66l24o3K67k52J00O4j23r2Q5M1k23J71J66k28J05J15j92n5K31k00J11n9
$$ 266 -58 -121 146 -106 -6 58 -65 -157 -72 -31 -254 -83 83 -145 -40 75 -117 -172 59 -141 -30 -89
4571h9J09j93J40J05n8J99j70q6r0L20l14J06L1J34q0J72l53j38L47rk66J79K08
$$ -89 20 -173 -33 72 14 213 43 -43 -133 187 -127 -21 10 144 64 236 -117 -255 92 83 -183 -4 204
4594B04m12J44J58j71o2Q3M6j99L37o6j29K29Nm21K46j8j29K06K15j96j04Q5j60
$$ 204 -208 -64 94 -77 -139 -56 -10 -209 128 62 -67 162 167 -254 -8 -26 -155 51 266 70 -34 51 -109
4617a09j0J36k16R8L78l30l7J70J20l46n0L34l44Q0L34k44J22O6J48l45J84q5
$$ -109 -119 17 -199 -101 277 -53 -90 80 200 -146 -196 138 -206 -126 208 -36 86 152 300 -45 139 54
4639E4p4n0M68l22j45K40j86j54J57rl0J63k94J50J38J12l41K8K88l16J58J41
$$ 54 -20 -70 398 76 -69 171 -15 -169 -12 -21 -51 112 -182 -32 106 218 -123 -95 193 -123 35 176
4661A76k31J21n7M2k47J15J97k26R1j6q3R9R0k25J08L36l23l1N4j14p4K72q3l12
$$ 176 -55 66 9 51 -196 -81 116 -110 -19 -35 -118 -19 71 -154 -46 290 -33 -64 -10 -124 -198 74 -9 -321
4685c21M79m5k39Q6K52l98J57L29m58N6J62p2q9O6J2k38J95K22l32J37K7j52K4
$$ -321 158 113 -126 -40 212 -186 -29 300 -158 -102 60 -12 -101 -35 -23 -261 -66 156 -176 -39 -12 -164 -140
4708a40J85j24o2J89r9j01L99j79j83K50k43j1N9K93j98k10K98q6j74L20j17k61
$$ -140 45 -79 -141 48 -51 -152 247 68 -115 135 -108 -119 -60 233 35 -175 123 37 -137 183 66 -195
4730a95L90k91J3P9J11j58J48j83q4P9R5q7J44K04l02J53l2R7k76J06J0k43J19
$$ -195 195 -96 -83 -4 107 -51 97 -86 -170 -91 4 -83 61 265 -37 116 84 181 -95 11 21 -222 -103
4753a03K96j93R3K3k79J28J48q5J02L32l95j07N9P6k22j79M92k96K6J79J11l25
$$ -103 193 0 93 116 -163 -35 113 28 130 462 67 -40 19 95 -127 -306 186 -110 -84 95 206 -119
4775a19K39p0j0J55j12O6j57K50n64K09J86q0j37L29j26r7jJ82k37K22p1j65N7
$$ -119 120 50 40 195 83 149 -8 242 -322 -113 73 -7 -144 185 59 -38 -39 143 -94 128 57 -108 -51
4798e1J87l97J51K58q1q7j05N5o2L40l46n9K20K3l16K21J47j36q4K82l25l0K04
$$ -51 136 -261 -110 148 67 -20 -125 -70 -132 208 -138 -197 23 46 -270 -49 98 -38 -122 160 -165 -195 9
4821IQj39N0n4O0L2j11J4M3J45kj11L06l88M2J80p4N3%q1k29L13j07q2K71k0m06
$$ 9 17 -122 -72 -126 -66 -34 -145 -131 -88 57 55 -56 250 -138 -96 84 10 63 63 -18 -247 66 -41 -123 148 128 -278
4848b78M1M19j43LJ83m32K07j26K14jJ4r8J7Q7rl34L08o6O0j04K56k06j64L57
$$ -278 -237 182 39 42 225 -207 0 -126 88 87 101 3 20 107 98 -236 72 6 66 -38 218 12 -152 205
4872B05k49J08n4R7p8J4K98n06J33K16k27J09j39J21j58J83N5k39M16k25r0J62
$$ 205 -44 64 10 107 29 43 341 -165 -32 184 -43 66 -73 48 -110 73 128 -111 305 80 -10 152
4894A52k63K24m7j5J15Rj35l2k33K38Q1j88M5J47j16Q1J3j86R7j11k1QJ82J02
$$ 152 -111 113 66 51 166 175 40 8 -225 13 94 -94 -49 98 -18 63 76 -110 -13 -124 -145 -137 45 147
4918A47j99K79k54M8r5K35m36J59K36nr0Q8k47N1P7r3n0M4L57l12l03L21j17M0
$$ 147 -52 227 -27 21 -74 161 -275 -116 120 115 25 113 -134 -83 -6 -99 -149 -105 252 -60 -363 -42 -159 -119
4942a19J42j34J47J54k19Q5j28O6n1O6Lj26K17P2m00K61L1l21J82J44%j18J05
$$ -119 23 -111 36 190 -29 56 -72 -6 -57 9 12 -114 103 175 -225 36 67 -254 -72 72 72 -46 59
4965E9m8k55M19j28l99L71J15l51J93J09m7j74P1K43j03r0L2j26J07l01J96K09
$$ 59 11 -244 175 47 -352 19 134 -217 -24 85 38 -136 -65 178 75 -15 17 -109 -2 -303 -107 102
4987A02j39n4J97q3m8p4N2J27p3k2P5k28L29j52k0P5r8j38J05K46l46K46J55k75
$$ 102 -37 -91 106 23 -25 -99 -47 80 7 -15 60 -168 161 9 -11 64 -34 -172 -67 179 -167 79 234 -41
5011d1O6J88l2j56q2P5NJ30Q6k20P7K57l14l1J2K3k78L11J30l62J65j1M8j26M98
$$ -41 25 213 181 25 -57 18 23 153 239 19 96 353 39 8 20 43 -235 76 206 -156 9 -2 46 -80 418
5036D18m87p9K5l7J25K45k52j26J59o6o6J21m9L7R6P0l03K20P8j72p5L21j19k17
$$ 418 -69 -148 -123 -160 -35 210 -42 -168 -9 -75 -141 -20 -69 -32 64 134 -169 51 129 -43 -118 203 84 -133
5060a33J54L4j09N8L0pK8k9l3J7J88j15k69K20MMp1Q9l4K7K51m35K5J82k46J48
$$ -133 21 55 -54 4 34 27 55 26 -7 10 198 83 -186 34 38 42 -29 60 26 53 304 -131 -106 76 -170 -22
5086b2J0l2k5J51j01j25K22k4m0l3Q7j39K5K43k42J39p8Mk54K10M9j30J98k86
$$ -22 -12 -44 -69 82 -19 -144 78 54 14 -19 68 -71 -46 197 -45 94 16 20 -234 -24 25 -105 93 -193
5110a93K32L1j36J8j8K41j83OL8J9r1Q4k43J63N1o4k4L39k75R1L1q7j28n6K75
$$ -193 39 70 -66 -48 -66 175 -8 -2 36 55 -36 48 -195 -32 19 -45 -69 270 -5 86 117 30 -98 -154 121
5135A21l9j62L21l52oK18J07j87J44k89J36p4J3J82ok28k3K15q5K27j92P8j55
$$ 121 82 -80 241 -111 -117 101 208 21 165 -124 12 -62 -49 133 127 -101 -124 91 6 233 41 119 -36
5158c6n3J28j4N1j45L7j37M5K16k10J54j30k12K27J41M3j20K9K37l20n7K34j06
$$ -36 -89 39 25 76 -69 -32 -169 -124 92 -118 36 -94 -306 -79 62 105 -15 14 251 -69 -126 108 2
5181B%J66j72m7J82p7k0M7M9q8j02J42j73J18n8k9L8j33J60k9o8J44j44J22O6
$$ 2 2 168 -4 -51 131 54 34 81 130 42 -60 82 -91 27 -31 -60 -22 -155 5 -24 -92 52 -92 30 96
5206I6k34K95q3j53J1k1J55q4j1J46j50J21R7k02L8N6l53K85K8J02p9j4k15J70
$$ 96 -138 157 74 -79 -68 -89 66 -18 -29 117 -33 88 185 -17 21 77 -276 9 37 139 60 46 -169 1
5230AQ4k06K96k54j4O5J80q7j74o2N6p3K51Rj07j8O6jj78K57j62pJ18N7KJ8m2
$$ 1 85 -121 175 -79 -93 -28 152 65 -109 -171 -115 -188 63 72 -35 -53 13 12 -166 91 -71 -78 40 97 99 117 75
5257G5k98K80j25K9M4LQ3n2L0J29k15J00j34k8n1L38l89J75J62q7j25Q4j06k29
$$ 75 -223 57 -68 -39 5 8 91 39 69 198 -17 83 -51 -79 -130 208 -181 -6 156 69 -56 28 -78 -307
5281c07M94j41r4J10N9m5Q2R2k25p2mJ02k46Q6N3K04p2n6M2n9O5rk29K29O4j73
$$ -307 187 46 -48 62 121 76 158 250 25 -47 -51 51 -195 -109 -56 148 76 20 62 3 68 59 -170 59 123 -50
5307e0P3r0P5J41K8k16J34Qj7Mq7j21N9M8j51Q8Rp4LO5%m2J12K16k18L3j70K32
$$ -50 23 -67 8 149 177 -39 95 103 86 90 3 -118 -59 -11 -162 -74 -65 -139 -136 -71 -71 -113 -1 215 -3 30 -140 92
5335I2j65J58q8p0J11K9k28K23l7j59K51Pj63k61L40j36K8J15J29k27q6O5r7L05
$$ 92 -73 85 -3 -73 38 67 -161 62 25 -134 117 124 -39 -300 40 -96 -68 47 176 -51 -137 -72 -169 136
5359A36Nj51K1J79k82Q4O8j93N1J45k4l2r9Q4O1M8j34l1K57k35K5m2J16k23J38
$$ 136 141 -10 11 190 -92 -8 60 -133 -82 63 39 7 -92 -8 53 101 -33 -64 193 -42 -17 -59 57 -166 -28
5384b8Pn2J08L8mj08P4l0j53J01K85k23j33J90k84K39J89k44R1Q8j15J04O9l55
$$ -28 -21 -73 35 73 69 -39 35 5 -148 -47 238 15 -118 72 -212 27 216 -28 63 151 36 140 209 -146
5408a46J93Rj32J15q2K10m9m3l28K76j17J13P6j11K36o2k35j4R6j49K32l0k31
$$ -146 47 56 -76 39 -43 167 118 75 -253 23 -94 19 95 -16 220 158 -77 -91 5 -144 88 58 -173
5431a73r6L11nj85J83M1j29j16J83j20K97j48n9P7k5j51j21J85J2K46jk26k00
$$ -173 -269 42 37 -148 35 76 -53 -169 14 -106 191 43 -16 61 36 -115 -236 -51 -39 207 206 -20 -220
5454b20J94J96k21j4Q5l05P8J83q8J45m2Q1j63J92k40J99M4n3j83J90R5j65q9
$$ -220 -26 170 -51 -65 20 -285 -207 -24 -112 33 -9 72 -91 101 -139 60 104 51 -132 58 153 -12 -101
5477a01J47j33J79Kk94q0M87j63lj1Q3k22J6K19j78k0p6K70o2O4l79J40J35Q7
$$ -101 46 -87 92 94 -200 -280 207 44 41 30 113 -109 -93 126 -52 -72 -148 122 60 124 -255 -115 20 107
5501A07r0J24r0l5L4N7k73O5J87j23rJ21L9k5j44n6K21m1o1q6N6R0N7n5J43J8
$$ 107 17 141 51 16 50 107 -166 -101 86 -37 -46 75 114 89 -55 -111 110 69 8 -78 -22 68 125 70 213 231
5527B31l54J73j27N5J16kN3k92J29L7jQ6q3k33K95J8j19K86j95j05J82j09r2J01
$$ 231 -123 50 -77 -22 94 92 145 -147 -18 19 18 104 21 -212 83 101 -18 268 73 -32 150 41 -51 50
5551E0K8n4Oj9j74J72L0o3j5N2o9k21N22k1l48J72Pm7J28k35j00J59k7N6J42p1
$$ 50 78 24 30 11 -163 9 39 -24 -39 13 -56 -277 245 224 -124 48 55 8 136 -99 -199 -40 -67 -11 131 60
5577F0J52j41j16J75m32L27j8N5j07J09n6j78O1P5j66K36k4p8N6M2N3qj73n1J71
$$ 60 212 71 -45 130 -302 25 7 62 -45 64 8 -170 -109 -34 -200 36 12 -66 -10 32 85 77 -96 -147 24
5602B4l4j9p5J89k3N0m8j61l3K49o0k47R4K99k76N9j27J61o1K89j50j02j8Q9j84
$$ 24 -10 -29 -104 85 62 112 64 -97 -130 119 59 -188 -94 205 -71 -12 -139 22 -39 250 100 -2 -20 69 -115
5627a15J25j20O9M4l2J1m2M2j04J28O5j55J69Q1j06j7j51J27Mj02J56k79L33R5
$$ -115 10 -110 -41 3 -29 -18 -60 -18 -122 6 71 -84 85 166 60 43 -108 19 23 -79 77 -202 131 226
5651B26l31m8L06k10r1N7J51n7J03l5o9j93Q6P0J84j93J79k68J05k5j31K22o1
$$ 226 -105 -153 153 -57 -148 -91 60 3 106 71 2 -191 -105 -35 149 -44 135 -133 -28 -53 -184 38 -23
5674b3P3j53j4K20K6k06j82L18pO3j32q4J17n4O1J85m0n6j35J24n8j43K46k05
$$ -23 50 -103 -117 103 129 -77 -259 59 52 115 -17 -101 16 -38 23 208 168 112 -23 101 43 -100 146 -59
5698e9J14q6J17j34J91n8j8%j25J18o8q4L4K93j90o1J49j22j81K42N5k70J31q2
$$ -59 55 -31 86 -48 143 85 67 67 -58 60 -8 -92 -58 235 45 -16 133 11 -170 72 127 -143 -12 -94
5722i4j02L21j43m5M3p5P2k47K31P3J8k56M7J01J30R0j86N6O5j38J63j5q7K2l7
$$ -94 -196 125 -18 -63 -20 -95 -23 -270 -39 34 52 -204 -157 -56 74 164 -22 34 99 -39 124 109 22 44 7
5747GJ0o8K6n2P5o7J70l58L05q8Kp0K66R4j36j84J36j9n2K30k45k8J03q6r0M08
$$ 7 17 -51 -25 -77 -2 -69 101 -257 48 -40 -38 -108 158 252 116 -68 68 49 -3 227 -18 -46 57 -29 -119 289
5773B89j18j02J57l10K4nJ9l5K29Nl11L25k10j22J38J1q8M1Q1N8j23K15k09P6
$$ 289 171 69 226 -84 -60 -65 -46 -81 148 153 -158 167 -43 -165 -27 -16 -104 -63 18 76 -47 168 -41 35
5797C5R1j23j82J61qp8J77J4k74J16K07k01J26j21P6j7j33K93l3j50J39L3o2n3
$$ 35 126 3 -179 -18 -26 -104 73 87 -187 -71 136 -65 61 -60 16 -1 -134 159 126 -24 115 148 86 33
5821C3l9J35N2j04k10Q8K05j74k8M2J17j70M2L6q6M7R4J40j05N3k38P3j43J76
$$ 33 -6 129 181 77 -133 -45 160 -14 -42 0 117 -53 -11 25 -61 -14 80 220 115 168 -70 3 -140 36
5845C6j12J67j18k4J40k57J89mm9k2L8l4J59k10K8j5J78N9j92K74k09k31J80M6
$$ 36 -76 91 -27 -51 89 -168 21 17 -32 -54 -16 -50 109 -101 -73 -88 90 149 -43 231 22 -209 -29 17
5869A7M1j59L02k70p7n0L8J43K6j07q0K19J48p2k17K71k18J19j23J37k84K34k24
$$ 17 58 -101 201 -69 -146 -196 -158 -15 11 -96 -176 43 191 119 -98 173 -45 74 -49 88 -196 38 -186
5892a86K19j35R9q0n5L47l03J5J60n3o8l1J50j51N1P0j58P8KJ6m6J85k49J83n4
$$ -186 33 -102 -3 -83 -138 209 -94 -79 81 28 -40 -71 79 -72 -21 49 -109 -31 -29 -13 -59 126 -123 60 6
5917FQ7p5N5J24m60L71l7j19J00K01m9j76p9l2J26J22j11q8K19r6j91Q8P0k52
$$ 6 93 18 73 197 -263 108 71 -48 52 253 204 28 -51 -83 43 165 54 -34 185 89 -102 -14 56 -196
5941a96K94j28J4J38j52m1j64K45l6p8M5k8k3J45P0q2P1j25O3l1M5j11Q1o4J93
$$ -196 98 -30 -16 122 -30 -71 -235 10 -26 -104 -59 -87 -110 35 105 23 94 -31 32 1 46 -65 16 -48 145
5966A45k11n9K71j59q8L5O0M1j19J93J1m2j50N6K41k99l9J1l4J88j25JL9j5q7
$$ 145 -66 -125 146 -13 -101 -66 -6 35 -84 109 120 78 -72 -16 225 -74 -113 -102 -136 52 -73 -72 -33 -48 -135
5991a35N3J11l5J42Lj70R5j83J00J4j12K25j20K5%r8J85k53L16l91k9L76K3q3
$$ -135 -82 29 -6 136 139 -31 64 -119 -19 -5 -117 108 -12 13 13 -85 100 -153 163 -228 -257 119 142 59
6015E9j76J43pJ8J86k02Nj3O5j83j1J52k69R6J28J7k0J03j2o9J53r1l1n6Q9K6
$$ 59 -117 26 19 37 223 21 26 13 78 -105 -116 36 -233 -137 -9 8 -12 91 79 10 163 72 41 -15 74 100
6041A00M0j36k0P1n7o8m9K43j1q6K32k69Pj8k5r1L5L13j47k22K41r4P8j10l4K05
$$ 100 140 4 -16 55 -2 -70 -119 124 113 27 259 -10 -3 -21 -46 -137 -102 211 64 -158 83 -11 67 -43 -77 128
6067A28k19J27N6l1r3m6j7J10R5j05J62k87Q6J6L2o7R5J85l51J61l3M9j57J80
$$ 128 -91 36 92 61 -32 -78 -95 15 110 5 167 -120 -34 -18 14 -53 42 227 -124 37 4 53 -104 76
6091G6j58M2P1j17j45J7K67Q8k8q1N8j10J69mOk81K6JL5K6j02R8n8K1L27k66j02
$$ 76 -82 -40 31 -86 -231 -214 53 141 113 32 90 -20 149 145 151 -130 -104 -103 -68 -42 -144 -46 -104 -83 244 -22 -124
6118a24K96l91K55j18p2K73k13N3l2J81r6M6j63Q2r1J41M6j99J36P3j71J28k0
$$ -124 172 -219 36 -82 -154 119 -94 -41 -73 108 12 58 -105 -23 -114 27 73 -126 10 83 -88 40 20
6141B0J45j87k9K5P6o9J52j80M3k6J43r2K2%j75J7J46k15M19k01J98l24K84j30
$$ 20 165 -22 -51 -26 50 -19 133 -47 -4 -30 113 21 43 43 -132 -115 31 -184 235 34 232 -92 192 62
6165F2o7R8q5L6n3N0j30K2p8J57j48K31l30M10l43J98J0j22J88r6L3J79m67K04
$$ 62 -5 93 8 44 -9 41 -89 -67 -145 12 -136 95 -235 175 -168 30 40 -82 106 10 43 222 -245 -41
6189d1J35j6r0K01p3j65K48j33p7N5j39m6p1L79k05m6K88r6q0l5n0m7O9%j19R5
$$ -41 94 78 -12 189 116 -49 199 66 -11 44 -95 -141 -212 167 -38 -84 204 108 28 -7 -57 -104 -35 -35 -154 -59
6215e9n5J66k2mJ16j60p0K4j2J6L0j36L9K80j58J73k57O0J74l55K52j00Mn7J63
$$ -59 -114 52 30 26 142 -18 -88 -64 -76 -60 -30 -166 -127 153 -5 168 -89 -29 145 -210 42 -58 -54 -111 52
6240E2j4k01j67K61q5N2J40L6j61J50k26L08l44K02p1K48l8j93L71l75k4k3m3
$$ 52 38 -163 -330 -69 -154 -102 38 74 -87 63 -163 145 -199 3 -68 180 142 -51 320 -55 -79 -102 -145
6263a45J56j35L5N5P3RP4j50j2O5P2J57k04n1R9o1qJ6pj09R8k2K39l32J18P5N
$$ -145 11 -124 -89 -34 39 48 122 -28 -40 25 97 254 50 -1 98 37 29 45 38 -71 27 5 244 -88 30 105 110
6290A10l29L42J57j15j33p8J62M4j79N7Q7Q8k04J95m64K34L2L2j03j43L10n5j59
$$ 110 -219 123 280 165 32 -46 116 160 -19 38 125 213 9 204 -260 -26 6 38 -65 -208 102 47 -112
6313a12m3K25j17J41k5n4j82K75M5j49J22k26K0O3q0l7R8J42k34K16n8N2j96K65
$$ -112 -155 70 -47 94 69 15 -167 108 153 4 126 -100 -80 -17 -97 -134 -36 106 -128 88 30 82 -114 151
6337A51k31p4M19j28k46P4R5j79O4J7J8N5jN4L1l6k50M7J12R5m9p2J8j60M5K73
$$ 151 -80 -154 265 137 -109 -35 60 -119 -55 -38 -20 35 34 88 119 83 -167 -120 -8 87 38 -34 -16 -176 -131 142
6363A42l5j94J44J08l37J14k4k3N4R5j90K32J3k01R7J57k82j6K21k10R6J6K1J04
$$ 142 107 -87 57 165 -172 -58 -82 -105 -51 44 -146 86 99 -102 -5 152 -130 -146 75 -135 -39 -23 -2 102
6387A02j91r7J60m3%K03j36N2J13j44J13j26J57k00j0R3J01L2j62K9J08j95J57
$$ 102 -89 -186 -26 -69 -69 134 -2 50 163 19 132 6 163 -37 -47 46 147 179 17 46 154 -41 116
6410A16M3k67O8J97j57rn0R6K6R2m6r5j13J37j18j9L75m64J70J01L0j95Q7K7j22
$$ 116 159 -108 -40 157 0 -9 -59 37 63 155 109 14 -99 38 -80 -99 276 -188 -18 83 113 -82 5 32 -90
6435i0J02q3J14k3m7j64P2J61r4j34J91k8j7L5J5o6Q5p2J54Mk30L20m45L39m4
$$ -90 12 -71 43 20 -27 -191 -119 42 -52 -186 5 -23 -40 -5 10 -56 29 -43 111 115 -115 205 -240 99 55
6460E5k33J55J29k42K49k29L8N4K0k16J12J21k06J20J73k06NK21k45N8Q5k77L30
$$ 55 -178 -23 106 -136 113 -116 -78 -24 -4 -220 -108 13 -193 -73 100 -106 -101 120 -125 -67 18 -259 71
6483G1Lp8J41k51J29j69K17q0O4Pm9J43k42K43q4j59J61J37r5j56O0k2J48r6j74
$$ 71 74 -4 137 -114 15 -154 63 -17 47 54 5 148 -94 149 65 -94 67 204 109 -47 13 -9 139 43 -131
6508a31M6J36p2J04j09J31j49R0q3K33j87LK9l1m9k45J50J3J9n1L45j76R5o9j77
$$ -131 -85 51 -21 83 -26 105 -44 46 -37 196 9 12 41 10 -39 -284 -134 -121 -102 -153 192 16 111 42 -135
6533a35N4r5j2J30j72P0J8J36Mk2N2k3J70k83k4K37j06R7j63O3M7J32j28%j62
$$ -135 -81 -176 -188 -58 -230 -160 -142 -6 -2 -24 28 5 175 -108 -132 105 -1 96 -67 -4 43 175 47 47 -115
6558a15o6J41K29k45J39j41J89r7j54J66M9j15K7K32j38j18L03n09L11j55mj29
$$ -115 -181 -40 189 -56 83 -58 131 34 -120 46 95 -20 7 239 101 -17 286 -223 88 -67 -71 -200
6580b00K07j79O8K26j64J02j43J88q6q9o3K39l66K51o8K37k66m3K12p5n7K20o6
$$ -200 7 -172 -104 122 -42 60 -83 105 19 -70 -133 106 -260 -9 -77 160 -106 -149 63 -12 -69 151 85
6603H5j41p2j9J05O5k40K94j66K23m6o1p8k1%j16J13P8J7k09K10n4L8K4K4k4J54
$$ 85 -56 -128 -147 -42 23 -217 77 -89 134 88 27 -51 -72 -72 -188 -75 3 20 -189 21 -33 5 29 53 29 183
6629A83l71K28k9j59m3L13N3l51P7K42l38O4L77k7j95j4M8J91l11o8J88j28k0
$$ 183 -188 40 11 -148 -191 122 175 -176 -99 143 -195 -131 246 219 24 10 58 249 -62 -130 58 -70 -90
6652i0O0J62nj01Pj20J32q7L4n8P1k4q5l5k7O3n9J82Qj36O6J48k77K06k15J31
$$ -90 -30 132 127 26 33 -87 45 -42 -8 -66 5 -19 -104 -139 -166 -103 -162 20 28 -108 -42 106 -171 35 -180 -49
6678d9K8mr3M9L9j7k2J58m9j14J22r5J27J61k12Kk9Q1k50J95j3nqQ1k0j42P7J80
$$ -49 -21 -25 -118 -69 -30 -47 -69 89 40 -74 48 -47 80 241 29 31 2 83 -167 28 15 10 2 83 63 -79 -2 178
6706A78j42r2m9J71ok34R8R5k4l07L30r0J21R4j48N9j67m3K87k26P9P7k10J29
$$ 178 36 -56 -105 66 60 -174 -76 19 -5 -312 18 -72 49 143 -5 54 -113 -156 131 -95 -16 61 -149 -20
6730b0J32k04M3k2oK1O6k9RL0K7j99J38r4P2K8O8M1n9Jj00j8J57J0l68J90J09
$$ -20 112 -92 -49 -71 -77 -56 10 -19 -10 20 47 -152 -14 -108 -36 -8 60 101 42 43 -57 -75 82 92 -276 -86 23
6757B3o6n6J46J05k25N3J45j03L6k44L10M2j62P5j23j4L6L0L0J87j34j96J18Q4
$$ 23 -43 -99 47 152 -73 -20 125 22 58 -186 124 166 4 79 -44 -58 -22 8 38 225 91 -105 13 97
6781I7j13q3q1K57l0q1P1j47J00R2j23l5r7L13k03O1J9j55k16K95J24J9k16K69
$$ 97 -16 -99 -180 77 47 -34 37 -110 -10 82 -41 -76 -173 140 -63 -2 17 -138 -354 -59 65 84 -132 137
6805A37K8j10L2Oj01O4J60j56L1j0l2k18L02j61n4m6J41J04l2J8j9k1j8j66R8
$$ 137 165 55 87 93 -8 56 216 60 91 81 49 -169 133 -28 -82 -128 13 117 85 103 84 63 45 -121 -23
6830b3Kr5M2J63k17K20l2j39m6J97r7L5m0K16k01M7J32j34O5j76P9j07J33J85
$$ -23 -21 -116 -74 89 -128 92 60 -79 -125 72 -25 10 -30 186 -15 32 164 30 95 -81 -2 -109 24 209
6854B09k21R2j73K62l73J83qq0M3MK5j25K62j14J39o3k7j49J49n6k47K64j0J09
$$ 209 -12 80 -93 169 -204 -21 -29 -109 -66 -62 -37 -162 100 -14 125 62 35 -114 35 -21 -268 -4 -14 95
6878I5o2Q5j31j30P8L5j1N2j03J66r3n4J97l6j39K4K21k44LO1M1k32J46j71J37
$$ 95 33 118 -13 -143 -65 -30 -41 11 -92 74 -19 -73 124 88 -51 -27 194 -50 -47 14 55 -177 -31 -202 -65
6903f5J82j27J02j44O3K7j39J60J5J85k20j3J06k02J05j16n8R0J50k30L7J66J01
$$ -65 117 -10 92 -52 11 38 -101 59 74 259 39 26 132 -70 35 -81 -139 -49 101 -129 -92 74 175
6926A75k13j03q0K95k44MK53p9N9k28J58Q2m4P2j56N4Q1j54O0j14J73j27J12l5
$$ 175 -38 -141 -221 74 -170 -166 87 8 67 -161 -3 79 35 107 -49 5 86 -68 -8 -122 51 -76 36 1
6950Ar9J78J10j47j33J57M0j26j54J16J54j55nR0J28j20l2J1k81J78J09N8k22
$$ 1 -98 80 190 43 -90 67 107 -19 -173 -57 97 -58 -63 27 155 35 3 14 -267 -89 20 78 -144
6973a44O4K60k44m8K66j43l2O0J8J1j20PqJ26n6k3L7J83j08j1L5j77n1M5%j13
$$ -144 -80 180 -64 -112 154 11 -21 39 57 68 -52 -45 -53 73 17 -6 31 214 106 95 130 -47 -98 -53 -53 -166
6999a66M1M03j71l1j78O5l4p2K34mj34r6J78K13k84n8K6R8O9j4j05K23k20k4n3
$$ -166 -125 278 107 76 -102 -37 -71 -143 91 87 -47 -143 35 248 -36 -94 -68 30 99 85 -20 203 -17 -41 -94
7024i4M5L6J09j34K29k60j0K40j13j4k0J27q5l6K9r3j4j38Q0J98j37J17r0J17
$$ -94 -49 -13 96 -38 191 -69 -79 161 48 34 14 141 56 20 49 -44 -58 -196 -116 82 -55 62 -28 89
7048H9j12j0JM1L8%k7J36j52P1pl4J11j76J39o4q9M8j62K30K5J9K5l8k7j46P5
$$ 89 -23 -33 -32 9 47 47 20 156 4 75 68 34 145 -31 108 44 -45 3 -159 71 96 115 140 102 75 -71 4
7075DRm4M0l7R2n2K6j19M3P1K7J51k03L5k49L97j28j42n9j2J6P8J04l53L52J3
$$ 4 13 -31 9 -28 64 12 38 -81 -38 33 60 211 8 43 -206 191 63 -79 -138 -150 -134 -56 48 -305 47 60
7101F0p4o1O8M1j5q9K3n1J11p8j6J88k36J18j8l4J00o0j30R1K4N7j89R0N8l1M6
$$ 60 -14 -75 -7 34 19 -70 -47 -98 13 -65 -81 107 -129 -11 -29 -63 37 -23 -153 -62 -38 19 -170 -80 -22 -53 -7
7128gK7J6N6j16q4J19p8N5k6J91k7j07K7j14J56l24J54J53k17J96j02l7L2J24
$$ -7 20 36 92 -24 -108 11 -67 -12 -38 153 126 19 46 -68 88 -236 -82 71 -146 50 -52 -89 -57 67
7152F7l0j57J79j00J20K04m41K14j83L03N0K4k87k8k7O8J36l13K25k84L10j5p
$$ 67 37 -120 59 -41 79 283 -158 56 -127 176 226 250 -37 -65 -92 -24 112 -201 24 -260 50 35 28
7175B8j53J50qn7J84p9R8j24P6m9j97O3J16J6J5j69K15m5L6j22K68k05j7k18K67
$$ 28 -125 25 17 -40 144 65 163 39 115 66 -131 -68 48 64 79 -90 125 80 116 -6 262 57 40 -178 89
7200H9r8R5K2r7J5K52l47J02q8J21N4pK0j5l34K21j55J01L6j00J69j13J39r8j02
$$ 89 -9 86 108 11 26 278 -69 33 -55 66 120 113 133 118 -216 5 -150 -49 -13 -113 56 -57 82 -16 -118
7225a18K03j96N5K2J24pj24k12J37K01j55l6k8m3L60j74N3J13j94J49j24rJm3
$$ -118 85 -111 -56 -34 90 83 -41 -253 -116 85 -70 -106 -134 -177 183 9 62 175 -19 130 6 -3 -2 -45
7249d5J48k44j54K12K45o3n3L6J7J7k10J69k01J14j26L1L3j00J19K81l20j33K99
$$ -45 103 -141 -295 -83 162 99 46 82 99 116 -94 75 -126 -12 -138 -107 -74 -174 -55 226 -94 -227 72
7272G2r8K55j49j08Q1k6J79q0j71K60m26K23O2om9R8r6L5l9j08P4m8O4K60l51
$$ 72 -26 229 80 -28 53 27 206 126 -45 215 -211 12 74 68 19 117 21 56 17 -91 -17 -65 -1 259 -92
7297i2J15m7L4o6n6K21j40J77j79J72jj03j22Q1Q6r0J65j77n2L05j97j55J42J
$$ -92 23 -24 10 -56 -112 109 -31 146 -33 139 138 35 -87 -6 80 -10 155 -22 -74 231 34 -121 21 22
7321B2P0j70n6J26j4O3R3l07M13k66m5o1R0K95j70n7k30K88l7O5n1p7M2j63K20
$$ 22 92 -78 -134 -8 -22 41 134 -173 240 -26 -71 -132 -42 253 83 26 -204 84 47 112 61 -16 26 -137 83
7346H3k51J8J98j84J1J44k0J73j89K6J01j17P6l22J80J6L62m18J57M5l28K73j88
$$ 83 -168 -150 48 -136 -125 19 -1 172 -17 9 110 -7 69 -253 -73 -57 305 -113 44 89 -239 34 -154
7369a54J52j66J06j1j62L07j04P1m4Q3O3r2k53P5M7K27k51K09p2p7N8J17o1j06
$$ -154 -2 -168 -62 -73 -235 72 -32 39 -5 78 141 49 -204 -129 -82 145 -106 103 31 -46 12 129 68 -38
7393c8J8r4J62k26L02j00N2L0k43L6M3nj9oJ46j43J12J6r7j1l1J06m4J42q7M9
$$ -38 -20 -114 48 -178 124 24 76 106 -137 -101 -58 -63 -82 -88 58 -85 27 43 -54 -65 -96 10 -34 108 21 70
7419G0R6j46k7J09J58l42J36M2j40j33J22L7j29K85j25j01R1p9L5J24Pp4l0o4
$$ 70 166 20 -7 102 260 -82 54 96 -44 -177 -55 -18 -147 138 13 -88 3 -76 -41 83 90 16 -14 -78
7443g8J28J4Q4rj10p7Lj04O4J58o4j31k08K23j2J98q2m2J85j47J56m16J11l0K84
$$ -78 50 64 148 139 29 -48 -45 -149 -85 73 9 -122 -330 -107 -119 79 -3 -45 140 -7 149 -267 -156 -186 98
7468I8j38O0O4J8O1l33Q0J92Ok61J68m0R8j23p0N3J27k14K74k2N2l41L22k51j24
$$ 98 -40 20 84 102 163 -170 -90 102 108 -153 15 -25 73 -50 -120 -67 60 -154 120 98 150 -191 131 -120 -244
7493b44K44j35J54kq4j04J16J4J46j1j32MJ13m6j4j4J37nk3k92J40n4M0o4Q8P6
$$ -244 0 -135 19 17 -67 -171 -55 -41 105 94 -38 -34 79 33 19 5 142 137 114 -178 -38 -92 -52 -116 -28 48
7519D8j22Q3k8J31j3J0j84K93l05K21j61L5J60j67m9j49J83j22J69R4j93J8N6
$$ 48 -74 9 -19 112 99 109 -75 218 -87 134 -27 8 168 1 -48 -197 -14 -136 33 127 -66 -48 8
7542HOk0J32K0o6J8j5k01M5M7nn1P6N7k09J51K64j75K3j44o4Q2P9k51K60k2K8
$$ 8 14 -6 126 146 80 98 83 -118 -73 -26 -31 -82 -6 51 -158 -7 257 82 105 -39 -103 -21 58 -193 67 45 73
7569G3k94L41j83r1J81O3j12k1J28m6j20K60j73j18J30j33l7K17j38P3M6j54L40
$$ 73 -221 120 -63 -154 27 90 -22 -43 85 39 -81 179 6 -112 18 -115 -152 65 -73 0 46 -108 232
7592B32j61r9r0J37J07K2P2j84j28R1om3j97R2K89k63K37j40L2O6m3j20l0N9K15
$$ 232 71 -28 -118 19 126 148 220 36 -92 -1 -7 -50 -247 -155 134 -129 108 -32 0 66 23 -97 -127 -68 147
7617A47k83K85l17L0n0K30l5lN5q3l8J76k51N7J99j95j4K10J3p4M3j84K48j74
$$ 147 -136 149 -168 -138 -188 42 7 4 59 -24 -62 114 -137 -80 119 -76 -90 120 133 59 102 -82 166 -8
7641hP4r4m8qJ16n9j9J19j30j21L90l63K47k01K03j83K99k12O6O0k84L0K29j56
$$ -8 66 -28 -76 -84 32 -27 -46 73 -57 -178 212 -151 96 -105 98 -85 214 2 68 128 -156 -126 103 -53
7665e3m0J40k34J91r3Q4l8M7J1Q6r6R0J9j13P4o7j66J74j43R6jk1J23J9n9j13
$$ -53 -93 47 -187 4 -89 -5 -43 4 15 101 5 95 114 1 75 8 -158 16 -127 -31 -32 -53 70 89 30 -83
7691h3Q4j9J15m8j71R0J6o8Q8p2K34l98K43J3j20M14m60K93r8k12J45J23j98n2
$$ -83 1 -18 97 49 -122 -32 -16 -84 4 -68 166 -232 11 24 -96 318 -142 151 53 -159 -14 109 -89 -141
7715a41J21N4kmR6p0j06J34Q2J9j57q5J68l37M46k78K3j39J50l1J98k23J14j31
$$ -141 -20 34 32 28 124 54 -52 82 164 183 26 -59 109 -228 218 -60 -37 -176 -26 -57 141 -82 32 -99
7739i9j97J62K3j33N0J54l6l7J92Kj4m6R8J26k30j52L1K8l4J67n1R6N6j73J0r2
$$ -99 -296 -134 -111 -244 -194 -40 -76 -113 79 81 67 21 119 245 15 -137 -106 -78 -112 55 4 100 156 -17 -7 -99
7765i9J28pN9N1j53m7J38j36J1q4N6J01N1k82K91P9k33O2k8o4N4p0K3J36j79L04
$$ -99 29 22 81 132 -21 -68 70 -66 -55 -139 -83 18 69 -213 78 157 -76 -14 -42 -106 -52 -122 -99 37 -142 162
7791A62k06L9J19l7r4n2L27j61l81J58J55n4J84j56j29J17R3p4J43q3k89K81m9
$$ 162 -44 -5 114 77 -17 -69 258 97 -284 -126 29 -25 159 3 -126 -9 84 10 153 70 -219 62 13
7814A3j21K07k9Mk50j55L48j28l0Q8m4J32m4q8l4J36j26J61q3qJ49j13K9J0j14
$$ 13 -108 99 70 74 -176 -331 17 -111 -141 -53 -97 35 -9 -97 -131 5 -121 40 -43 -51 98 -15 14 24 -90
7839i0J30j95J18M0J4Q4M4j09Q5k45r0J46m4P7j44L28J17k09o8p1K39k48K38j26
$$ -90 40 -155 -37 3 17 101 145 36 121 -124 -214 -68 -112 -35 -179 149 266 57 -11 -82 157 -91 147 21
7863B1j21J03M6p2j03J03J2N4j31J59k55L07j57q2J84Jj61Q1J4J2K9M6m1K16k30
$$ 21 -100 3 49 -23 -126 -23 -11 43 -88 71 -184 123 -34 -116 68 69 -92 -11 3 15 44 90 49 265 35
7888C5j01M3O1r2j14P3oK79l18J33Q6j71J94j64N4j30L00m30L35q0J68j57K0q1
$$ 35 -66 -23 38 -54 -168 -95 -101 178 -140 -7 79 -92 102 -62 -8 -138 162 -268 67 -13 155 -2 18 -63
7912f3m4J17j30m0J70j03l7m1Q0L9l5J04J14q2k12K66j43J70p0j08L06j97j76
$$ -63 -107 10 -120 -160 10 -93 -130 -171 -91 -52 -87 17 131 49 -163 103 -40 130 60 -48 258 61 -115
7935a15K36q4j02J53J59k42J35j08j22M1M6R3R9n9j27NK0K47j73N3j84L9k13L91
$$ -115 121 37 -65 88 247 5 140 32 -90 -49 -3 90 189 130 3 8 28 275 102 155 -29 10 -203 188
7959A88j57o0J33p1J06j40n8n0K33j42J75l2j62R2n2j70L07k38K12M5k22J94K3
$$ 188 31 -29 104 33 139 -1 -59 -109 124 -18 157 125 -37 55 3 -167 140 -98 114 159 -63 131 154
7982A54j74M4j4j9J28j26j37J77j4R2j30l3j4k19M04k18p4K38kpj15r4J02J28
$$ 154 -20 24 10 -9 119 -7 -144 33 19 111 -19 -52 -66 -285 119 -99 -173 65 63 56 -59 -153 -51 77
8006G7k42J41j18K32j77m4J34J05j32j02J67j95L63k13J28o6p3K0K16k95k1L5
$$ 77 -165 -24 -142 90 -87 -131 3 108 -24 -126 41 -154 209 -4 124 58 -15 5 221 -74 -95 -60
8028f0k8K4K04j75J9J22K1k44N2p1J3k9J47k6K2J2R2J1q9j9J35r7K4l5p1k7j2
$$ -60 -88 -64 140 -35 -16 106 127 -117 -65 -136 -123 -152 -5 -31 -9 3 95 106 17 -2 133 36 60 25 -46 -73 -85
8055h5J04J43k90K2L27p8k30qK70r0o8j32J64J33j19Q7j34m5J89n1l78L81N2j89
$$ -85 19 162 -128 -106 221 143 -87 -95 175 85 17 -115 49 182 63 150 16 -29 160 109 -269 112 164 -25
8079b5J55k69J05K6j8P4j96K78p2j54L6j68J08NK41k10oP1J51k73J92N5J88ml36
$$ -25 130 -139 -34 -8 -26 48 -148 130 58 -96 -60 -228 -120 -115 126 -84 -90 -19 132 -141 51 106 294 290 -46
8104d6QJ8M4j45J43N2j47J88J19l16K16L6j05j32l0J62j62L11j82j37J40q2j59
$$ -46 -38 -20 24 -121 22 74 -73 115 234 -82 134 170 65 -67 -97 65 -97 214 32 -105 35 -47 -206
8127b06J14J1J04J23J02l68k1J68k53L02k0j75j33N0J65j59L26j79J58j11J11
$$ -206 -92 -81 23 146 248 -120 -141 27 -226 76 56 -119 -252 -202 -37 -196 130 -49 109 -2 109
8148A09l13J63O7J20j97J32J8%n5M7K2j96K71p2j28j31K54n8Kj90N6K05K3j41
$$ 109 -204 -41 26 146 -51 81 99 99 44 91 113 -83 188 116 -12 -143 111 53 55 -135 -79 126 149 8
8172HOJ32k57L91k49p4j8O5l3q6L52j84k56L08k32J34M0l7J54
$$ 8 14 146 -111 280 31 -43 -61 4 -29 -115 237 53 -203 105 -127 7 47 10 164
8191A64
$$ Imaginary data points
##PAGE= N=2
##DATA TABLE= (X++(I..I)), XYDATA
0@%%%Qj6J6j6K4m0N5o3P2r6J20j44J82k22K64l12L67m31N04n84O75p80Q95j023
$$ 0 0 0 0 8 -8 8 -8 16 -24 31 -32 40 -56 64 -80 102 -120 144 -168 199 -232 272 -312 363 -417 478 -545
27e45J165j322J498j690J899k132K389k669K973l311L685m089M530n021N564o160
$$ -545 620 -702 796 -894 1005 -1127 1262 -1407 1566 -1745 1940 -2149 2381 -2640 2924 -3236
43c236O818p551Q374r297J0340j1535J2918j4535J6457j8793K1702k5437L0432
$$ -3236 3582 -3969 4405 -4892 5448 -6087 6831 -7704 8753 -10040 11662 -13775 16657
56A6657l7514M8412o7520J10723l77804m368O35690k69725k31238J41384J24559
$$ 16657 -20857 27555 -39965 70758 -307046 -311414 324276 54551 -176687 -35303 89256
67H9256l51522j09288L86043L41430k20506k48096R4204J03490j82967K4555L32351
$$ 89256 -262266 -371554 14489 355919 135413 -112683 -18479 85011 -97956 -73401 258950
78B58950Q8687l10510j23877J42029o278j48069J01059K14686n5811k38901j6061
$$ 258950 347637 37127 -86750 55279 49001 -99068 1991 216677 160866 -78035 -94096
89i4096J35554o2023j45022J63534K31836j74063k88450J36469K40416j45730
$$ -94096 41458 -20565 -165587 -2053 229783 55720 -232730 -96261 144155 -1575
99a575j74873K30777K18200k27621k71204J52192K46222j16513j90164J70385
$$ -1575 -176448 54329 272529 44908 -226296 -74104 172118 55605 -134559 35826
109C5826J94792k31863k64511J85527K43513j39610j59178J46944Q5117k06992
$$ 35826 230618 -1245 -265756 -80229 163284 23674 -135504 11440 96557 -110435
119a10435j19254J89945J59682j07607j09377R6991N3748j45285l1205K14404
$$ -110435 -229689 -39744 119938 12331 -97046 -55 53693 -91592 -122797 91607
129I1607P8854j81553n5848J41962q776j37075O6252J80245m5983j91263q71J44090
$$ 91607 170461 -11092 -66940 75022 66246 -70829 -4577 175668 129685 -61578 -62449 81641
141H1641k8110j51750O5957J97251q0085k46726M4838K17794m8594j73300Q2288
$$ 81641 53531 -98219 -32262 164989 84904 -161822 -116984 100810 52216 -121084 -38796
152c8796J59002r7575j64528P8869J64209m6514j31092O6570J30992r2345j42907
$$ -38796 120206 22631 -141897 -63028 101181 54667 -76425 -9855 121137 28792 -114115
163a14115J08424J46204j11870j28688J11452J01815j15511r6402R0413P6490
$$ -114115 -5691 140513 28643 -100045 11407 113222 -2289 -98691 -8278 68212
173F8212p8554o6894P3159N1218j01246o4648J06948N9621j05759k2665J26620
$$ 68212 -10342 -77236 -4077 47141 -54105 -118753 -11805 47816 -57943 -80608 46012
184D6012K31j43252L203J44235J2800j14449l477J10152M959j11475K982J34788
$$ 46012 46243 -97009 -93806 50429 63229 -51220 -54697 55455 60414 -51061 -48079 86709
196H6709M885j39275k495J23062k8446j18677N2962J20802n2333j13724L5726
$$ 86709 91594 -47681 -50176 72886 44440 -74237 -21275 99527 47194 -66530 -30804
207c0804R1225l7066r0608L3936R2903l8585r9335M8324J03281n3144q8529O1725
$$ -30804 60421 23355 -67253 -33317 59586 21001 -78334 -30010 73271 20127 -68402 -6677
219f677O7207p0260n0435P2843M5317o2010m0003N8122M4021n8190m7637O3203
$$ -6677 60530 -9730 -60165 12678 57995 -4015 -44018 14104 58125 -65 -47702 15501
231A5501M2226q0418l7628R1100K8042r2212j8819Q0651N002p1095N78O4926J908
$$ 15501 57727 -22691 -60319 30781 58823 -33389 -52208 28443 33445 -37650 -37072 27854 29762
244B9762o4923q098P0227J2551p1825r07Q0351j0979q1169K4717Q1264k2610o4232
$$ 29762 -35161 -43259 26968 39519 -32306 -33213 47138 36159 -45010 -20293 60971 38361 -25871
257b5871K0605M7023k2067m2964J8541M8335j2960n5169J0084M9089k6322m8962
$$ -25871 -5266 41757 19690 -23274 -4733 43602 30642 -24527 -14443 34646 8324 -40638
269d0638L8944M1699n1539l7917M6023K8738l5132j9468K8289J9085k5780k4379
$$ -40638 -1694 40005 -11534 -49451 -3428 25310 -9822 -29290 -1001 18084 -7696 -32075
281c2075K8217L1459l1407k5735M2812J9622m6360n740M6751n992m3862P027L5319
$$ -32075 -3858 27601 -3806 -29541 13271 32893 -13467 -19207 27544 21552 -22310 -15283 20036
294B0036l572k9848o113K4632P737l0587p799L8322K164m4223K983L7917j2361
$$ 20036 16464 -13384 -19497 5135 12872 -17715 -25514 12808 14972 -29251 -26268 11649 -712
307g12k6683K1679K2266j5885j5372Q860J6145P76j7942k650K2749k794k6021
$$ -712 -27395 -5716 16550 665 -14707 -5847 10298 11074 -6868 -9518 13231 10437 -15584
320a5584J1582K6596j7873j9876J7626N379j9089k073R993j18l257l122L127J2531
$$ -15584 -4002 22594 4721 -15155 2471 7850 -11239 -13312 -3319 -3437 -6694 -9816 -6689 5842
334E842l737j5914R798J2585j7817m366K5453J678j7551P295J1791o904m804J579
$$ 5842 2105 -13809 -4011 8574 -9243 -13609 11844 13522 -4029 3266 15057 8153 3349 4928
348D928j26L497m384j0648J0344J1176j5291o192J5305n552j6765Q421R061p490
$$ 4928 4802 8299 3915 -6733 3611 14787 -504 -6696 8609 3057 -13708 -5287 3774 -3716
362c716m60M899j685M228J031r008N702R961j1034m263J5993r45j1252P384L698
$$ -3716 -4176 723 -962 3266 4297 -4711 991 10952 -82 -4345 11648 10703 -549 6835 10533
377A0533j0025J833L753o257K321L639q767J409Q257q858m759J0943l391r222
$$ 10533 508 2341 6094 -163 2158 5797 -2970 -1561 6696 -2162 -6921 4022 631 -8591
391h591R630M344q352N204O057q429K4N941n944K80P594o235k679R435n147r331
$$ -8591 1039 5383 -2969 2235 8292 -137 -113 5828 -116 164 7758 1523 -1156 8279 3132 -6199
407f199Q771N59j3121L162P437p582j129O559m114j002N055o226j671J0582l822
$$ -6199 2572 3131 -9990 -6828 609 -6973 -8102 -1543 -5657 -6659 -1604 -7830 -9501 1081 -2741
422b741q125J0916M538r604M610P434p742q50O494n949k201P072l712m630O986
$$ -2741 -10866 50 4588 -5016 -406 7028 -714 -1564 4930 -1019 -3220 3852 140 -4490 2496
437B496k739o308P197N2r933N699M757j0752J477J0894o065m242R225j26n474
$$ 2496 -243 -6551 646 698 -9235 -3536 1221 -9531 -8054 2840 -3225 -7467 1758 1632 -3842
452c842M658M25k705N213k427p039J0030M779j3003J417J1966q225q688Q029N70
$$ -3842 816 1241 -1464 3749 1322 -5717 4313 9092 -3911 -2494 9472 1247 -7441 588 1158
467A158o410L142P81k748N167l21n690O998J586j0972M530J1704q470m812J3585
$$ 1158 -5252 -2110 -1329 -4077 1090 769 -4921 2077 3663 -7309 -2779 8925 455 -4357 9228
482I228M85j0421M222M900m517L84o05k814M895k45q411O837P268j4155m639J4473
$$ 9228 9713 -708 3514 8414 3897 4281 3676 862 5757 5512 -2899 3938 11206 -2949 -7588 6885
498F885l426j3815Q078J0458p002n126K361K732L387m786o544J0468P499j5026
$$ 6885 3459 -10356 -2278 8180 1178 -3948 -1587 1145 4532 -254 -6798 3670 11169 -3857
512c857j876J7302l999j4657R069R118j0734n253O745K893j499m517j548R766
$$ -3857 -5733 11569 7570 -7087 1982 11100 366 -4887 1858 4751 3252 -1265 -2813 6953
526F953K32j7528J612J8063p337j3997J4004Q705j6286m547J1924J121p157j607
$$ 6953 7185 -10343 -8731 9332 1995 -12002 2002 10707 -5579 -10126 1798 2919 -4238 -5845
540e845M805N177p579j1633J2564J6470j7189j4921J9994P042k2982j419K1480
$$ -5845 -1040 4137 -3442 -15075 -2511 13959 -3230 -18151 1843 8885 -14097 -15516 5964
553E964R52j3841j017Q378K944q763o073J5092Q634k1048o794K6448J566k6522
$$ 5964 6916 -6925 -7942 436 3380 -5383 -11456 3636 12270 -8778 -15572 10876 12442 -14080
567a4080N145K4963q895k0690O652J5333k509j3134n15J6032K323k0413R92K2946
$$ -14080 -8935 16028 7133 -13557 -6905 8428 5919 -7215 -7730 8302 10625 -9788 -8796 14150
581A4150q873k4135J7278K2581k2100j7674K2458J3346j9976j2733J5735J5536
$$ 14150 5277 -18858 -1580 21001 -1099 -18773 3685 17031 -2945 -15678 57 15593
593A5593j3688k1152J3882K3703j8516k2780K4822J8654k8663j1743K8837M494
$$ 15593 1905 -19247 -5365 18338 -178 -22958 1864 20518 -8145 -19888 8949 13443
605A3443k6305q16K5225M976k1499q898K2731J2225k6538j1456L3035Q844l5622
$$ 13443 -12862 -13678 11547 16523 -4976 -13874 8857 21082 -5456 -16912 16123 24967 -10655
618a0655k614L3676m828k8678Q784K3810r868k2112N366K1377m568k5686O395
$$ -10655 -13269 20407 15579 -13099 -4315 19495 9627 -12485 -7119 14258 9690 -15996 -9601
631i601L1933j0301l6882J4652L4810j9924k8323K4637K3344k3900j8730K0818
$$ -9601 22332 12031 -24851 -10199 24611 4687 -23636 1001 24345 445 -18285 2533
643B533J8339j8077j9966J8328K3280k3533k6263K9183K6280l4764k2821L4753
$$ 2533 20872 2795 -17171 1157 24437 904 -25359 3824 30104 -4660 -27481 7272
655G272J4441l4309j0190K9977P717k5535r949K3182J1275k4418r974L0852O038
$$ 7272 21713 -12596 -22786 7191 14908 -10627 -20576 2606 13881 -10537 -20511 10341 16379
668A6379l8734j809M3138o82l8388P387L3027j1812l1122R800L1308l386l0562
$$ 16379 -22355 -24164 18974 18292 -20096 -12709 20318 8506 -22616 -12816 18492 15106 -15456
681a5456K6L0308m692l3438J2497L6826j8798l5981K2067K8330k5827k2118K8528
$$ -15456 -15430 14878 10186 -23252 -10755 26071 7273 -28708 -6641 21689 -4138 -26256 2272
694B272K3380k3247k6029J7188K6763j7070k7346K4330L1341k8489l0540K8337
$$ 2272 25652 2405 -23624 -6436 20327 3257 -24089 241 31582 3093 -27447 890
706H90K1413k8345j0253K9303N339k9715q350K4731R837k2486q758K8783Q232
$$ 890 22303 -6042 -16295 13008 18347 -11368 -19718 5013 14850 -7636 -16394 12389 20621
719B0621l9189j0253M1873Q411l7551J511L5049q381l3417Q061L1358k523k6300
$$ 20621 -18568 -28821 13052 21463 -16088 -14577 20472 12091 -21326 -13265 18093 15570 -10730
732a0730K818K7142n826l4548R351M1929j0592m1251J3577L4490j9784k9843K1178
$$ -10730 -7912 19230 13404 -21144 -11793 30136 19544 -21707 -8130 26360 6576 -23267 -2089
745b089K6967j6675k4348J1531K0950j2476k2958J7110K6819k1666k7460K5447
$$ -2089 24878 8203 -16145 -4614 16336 3860 -19098 -1988 24831 3165 -24295 1152
757A152K2984k8937j5940L0575J1906k8431r855K3476R439k0998j0220K3455J2218
$$ 1152 24136 -4801 -20741 9834 21740 -6691 -16546 6930 16369 -4629 -14849 8606 20824
770B0824k9101j2579L3322Q472l6854l427L7949j872l5293L233L0159k412k7285
$$ 20824 -8277 -20856 12466 20938 -15916 -19343 18606 16734 -18559 -15326 14833 12421 -14864
783a4864m27K7622K441l0509l311L3689M03l4052N271L1971j1583k7953J5166
$$ -14864 -15291 12331 14772 -15737 -19048 14641 15044 -19008 -13737 18234 6651 -21302 -6136
796f136K3007j5152j8836J2814J7552j1088j9088J2375K2178j6484k6066K0473
$$ -6136 16871 1719 -17117 -4303 13249 2161 -16927 -4552 17626 1142 -24924 -4451
808d451K6248k3081k0724K4715J3027k5308q444K3969Q144k0214r515J8963J0623
$$ -4451 21797 -1284 -22008 2707 15734 -9574 -18018 5951 14095 -6119 -15634 3329 13952
821A3952k2669j1524K9818J3298l3454j1721L3130O131l0359m04K7403K11k3127
$$ 13952 -8717 -20241 9577 22875 -10579 -22300 10830 16961 -13398 -13802 13601 13812 -9315
834i315k379J8170L352j7448k248K2141M34k6824J667K7141o659k4276J2814K0951
$$ -9315 -11694 6476 9828 -7620 -9868 12273 12707 -14117 -12450 14691 8032 -16244 -3430 17521
848A7521j4707j7664J1155J4107p391j2056Q013J5402r617j9774J1491K0334j5078
$$ 17521 2814 -14850 -3695 10412 3021 -9035 -1022 14380 4763 -15011 -3520 16814 1736
861A736j6411K1202J2798k3730j0554K0619Q172j5496o217J3686P636j5399j2656
$$ 1736 -14675 6527 19325 -4405 -14959 5660 13832 -1664 -7881 5805 13441 -1958 -14614
874a4614J7154J5172j8249j1963K0613N128k2896p97K1047o70j5614J819J1478
$$ -14614 2540 17712 -537 -12500 8113 13241 -9655 -10452 10595 9925 -5689 -3870 7608
887G608j133j1871j725J3988L715j6821k529J8755k205j9045O305J6497r782j2148
$$ 7608 6475 -5396 -7121 6867 10582 -6239 -8768 9987 7782 -11263 -4958 11539 1757 -10391
901a0391R708Q086q367p250N273Q975l564j2412N097J5441r112j6961J1875J4966
$$ -10391 -683 7403 -964 -8214 -2941 6034 2470 -9942 -4845 10596 1484 -15477 -3602 11364
915A1364j2747r389J2890M604j1032l163P725N181n220o938N079R187q363r485
$$ 11364 -1383 -10772 2118 6722 -4310 -7473 252 5433 213 -6725 -1646 7541 -822 -10307
929a0307J2274P578j4987l582J4513k97j1598J439P142n16l756j618M267L271
$$ -10307 1967 9545 -5442 -9024 5489 5192 -6406 -4967 2175 1659 -2097 -3715 552 3823
943C823p933m526J1669L119j3099J073J2568n447j0209P201P087n454m031K327
$$ 3823 -4110 -8636 3033 6152 -6947 -5874 6694 1247 -8962 -1761 5326 -128 -4159 -1832
957a832M120M79o804j775J0119N09j0906L118J0508p385q154R410M761p414j383
$$ -1832 2288 2767 -4037 -5812 4307 4816 -6090 -2972 7536 151 -8003 1407 6168 -1246 -2629
972b629M242O01j362k509J049N991k114q310N019Q396p826n266R493J392q182
$$ -2629 1613 2214 852 -1657 -608 5383 3269 -5041 -22 8374 548 -4718 4775 6167 -2015
987b015J697M917k501j553J92O38K808j598n085M233M922p903k841R174q09p913
$$ -2015 -318 4599 2098 545 737 1375 4183 2585 -2500 1733 6655 -1248 -4089 5085 4276 -3637
1003c637M116M473m735j989K048L92J027l87l597K875K584n905k4P914l309p562
$$ -3637 479 4952 217 -1772 276 668 1695 1308 -2289 586 3170 -2735 -2759 5155 1846 -5716
1019e716N342M067n514lL996k098j148J064j254J783K140n250q66O111k036m623
$$ -5716 -374 3693 -1821 -1824 2172 74 -1074 -10 -1264 519 2659 -2591 -3457 2654 618 -4005
1035d005N596J634o941J171M246k486o96K172k169M12K652l213o34M673k625m194
$$ -4005 1591 3225 -3716 -2545 1701 -785 -1481 691 -1478 -1066 1586 -1627 -2261 2412 -213 -4407
1051d407M928J541n615J836M042m147p74L671k097j540K750j919j293M068j985
$$ -4407 521 2062 -3553 -1717 2325 -1822 -2596 1075 -1022 -2562 188 -1731 -3024 1044 -941
1066i41l433M452P64n551K519L354m076l23L948j893j372K839j664j638M631q68
$$ -941 -4374 78 842 -4709 -2190 1164 -2912 -3235 713 -1180 -2552 287 -1377 -3015 1616 748
1082G48l803M027J285m498K153L540l966k24M006k643j700L764j563j932L666
$$ 748 -3055 972 2257 -2241 -88 3452 -514 -738 3268 625 -1075 2689 1126 -806 2860
1097B860r19l683L687J018m574J975L227l951k20M045l353j399M060j061k779
$$ 2860 1941 -1742 1945 2963 -1611 364 3591 -360 -580 3465 112 -1287 2773 1712 -1067
1112a067L144l29l076L408P42m423K148L118m364k28M452k836k392L794j035k602
$$ -1067 2077 1748 -1328 2080 2822 -1601 547 3665 -699 -927 3525 689 -1703 2091 1056 -1546
1128a546L227N9l277K550Q80l910K704K680m582n1M417l034k267M659o96l267
$$ -1546 1681 1740 -1537 1013 1893 -2017 687 3367 -1215 -1266 3151 117 -2150 2509 1813 -1454
1144a454K755Q21l063J989J072l104J410J901l811O83M023m022k166N084j444
$$ -1454 1301 2122 -941 1048 2120 -984 426 2327 -1484 -801 3222 -800 -2966 2118 674
1159F74m545L302K014l367N85J483k111R91J311l138J479L159m345j095N753j575
$$ 674 -3871 -569 1445 -1922 -1337 146 -1965 -974 337 -2801 -1322 1837 -2508 -3603 2150 575
1175E75m844M412K208n295M82L431j750k21J037j857J121J979m076k24N176k859
$$ 575 -4269 143 2351 -2944 -2462 969 -781 -1002 35 -1822 -701 1278 -2798 -3022 2154 -705
1191g05m241N545J690o529J573M826l140k351L061J31j65L35k632J382M685m164
$$ -705 -4946 599 2289 -4240 -2667 2159 -981 -3332 -271 -140 -305 30 -2602 -1220 3465 -699
1207f99l294O793K63p311K583O112m223k649M427K30k564j17k74J878K035m144
$$ -699 -3993 2800 3063 -4248 -1665 4447 224 -2425 2002 2232 -332 -449 -723 1155 3190 -954
1223i54j404O727j596p272M671N600o009k902N996j47l781J029J662J01k15k659
$$ -954 -2358 4369 2773 -4499 172 5772 -237 -3139 2857 2710 -1071 -42 1620 1721 1506 -1153
1239a153Q93M781l349n359O503L605q205q72Q357j966o468K778L863j799j941
$$ -1153 -260 4521 1172 -4187 2316 5921 -2284 -3156 5201 3235 -3233 -455 3408 1609 -332
1254c32m27K146K511m723l469P463K045r301J221Q639m082o755N353M154m282
$$ -332 -759 1387 3898 -825 -4294 3169 5214 -4087 -2866 5773 1691 -5064 289 4443 161
1269A61j967J810J644J35l716m84O158r41p712L465P646p185n180P888K505o951
$$ 161 -1806 4 1648 1783 -1933 -2417 3741 2800 -4912 -1447 6199 -986 -6166 1722 4227 -2724
1285b724o07M761l47l013j621J792M705k718n971N254N371q761k960J0276M72
$$ -2724 -3331 1430 1083 -1930 -3551 -1759 2946 228 -5743 -489 4882 -3879 -6839 3437 3909
1300C909q846J620O445k646m161J261L593K237m856m142O257L525q667j091J0827
$$ 3909 -4937 -3317 3128 482 -3679 -2418 1175 3412 -1444 -5586 671 4196 -4471 -5562 5265
1315E265j967j0078L734O680m612l654M160K928j917m156J48N985%p637K751R588
$$ 5265 3298 -6780 -3046 3634 -978 -4632 -472 2456 539 -3617 -3469 2516 2516 -5121 -2370 7218
1331G218n951q823P622O465p860k814P046J331n230k263L049M152k459n847M656
$$ 7218 1267 -7556 66 6531 -1329 -4143 2903 4234 -996 -3259 -210 3942 1483 -4364 292
1346B92O563q237o021J0468L486j0523j2R017j387p645J157N684J357m399k983
$$ 292 6855 -1382 -7403 3065 6551 -3972 -3984 5033 3646 -3999 -2842 2842 4199 -200 -3183
1361c183O084L305q801k675J1432K42j1155K398R390m959o733M748M822l199m084
$$ -3183 2901 6206 -2595 -5270 6162 6404 -4751 -2353 7037 2078 -4655 93 4915 1716 -2368
1376b368P60N259k58p526J227R461l354r922O638Q315q677n947Q693L285o564
$$ -2368 -1608 3651 3393 -4133 -2906 6555 3201 -6721 -83 8232 -445 -6392 2301 5586 -978
1391i78k205M644L120m076n375L949P374o139p133Q773N076j1194k897J0756L00
$$ -978 -3183 1461 4581 505 -4870 -921 6453 314 -6819 1954 7030 -4164 -7061 3695 3995
1406C995q437R68O280p32n632j151N705L677p117l599R371J684j1629J139J1279
$$ 3995 -4442 -3474 2806 2074 -3558 -4709 996 4673 -2444 -6043 3328 5012 -6617 -5478 5801
1421E801k969q669M533N471m495m255K471M664o88o060N84P819k601r850N445
$$ 5801 2832 -5837 -1304 4167 -328 -4583 -2112 2552 1864 -4196 -3612 4207 1606 -8244 -2799
1436b799R887p148p775Q323M490p946k683O374K991l710m060K699N520m072o903
$$ -2799 7088 -60 -7835 488 4978 -2968 -5651 723 3714 4 -4056 -1357 4163 91 -6812
1451f812P045P188r315m639R476J465r433Q25P715m02n121r06L877K071m650l027
$$ -6812 233 7421 -1894 -6533 2943 4408 -5025 -4200 3515 3113 -2008 -2914 963 3034 -1616 -4643
1467d643P238L527r488j178R812j714q575M188O867m557m397L508K809j947m135
$$ -4643 2595 6122 -3366 -4544 5268 3554 -5021 -833 6034 1477 -2920 588 3397 1450 -2685
1482b685Q95O642n21q655K082Q365m694p670P358O413p504m168N364J971l377
$$ -2685 -1790 4852 4331 -4324 -2242 6123 1429 -6241 1117 7530 26 -4142 1222 3193 -184
1497a84j703K926L610k701o490L939O482n584n098P733L453r044q18O395q96m208
$$ -184 -1887 1039 4649 1948 -4542 -603 5879 295 -4803 2930 6383 -2661 -3479 2916 2020 -2188
1513b188J077L014M76l103k803L808L522n798k229Q043K16q598K036O749l706
$$ -2188 -1111 1903 2379 -724 -3527 281 3803 -1995 -4224 3819 4035 -4563 -2527 4222 516
1528E16m197L838L108k562k704m7L400J100n184Q5O999k607p976M163O608n260
$$ 516 -3681 157 3265 703 -2001 -2048 1352 2452 -2732 -2647 4352 1745 -6231 -2068 4540 -720
1544g20l679N062J136l884p69J819K316p49l873R06N618k831n470M822L952o130
$$ -720 -4399 663 1799 -2085 -2854 -1035 1281 532 -3341 -2435 3183 352 -5118 -296 3656 -2474
1560b474r95N985p86n104J286K739k99j132r47J146K887l763l056N775K066o554
$$ -2474 -3469 2516 1730 -3374 -2088 651 352 -780 -1727 -581 2306 -1457 -4513 1262 3328 -3226
1576c226J81O373k327m816L342K735k400j130J022J436P71l157j599N125J119
$$ -3226 -3045 3328 1001 -3815 -473 2262 -138 -1268 -246 1190 1961 -1196 -2795 2330 3449
1591C449o021J168N502l494m012M406J834l226k95J440m3l3j083n27L242j52m620
$$ 3449 -2572 -1404 4098 604 -3408 998 2832 -394 -689 751 708 675 -408 -935 2307 2155 -2465
1608b465K119M121m279k481N539K86m500J322K438j550o91N46k0J624q73l065
$$ -2465 -346 3775 -504 -2985 2554 2840 -1660 -338 2100 550 -141 405 385 2009 1136 -1929
1624a929L011K791m442j830N341n47m399K354K468k859o53J375L5N01m10k491
$$ -1929 1082 3873 -569 -2399 2942 2395 -2004 350 2818 -41 -694 681 716 1217 807 -1684
1640a684J900K013l471m72M361j530m008L228J673l275O49K036j866j20J176j368
$$ -1684 216 2229 -1242 -1714 2647 1117 -2891 337 2010 -1265 -616 1420 -446 -566 610 -758
1656g58R79Q82k620j78L771j535l215L033R99l819J317K285j825p35J390j260
$$ -758 221 1103 -1517 -1695 2076 541 -2674 359 1358 -2461 -1144 1141 -684 -1419 -29 -1289
1672a289J73J670k159L9K597j503k705L215J170l376R07K541k480j10J944j550
$$ -1289 -1116 554 -1605 -1566 1031 -472 -3177 38 1208 -2168 -1261 1280 -1200 -1310 634 -916
1688i16l22K136j766o47K681j216k379K931Q10l323J326J924k359j48K447j526
$$ -916 -1238 898 -868 -1515 1166 -50 -2429 502 1312 -2011 -685 1239 -1120 -1268 1179 -347
1704c47q93K067j160q88K290r49j747K570N55l015J787J716k682j43K534j257
$$ -347 -1240 827 -333 -1221 1069 120 -1627 943 1498 -1517 270 1986 -696 -839 1695 438
1720D38r34J854j024j083K160p52j937K433M77k880J280K112k429l52K096j233
$$ 438 -496 1358 334 -749 1411 659 -1278 1155 1632 -1248 32 2144 -285 -637 1459 226
1736B26j016K326q61j309K263o92j739K390M20k845J177J794k136j69K415j741
$$ 226 -790 1536 675 -634 1629 937 -802 1588 2008 -837 340 2134 -2 -171 2244 503
1752E03r74J926q53j316K044l53k040J982K66k342J308J625k669J74K374j741
$$ 503 -471 1455 602 -714 1330 977 -1063 919 1185 -1157 151 1776 -893 -719 1655 -86
1768h6j213K379n24j717J943j63j765J780J03k213J404J468k293j59K284j695
$$ -86 -1299 1080 556 -1161 782 619 -1146 634 737 -1476 -72 1396 -897 -1056 1228 -467
1784d67j095K505q20j827J954K29k065J281R33k270R96J506k374P3K284j595q52
$$ -467 -1562 943 123 -1704 250 479 -1586 -305 628 -1642 -646 860 -1514 -1441 843 -752 -1604
1801a604K260p44j678J912L67k364J482J069j925N59J371j724j39J983j669j065
$$ -1604 656 -88 -1766 146 513 -1851 -369 700 -1225 -666 705 -1019 -1158 825 -844 -1909
1817a909K528p54j765K224M62k219J128J057j667L07J526j642N0J682j378o67
$$ -1909 619 -135 -1900 324 786 -1433 -305 752 -915 -608 918 -724 -674 1008 -370 -1037
1833a037K084q42j472K068J18j993J109J375j991J59J933j609m23J849r60r57
$$ -1037 1047 205 -1267 801 919 -1074 35 1410 -581 -422 1511 -98 -521 1328 368 -589
1849e89J693o59j407K243N7k598J658J719k587j20K047j212o45J535p92p84J752
$$ -589 1104 445 -962 1281 1338 -1260 398 2117 -470 -590 1457 245 -400 1135 343 -441 1311
1866A311q94j468K417kk482J519J771k659o0K515j288j242J759n92j088J707p40
$$ 1311 417 -1051 1366 1364 -1118 401 2172 -487 -547 1968 680 -562 1197 605 -483 1224 484
1883D84j172J931m32k198J849J375k783J16K664j943j656K243J60j423Q54J57
$$ 484 -688 1243 811 -1387 462 1837 -946 -830 1834 -109 -1765 478 638 -785 69 226
1899B26j028J759p57j751K014Q80k784N25K652k156j201K366K63k158Q97M85r28
$$ 226 -802 957 200 -1551 463 1343 -1441 -916 1736 -420 -1621 745 1008 -1150 -253 232 -696
1916f96O09l93j133K131Q7k747Q38K827k445j399L113m74k130J398J099j364N0
$$ -696 -87 -480 -1613 518 605 -2142 -1304 1523 -922 -2321 792 318 -1812 -414 685 -679 -629
1933f29N16o60J299k70j933J539J760l126o66L552n86l030J910J394j765l00O98
$$ -629 -113 -773 526 256 -1677 -138 1622 -1504 -2170 1382 796 -2234 -324 1070 -695 -995 -297
1950b97LL54j46j375J627R28k805L34L816j773k933K537J708k805j1K061j90o89
$$ -297 -294 60 -86 -1461 166 1094 -1711 -1377 2439 666 -2267 270 1978 -827 -838 1223 1033 344
1968C44k80n86J411L54k503R04K894k222k529L425P47l201N58K766q52j804O62
$$ 344 64 -522 889 1243 -1260 -356 2538 316 -2213 1212 1959 -1242 -684 2082 1230 -574 88
1985H8K69N26l44j255J200K288k977j549L669K86l871J587K828k306j675J690
$$ 88 357 883 539 -716 484 2772 -205 -1754 1915 2201 -1670 -83 2745 439 -1236 454
2001D54O24p89m83j98J355N57k757n52L826q32l550K315K645l277j382K897L28
$$ 454 1078 289 -194 -392 963 1520 -1237 -1789 2037 1205 -2345 -30 2615 -662 -2044 853 1181
2018A181j779j09J046N42o0k202M08L332j912k999K763K399m113q09L546n79k414
$$ 1181 -598 -707 339 881 821 -1381 -973 2359 447 -2552 211 2610 -1503 -2312 1234 655 -1759
2035a759J177J099q25k73q63R35J514k063j386L235Q76m272O25L879j461k869
$$ -1759 -582 517 -308 -581 -1444 -509 1005 -1058 -2444 791 1667 -2605 -1980 1899 438 -2431
2051b431K143J555j650q66K70J047P45j950k49K688m88l578J441L618k679k333
$$ -2431 -288 1267 -383 -1249 -979 68 813 -1137 -1386 1302 814 -2764 -1323 2295 -384 -2717
2067b717L311R38k863l15J511Q84n68j240J49K309q05l339K596K540k775j803
$$ -2717 594 1532 -1331 -1646 -135 749 181 -1059 -910 1399 594 -2745 -149 2391 -384 -2187
2083b187L587K18l330J028K220q47p58n0N16Q58j251j940K662J937l502q23L958
$$ -2187 1400 1618 -1712 -684 1536 689 -69 -119 397 1255 4 -1936 726 2663 -839 -1662 2296
2100B296r13l344J681K285j664q77R64M05j83j044n98K352R08l461K92L631j758
$$ 2296 1383 -1961 -280 2005 341 -536 428 833 650 -394 -992 1360 2268 -1193 -901 2730 972
2117I72l120K642K157k689q30J886l7r26m74L86J591m73k489J027K802k375k503
$$ 972 -2148 494 2651 -38 -868 1018 981 55 -419 -33 1558 1085 -1404 -377 2425 50 -2453
2134b453L487J285l318j26K318m78j591P09O20O05p64j575J429J699k835j024
$$ -2453 1034 2319 -999 -1125 1193 715 -876 -167 453 1058 294 -1281 148 1847 -988 -2012
2150b012L643L96m105R21K888j882j607J372J181n60p59p34J374P84k385j13L273
$$ -2012 1631 2027 -2078 -1157 1731 -151 -1758 -386 795 235 -524 -1258 116 900 -1485 -1598 1675
2167A675p94l749K053K720k913j124K643L84j852j20N14R23p6j759M26K493j214
$$ 1675 881 -2868 -815 1905 -1008 -2132 511 895 -957 -1077 -563 360 284 -1475 -1049 1444 230
2184B30k854K326J920k885m11K904p93j849O41P82m9k05o20Q13J475j717j855
$$ 230 -2624 -298 1622 -1263 -1674 1230 437 -1412 -771 11 -38 -243 -863 -50 1425 -292 -2147
2201b147K602J238l169M53L030j546k044J598Q45q28r7N8L54O08j540o68K556
$$ -2147 455 1693 -1476 -1023 2007 461 -1583 15 860 32 -65 -7 347 955 -585 -1253 1303
2218A303Mk738Q49K614j802j850K314O73j643L84M93j63K8p02l63J627O9k121
$$ 1303 1307 -1431 -582 2032 230 -1620 694 1367 -276 108 601 438 466 -236 -599 1028 1097 -1024
2236a024J240K066k542j097K837r7k240R58J111j038j87l4m9J232l46j633J122
$$ -1024 216 2282 -260 -1357 1480 1383 -857 101 1212 174 -13 -47 -96 1136 790 -843 279
2253B79J367k541l76K885o55k091J440J141j723j61N35p5N87j42j281R55Q30j855
$$ 279 1646 -895 -1271 1614 959 -1132 308 1449 -274 -435 100 25 612 470 -811 144 974 -881
2271h81k4K130r10j845J767N97j900M70J141n37j24J02p29O27O74j617J65J929
$$ -881 -905 1225 315 -1530 237 834 -1066 -596 545 8 -116 -14 -743 -116 558 -1059 -894 1035
2289A035q84j887J889M83k122Q26J232j043j83P85o12J64M96j164K95J709j522
$$ 1035 151 -1736 153 636 -1486 -660 572 -471 -654 131 -481 -317 179 -985 -690 1019 -503
2306e03j074J838K69j869R11J237j396n0O87l51k45Q10n98J20R63j023r77J738
$$ -503 -1577 261 530 -1339 -428 809 -587 -637 50 -301 -546 264 -334 -214 749 -274 -1251 487
2324D87j35j679J199J127j455k62J417q63m07R31m94j24J061q03p05J599k14j644
$$ 487 352 -1327 -128 999 -456 -718 699 -164 -571 360 -134 -258 803 0 -705 894 680 -964
2342i64J395P84j560j31J776j014o52R74k67o60R96p21m39J275J09j689J110R34
$$ -964 431 1215 -345 -476 1300 286 -366 608 341 -319 677 -44 -483 792 901 -788 322 1256
2360A256j772L40J427r81p04J361l28q83Q31k21q68J447l41j115J105N57j596
$$ 1256 -516 -176 1251 270 -434 927 599 -284 547 326 -542 905 564 -551 554 1111 -485
2377d85M40J031j005l71J237n64q78J108j85q83R34N0j134J021L05j444M71J226
$$ -485 -45 986 -19 -390 847 283 -595 513 328 -555 379 429 -705 316 621 -823 -352 874
2395H74j019n48J465o11q92R70J81j040O73L64j326P21O58j124R7J164j242j98
$$ 874 -145 -693 772 161 -731 239 420 -620 53 417 -909 -188 470 -654 -557 607 -635 -833
2413h33J161l48j076J195N7j249J171K12j217O14N48r01J37J094j020l95J318
$$ -833 328 -20 -1096 99 156 -1093 78 290 -927 -313 235 -666 -529 565 -455 -850 468
$$ [...]
8191g6
##END NTUPLES=NMR FID
##END=
