##TITLE=1H_115-2023
 CDCl3
 8 sc, 
 24.11.2023
##JCAMPDX= 6.0         $$ Bruker NMR JCAMP-DX V2.0
##DATA TYPE= NMR FID
##DATA CLASS= NTUPLES
##ORIGIN= UXNMR, Bruker Analytische Messtechnik GmbH
##OWNER= root
$$ XWIN-NMR		Version 3.5
$$ Fri Nov 24 14:21:59 2023 Russian Standard Time (UT+4h)  she@DPX200
##.OBSERVE FREQUENCY= 200.1313
##.OBSERVE NUCLEUS= ^1H
##.DELAY= (6, 6)
##.ACQUISITION MODE= SIMULTANEOUS
##.ACQUISITION SCHEME= undefined
##.AVERAGES= 8
##.DIGITISER RES= 18
##SPECTROMETER/DATA SYSTEM= spect
##.PULSE SEQUENCE= zg30
##.SOLVENT NAME= D2O
##.SHIFT REFERENCE= (INTERNAL, D2O, 0, 15.7039)
##AUDIT TRAIL= $$ (NUMBER, WHEN, WHO, WHERE, WHAT)
$$ ##TITLE= Audit trail, XWIN-NMR		Version 3.5
$$ ##JCAMPDX= 5.01
$$ ##ORIGIN= Bruker BioSpin GmbH
$$ ##OWNER= she
$$ F:/spectra/data/she/nmr/H-F/1/audita.txt
$$ ##AUDIT TRAIL=  $$ (NUMBER, WHEN, WHO, WHERE, WHAT)
(   1,<2023-11-24 14:20:33.28 +0400>,<she>,<DPX200>,
      <created by zg, POWCHK disabled, PULCHK disabled
       configuration hash MD5:
       00 E9 B6 7A A2 85 ED C7 34 08 36 98 17 FE 4E 26
       data hash MD5: 16K
       56 48 AA 3D C8 FA 85 27 5C F7 AA 65 4D F8 65 5F>)
$$ ##END=
$$ 
$$ hash MD5
$$ 76 25 66 07 E7 3F 23 5E 50 44 78 64 44 22 FE 16
##$RELAX= 
##$RELAX= 
##$RELAX= 
##$RELAX= 
##$RELAX= 
##$RELAX= 
$$ Bruker specific parameters
$$ --------------------------
##$DU= <F:/spectra>
##$EXPNO= 1
##$NAME= <H-F>
##$PROCNO= 1
##$TYPE= <nmr>
##$USER= <she>
##$AMP= (0..31)
100 100 100 100 100 100 100 100 100 100 100 100 100 100 100 100 100 100 
100 100 100 100 100 100 100 100 100 100 100 100 100 100 
##$AQSEQ= 0
##$AQ_mod= 1
##$AUNM= <au_zg>
##$AUTOPOS= <>
##$BF1= 200.13
##$BF2= 200.13
##$BF3= 200.13
##$BF4= 200.13
##$BF5= 200.13
##$BF6= 200.13
##$BF7= 200.13
##$BF8= 200.13
##$BYTORDA= 1
##$CFDGTYP= 0
##$CFRGTYP= 5
##$CHEMSTR= <none>
##$CNST= (0..31)
1 1 145 1 1 1 1 1 1 1 1 1 1 1 1 1 1 1 1 1 1 1 1 1 1 1 1 1 1 1 1 1 
##$CPDPRG= <>
##$CPDPRG1= <>
##$CPDPRG2= <>
##$CPDPRG3= <>
##$CPDPRG4= <mlev>
##$CPDPRG5= <mlev>
##$CPDPRG6= <mlev>
##$CPDPRG7= <mlev>
##$CPDPRG8= <mlev>
##$CPDPRGB= <>
##$CPDPRGT= <>
##$D= (0..31)
0 1.2 0 0 0 0 0 0 0 0.06 0 0.03 0 0 0 0 0.0002 0 0 0 0 0 0 0 0 0 0 0 0 
0 0 0 
##$DATE= 1700821232
##$DBL= (0..7)
120 120 120 120 120 120 120 120 
##$DBP= (0..7)
150 150 150 150 150 150 150 150 
##$DBP07= 0
##$DBPNAM0= <>
##$DBPNAM1= <>
##$DBPNAM2= <>
##$DBPNAM3= <>
##$DBPNAM4= <>
##$DBPNAM5= <>
##$DBPNAM6= <>
##$DBPNAM7= <>
##$DBPOAL= (0..7)
0.5 0.5 0.5 0.5 0.5 0.5 0.5 0.5 
##$DBPOFFS= (0..7)
0 0 0 0 0 0 0 0 
##$DE= 6
##$DECBNUC= <off>
##$DECIM= 32
##$DECNUC= <off>
##$DECSTAT= 4
##$DIGMOD= 1
##$DIGTYP= 9
##$DL= (0..7)
0 120 120 120 120 120 120 120 
##$DP= (0..7)
150 150 150 150 150 150 150 150 
##$DP07= 0
##$DPNAME0= <>
##$DPNAME1= <>
##$DPNAME2= <>
##$DPNAME3= <>
##$DPNAME4= <>
##$DPNAME5= <>
##$DPNAME6= <>
##$DPNAME7= <>
##$DPOAL= (0..7)
0.5 0.5 0.5 0.5 0.5 0.5 0.5 0.5 
##$DPOFFS= (0..7)
0 0 0 0 0 0 0 0 
##$DQDMODE= 0
##$DR= 18
##$DS= 0
##$DSLIST= <SSSSSSSSSSSSSSS>
$$ [...]
##$SUBNAM2= <"">
##$SUBNAM3= <"">
##$SUBNAM4= <"">
##$SUBNAM5= <"">
##$SUBNAM6= <"">
##$SUBNAM7= <"">
##$SUBNAM8= <"">
##$SUBNAM9= <"">
##$SW= 18.0517328524113
##$SWIBOX= (0..15)
0 0 2 0 0 0 0 0 0 0 0 0 0 0 0 0 
##$SW_h= 3612.71676300578
##$TD= 16384
##$TD0= 1
##$TE= 0
##$TE2= 300
##$TE3= 300
##$TEG= 300
##$TL= (0..7)
0 120 120 120 120 120 120 120 
##$TP= (0..7)
150 150 150 150 150 150 150 150 
##$TP07= 0
##$TPNAME0= <>
##$TPNAME1= <>
##$TPNAME2= <>
##$TPNAME3= <>
##$TPNAME4= <>
##$TPNAME5= <>
##$TPNAME6= <>
##$TPNAME7= <>
##$TPOAL= (0..7)
0.5 0.5 0.5 0.5 0.5 0.5 0.5 0.5 
##$TPOFFS= (0..7)
0 0 0 0 0 0 0 0 
##$TUNHIN= 0
##$TUNHOUT= 0
##$TUNXOUT= 0
##$USERA1= <user>
##$USERA2= <user>
##$USERA3= <user>
##$USERA4= <user>
##$USERA5= <user>
##$V9= 5
##$VALIST= <valist>
##$VCLIST= <CCCCCCCCCCCCCCC>
##$VD= 0
##$VDLIST= <DDDDDDDDDDDDDDD>
##$VPLIST= <PPPPPPPPPPPPPPP>
##$VTLIST= <TTTTTTTTTTTTTTT>
##$WBST= 1024
##$WBSW= 4
##$XGAIN= (0..3)
0 0 0 0 
##$XL= 0
##$YL= 0
##$YMAX_a= 161041
##$YMIN_a= -203801
##$ZGOPTNS= <>
##$ZL1= 120
##$ZL2= 120
##$ZL3= 120
##$ZL4= 120
##$ABSF1= 10
##$ABSF2= 0
##$ABSG= 5
##$ABSL= 3
##$ALPHA= 0
##$AQORDER= 0
##$ASSFAC= 0
##$ASSFACI= 0
##$ASSFACX= 0
##$ASSWID= 0
##$AUNMP= <proc_1d>
##$AZFE= 0.1
##$AZFW= 0.1
##$BCFW= 1
##$BC_mod= 2
##$BYTORDP= 1
##$COROFFS= 0
##$CY= 11.3945322036743
##$DATMOD= 1
##$DC= 2
##$DFILT= <>
##$DTYPP= 0
##$F1P= 15.7292609196834
##$F2P= 12.9074282941183
##$FCOR= 0.5
##$FTSIZE= 0
##$FT_mod= 4
##$GAMMA= 1
##$GB= 0.15
##$INTBC= 1
##$INTSCL= 1
##$ISEN= 128
##$LB= 0.24
##$LEV0= 0
##$LPBIN= 0
##$MAXI= 10000
##$MC2= 0
##$MEAN= 0
##$ME_mod= 0
##$MI= 1.114404
##$NCOEF= 0
##$NC_proc= 0
##$NLEV= 6
##$NOISF1= 3.799351
##$NOISF2= 2.8
##$NSP= 1
##$NTH_PI= 0
##$NZP= 0
##$OFFSET= 15.70392
##$PC= 1
##$PHC0= -24226.97
##$PHC1= 7.052691
##$PH_mod= 1
##$PKNL= yes
##$PPARMOD= 0
##$PSCAL= 0
##$PSIGN= 0
##$REVERSE= no
##$SF= 200.130013532006
##$SI= 16384
##$SIGF1= 3
##$SIGF2= 2
##$SINO= 400
##$SIOLD= 16384
##$SREGLST= <1H.CDCl3>
##$SSB= 0
##$STSI= 0
##$STSR= 0
##$SW_p= 3612.71676300578
##$SYMM= 0
##$S_DEV= 0
##$TDeff= 0
##$TDoff= 0
##$TI= <>
##$TILT= no
##$TM1= 0
##$TM2= 0
##$TOPLEV= 0
##$USERP1= <user>
##$USERP2= <user>
##$USERP3= <user>
##$USERP4= <user>
##$USERP5= <user>
##$WDW= 1
##$XDIM= 8192
##$YMAX_p= 0
##$YMIN_p= 0
$$ End of Bruker specific parameters
$$ ---------------------------------
##NTUPLES= NMR FID
##VAR_NAME=  TIME,          FID/REAL,        FID/IMAG
##SYMBOL=    X,             R,               I
##VAR_TYPE=  INDEPENDENT,   DEPENDENT,       DEPENDENT
##VAR_FORM=  AFFN,          ASDF,            ASDF
##VAR_DIM=   8192,          8192,            8192
##UNITS=     SECONDS,       ARBITRARY UNITS, ARBITRARY UNITS
##FACTOR=    0.0002768,     1,               1
##FIRST=     0,             0,               0
##LAST=      2.2672688,     0,               0
##MIN=       0,             -203801,         0
##MAX=       2.2672688,     161041,          0
$$ Real data points
##PAGE= N=1
##DATA TABLE= (X++(R..R)), XYDATA
$$ [...]
1905A853m95k618J596J42p70J666k534p39J749r46J214O93k896J082J041p78K587
1922A847j291j630J771r44P44J773k612k09P08j287K316j01k433J051q58Q0K555
1939A480j567n57P90j543J966J355j953Q21o72j109K907l59j581Q18j922K04K173
1956A251j780K28m85j954K198O75j086J641j992n83L075p67N63P14k642Q97J422
1973A375j162J450j368j997J935m84M6J503k704k32J665o48J425K01k354J287
1989f2L62N4K015j959j134J501j319J171J074k445J01K7q56K297m91j807R81r45
2007a435O29K438j984k18O51j533K028J214j817P10j304l95K769j181n20L44k035
2024a639J016J845j671P56o93j565K590p0n87J043j993L54K140j223R09k7k306
$$ plain form
1905 1853 1358 -1260 336 478 -292 1374 -1160 -1899 -150 -1096 118 811 -2085 -1003 38 -740 1847
1922 1847 556 -1074 697 -247 497 2270 -342 -551 157 -1130 1186 1085 -1348 -297 -1155 -1075 1480
1939 1480 -87 -644 146 -1397 569 1924 -29 792 120 -989 1918 1559 -22 796 -1126 -922 1251
1956 1251 -529 -301 -786 -2740 -542 133 -953 688 -1304 -1887 1188 421 984 1698 -944 -47 1375
1973 1375 213 1663 295 -1702 233 -251 -205 1298 -1406 -1638 27 -621 804 1005 -1349 -62
1989 -62 300 354 2369 410 -724 777 -542 629 1703 -742 -641 -614 -1470 827 336 -1471 -490 -1435
2007 -1435 -806 1632 -352 -570 81 -1452 576 1790 -27 683 -621 -1016 1753 572 52 396 -1639
2024 -1639 -623 1222 -449 307 -386 -1951 639 569 -18 1025 -968 -614 1526 303 1212 1185 -1121
2041a121J387N63r11J502j791j480J811p94O66R03k671O21J292p49J935m59j866
2058a162J440l51K79J548j627n15P63j147J633M40k420Q70k72q82K442r06j021
2075h88J068j301J019J593j592L36J72j386K266Jj379R91j475j66J810j233P0
2092i4Mj802J550J086j685J182o59j198K319j09m49R25j740M92J291j093R78m98
2110E00j977J814n34n00J563j865l87J497p86N73R82j991J023P02q53J846j061
2127E46j134J664r60J84J212k068K31L90r51J426m46j552J515p35k95K142j295
2144a26n40J378j217Q35R71j729O87j47r58J606n42r45J027j409K91J914j819
2161g23N57M10j430J740L02j041J318j144o71J955r57j03Q26k085P95Q13j340
$$ plain form
2041 -1121 266 829 -82 1420 -371 -1851 -40 -834 -168 735 -1936 -1315 -23 -772 1163 704 -1162
2058 -1162 278 -73 206 1754 127 -388 375 -772 861 1301 -1119 -249 -521 -1403 1039 133 -888
2075 -888 180 -1121 -102 1491 -101 235 407 -979 1287 1288 -91 900 -575 -741 1069 -164 -94
2092 -94 -90 -1892 -342 744 -941 241 -418 -1616 703 594 145 1070 -670 -178 1113 20 998 500
2110 500 -1477 337 -197 -697 866 -999 -1386 111 -675 -102 880 -1111 -88 614 -239 1607 546
2127 546 -588 1076 116 300 1512 -556 -325 65 -886 540 94 -1458 57 -678 -973 1169 -126
2144 -126 -666 712 -505 330 1301 -428 259 112 -846 760 218 -727 300 -1109 -818 1096 -723
2161 -723 -166 244 -1186 554 856 -185 1133 -11 -682 1273 316 213 1039 -1046 -251 562 -778
2178g78J231p66j109J579p36j03J370j587K28J678j533R66O43j612J187l0j048
2195d20J662j225o64J233j353P16Q23j852R32L28j343J603r3j122J670j176k8
2212c09J385j377K22P99j626J029M55j781J247l36p91J531q81p9J105j469R79
2229A03P50j581J497J22j505J677m65q59J603j202l08J100j492O05L63j339J113
2246A82j80j244J492n75n71J457r79J57R58j343P60Q54j711J235R3j247J516p76
2264G8n71J167j143R0J111j604Q58M71j396J511n8j362J826j178j26J592j394
2281a28j00R37j446P04Q62j639R11k87q47J556q39l21J091j232L70J444j696J042
2299C82K60j327J365L2j004J136q12o99J772j343K41O27j669Q56M55j042J161
$$ plain form
2178 -778 453 -313 -1422 157 -579 -682 688 -899 -671 1007 -526 440 1083 -529 658 628 -420
2195 -420 1242 17 -647 586 -767 -51 772 -1080 -148 180 -1163 440 347 -775 895 -281 -309
2212 -309 1076 -301 -79 720 -906 123 578 -1203 44 -292 -1083 448 -433 -512 593 -876 103
2229 103 853 -728 769 891 -614 1063 598 -261 1342 140 -168 932 -560 45 408 -931 182
2246 182 2 -1242 250 -325 -896 561 -418 -261 697 -646 114 968 -743 492 585 -662 854 78
2264 78 -493 674 -469 -379 732 -872 -14 457 -939 572 514 -848 978 -200 -326 1266 -128
2281 -128 -228 709 -737 -33 829 -810 101 -186 -1033 523 -316 -637 454 -778 -408 1036 -660 382
2299 382 642 -685 680 712 -292 844 32 -667 1105 -238 3 630 -1039 -183 272 -770 391
2316C91o84r43J659p87o1J292j414K71J088j207R85K52j515J238k11q32J550j081
2334ip47J076j051O76P22j538Q07O5p67J703n08r14J056j049M36J429j574K88
2352A01M40j360R91L27j377Q98o80m16J469o66j46P76j402J053R22j125R87l02
2370D90j055J599m13o06J064j551q8J285j275N03J7j465J054M97r23J538r62r20
2388a211J705n85N29O87j506N22N93q23J128m15j396J183o33j09J243j419o8O59
2406H4q79Q82N25j386R49k77m30J785r27o49P41j053Q64Q15j440L24j80j003J476
2425B21k56p74Q24j105K34J532r88L28J73j122J465M92q80Q98o71p68J503o11
2443D95m07P73j651L02J022q25N25l52j059J127j5j49J038j222k55J330p92O58
$$ plain form
2316 391 -293 -1236 423 -364 -425 867 -547 -276 812 -395 590 842 -673 565 354 -478 1072 -9
2334 -9 -756 320 -731 -55 667 -871 -64 1 -766 937 429 -485 571 -478 -42 1387 -187 101
2352 101 541 -819 172 499 -878 20 -660 -1076 393 -273 -419 357 -1045 8 930 -195 792 490
2370 490 -565 1034 621 15 1079 -472 -560 725 -550 -47 -30 -1495 -441 56 -867 671 -291 -1211
2388 -1211 494 -91 438 1125 -381 141 734 -89 1039 624 -772 411 -222 -331 912 -507 -575 84
2406 84 -795 87 612 -774 175 -102 -532 1253 326 -323 418 -635 229 1044 -396 -72 -252 -1255 221
2425 221 -35 -809 15 -1090 -856 676 -312 16 189 -933 532 1024 144 1042 371 -397 1106 495
2443 495 88 861 -790 -488 534 -291 234 -118 -1177 -50 -65 -214 824 -398 -653 677 -115 543
2461E43L59j573P72J87q07J270p34j133J105p40J95J169j337J51N29p04J306J0
2479E68j079P94l94J07J305j222n5P00j241R50N31j431O28l71p26J649n08o66
2497d61P48j129N36J221r62L68j70j101J433J88q27Q06j071l08J161n81J56J92
2515A99j692J060N82p94R50o05p99J194j98K07P93j143J91R29p34O42J76j248
2533b90O88k36m84J078r65m26O49o58O38N74j555P58L53q63J661n50q09R14o23
2552a46J51J048j141j6N13j279J300j12j050Q66n25l72J216n70j99O11j031O55
2570h1R32r24M57j49o89J143j47n97O22r32k27R93o74J36K80j337J053J78n99
2589e62R41m90o62J341m38O5O31r83M59L76p79R00p29q30Q45m71q0P83j057o3
$$ plain form
2461 543 902 -671 101 288 -519 751 17 -1116 -11 -751 -556 613 -724 -573 -44 -748 558 568
2479 568 -511 283 -111 -4 1301 79 24 724 -517 433 964 -467 161 -210 -936 713 205 -461
2497 -461 287 -842 -306 915 -47 321 151 -950 483 671 -156 650 -421 -729 432 -149 7 199
2515 199 -1493 -433 149 -645 305 -300 -1099 95 -103 104 897 -246 -55 874 140 782 958 -290
2533 -290 398 162 -322 756 -209 -635 14 -644 -6 568 -987 -229 124 -739 922 372 -437 477 -146
2552 -146 5 1053 -88 -104 409 -870 430 318 -732 134 -391 -763 453 -117 -316 295 -736 -81
2570 -81 851 -73 384 235 -454 689 542 -55 567 -365 -592 401 -273 -137 143 -1194 -141 37 -562
2589 -562 379 -111 -773 568 130 195 826 -157 302 678 -101 799 70 -760 85 -386 -466 317 -740 -803
2609h03P80p49J001K07j079Q54j76k76J179n76n55R05r95N37P28j291J95j05n39
2628g58J118l82o43Q50o58J56J075r04J43N62j223R41L97r00N58l34n55J003o80
2647b34J8M62j027L92O20o82N02K13p75Q75j10k82Q19j018K23J001j039M01M37
2666G96j244N79p7n29P90n33l79P29q23K54P52j106M79O08r51O29L21p90R60m35
2686C0j30R38p80p2N98j008M81L70r94Q84k27n06Q57j86o32R86q09K82O53j130
2706c95P07J87j101Q51p5q37Q05l73l23Q60q01J38N34r49Q28J06p57R21k32m92
2726c98J107o57k35R81q41R0N87r62N86P3p88R38k87n93Q45n34k4O79r24M66K87
2747C96q70O82K09q22Q98m28o16J120n89k02M51o63L26K44q10R06l59m82R19k71
$$ plain form
2609 -803 -23 -772 229 436 -643 211 35 -241 938 362 -193 712 -283 254 982 -309 -114 -219 -758
2628 -758 360 -22 -665 185 -473 -317 758 -146 -3 559 -664 277 674 -226 332 -2 -557 446 -234
2647 -234 -216 246 -781 -389 231 -451 51 264 -511 364 254 -28 791 -227 -4 997 -42 359 796
2666 796 -448 131 54 -475 315 -218 -597 132 -691 -437 315 -791 -312 296 -655 -26 295 -495 465 30
2686 30 -100 838 58 -14 584 -424 57 427 -567 317 90 -416 441 255 -377 609 -200 82 735 -395
2706 -395 312 499 -602 249 174 -663 142 -231 -554 306 -495 -357 177 -772 56 162 -595 326 94 -398
2726 -398 709 52 -183 798 -43 47 634 -328 258 331 -457 481 194 -399 446 -88 -112 567 -357 109 396
2747 396 -474 208 417 -405 493 65 -551 569 -20 -222 229 -434 -108 136 -674 232 -127 -609 310 39
2767C9n58J077q77N4R09r05K16N66r78P41l7n53N83m77k94R36q09J55O39j067
2787f40N68L07m60O50k14n34Q46l19k97O75o82J18N49r25M80L26r73N58p0l73
2807d10Q15o14l80R65p00J62O40q87M55K83o46Q16j82o77O82m23M4O18q15K5M61
2828B32p12P63J5o92O60k45o16J096n04o7M32o72K50N93q12L65k3n80O52j01m26
2849c92O21o85K0Q77o12J67M82j176Q70J06m98O81n60k17P33m70P1O00j091K11
2869b62N00o63O63k91n67P76l63m3O43n30k92O08o05N36J35p70P41J5p27Q74k47
2890A31n23O53p47L04O92r37L50K18n40Q67j72n48N28m53j45J002q12K00K38p65
2910d59P18K29p78N96l14n28Q09k89l52M23n07ON91m44L60J36o27M93J05l60Q21
$$ plain form
2767 39 -519 558 -319 -265 644 -261 -45 521 -457 284 247 -306 277 -200 -494 442 -367 -212 427 -640
2787 -640 -72 235 -225 425 211 -323 523 204 -93 582 -100 18 567 -358 122 448 -525 33 -37 -410
2807 -410 405 -209 -589 376 -324 -162 478 -409 46 329 -317 499 317 -360 322 -101 -57 561 -254 -229 232
2828 232 -480 283 298 -394 266 21 -595 501 -3 -70 362 -310 -60 533 -279 86 63 -517 135 34 -392
2849 -392 229 -456 -436 441 -171 -4 478 -698 172 278 -220 461 -99 -316 417 -53 18 618 -473 -262
2869 -262 238 -425 238 -53 -620 156 -207 -250 393 -137 -429 179 -426 110 245 -525 216 231 -496 378 131
2890 131 -392 261 -486 -182 510 -427 -77 141 -399 468 296 -252 276 -177 -322 680 -132 68 306 -459
2910 -459 259 488 -290 306 -8 -536 273 -16 -368 55 -452 -446 145 -299 61 197 -430 63 168 -192 629
2931F29q09l55Q55n01J47L99j010M33M96o52Q82m79n31P21m39K06P17r13K4O40
2951D60p02P89J41r59N87k04m31R84p41m13P41n62K00N59q51M26o7p11Q88j01
2971C3m18N49n81J17P46n84P8L54p75O26J16m60M96m31l26Q58m65n9M02o31K29
2992a26N18n55N33k79n89Q65j74j37O53p70j62O08o15N40J8r41O06k11j71P65
3012C76o30k90O59l99J17O25q26J43L50m37O82j32p21P81l59j17P86q03Q1L96
3032B82p61N96K88q64O98l63j71Q44m07l24O44p71L80N55p28K97j15m83N54j93
3052d2l86P17o94j14O52n36L94J65o62N65K44n67O88l55l85Q97n77LL97p68L30
3073c4J35m91M94l7o42N98o9l35R09r06Q7Q07n68L76K09o42M02O1n99P32n02k83
$$ plain form
2931 629 -180 -535 320 -181 -34 365 -645 -212 284 -368 514 35 -496 225 -214 -8 709 -204 -180 460
2951 460 -242 547 688 -271 316 112 -319 665 -76 -489 252 -310 -110 449 -402 24 -43 -754 134 33
2971 33 -385 164 -417 -300 446 -138 -60 294 -481 145 261 -199 297 -134 -460 398 -67 -126 276 -355 -126
2992 -126 392 -163 370 91 -498 367 193 56 709 -61 -223 385 -230 310 328 -613 -7 -218 -389 376
3012 376 -254 -544 115 -284 -167 458 -368 -225 125 -312 370 238 -483 298 -61 -178 608 -195 -114 282
3032 282 -479 117 405 -459 239 -124 -295 549 142 -182 462 -309 71 626 -102 195 80 -403 151 -42
3052 -42 -428 289 -405 -519 133 -403 -9 156 -506 59 303 -264 424 69 -316 581 4 7 404 -364 -34
3073 -34 101 -390 104 67 -575 23 -46 -381 528 -378 -291 516 -52 324 533 -109 293 354 -245 487 -15 -298
3095b98L91m51J56O45p80J47M35q41O84J26o28N97l87r6O20l21PM28p08N07K96
3116E29p97N78k42n49P36m98K7N09o79K84M31p57O25J73p85O87o0n03N44l24k44
3137c15O00o16J96K95p94N77O8o58P62m2n60Q49l50k19P21o85L22M68p50N36K2
3158D27o90P23l39k84O43o97R7L34p29K71N41q23K98L64n55O75k35m32O79m73
3178b05J83L94n82Q7M14o72N62q7n57O63k86m91R33l50l75Q00p07N56J95n91P24
3199F08l87m39P73l69l70N89n21j33N04n12J64J19m39M09O6m32Q07n44j90O49
3219C52n59p7N51o51M26K28p23P03o5n25N53m59m0O12o91K90L74p58L78J84m54
3240c51N83j54k03M93m26j94O89n48j2O65q35N67j93m25N82k56l47O84o19RO41
$$ plain form
3095 -298 93 -358 -202 443 -337 -190 245 -596 88 214 -414 183 -204 -300 320 -1 6 434 -274 233 529
3116 529 -268 310 68 -481 255 -243 -216 293 -386 -102 329 -428 197 370 -415 272 212 -291 253 -71 -315
3137 -315 285 -331 -135 160 -634 -57 11 -647 115 73 -487 362 12 -207 514 -171 151 619 -131 405 427
3158 427 -263 460 121 -163 480 -217 -120 214 -515 -244 297 -526 -228 136 -419 256 21 -411 268 -205
3178 -205 -22 372 -210 -123 291 -381 181 94 -463 200 -86 -577 356 6 -369 431 -276 280 475 -116 608
3199 608 221 -218 555 186 -184 405 -116 -249 255 -257 -93 26 -413 -4 62 -370 437 -107 -297 352
3219 352 -207 -284 267 -384 42 270 -453 250 185 -340 213 -246 -286 326 -365 -75 299 -459 -81 103 -351
3240 -351 232 78 -125 368 -58 -252 437 -111 -123 542 -293 274 81 -344 238 -18 -365 319 -300 -291 350
3261C50q04K59N23p05L76M80q96P01k37k27O34p22%M35n89L81J79q10P25o0l39
3282c46N01j38k45N07l36n5P06p08j5N63n92L72R8p93O30k80j72M68l94kN81p21
3304c71K06M75p20L87J46m76M85r2k59P23p26O7O05n05M7K17p01O01Q4o68N73
3325I8q7k86O80o22J85L89n51K52L12m94M54n7o85O65k01j98N04o09J38L50n76
3346c39M19K6l86N54j91l73N07k50j58N15m01K69K95q16K35L36n61N79j05m47
3366b92N28l82K3O63q38J09K75n10O41J35p37M91j44k56P09m02j53M30p59L77
3386i2K08m33M14k75l26P36k25j96O01o63j31Q19n01N2M21o75N09J53n62N76l38
3407G2m09N05m22L9P51r78L22L11m69O06j95m94O69k19j40M37n89J06K15m01M69
$$ plain form
3261 350 -454 -195 328 -377 -1 479 -417 284 47 -180 454 -268 -268 167 -422 -41 138 -672 53 -7 -346
3282 -346 155 17 -228 279 -57 -112 594 -114 -129 434 -158 214 312 -481 149 -131 -303 165 -229 -231 350 -371
3304 -371 -165 310 -410 -23 123 -353 132 40 -219 504 -222 -155 450 -55 -8 209 -492 109 193 -475 98
3325 98 11 -275 405 -217 -32 357 -194 58 370 -124 330 273 -412 253 52 -146 358 -251 -113 237 -339
3346 -339 80 106 -280 274 83 -290 217 -33 -191 324 -77 192 487 -329 -94 242 -319 260 155 -292
3366 -292 236 -146 -123 540 -298 -189 86 -424 217 352 -385 106 -38 -294 415 13 -140 290 -469 -92
3386 -92 116 -317 97 -178 -504 232 7 -189 412 -251 -382 437 -64 -12 409 -266 243 396 -166 410 72
3407 72 -337 168 -254 -215 536 -442 -120 191 -278 328 133 -361 308 89 -51 386 -203 -97 118 -283 186
3428A86N4o36M77q2l75O10n21j63N63k99k2O28n37J06K36m68O50j51m14N31n96
3449b23o8P39n23j5K69n35N07J73o48M19j29j60M17j40k05M41m49q1O13n25L27
3470B04K1n85N32j06l28M84m18j56O48m68K8K71n93L78L47m50L79r8m03N84k04
3491F7j16N53o70K33J97m48K21K59o82L97j70j50M48k21p3K66n37M43K77o50N42
3512A86j69k79O37m10j86M48m78l3M91n09K75J77n98N07J22n99M29j12j75O38
3532C62l34p4M48o02J97J31k76M03j79l74N58k47l08N20m40M0L54l12M38k07n04
3553d06M77k28J09M62l45l43M32l55L01J47l78N0J45m24O66j12m78N43l01j09
3573a47M52l85J24K29m77L37J72m89L40k30m1L63k00j30M54o63J48N29o29K28
$$ plain form
3428 186 240 -396 81 -1 -376 234 -287 -450 113 -186 -208 420 -117 -11 225 -243 407 256 -158 373 -223
3449 -223 -291 448 -75 -90 179 -356 151 324 -324 95 -34 -194 223 83 -122 319 -130 -211 402 -123 204
3470 204 225 -360 172 66 -262 222 -196 -352 296 -172 -144 127 -466 -88 259 -191 188 90 -313 271 67
3491 67 -49 504 -166 67 264 -184 37 296 -386 11 -159 -309 139 -82 -155 111 -426 17 294 -356 186
3512 186 17 -262 375 -35 -221 227 -251 -284 207 -302 -27 150 -448 59 181 -418 11 -101 -276 362
3532 362 28 -46 402 -200 -3 128 -148 255 76 -298 260 13 -295 225 -215 -175 179 -133 305 98 -406
3553 -406 71 -157 -48 414 69 -274 158 -197 104 251 -127 -77 68 -356 310 198 -280 263 -38 -147
3573 -147 305 -80 44 273 -204 133 305 -184 156 -74 -115 248 48 -82 372 -291 -143 386 -243 -15
3593a5o2j81L39j31j70K84l49n6N82n50L85J48n37L81J21m56O01m99o2L93j90
3614b4k5L84n41K10K87n34M90Q2o14N72l66j80O47n05o7L72l16M33o9n56K51R5
3636B6m93M63j65k31M39k25q5M94m03K99J95n07M71j86j84K88j70l19O57m68J15
3657A1J05l95J40J82k58M30j44l17M00q4j58L43l65R1L47o84O04r6n52L61p6l59
3679d74O70l89j49N58m07RL68l19J10K4j14K24P4l75M66k22j12K67n13K04K43
3700A43l19K52M8n24P20j23m20L67k82oL12j90J0L56m95K31J81m08L76l04o7L44
3722B02m26l9M86l65k0L11l66L02j59k30L63j32j25L19k82J17L50k36n8J91k57
3743e4K06r8j75L58k29j45K36k12j6L70l92J99J50l76L99m2l19N02l99K7J57l44
$$ plain form
3593 -15 -77 -258 81 -50 -220 64 -285 -341 241 -309 76 224 -313 68 189 -267 334 -165 -227 166 -24
3614 -24 -49 335 -206 4 291 -243 247 329 -285 287 -79 -259 388 -117 -184 188 -128 305 236 -320 -69 26
3636 26 -467 -4 -169 -400 39 -186 -271 223 -180 119 314 -193 278 92 -92 196 26 -293 364 -104 11
3657 11 116 -279 -139 43 -215 215 71 -246 154 70 -88 255 -110 -19 328 -356 248 152 -400 -39 -115 -474
3679 -474 196 -193 -342 216 -191 -182 186 -133 -23 1 -113 111 185 -190 276 54 -58 209 -304 -100 143
3700 143 -176 76 124 -400 320 197 -223 144 -138 -144 168 -22 -12 344 -151 80 261 -147 229 -75 -142 202
3722 202 -224 -263 223 -142 -162 149 -217 85 -74 -304 59 -73 -198 121 -161 -44 306 70 12 203 -54
3743 -54 152 54 -121 237 8 -137 99 -113 -129 241 -151 48 198 -178 221 179 -140 362 -37 -10 147 -197
3765a97KL32n45K90K78o17N72k22l02P79k72k25L22m11L36L9m26J51K59n19M94
3786A18q4k29K81k08k57N14k63j8L70n14K59K02l86L27q6j14M99l61k6K13n94
3807c57L42M09o52L51o2m80O75l17l62O44l68J38K69l14J39J46m07J81K46l99
3827a78N47l58k49M13k69j38M76j57k03J58m09N22Qn50O24k33k80N26k39j25L62
3848B48m22K94J43n22M08j95k00M68m92O0K64k45P9L50l03J3J43k82M93p4l58
3869a30M00l08JL50l28p6K87n35J31L78m05K28L1j97O8m1J34L01m33K82J57l35
3891d0K35j51j85L38j2k75L13l78N3K93m11J50L49m63K60l9k24N09j84l14N43
3912C67l87j75N69n53K01J35n20M97L9m08L00k0k14J71k00R3K40j45j65L52k22
$$ plain form
3765 -197 -195 137 -408 -118 160 -457 115 -107 -409 370 98 -127 195 -216 120 159 -267 -116 143 -376 118
3786 118 34 -195 86 -122 -379 135 -128 -146 224 -290 -31 171 -215 112 26 -88 411 50 24 237 -357
3807 -357 -15 394 -258 93 31 -449 226 -91 -453 191 -177 -39 230 -84 55 201 -206 -25 221 -178
3827 -178 369 11 -238 175 -94 -232 244 87 -116 42 -367 155 163 -387 237 4 -276 250 11 -114 248
3848 248 -174 120 263 -259 149 -46 -246 222 -270 -210 54 -191 -112 238 -65 -52 91 -191 302 228 -130
3869 -130 270 -38 -37 313 -15 -91 196 -339 -208 170 -235 -7 24 -173 -105 -146 -12 289 -144 138 295 -40
3891 -40 195 44 -141 197 185 -90 223 -155 -102 191 -220 -70 279 -184 76 37 -187 322 138 -176 367
3912 367 -20 -195 374 -179 22 157 -363 134 173 -235 65 45 -169 2 -198 -105 135 -10 -175 177 -45
3933d5M1J26l52M65j89k63L38k95o9N04m78J13J59l64L73qj77L83j21k68L66j65
3955G4KJ09k88J92Qk32L80j21m25L70k5j79M09m16q2K65j76J02K32l79K93j31
3977a8j72N26l20j66K29k87L27K03m12Q6p7l26L99Pj75L45j86k62N34k00mN2j52
4000d9J87J14m59L15o4k60K91k11J4L19k80n3L61l67Q3Q7k37K31J88l15M70m29
4022f4qK19l64J54K13m45L50lk94M37O5m93N35k53o0K95l96J37K00l27J04K30
4044B32m17K29o6q9M34k46k97K92k58J66J16p1J6j00q5K03j35k03M28m01J79K50
4066A77k49kK54l98M54p8j73J10j00j03K94k20K7J80l44J67J45k48J27J04l65
4087b41L43m3k08L17l37j18N30k38QR5n33L73k9j76N54m43J9K35k63J48K99l69
$$ plain form
3933 -45 -4 122 -230 235 46 -217 121 -174 -243 261 -217 -104 55 -309 64 56 -121 262 141 -127 239 74
3955 74 76 185 -103 89 97 -135 245 124 -301 69 44 -135 274 -142 -224 41 -135 -33 199 -180 113 -18
3977 -18 -190 336 16 -150 79 -208 119 322 -90 -4 -81 -407 -8 -1 -176 169 -17 -279 255 55 51 103 -49
4000 -49 138 252 -207 108 44 -216 75 -136 -122 197 -83 -136 225 -142 -59 28 -209 22 210 -105 365 -64
4022 -64 -72 147 -217 -63 150 -295 55 52 -242 195 260 -233 302 49 -11 284 -112 25 225 -102 2 232
4044 232 -185 44 -22 -111 323 77 -220 72 -186 -20 96 25 41 -59 -144 59 -76 -279 149 -252 -73 177
4066 177 -72 -74 180 -218 236 158 -15 95 -5 -108 186 -34 -7 173 -171 -4 141 -107 20 124 -241
4087 -241 102 59 -149 168 -169 -287 243 5 13 108 -425 -52 -81 -257 297 -146 -127 108 -155 -7 292 -77
4109g7J17L35n77K28P5k65M64j95k31L86k63K4J52k41K14J05m19K12R2m91N53
4130A98l11j40M52l50J06K09k47K44j91j73N05k05j92K01l87N3M35k89KJ64n20
4151d36M50k3k97M75j87j51L60j06k67N93n75J07J82l04L12Q5m02K56p4k28M55
4172B25k87n5K25k32O8J49k84K96n3j58L64k81K9J72k39r3K86m32K42K34n10M08
4194G4M6l58L79j18k35M57l49M5K02k89K79J7j69J53q9j74L51j12k11L79l36O5
4216GL23m81L02j98k53M27j66j88L72j33K1L00l58N2K80n14J40K69m32M23r1j63
4238f1K18j78j13K49l01Q4M06l38J26K18m59K15J89l92K88j41o7J57j98J36J22
4259A60m78K71J64j92J01j7j14R0r8R8K38n78L74L67p30M96N5k26J18J3k38N4
$$ plain form
4109 -77 40 375 -202 26 101 -164 300 105 -126 260 -3 21 173 -68 146 251 -168 44 136 -355 198
4130 198 -113 -253 199 -151 -45 164 -83 161 -30 -203 302 97 -95 106 -281 -228 207 -82 -80 84 -436
4151 -436 14 -9 -306 169 -18 -169 191 85 -182 411 -164 -57 125 -179 133 218 -184 72 -2 -230 225
4172 225 -62 -117 108 -124 -56 93 -191 105 52 -106 258 -23 6 178 -61 -154 132 -300 -58 176 -334 74
4194 74 120 -238 141 23 -212 245 -104 -59 143 -146 133 150 -19 134 45 -129 222 110 -101 278 -58 7
4216 7 330 -151 151 -47 -300 127 -39 -227 145 12 33 333 -25 27 307 -207 -67 202 -230 193 102 -61
4238 -61 157 -21 -134 115 -186 -102 304 -34 92 310 -149 66 255 -137 151 10 -57 100 -98 38 160
4259 160 -318 -47 117 -75 26 9 -105 -15 -113 -15 223 -355 19 386 -344 152 207 -19 99 112 -126 -72
4281g2j2rL54m65K16J53l65M19j35k69K73q0j17L70l09l9L75m08Q1K47m64L14
4303E8O9k27K38k75O1K8r0R7J68k41J41J78l67L18K0l91M85k08J0J55k07M4K14
4326B78m33L28k0m10M63j01m84N44k04j79M63l84K44N8k61J18J5k80K95q7l29
4347c66M68r6j20L00l09l5L90m25J67J08l02L78j70k56M79k70p6L76j91PQj99
4369a34K71o5k17L96l64Q0K23j14k41M14k47K6K37m99K76J4k16K31k55J0K87l69
4391b56K03J77k40p2K33m5R7J6j76J41n2j97L64r7k5J40l59J96M0l40L17n0j87
4414a72K37k68q1M07j89N9J88j30j05K56l31K23o9pM7r0k8K54l78k6K82l33K11
4437d3M9l32L76O0l75M26j26j21K80l05K60L1k97l8J84k84L01N4k48L45k70lL02
$$ plain form
4281 -72 -84 -93 261 -204 12 165 -200 219 84 -185 88 8 -109 261 -48 -87 288 -120 -39 208 -256 58
4303 58 127 -100 138 -137 -76 -48 -138 -41 127 -114 27 205 -162 156 176 -215 270 62 72 227 20 64 278
4326 278 -155 173 153 -257 206 105 -379 165 -39 -218 245 -139 105 163 -98 20 35 -245 50 -37 -366
4347 -366 102 6 -114 186 -123 -158 232 -193 -26 82 -220 158 -12 -268 211 -59 -135 241 50 57 65 -134
4369 -134 137 72 -145 251 -113 -33 190 76 -165 249 2 28 265 -234 42 56 -160 71 -184 -174 113 -256
4391 -256 -53 124 -116 -188 45 0 97 113 -63 78 26 -171 193 96 71 211 -148 48 88 -252 65 15 -172
4414 -172 65 -203 -284 123 -66 -7 181 51 -54 202 -129 94 25 18 65 -25 -53 201 -177 -203 79 -254 -43
4437 -43 6 -326 50 110 -265 161 35 -86 194 -111 149 180 -117 -155 29 -255 46 100 -148 197 -73 -76 226
4460B26l84J76J15j78Q4N5l24L38M1k11J51Q2j06j68l5R7J70k82J22j07N0J4M9
4483b5j15L60j18j63K12k46J09J26k09M4K47l40K55j70p4J84j82N1J88k81K29
4504H2M7l05Q1K76l19P5L01m29L81j73p5L25l93j03K86j54J4J35k42K96j68j35
4526a97L61k48l9M19n00L11Qj47J35K9j54P0K00l39K04k21Q4J24j86J11m8k20
4548b43K37J48l20K09j50O6K90l02NK95l45L37K3n20M41k30j94L81k47J23J62
4569A66k39n3K19p2m5O3j28R3M7j09J15j35k4M01l14n1K07k07K9K95n18K88P7
4592A05j47J9n1k08K79k00K26J77m07L36O9k67J72k2k48M68l20j59K75j23j08
4613a34K51l43K11J80m46M41p2l54M13k92q3L63j21P0J71l66N7J43k00K29k33
$$ plain form
4460 226 -158 18 133 -45 39 94 -230 108 149 -62 89 171 65 -103 -138 -41 129 -153 -31 -138 -88 -74 -25
4483 -25 -140 220 102 -61 151 -95 14 140 -69 -25 222 -118 137 -33 -107 77 -105 -54 134 -147 82
4504 82 129 -176 -95 181 -138 -63 238 -191 190 17 -58 267 -126 -229 57 -97 -83 52 -190 106 -62 -197
4526 -197 164 -84 -123 296 -204 107 115 -32 103 132 -22 48 248 -91 113 -108 -24 100 -86 25 -23 -243
4548 -243 -6 142 -178 31 -119 -53 237 -65 -60 235 -110 227 250 -270 171 -59 -253 128 -119 4 166
4569 166 -73 -126 93 21 -24 39 -89 4 51 -58 57 -78 -102 299 -15 -66 141 -66 -37 258 -260 28 105
4592 105 -42 -23 -74 -282 -3 -203 23 200 -207 129 198 -69 103 81 -167 301 -19 -178 97 -26 -134
4613 -134 117 -226 -15 165 -281 160 88 -266 147 -145 -228 135 14 84 255 -111 -54 89 -111 118 -115
4634a15l3K31k31n6L00k24J63k8j08L40j65j39Q0p6j7J30k58L11jj06N9j5k07
4657a65J85J04k91J59j0j20K68k26J61j20K8N6R9k80L29j21n0J32l58j3L33j97
4679i7j6K46l02K22l2k25K7J74k07L83k87L6J93j98J7J87j95L0J80l28L78j44
4701D2k38L41k70J26K59l31j34K03l55L95nj16J08L8j35K13j52R3J08k01r2J35
4723C2j87J29J51m14M46j48k34O0J54m6J79k19K05k04J50L6nk29K69l1j87o6Q9
4746g0n7K08j63N1K40m33L69j75j36L17q8k10K97j71P1J67j81O0J04l61L81J7
4768B37k74j04J61KJ09m08K27J27j86K32N4l68K09k0j23J81j26q5M19k51J5J69
4790A97m24L27n3j63J66l2l7J73k38j82K55J39j51R1j03J63j2j09J94n3j98P3
$$ plain form
4634 -115 -148 83 -148 -204 96 -128 35 7 -101 239 74 -65 15 -61 -78 52 -206 105 104 -2 57 42 -165
4657 -165 20 124 -167 -8 -18 -138 130 -96 65 -55 -27 29 128 -152 177 56 6 138 -220 -233 100 -97
4679 -97 -113 133 -169 53 21 -204 -177 -3 -210 173 -114 -78 115 -83 -66 121 -74 -44 136 -192 186 42
4701 42 -196 145 -125 1 260 -71 -205 -2 -357 38 33 -83 25 63 -72 141 -11 82 190 -11 -103 32
4723 32 -155 -26 125 -289 157 9 -225 -165 -11 -57 122 -97 108 -96 54 90 85 -144 125 94 -93 -159 -70
4746 -70 -127 81 -82 -31 209 -224 145 -30 -166 151 63 -147 150 -21 50 217 36 96 200 -161 220 237
4768 237 -37 -141 20 22 131 -277 -50 77 -109 123 177 -191 18 -2 -125 56 -70 -155 264 13 28 197
4790 197 -227 100 47 -116 50 18 -19 154 -84 -266 -11 128 -23 68 -35 128 116 7 201 148 -50 23
4812B3j03p6L31l16RL08k79J84n8j55K87q8M5j30Jk7J56k06K29K04m48P5K73m30
4836a91L00k03l7Q6NJ1Nj70K27J3j93J52J35k47K54j24Q5J15j79o3M3j21r7L13
4860A19j50J43j51p2J95m1k60L47j62J53J08q3p5M7k48K24N8j57J78l06J59L2
4882E8r3J8J28m47L22J33k81K69j57p0L33j56j31R0p2J28o3j23J33K9p4K15r5
4905I4k41J23n3rJ06L1L7j8r8J84m9j06R0J42k78k1M2j30J47j76KK02j59J79P
4930D8j17J74J9j83O3J29k54K38j20J6Q1j59J87K4k84K48j8j57R0j16K6J62m8
4953D9J2l3L6j80L10j43N3l2j93J92j69j9K05j43K24j37j73L02k04j21K88j41
4975a7k36K96k66M9K42jk61L78j70Kj2k14L10jk61K67q5j68K70m10L52o5j61J74
$$ plain form
4812 23 -80 -156 175 -141 -132 176 -103 81 23 -132 155 67 112 -18 -17 -44 112 -94 135 339 -109 -34 239 -191
4836 -191 109 -94 -131 -45 -40 -29 -24 -194 33 46 -147 5 140 -107 147 23 108 223 44 -19 24 -97 -194 119
4860 119 -31 112 -39 -111 84 43 -217 130 -32 121 229 146 71 118 -130 94 152 -5 173 -133 26 58
4882 58 -35 -17 111 -336 -14 119 -162 107 -50 -120 213 57 -74 16 -56 72 9 -114 19 48 -26 189 94
4905 94 -147 -24 -77 -86 20 51 88 70 -28 156 107 1 91 233 -45 -66 -24 -154 -7 -183 -181 21 -138 41 48
4930 48 -69 105 124 -59 4 133 -121 117 -3 13 94 -65 122 146 -138 110 92 -65 25 -91 -65 97 49
4953 49 61 28 64 -116 194 51 104 72 -121 71 -98 -117 88 -55 169 32 -141 161 -43 -164 124 -17
4975 -17 -253 43 -223 -174 68 67 -194 184 14 16 4 -210 100 99 -162 105 20 -148 122 -288 64 -1 -162 12
4999A2j02m6K43j25j17K63l26K03L1j86M7J81l1J27j09k45K68k95N5J59j51J09
5021c5J93j39j57Q1j5J16M0j02K54k51j6J93j56j38K18k57P3J54k23K08k0k58
5043b37K74k1q8N8m6J00K25l28J58r4j21K02L1k65K33j33L4k8j14l0J65j41J12
5066e4L5J02L9k03K68M6k47J41j9j80K9J56p6J26j65q6k8J61j34J26j11p5K43
5089I4k23K22j00j41J70M7k9R6l6j47K04k46P6K00j65L7q2J9P7m2PJ07j72J7K80
5114B70k07J00j27j90K84O0l67J84q9k0K51k70r9L12k98J56L6j09M8l6n5L32k72
5137a06O9O7N1j70J72k03N1J13L2j38K45l44K91m7r8J13j55P5J80k48OJ58j14
5160@O7j47J08M2o0j70K12nk17L67l10K0J19j66Q1nj28P1J48j0K8j30K44Mr1O3
$$ plain form
4999 12 -90 -136 107 -18 -135 128 -198 5 36 -150 -103 78 47 174 65 -180 88 -207 -152 7 -144 -35
5021 -35 158 19 -138 -57 -72 44 84 -18 236 -15 -31 162 6 -132 86 -171 -98 56 -167 41 21 -237
5043 -237 37 16 -72 -14 -60 40 265 -63 95 1 -120 82 113 -152 81 -52 -18 -46 -160 -190 -25 -166 -54
5066 -54 -19 83 122 -81 187 233 -14 127 108 -72 -43 113 37 163 -2 -88 -116 45 -89 37 -74 -149 94
5089 94 -129 93 -7 -148 22 69 40 136 100 -47 157 -89 -13 187 22 59 -23 -4 73 31 38 145 -27 -10 270
5114 270 63 163 36 -154 130 190 -177 7 -82 -102 149 -121 -220 92 -206 -50 -14 -123 -75 -111 -166 166 -106
5137 -106 -37 30 81 -89 83 -120 -69 44 76 -62 183 -161 130 83 -15 98 -57 18 198 -50 -44 114 0
5160 0 67 -80 28 70 10 -160 52 47 -170 197 -113 -93 26 -140 -59 -64 -192 -121 27 17 45 -85 159 163 72 135
5186A35pj15J2Jk18K77N1j88J80j71J8Q6j16k5K67j98J68o5j87K43j06j40J30
5209C2j52J05Q4l00J32J52k53O9J28L0l1j7j5J81j91oK81k26N8k5m2J34P1k18
5233a9l7K5J8O7j06o4K07k60K97k28j7RJ62n8n5M7j7J23n8j38J72j55L7R2j30
5258h6Q6N2j75J53j94J02K20l24K55m1j39J68N0j70Q2K1q4O4k19J08N9O3J3q2
5282a8j99K62j61J31k3m4p4K22l5jrk03L05k4j59l8k0N1J75j65j58L11j64j01
5306a39L07q7QL0k11oQ1J03J4j60N3Q5R1j22p5J19Ml3r5J53m7j07O2lj81L22k08
5333d2NK28l04J7J65k15J84J0MK6j75j07K30P3j55J3r9P9M9jo0J6j05P2P4j80
5359a98K12N8k9m7K6j51J04O6M5l4k49J93N3k08K19j79M7K51k04J51j37j82K64
$$ plain form
5186 135 128 13 25 26 -192 85 136 -52 128 -43 -25 61 -55 -80 187 -11 157 92 -95 148 42 -98 32
5209 32 -120 -15 69 -231 -99 53 -200 -131 -3 27 -4 -21 -36 145 -46 -52 229 3 61 36 -6 128 199 -19
5233 -19 -56 -31 -13 54 -52 -116 91 -169 128 -100 -117 -108 54 -4 -59 -12 -29 94 36 -102 70 -85 -48 44 -86
5258 -86 0 52 -123 30 -164 -62 158 -166 89 48 -91 77 127 -43 39 60 -24 40 -179 -71 -12 51 64 -18
5282 -18 -217 45 -116 15 -8 -52 -126 96 61 60 51 -152 153 129 -30 -68 -88 -37 138 -27 -185 126 -38 -139
5306 -139 168 81 89 119 -92 -98 -17 86 100 -60 -7 78 169 47 -28 91 95 62 -33 120 73 -34 28 25 -156 166 -42
5333 -42 -37 191 -113 -96 69 -146 38 48 52 78 -97 -204 26 99 -56 -43 -142 -63 -14 -15 -75 -59 -164 -92 -18 -198
5359 -198 14 72 43 -4 22 -129 -25 41 86 52 -197 -4 49 -159 60 -119 -72 179 -25 126 -11 -193 71
5382G1Ml2M0O7j36K6Q7p7j4l4RO6j66k8J03j0q2M0j02L15m6l9L2o8K7L8j95L03
5410A99M9j80Mp8j28K26k19J41J93m33M11r6k71K38l8m8Q3n0NQ6r7k1J65k65K31
5435A07j15p9J05N3k41%J89j29L03m46J80J51l46L03j12J10P9k75J24k3m9J65
5457E4l7k70K13Rj8j10J24k3K79m10K02j33Q7N8l1Q7k32K50M1l8j24m3K24k76
5481a17p1M73l71J30m7k38L19m7l6pRK8R6p3j19K87j14o5J07j12l3l7J12l6Mj83
5507a41R4Q7p3L58l38L8oj47Q9J18KN0q2j22K57j89N2J18k07R3M3k03P5j60K56
5532F2Mj31n2J95J8j05J18j93qJ31n0J66q7j52P6l9j50J59j08R6mj15j0J94o3
5557d8J13P3ro7j9m3J90j73n6J68k16J35J19k46J70m9j51J76k28J13m0m6K08M8
$$ plain form
5382 71 75 43 83 150 14 40 127 50 36 2 11 77 -89 -117 -14 -24 -106 -66 -168 147 101 62 94 26 53 91 -104 199
5410 199 248 68 72 -6 -134 92 -127 14 207 -226 185 89 -182 56 18 -30 53 3 8 94 -3 -24 141 -124 107
5435 107 -8 -87 18 71 -170 -170 19 -110 193 -253 -73 78 -268 35 -77 33 112 -163 -39 -62 -111 54
5457 54 17 -253 -40 -31 -49 -159 -35 -58 221 -189 13 -120 -33 25 -6 81 -151 99 140 102 -22 -65 159 -117
5481 -117 -188 285 -86 44 -3 -241 78 31 -5 -12 -3 25 121 48 -71 216 102 37 144 32 -1 -38 74 38 42 -141
5507 -141 -47 40 -33 325 -13 25 19 -128 -39 79 81 131 49 -73 184 -5 47 165 -42 51 94 -109 -34 -194 62
5532 62 66 -65 -117 78 96 -9 109 -84 -92 39 -11 155 68 -84 -8 -47 -197 -38 -146 -50 -54 -169 -179 15 -48
5557 -48 65 138 129 62 43 0 190 17 -39 129 -87 48 167 -79 91 42 -109 67 -161 -48 -88 -134 74 122
5581A22k22K17j83M0Q7o0K6J22j05MN6L2l84K24j89J21J81l08K33j7J0j8j2j12
5605a35J43N6J5J5j22J89j70K6J92j90q5J39k80K88L8j66n0J61j58J16P4k91J82
5628a3q2MJ94q3M6Kj53J56J01j59j85J9L3J39k44J73J34k19nJ59k13J98M1j06
5652f3J05M4n0J92n6k53L2J58p4N2j21Mn1n6l6K54j49j4L4j19K91j40j05J67j27
5677h1J16k5l1j4%M2R5Nj32J30r1j11J81j04l0K00m8j65l7J31o7L10l62J64j28
5702e2J25k7k11K32K7k34J63j5J20n9k15Q3K26k46R9j15Q1P8j30r7K27p4PJ14
5726A07j83Q8J01j02R9j17J66j88P1k13J13J85J2q5j03k7QK30j65J44r4q2J32
5749I7j25K0o2j33K45p8rJ86j26O5pj00N8N6j71J89K5l39K25o6j44K69j45P0j9
$$ plain form
5581 122 -100 117 -66 -26 61 1 27 149 44 48 104 136 -248 -24 -213 -92 89 -219 14 -3 7 -11 -23 -135
5605 -135 8 64 79 94 -28 161 -9 17 209 19 -66 73 -207 81 119 -47 -97 64 -94 22 96 -195 -13
5628 -13 -95 -91 103 20 66 68 -85 71 172 13 -172 -153 -120 19 -225 -52 82 -137 -142 17 -196 2 43 -63
5652 -63 42 86 36 228 172 -81 -49 109 35 87 -34 -30 -81 -137 -173 81 -68 -82 -48 -167 124 -16 -121 46 -81
5677 -81 35 10 -21 -35 -35 7 102 107 -25 105 14 -97 84 -20 -50 150 102 -63 -100 31 -36 274 -88 76 -52
5702 -52 73 46 -165 67 94 -140 23 8 128 69 -146 -63 163 -83 16 -99 -18 60 -70 -167 60 -14 -7 107
5726 107 -76 12 113 11 110 -7 159 -29 42 -171 -58 127 139 54 -49 -76 -68 162 -3 141 47 -35 97
5749 97 -28 -8 -70 -203 42 -36 -45 141 15 80 73 -27 31 87 -84 105 130 -209 16 -50 -194 75 -70 0 -19
5774a9k1M3p5Q8O4O9l93K52J11j78J41k28K37N6j05n5K0q9J43o6Q8n5j24L08k61
5799d9K09o4j7q6O8k8p6R4r3j16K81k17L15j62p3J9k1j01J49%pQ7j85p0K06k53
5825a90J48J26j39J40k50Q7J48l2L3j15q8K06j8j35j15K81k44J30qL8m3k4k25
5848b89L29J38j24K5m0j16K01k44K12p4RRn3k3jp4qL01k18J40L4k81K45q9N9q5
5874a7N3k77M62j34l21L97j38l3K8L4o2J69k47J0L8p6J99q6m5J99r5j10j1J48
5898H5j08J25j43L0n6J63j02j7R0j9k40J57J00j23N5r0p3K29p9j74J84RK8N7r1
5923cj43J41p0J23O3K2p7o2k08J83n9J51L9j01P5k2j3J9k5M3j13M3L7j8k9K43
5949B39j40n3o7N4j30j70L12j71J67j05R5k5pmJ24k08J70o4j0k26L59j89O9J13
$$ plain form
5774 -19 -40 3 -72 16 80 149 -244 8 119 -59 82 -146 91 147 42 -13 7 -82 61 -5 83 28 -96 212 -49
5799 -49 160 96 79 -7 61 33 -43 51 -42 -158 123 -94 221 59 -14 5 -16 -117 32 32 25 112 -73 -143 63 -190
5825 -190 -42 84 -55 85 -165 -78 70 38 71 -44 -132 74 56 -79 -194 87 -157 -27 -35 3 -40 -64 -289
5848 -289 40 178 54 79 39 -77 124 -120 92 18 27 36 -17 -40 -41 -115 -123 178 -40 100 134 -147 98 9 68 -17
5874 -17 36 -241 221 87 -234 163 25 -8 20 54 -8 161 -86 -76 -38 -114 85 -1 -46 153 58 -52 -63 85
5898 85 -23 102 -41 -11 -67 96 -6 -23 67 48 -192 -35 65 -58 -3 -93 -166 63 -16 -190 -6 3 31 88 -3
5923 -3 -146 -5 -75 48 111 133 56 -6 -214 -31 -90 61 100 -1 74 52 39 58 33 76 -37 6 43 25 -4 239
5949 239 99 46 -21 33 -97 -267 45 -126 41 -64 31 6 -1 -5 119 -89 81 17 7 -219 140 -49 20 133
5973A33m0r5j11K0J54j02L8k4j46L2L4p9J60P0R5J17j17k21L4o1R3Q2O4m9j23
5998d2j34R7l7J86j2j74K79j50n3N4k09K20NN0m5J71j28l7K2q1o2J83p5R2j30
6023a0l2J19j30J26N6k94K57k7o6k13K02l6M0m7j27K98j9j71O2n4L1J08m7rRr8
6049g2P3j23P8K13J7k71J44P0nj24N5Q3p8m7RL7k51K01jp0J45o2j07K35j79O6
6075C6j89J28j35J31J75j88J59o1l6q5kQ9q7K00r1l4%L1q2J64j51m4m4L2PO5n4
6102f6J16p4M5J5k5k6J63j51r1J68n6K3q9j89M29k0j59N7r5j43J69j17J85j72
6126a03J23j12k1K49j09j46O5O6m0J63j80L7m3K07k41M6J17j3j06Mj1J71j47r
6150c3j02J96m9J31l18J63j52J95j89J21j45K80J54k60M8j00J66j6j35k1J33j46
$$ plain form
5973 133 93 -2 -113 -93 61 -41 -3 -27 -173 -141 -107 -186 -26 44 139 256 139 -82 -48 -109 -16 66 130 81 -42
5998 -42 -176 -79 -116 70 58 -116 163 13 -40 14 -195 25 30 80 35 206 78 41 63 -18 -80 103 28 120 -10
6023 -10 -42 77 -53 73 129 -165 92 65 -1 -214 -12 -48 -8 -55 -182 116 97 -74 -12 -66 -35 73 26 17 26 -72
6049 -72 1 -122 -44 169 186 -85 59 129 124 0 55 138 60 13 22 59 -192 9 8 -62 83 21 -86 149 -30 36
6075 36 -153 -25 -160 -29 146 -42 117 56 20 -65 -67 22 -65 135 44 10 10 41 -41 123 -28 -72 -116 -84 -77 -12 -66
6102 -66 50 -24 21 36 11 -15 148 -3 -94 74 18 41 -48 -237 192 172 13 70 -25 -168 1 -116 69 -103
6126 -103 20 -92 -113 136 27 -119 -54 12 -28 135 -45 -8 -51 156 -85 -39 78 65 -41 -37 -48 123 -24 -33
6150 -33 -135 61 12 143 -175 -12 -164 31 -158 -37 -182 98 252 -8 40 -60 106 90 -45 -66 67 -79
6172g9J18n6o0R3N5k80J96p0N3J42qm0q6J53k50K58l19K78j55K8O0j17R5M8j41
6197h4l3K95k53K39j10j50J48o1l6q2J48J3N1p0k6N6nj05l9J25q5L1K04j71n6
6222e6K11l59O5P9J07j09R3O8j51lj0rJ80j1j40J46o5j3j0P1l7j94nJ85j37J46
6248D2p5L8P6L4j8j53Q4l7p1j57J37P0L1P0r0j26J31J78k86J72K1j13Q0m6n4J16
6274E4L7m9k6j00Q8j23J01P9Qj98Q6j0j2J51k40R6J66j89NO2j37P5M9m3J09r1
6300e2M3m2K12j51l7j01L32j15k46L37m1j86j52J85Oj89J51r5J56Q9j65K0m3K6
6324e8m0K1K79l65J29K13j01k9o0o0L8p9K51k05PK5q2J37P5R0l61J77J26j27m9
6349d8m1J45k5n0J10j98j1KN5K6O7m9rj22N0J11Q6j85J57O5j96J26q6p5K39o1
$$ plain form
6172 -79 39 -17 -77 16 71 -209 -13 -83 -30 112 104 64 -22 131 -119 139 -180 98 -57 -29 31 -86 9 57 -84
6197 -84 -117 178 -75 164 54 -96 52 -9 -45 -127 21 34 85 15 -11 45 40 -65 -104 21 -64 -33 171 0 -56
6222 -56 155 -204 -139 -60 47 -62 31 99 -52 -55 -65 -74 106 95 -45 101 36 23 13 84 47 -147 -152 33 -104 42
6248 42 -33 5 81 115 97 -56 28 -9 -80 -237 -100 -30 1 71 -19 -145 -14 164 -122 50 71 -42 38 -8 -62 54
6274 54 91 42 16 -84 4 -119 -18 61 69 -129 -43 -53 -65 86 -154 -58 108 -81 -76 -14 -151 -76 -27 -70 39 -52
6300 -52 -9 -51 161 10 -27 -128 204 89 -157 180 139 -47 -199 -14 -8 -197 -46 -141 15 104 -61 -41 -84 -58
6324 -58 -98 -77 202 -163 -34 179 78 49 -11 -71 -33 -112 139 -66 -59 -34 -116 21 96 186 -175 2 128 1 -48
6349 -48 -89 56 31 -19 91 -107 -118 -116 -61 -35 32 -17 -26 -148 -98 13 99 -86 71 136 -60 66 -20 -95 144 83
6375H3k04K04j12J9j29M8J42p8M8pj3k2R0j09K9J18j32P9j11J01R9q9q1Q3O9n5
6401G0j33P1m4P5P1k43J89N0j83J31o7J0O7j7kR1r8j6J15j67K3M1q0j3l0J25j26
6428i0R6J4k4j09J82pk16K55r8K74k16j35N2N5rj13O6O2n0qq6L08j06k24K30k97
6454a94L08j74O0%j48O2jm5K29%q8O2j34n5J24O2j74J0l7k6J69Q8j40J11k2Q5
6480A32k2j00P9j89K08j94P5Q6q9q7n9K50j16J87k03J16j10j3j8O8J20k7%j10
6504a6Q3J9j35r9K01j22J16L5j97RJ45n1J15p7NJ00j56J50jM4m3r6k1L1m2j3Q5
6531F9q3j03J11J11k13K15n5k29K19j78J12j1QPrp6K60k34J18J6r3J04q4n1O3
6556fj53L8J22j27O5j9J63o0n3j5J57p7j05j9j7J76p0j01JQ2j0P8Ok5K4M7k09
$$ plain form
6375 83 -121 83 -29 -10 -139 -91 51 -27 21 14 1 -21 69 -40 -11 107 -25 54 -57 44 143 54 -27 56 125 70
6401 70 -63 8 -36 39 110 -133 56 106 -77 54 -13 -3 64 47 45 136 38 22 137 -30 -7 34 -46 -59 -89 36 -90
6428 -90 6 20 -4 -113 69 62 -154 101 3 277 61 -74 -22 33 24 -89 -23 39 -11 -19 -105 203 97 -127 103 -194
6454 -194 114 -60 0 0 -148 -86 -87 -132 97 97 9 71 -63 -118 6 68 -106 -96 -133 -159 10 98 -42 69 47 132
6480 132 110 10 89 -100 108 -86 -11 75 -14 -101 -160 90 -26 161 -42 74 -36 -49 -67 1 121 94 94 -16
6504 -16 67 86 -49 -148 53 -69 47 82 -115 -106 39 -12 103 26 31 131 -25 125 124 168 125 29 8 39 -3 -16 69
6531 69 -14 -117 -6 105 -108 107 52 -177 42 -136 -24 -35 -27 -20 -29 -105 155 -79 39 55 -38 66 -18 -69 -6
6556 -6 -159 -121 1 -126 -61 -80 83 23 -30 -45 112 35 -70 -89 -106 70 0 -101 -100 -18 -28 50 56 31 55 102 -107
6583a07J52r4L7k3N3Q1N8l20K4J30j64J88qj9j9o6k0J04j51K28qj23k2O9r9L9
6609h0J26o8K20m2r5p8k3J54j58k0J27q8p7P2J4j04J21n3O5K5k11J04K79k10p4
6634g4J35j27M8K1k35K06j41J42J22j8j40J00p6N3J18j66J84o0k63K85J1p5n1
6657aR0j72J47ooj4M0P1j27o2R8o8k3Q9j27K22k16j84J21J74k13K34j44mJ23n8
6683a6Q2n2rK16k33J72L6j37j09N4j26R6m1j02K61q4Lj65J99l2J22k20j00K47
6707F2Q9l9j09m9J65Qk64J81n6l3J25K4m1P1j26R1j53q0R8j17K47L7j89K0Qp3
6733a03J8K5J7J78k12K0O3j4j67K03J14j26L0p1K7n1j9NK33j31l4l5MP6n3qN8
6760D7m5k31L53k35n5J77k0J06No2N4q4K0J38r9m9q2J75m9j09j4K2o4O2ml6LR5
$$ plain form
6583 -107 45 -49 -12 -35 18 99 157 -163 -139 -9 -173 15 7 -12 -31 -97 -117 -13 -164 64 56 -67 -89 -20 -119 -80
6609 -80 46 -22 198 156 61 -17 -40 114 -44 -64 63 -25 -102 -30 -16 -120 1 -52 13 38 -173 -69 210 0 -74
6634 -74 61 -66 -18 3 -232 -26 -167 -25 97 79 -61 39 -37 16 134 -32 152 92 -171 114 125 50 -1
6657 -1 89 -83 64 58 52 38 78 149 22 -40 58 -10 -33 56 -71 151 -65 -249 -128 46 -167 67 -77 -81 42 -16
6683 -16 66 14 5 221 -12 160 196 59 -50 4 -122 -26 -67 -169 92 8 11 -154 45 13 135 -85 -185 62
6707 62 151 112 3 -46 119 127 -137 44 -12 -45 80 104 63 134 8 99 -54 -134 -36 -153 94 131 -58 -38 -30 -103
6733 -103 -85 -60 -43 135 -77 -57 6 -8 -175 28 142 16 46 -25 2 -49 -68 -63 170 39 5 -30 -26 50 -3 -11 47
6760 47 2 -229 124 -111 -166 11 -9 97 102 40 94 10 30 168 69 20 -62 113 64 -45 -59 -37 -101 -39 -43 -79 -76 19
6788A9K0J1j29p9J93R5k29J25j25J54L9j62K19j78O1j26o0K10n2k5M3j01J52j56
6812h1Q4Q8j26K1J26j36M3O9m4K1j02o6N8j14J33K17j88J02k91J0L67k78J09O7
6836H9j54pJ18j36J83j44r9J53K8K11k14j15k5r6N9K16j18J55n3p2J07l3P3l34
6860b08K89R4k88J66k2J08j46K2j2M8N3j14m6O3q4K6J20k81J49R6P8o5l8Np6O5
6886Br9J27M3k53K15o2k1j4pR0j13n6K52r7l4R3J4j35J60k7Jq3M0j86K14j19J14
6913E9Oq7J14k1j15n0J57j6j1l4k2K09k67%N7o0m8R3O6J7j15QL8q8R3J33q1L3
6941F8q4k9n6J94m0j39l8J94l08K96k09J10K0L2%j46P8M8J01j47J76q5m5r0kK16
6967A15j65J33j05j2J29j15M0j10J58R5k93J12Pj24N9l4K40j15J18r4n7O7K5j7
$$ plain form
6788 19 39 50 -79 -158 35 130 -99 26 -99 55 94 -68 151 -27 34 -92 -152 58 6 -19 24 -77 75 -81
6812 -81 3 91 -35 -14 112 -24 19 88 44 65 -37 -103 -45 -159 -26 191 3 105 -186 -176 191 -87 22 89
6836 89 -65 -72 46 -90 93 -51 -150 3 31 242 28 -87 -112 -208 -149 67 -51 104 51 -21 86 53 126 -208
6860 -208 81 175 -113 53 31 139 -7 15 3 51 104 -10 -56 7 -77 -51 69 -212 -63 33 111 46 8 13 -63 2
6886 2 -97 30 73 -180 35 -27 -48 -62 -69 21 -92 -148 104 7 -27 66 80 -55 105 78 79 -4 36 -150 64 -55 59
6913 59 65 -22 92 71 -44 -94 63 47 36 2 -20 189 -78 -78 -21 -81 -129 -36 30 47 -68 -60 -22 -110 -17 116 35 68
6941 68 -16 -45 -101 93 53 -86 -124 70 -238 58 -151 -41 -21 11 11 -135 -57 -9 92 -55 121 36 -9 -99 -101 115
6967 115 -50 83 -22 -34 95 -20 20 -90 68 163 -130 -18 -11 -135 -76 -110 130 15 133 39 -18 49 74 57
6991E7k8jj60J84nq0R8L3J7k36J29R6j75K5K48j49j86K27j78J54J46k20jK16l17
7016a06K50j40p8R4j58J06N5m4J08q9j37J20k9l9J3m8l3K56k29J28M0r5L6J38
7040A19j51L1j17q8J96l0J62j00r2J02Pj40J89j8nJ2j22J69j16l8J0j3k3N9K6
7065B9o2R7r5n1J71j12P9q6J12n9L5n6k0j6J24j34M8l0o7J96j30Q2m4j08P3P9
7091E5j26J73j24NJ9Kj00n0J43K7o6j12J87j64P8J2k5O5J00L9j47N1L5r2o9K1
7117f3M3j44J38J25k29K8K08q2n3j1K40k5o7n2k8M5j08R4j6J7J65M3l55L0j23
7142a80m0K50j40J26J3J8j94J04j3J65J4L6j67j1J04j34M5p6J0J15q8J16K8j7
7166H4o3n4N7q2mJ41M9j63n3m2J31M6l4o4Q8Mj60m2J18r4J52j4R4j39J00m6J0
$$ plain form
6991 57 29 28 -132 52 47 -33 65 98 115 -121 8 104 -71 -46 202 53 -133 94 -84 70 216 -4 -5 211 -106
7016 -106 144 4 -74 20 -138 -32 23 -21 87 -2 -139 -19 -48 -87 -74 -122 -155 101 -128 0 40 -55 -19 119
7040 119 -32 -1 -118 -206 -10 -40 122 22 -70 32 39 -101 88 70 65 77 -45 124 8 -30 -20 -33 -56 3 29
7065 29 -33 64 -31 -82 89 -23 56 -30 82 23 58 2 -18 -34 90 -44 4 -26 -93 103 -27 55 11 -97 -24 55
7091 55 -71 102 -22 -17 2 4 -96 -146 -3 24 -42 -154 33 -131 -53 -41 -66 -1 99 138 -9 42 77 -15 -84 -63
7117 -63 -20 -164 -26 99 -130 -102 106 24 -29 -40 200 175 108 56 28 73 -35 59 43 60 225 268 -87 -57 -180
7142 -180 -220 30 -110 16 29 47 -147 -43 -56 109 123 159 -8 -19 85 -49 -4 -80 -70 45 -43 73 101 84
7166 84 21 -33 24 -58 -62 79 128 -35 -88 -130 1 47 13 -51 37 41 -119 -161 -43 -137 15 1 95 -44 56 10 20
7193B0j1L1p8J5k0P6j40R3pJ54j18m2j27K26o5n2j9P3J2P8q7N7j09L1O8M8j09
7220bO2j76J40MJ62l37J86o3J63k50J24M1j82J29q9p0K02qk7j1J51k91J74J6m9
7245al3p6N8Q7k0m8q2L7r5K03P2j45K36k43q2K30p3Q7j00p8Q2o7K32j84N7P9q4
7272D9j73J48M2j23R0LQ6j56n1J90Ql20J81J70p4n8j24J89j57R7nM6Q7j20L5n3
7298Gj19K3P3J63q6q3mJ93k20K6l5j47K01m8J1j0R0l9l3K2J47M8j05k1q2LJ73
7325A48l02K64k52K53j08o6J50m9M7j16LM9J1r2Q3M2j45J1P6j1M6J15p5N5j29
7350Hn6q3J48K2j0P1q8l0p0q6J11K12r0P0j13Q5j09N2P8k30J57k3j9R6j27J19
7376I5k61J71l7J07r9m7J72j7j22M1L0K8j39O8P5m2p3P6m2P7r0J54k36J07N8M0
$$ plain form
7193 20 9 40 -38 -23 -43 33 -107 -14 -21 133 15 -27 -154 72 7 -45 -64 9 21 99 12 69 -40 -9 59 107 -2
7220 -2 60 -116 24 28 190 -147 39 -24 139 -111 13 54 -128 1 -88 -158 44 36 9 -2 149 -142 32 48 -1
7245 -1 -34 -110 -52 35 15 -33 -115 -78 -173 30 102 -43 193 -50 -132 98 25 112 12 -66 16 -51 181 -3 54 133 49
7272 49 -124 24 66 -57 33 36 122 -34 -85 105 113 -207 -26 144 70 12 -112 77 -80 17 12 58 145 25 60 7
7298 7 -112 -89 -16 147 61 -22 -26 167 -53 -27 -62 -209 -8 -56 -45 -55 35 -4 -37 -15 132 180 75 54 -28 -25 148
7325 148 -154 110 -142 111 3 -63 87 38 85 -31 -28 21 32 -60 23 65 -80 -69 7 -4 42 157 82 137 8
7350 8 -48 -131 17 39 29 100 12 -18 -88 -174 -63 149 59 129 16 101 -8 44 122 -108 49 26 7 103 -24 95
7376 95 -166 5 -32 75 -24 -71 101 84 -38 3 33 61 -78 -10 65 23 -50 26 -16 61 -29 125 -111 -4 54 94
7402I4l6o3N4p9L4j25K51k63j8J53n5J2J4N6o7o8J12j15k0J22o2J39l8P4j38J0
7428b2r9k2Q4J07p3L7j5N1r7N4mj18O2R0n2J3q5oJ30l9J22j54R1j18M1O1m9j25
7456a35J43JP9l6j16O6J50j9j39q5R0Jm4Ql7K10j53P0j16j55J72O2l8lR4j72P9
7483b3j4Mq5J55j16J39k8K8J24k55N3K7J52j62J14l12J90Q0m2j20J5qO3J89j41
7508B7J24K8j77O2o6j82K52r8P4j15J64p0q6P4k06J23J65r4j92K80o5O9j1j59
7532g9R4N6k4j13M8o9P5J15l19J66J9M5M6J11l10J79k1J75k28O2J01r1j01J72
7556A09j25p1j77K91Q3j15P3Jm5p0j38J37jm7J02n7O7j94J99M5J15j19J31k67
7580g3K8P3o4K03l6j51n5o2N0M1M7p9J88j5j83J46o1j74J67j35J53N7p7J01j11
$$ plain form
7402 94 58 -5 49 -30 4 -121 130 -133 -151 2 -53 -41 -27 29 -38 -106 6 -109 -129 -7 -69 70 32 106 -32 -22
7428 -22 -121 -143 -59 48 -25 12 -3 48 -49 5 1 -117 -55 35 -17 -4 -89 -95 35 -4 118 -36 55 -63 -22 39 -10 -135
7456 -135 8 9 88 52 -64 2 152 133 -6 -91 -1 0 -44 -36 -73 137 -16 54 -62 -217 -45 17 -21 -24 70 -102 -23
7483 -23 -37 -33 -118 37 -79 60 32 60 184 -71 -18 9 161 -1 113 -199 -9 71 29 -91 -76 -84 -21 168 27
7508 27 151 179 2 64 -2 -184 68 -30 44 -71 93 23 -63 11 -195 -72 93 -1 -193 87 22 91 80 -79
7532 -79 15 71 47 -66 -18 -87 -12 103 -216 -50 -31 14 60 171 -139 40 19 194 -34 28 129 38 -63 109
7556 109 -16 -87 -264 27 110 -5 68 69 24 -46 -184 -47 -48 -95 7 -50 17 -177 22 67 182 63 194 -73
7580 -73 -45 28 -36 167 131 -20 -75 -137 -87 -46 1 -78 110 95 -88 58 -3 -177 -10 -145 8 65 -12 89 -22
7605b2K02q2p8N7O4j9Jj47K9oL04l90K42q4j09L6r8N5j8M0J20r7Q9j94R5J20j65
7632e5n0J65r7j15NL10j87J43j78p3K63j92J50N9q6K2k66J14K91k57l4M0k5k6
7656g9L46k10mj23j06K19j95J83J15k53O9J08j84J78j38J04l2R2j44R8N9j33k7
7679e7R6k94J58K55j39j35J9J27M4r7P3o2J25j39J70k47j4K06j85Q0O5k2L5j33
7703g1P7qn2O0pm8R2Kj03J59K7J05l44K32Kk47L10j76m1Q5Kk0L3m1JP9n0M9j91
7732h4j7J83l8M7j44O4pk3K01l38J18j25L43j2n2k29K11j24o0J49j40j2Q2J6J50
7757A59j37j1pq2J38m4J69j37j38P9j54KP9R4J21j26q5J10m7P7qr5L8J18n0r8
7783c5o3n4J28J20n0J20j18l5p1q1J76K7o9m0m2M3P7p1k8J44k05J12m8J1p6K09
$$ plain form
7605 -22 180 98 20 77 141 122 123 -24 5 -1 303 -87 155 71 -38 -2 -100 -45 -63 -23 97 0 89 -105 -10 110 -55
7632 -55 -105 60 -37 -152 -147 163 -24 119 -59 -132 131 -61 89 148 62 84 -182 -68 223 -34 -68 -28 -53 -79
7656 -79 267 57 53 -70 -176 43 -152 31 146 -107 -38 70 -114 64 -74 30 -2 90 -54 44 103 -30 -57
7679 -57 39 -255 -97 158 19 -116 -97 30 74 -23 50 -12 113 -26 144 -103 -117 89 -96 -16 49 27 62 -71
7703 -71 6 -2 -54 6 -1 -49 43 45 -58 101 128 233 -111 121 123 -124 186 10 -31 54 56 36 69 28 29 108 58 107 -84
7732 -84 -101 82 44 91 -53 11 4 -19 182 -156 -38 -163 180 168 116 -113 98 -26 -86 63 -77 -89 -7 9 159
7757 159 22 11 4 -78 60 16 185 48 -90 -11 -165 -163 -84 10 131 5 -80 30 -17 60 52 -43 -5 113 63 -35
7783 -35 -98 -152 -24 96 46 166 48 13 -58 -139 37 64 -5 -45 -87 -44 33 -38 -66 78 -127 -15 -63 -52 -128 81
7809H1j70J61j44J80j54P0j2l8M9l5l3O4N7k6R6j90J08j7m1q3N0p8J01j81j37
7834c22K37J22K0l5j58R1J01j3k0o6n6J68j81J58r1m9P9J63k34J56o9N9j39l1
7858a10J24Q5j58P2l5p2m5J20l2J82k94J18J72K8o3j45Nl5P0J88k49M0K08j52
7882B2L9r3K1q2M2J13o9O5Q6j13j82J53J26rj28J03j54p2J55l3j0R2q0j0K5K4
7908C1J28k01%J56J0j04J23o6o3k3o0N5P1p0Q1r1k8J77k17o0K82j09n1N9o8rr4
7935a41J18q7J6K58j84j97K64j32K9J82j16K04r9k59K08j62Qj42K16L7P3j69P
7958f8oK7K5J01j54J7J87j10j2q7K2n2M8k1L9K1Nn8m4P5J56k8k48J61n3L6j1j44
7986a76R9l6Q3O2O3k60J00O7m6K2J58j34Q4m6m3k1O5q6P8k16K98Qj36q0K31m1
$$ plain form
7809 81 -89 72 -72 108 -46 24 12 -26 23 -12 -45 19 76 50 146 -44 64 47 6 -77 -27 -105 -4 -185 -322
7834 -322 -85 37 57 22 -136 -45 56 43 23 -43 -99 69 -112 46 -45 -94 -15 148 -86 70 1 60 -79 -110
7858 -110 14 99 -59 13 -22 -94 -139 -19 -51 131 -163 -45 127 155 92 -53 -48 -83 -13 175 -74 -34 174 22
7882 22 61 -32 -11 -93 -51 62 -7 58 144 31 -151 2 128 119 -9 94 -60 -132 23 -10 -20 72 -8 -18 7 31
7908 31 159 -42 -42 114 124 20 143 77 14 -9 -69 -14 57 -13 68 -23 -51 126 -91 -151 131 22 -29 30 -38 -47 -141
7935 -141 -23 -110 -94 164 -20 -217 47 -85 -56 126 10 214 115 -144 64 -98 -90 -232 -16 21 94 -75 -68
7958 -68 -74 -47 -22 79 -75 -58 129 19 7 -80 -58 -110 -62 -83 -44 -23 -18 -76 -120 -45 111 83 -165 -4 -57 -21 -32 -176
7986 -176 -77 -113 -30 32 95 -165 -65 2 -44 -22 136 2 86 40 -3 -24 41 -45 33 -183 115 123 -13 -93 138 97
8012I7q3j71J32M7j51J05j60J01n4J98J03k63mJ87j70J28m4j2r7J4M4J4j46J41
8036d4P3O4j86R3n1J53j13o4J27q2N7j60K54r4L0o9j00J18q3M5pJ74k43K06j39
8061d1l5K51k07M1n5J15K24q5k99O8J23j96J64Q1k50J29j60J39r5R3j16J65p1
8084a7J89l03K37r2J36j28J71j71M4n5j34J32j75J99O0K8j22n9P5o8R7m8k2M8
8108B2p8Q6r7L6p3L15j58j01P5j23K20k59J25P0j05N5M5k11J42L8rr5J49j35l9
8133a05J18o8J14j41M0P6j7j26K52k0j32J10m1r1O3j5j20J0J29P4p7J0Q3j94R4
8158B6j22O4M0N2j3j61N0O1mj5n2l5P7J15k1j42J88n3J3r2L0K4L5q9r5M3j5K16
8186A25n9o8QR8r6
$$ plain form
8012 97 14 -157 -25 22 -129 -24 -184 -83 -137 61 164 -99 -103 84 -86 42 -2 -14 -111 -97 -53 -39 -185 -44
8036 -44 29 93 -93 0 -51 102 -11 -75 52 -30 27 -133 121 27 57 -12 -112 6 -77 -32 -39 135 -108 98 -41
8061 -41 -76 175 -32 9 -46 69 293 208 -91 -23 100 -96 68 149 -101 28 -132 7 -88 5 -111 54 -17
8084 -17 172 -131 106 14 150 22 193 22 66 11 -123 9 -166 33 93 121 -1 -60 15 -53 44 -4 -26 22
8108 22 -56 30 -67 -31 -104 211 53 -48 27 -96 124 -135 -10 60 -45 10 55 -156 -14 24 15 -80 69 -66 -105
8133 -105 13 -55 59 -82 -42 34 17 -109 143 123 -9 101 60 -31 32 17 -103 -93 36 110 33 43 126 -68 26
8158 26 -96 -32 8 60 47 -114 -64 -3 -7 -22 -74 -109 -32 83 62 -80 108 55 68 -24 6 30 65 -24 -119 -76 -91 125
8186 125 66 -2 6 104 8
8191H
$$ Imaginary data points
##PAGE= N=2
##DATA TABLE= (X++(I..I)), XYDATA
0@%%%%%%%%%%%qJ6j6J6k4L2m0M8n6P2q8J04j20J37j61J90k21K55k90L31l78M31
33B30m91N56o28P06p90Q84r87J100j225J360j507J668j843K036k246K473k725
50a429L004l309L645m020M440m912N444o050O751p573Q549r731J1199j3079J5582
65H511j9096K4436l3610N3614j74912R6879J66729k84800J49341P1770k02920
76a44058P8368K16572j37552l2594J24454j08568q7305K42154j7293k53141J18952
87a1J20369k19279P7956J60154k18889k9805J90635j03543j6204J52775j31154
98a6996j11946J94404L9500j45921O0193O2785j68515J6375J92403r5822j02976
109g6516J12562r3913p1028K12559l1068j74898J15407K4211j26103J18561J02811
$$ plain form
0 0 0 0 0 0 0 0 0 0 0 0 0 -8 8 -8 8 -16 16 -24 24 -32 40 -48 56 -64 73 -88 102 -119 136 -154 177 -201 230
33 230 -261 295 -333 373 -417 467 -520 580 -645 715 -792 876 -967 1069 -1177 1296 -1429
50 -1429 1575 -1734 1911 -2109 2331 -2581 2863 -3187 3564 -4009 4540 -5191 6008 -7071 8511
65 8511 -10585 13851 -19759 33855 -141057 -44178 122551 -162249 -12908 58862 -144058
76 -144058 -65690 150882 13330 -19264 105190 -3378 -90683 151471 134178 -118963 -11
87 -11 120358 -98921 -20965 139189 -79700 -109505 81130 -22413 -38617 114158 -16996
98 -16996 -128942 65462 104962 -40959 19234 82019 -86496 -70121 122282 26460 -76516
109 -76516 36046 -57867 -128895 83664 52596 -122302 -6895 17316 -108787 9774 112585
120A12585j41725l4838J10916k3961l6780R6522l8205j23070J05605N3814j31822
131e0959O2046N6092j62587M1525J40168j02877m2817P5679n6477j4766J08689
142E3716o728q4710K9371L7368n3050M5887Q5280j10616o1158J06168l3086l9808
154c1366J00485n6872j00150Q2849J8937m9862N5400J837q1527K2720P6204k4044
166A4611l8868M5989j4248n6918P6726K9636r7404K7231L8554p0415M7857N4914
178E7665r2681j2093O1626k1126J269M2858k7680n1708L0969N1169k4427l238
190A2603K8978o2430j3138Q6633k6136m0663M6717m4131m0523P1762K137m6381
202b4572J6320k957k4471K1860L1236k0803k9938L0793J0131k8648M0720Q210
$$ plain form
120 112585 -29140 -63978 46938 22977 -13803 82719 44514 -78556 27049 80863 -50959
131 -50959 11087 67179 -95408 -53883 86285 -16592 -59409 16270 -40207 -54973 53716
142 53716 46988 -37722 -8351 29017 -24033 21854 107134 -3482 -64640 41528 8442 -31366
154 -31366 69119 12247 -87903 -5054 13883 -35979 19421 21258 -60269 -37549 38655 14611
166 14611 -24257 21732 7484 -49434 27292 56928 -40476 -13245 25309 -45106 2751 57665
178 57665 -35016 -47109 14517 -6609 -5340 37518 9838 -41870 -10901 40268 15841 12603
190 12603 41581 -20849 -33987 52646 26510 -14153 32564 -11567 -52090 19672 21809 -24572
202 -24572 -8252 -11209 -35680 -13820 17416 -3387 -33325 -2532 7599 -21049 19671 27881
214B7881o3061L4951L7693m5963K0183J6504n6061J3773M1435j8625j0456M001
226B255j5214r741K6596K7395l2740j7488K7105k2789L017N4060l4618l2823L8010
239A3025j8136j0444M3208j7997l0015J6662K222n543O298N860j0439j4854K4509
252D356Q258k9051K0674P887l3349L1485J5675m0378J5724J0592k5500K1832J1772
265A9977k4230l783K200K107M185K546N335k1361o319K8291j0888k830K5041k7613
279g342r524L2024j4936k903K1254k0075n898J3752o578J058K28k267K843r643
293h007P203M218j7793J6079P723k1406J6092J608k0944K1167L389j5182J4336
306H483o478r672J1496l998L068K603j1157P122l104o056J6659r206o037J6051
$$ plain form
214 27881 -35180 -229 37464 -8499 11684 28188 -27873 -14100 27335 8710 -1746 2255
226 2255 -12959 -22700 3896 31291 -1449 -18937 8168 -14621 -11604 42456 7838 -24985 13025
239 13025 -5111 -15555 27653 9656 -20359 -3697 -1475 -7018 -720 5140 -5299 -20153 4356
252 4356 12614 -16437 4237 12124 -21225 10260 25935 -14443 1281 11873 -13627 8205 19977
265 19977 -4253 -8036 -5836 -3729 456 3002 8337 -13024 -19343 8948 -1940 -4770 20271 -7342
279 -7342 -16866 15158 222 -2681 18573 -1502 -7400 6352 -226 832 1060 -1207 1636 -8007
293 -8007 -804 3414 -14379 1700 9423 -11983 4109 5717 -15227 5940 9329 -5853 8483
306 8483 2005 -7667 3829 -169 2899 5502 -5655 1467 -1637 -7693 8966 -240 -6277 9774
320I774j4450j972J5150j3926N481J0348j6275M623J202q933J4501k534o899P415
334C505j3323K391J4553r245O446J776j7584J1740N565o011J1769r734q504J2244
348E588o790L595O877j6647N716N501j1661J2044k883j3904J3894j579l835J0560
362F476j1967k808J0267m221J0249j506j6470Q435l43L48J8449j3913j1946J0991
376B041q392Q504J5615j7469l929K373o549J5480L370j0648M66j0167M641J5243
390A0579j0594J72j202j5667J6848P846j6299O787m953r526K0032J002r291K175
404b091q314O191J3069k164L282j1052r249J9918K258k405Q145k2527o453K1448
418A0056l976J929K224k2596K03J1653J089P148j0192j2001N611PJ2556O700k0922
$$ plain form
320 9774 -4676 -6648 8502 -5424 57 10405 -5870 -1247 -45 -8978 5523 2989 -3910 3505
334 3505 -9818 -7427 7126 -2119 4327 6103 -11481 259 5824 -187 11582 1848 -6656 5588
348 5588 -1202 2393 9270 -7377 -1661 3840 -7821 4223 1340 -12564 1330 -249 -4084 6476
362 6476 -5491 -8299 1968 -2253 7996 6490 -9980 -1545 -1888 -1540 16909 2996 -8950 2041
376 2041 -6351 2153 17768 299 -3630 -1257 -7806 7674 11044 396 862 -9305 -4664 10579
390 10579 -15 157 -1045 -16712 136 7982 -8317 -1530 -6483 -16009 4023 5025 -4266 -2091
404 -2091 -10405 -4214 8855 6691 9973 -1079 -10328 9590 11848 9443 17588 -4939 -11392 10056
418 10056 6080 8009 10233 -12363 -12160 -507 582 7730 -2462 -14463 -8852 -8845 3711 10411 -10511
433a0511J903O416n495J9533j658k3589Q959L881j125J5804r621j4704L963K952
447c292J1990L115j3345j701p052N429K4397r876j2642N411j4365R160K5441j4742
461G928j0794O35j0277J1491J2864p195p564j1201K995J3558j032N043o985j9379
475a9913J7374J3686r279J0065r447j8199K1599Q523q376J929j4638p889J4581
488A6O682j33j2308j2422P692L057J0549J1241k5105p976J7963l084J3829J1808
502B1809k8837m599J6457m52R853J946j8256o245M530J3279N561j3334k594n942
516f824m407K4824j0k0789P173o564m590K6897l627j9872J840l981N252J5100
530A0422o518j1649r310M94J5513J823q10m008k0810J0927K4420o578L516j479
$$ plain form
433 -10511 -8608 -2192 -7687 11846 10188 -13401 -4442 -561 -1686 14118 4497 -10207 -6244 -3292
447 -3292 8698 11813 -1532 -3233 -10285 -4856 19541 9665 -2977 2434 -11931 -2771 22670 7928
461 7928 -2866 -2231 -12508 -1017 11847 4652 -2912 -14113 -11118 2440 1408 6451 -534 -19913
475 -19913 -2539 11147 1868 11933 2486 -15713 5886 14409 6033 7962 -6676 -14565 16
488 16 6698 6565 -5743 -18165 -10473 -7416 3133 14374 -10731 -18707 -744 -3828 10001 21809
502 21809 -7028 -11627 4830 4378 14231 16177 -2079 -8324 -3794 9485 15046 1712 -882 -6824
516 -6824 -11231 13593 13583 -7206 -33 -6597 -11187 15710 12083 -7789 -5949 -9930 -4678 10422
530 10422 3904 -7745 -17055 -16561 -1048 775 -35 -4043 -24853 -13926 10494 3916 7432 5953
544E953k0597J5788K0550o611J580q017j3718J0721J0233P58r880j6462L130L358
558c214J99J2197j4115j7123J5354K272K244J4692j7179j1929J6373L914M373
571H058K057j4629m052K654O929J0462j1210j1250J076l876J5708J1009j8136
584e200j318K402m764K0241O846j5917j182k820K470J5937l558j0573n237n057
598g730J1078M163p569K63j2789l562K1382k223p233L192j2119N393J9115m087
612G274k653l425q601J0128P681k65j674j6314j785J2942l071L906k119j9043
626a7019N230R608j218R451p213j2849R832N581M920N550j2688k839N651Q5J0277
641A2359l708j4128L593j141K965J2151j2270r346O939l036Q632Q397j2844l243
$$ plain form
544 5953 -14644 1144 21694 15083 16663 8646 -5072 5649 15882 16640 6760 -9702 -6572 -3214
558 -3214 -3015 9182 -4933 -22056 -6702 -4430 -2186 12506 -4673 -16602 -229 3685 8058
571 8058 10115 -4514 -8566 -5912 1017 11479 269 -10981 -9905 -13781 1927 12936 -5200
584 -5200 -6518 -4116 -8880 11361 18207 2290 1108 -1712 758 16695 13137 2564 -2673 -7730
598 -7730 3348 7511 -58 205 -12584 -16146 5236 3013 -4220 -1028 -13147 -7754 11361 7274
612 7274 4621 1196 -7405 2723 10404 10139 8465 -7849 -9634 3308 237 4143 2024 -17019
626 -17019 -11789 -2181 -3399 6052 -1161 -14010 -4178 1403 6323 11873 -815 -3654 1997 2082 12359
641 12359 8651 -5477 -1884 -3025 -60 12091 -179 -9525 -2586 -5622 3010 11407 -1437 -4680
655d680J404J569J2648k508r188p21o906Q020J0916j1263k117j206j0326J2716
669a642P499r510J087n187k555J3110J325j431j093q411P461P059l785N188p184
684A931q757J2700j73l684N078j2165k635J1032l450K054n16j1044M150N567R80
699A068M838q410l991P267j999P025L111j4246L153M057n670J0417j552j2481
713g413N086j5p98P893n494l541J960k262P974R98p022N144l969r91J1556o759
729B347m546O357p812K627Q512r068N5J207o013P575J473m995K819n141J108P999
745D504m666K344N20q644Q158K469o602P027m428o668R311k930k536N339p092
760c894k6M969m158L914n09n156O857j774j413O585o961K37P343o670K688L400
$$ plain form
655 -4680 -3276 -1707 10941 8433 -755 -1476 -8382 -362 10554 -709 -2826 -4032 -14358 -1642
669 -1642 5857 -3653 -2566 -7753 -10308 2802 4127 2696 1603 -6808 653 7712 3927 9115 1931
684 1931 -6826 5874 5701 2017 7095 -5070 -7705 3327 -123 1931 1415 -9629 -5479 88 1068
699 1068 5906 -2504 -6495 772 -1227 5798 8909 -5337 -2184 1873 -3797 6620 5068 -7413
713 -7413 -2327 -2342 -3140 4753 -741 -4282 -2322 -4584 3390 4388 -2634 2510 -1459 -2450 9106 2347
729 2347 -2199 4158 -3654 -1027 7485 -1583 -1528 -321 -6334 1241 2714 -2281 538 -4603 -3495 4504
745 4504 -162 2182 2702 -5942 2216 4685 -1917 5110 682 -5986 3325 395 -2141 3198 -3894
760 -3894 -3920 1049 -3109 805 296 -4860 1997 223 -1190 5395 -1566 -1329 6014 -656 2032 5432
776E432q828M114K064n915N674k527m832N568l876O61M874o681K906K520n764
791d610O638j92n567P687k840l529P094n447l22O093o639J722K287o187N472L27
807A987m633N627m179j992P095m808R95M102q151L575L766o001N138j582n945
822e006O662k388j865N378o581O24N141n138M131J037o805O034K59k877O936n089
838D53l268O595l806K189L711q578J898K285l827O788k609o590M895l094Q70O937
854D849p178r90K709n011O523K848p138L513k441j626R184l666l073L533n641
869c605M170N925o506K191j170m860Q416j19m386L202o566M18Q007m425L33n10
885E15p726O158L621m038L695n602m165Q336j193N04K837q623J725N426k145N312
$$ plain form
776 5432 -3396 718 2782 -3133 2541 14 -4818 750 -3126 -2465 2409 -4272 -1366 1154 -4610
791 -4610 2028 1836 -3731 3956 1116 -2413 4681 -766 -1088 5005 -1634 88 2375 -3812 1660 1987
807 1987 -2646 2981 -1198 -3190 3905 -903 92 4194 -3957 -382 3384 -2617 2521 939 -5006
822 -5006 1656 -732 -2597 2781 -3800 -3176 1965 -3173 958 1995 -4810 1224 1483 -1394 5542 453
838 453 -2815 3780 -26 2163 5874 -2704 -806 1479 -2348 4440 1831 -4759 136 -2958 -2088 4849
854 4849 -2329 -3319 -610 -5621 902 3750 -3388 125 -2316 -3942 5242 1576 -1497 2036 -3605
869 -3605 565 6490 -16 2175 1005 -3855 4561 4442 56 3258 -3308 -2890 5117 692 1025 515
885 515 -7211 -1053 2568 -1470 2225 -3377 -7542 794 -399 105 2942 -5681 -3956 1470 -675 4637
901D637k740p837O100M51P72N713p908k915N510k309N208J220r654K551J249j050
917a002P766n051o178L870l047M483N899q965r13Q35k570R194j32p539K488l471
933d333J449R584m937k891O73n161O585M844n712J212m240k611R599r05k678J338
949A816q107L050Q269m097J101k393p013P390L565k167J990p681j982Q215q51
964A105K370l21r769L943N110r09N582n796p208O616J98K806L991r893j791M582
980F16j758O254q43r490J928l7J427P407o499m613K737l048O868M400q511N5Q1
997c026j345R833j088o192J368l713M121P923n400j412j287m894Q695L642n674
1012A551J024n451j427R584r68j832j044p924M429O292l356J779n012o012P997
$$ plain form
901 4637 1897 -5940 160 611 1383 7096 -812 -3727 1783 -526 4682 5902 -3752 -1201 48 -1002
917 -1002 6764 1713 -4465 -595 -3642 841 6740 -2225 -3138 -2303 -4873 4321 4189 -3350 -862 -4333
933 -4333 -2884 6700 1763 -1128 -455 -5616 969 5813 101 1313 -2927 -5538 4061 3156 478 1816
949 1816 -6291 -3241 5028 931 2032 -361 -7374 16 3581 1414 3404 -4277 -6259 1956 1105
964 1105 3475 3154 -6615 -2672 2438 1529 7111 1315 -5893 723 921 3727 7718 -2175 -3966 616
980 616 -1142 5112 4269 -5221 -3293 -3330 -1903 5504 -995 -5608 -2871 -5919 949 5349 -3162 -3107 -3026
997 -3026 -4371 5462 4374 -1818 -450 -4163 -42 7881 2481 1069 -218 -5112 3583 7225 1551
1012 1551 2575 -2876 -4303 5281 4313 2481 1437 -6487 -2058 4234 878 2657 -2355 -8367 -370
1027c70J281j129K376q215n38P169j206L519j431q441M914L405m39N148o054n322
1043e333O186k56L382J881r087O97K511r01P303k968p973L806j016K067P033o771
1059E61l552J840j922O642K012p336M29k040J34Q735l731m437J580m639M510O355
1075E141n723j18j589l401Q772J094m271J497n510Q37Q350k641j247q74o213N308
1091e88L962k779K101n548l229P967p49N30J987q347J124O276j449L119k243o638
1107d504M457J350O43L946p373k671M723k023M112J075q231J474J610n13O165
1122D240l521n143L289j696L506N160o984j267J632k153O610N04o063J700k623
1137b809P51O878m179j738J140m690N098M253n285J784j866l204P014l04k163
$$ plain form
1027 -370 911 -218 2158 -6057 -6595 574 -632 2887 1456 -6985 -2071 1334 895 6043 -11 -5333
1043 -5333 853 597 3979 5860 -3227 -2530 -19 -920 6383 3415 -4558 -752 -1768 299 7332 561
1059 561 -2991 -1151 -3073 3569 5581 -1755 -1326 -3366 -3232 5503 1772 -2665 -1085 -5724 -1214 5141
1075 5141 -582 -700 -2289 -5690 3082 4176 -95 1402 -4108 -3271 5079 2438 1191 317 -5896 -588
1091 -588 3374 595 2696 -2852 -6081 1886 1137 1667 3654 -4693 -3569 2707 1258 4377 2134 -4504
1107 -4504 -47 1303 1946 5892 -1481 -4152 571 -1452 2660 3735 -4496 -3022 -1412 -1925 4240
1122 4240 719 -4424 -1135 -2831 675 5835 -1149 -2416 -784 -2937 3673 4177 -1886 -186 -2809
1137 -2809 -2058 4820 641 -1097 43 -4647 451 4704 -581 1203 -663 -3867 3147 2843 680
1152F80J509n461J704N586m058J557j173n776N517J569k856L312m610k009N939
1167A430j605J429J206o432K657L369k429M150k519m950M573o81M32K964n828
1182b234j84K849k803M443q2n907L713l61j283N874l291l058L859k736K429K767
1198C995n302J517L56k789N107j716l586L209l315O27M931m645P20J533m165M683
1214A160J582m290L272k019k199N709k385j558K655m482J818K732l521K469j124
1229a81l294M952j528j386M375m797K56M472l691J850J308m698L359O25l134L737
1245B225k616k150M081k935L60K920m664J709J736l031L591n87l205M342j966
1260a90p82M348l995L2L353m015K240J428m562L321n17k788L747k160j268L349
$$ plain form
1152 680 2189 -3272 -1568 4018 -40 1517 344 -5432 85 1654 -1202 2110 -2500 -4509 1430
1167 1430 -175 1254 2460 -3972 -1315 2054 -375 3775 1256 -3694 879 198 630 3594 -2234
1182 -2234 -2418 431 -2372 2071 1989 -3918 -205 -566 -1849 4025 734 -2324 1535 -1201 1228 3995
1198 3995 -1307 210 566 -2223 2884 1168 -2418 791 -2524 -1897 3034 -1611 -891 642 -3523 1160
1214 1160 2742 -1548 1724 -295 -2494 3215 830 -728 1927 -2555 -737 1995 -1526 943 -181
1229 -181 -3475 1477 -51 -1437 2938 -1859 -1603 2869 -822 1028 2336 -2362 997 1622 -1512 2225
1245 2225 -391 -2541 1540 -1395 -1035 1885 -2779 -1070 666 -2365 1226 639 -2566 1776 -190
1260 -190 -972 3376 -619 -587 2766 -1249 991 2419 -2143 1178 661 -2127 1620 -540 -1808 1541
1276A541l431R25K575l935K759J040l635L806q95k718M282k347j150L500l917
1291a600O25K780l770K267M52l653L583m69k052L990k980m44L691l143J470K075
1307B822m625K645J042l002L477j786l076L470j799m44K933m132N65K154k677
1322b433L237L49l674L261p94r93M569l160j055K641l129K171K330m529J449j24
1338A16k528M432j270k871K607k912J228L791l649P96P29l300M323P11l246K849
1354A806k736j208M941k323q34J513m282K138K651k856K144j688k683M422n65
1369D40m56K722m280M14L743k259J964K78m994K747O58j291L022l565k580L258
1385a79j498J543J875m938J215J689j163M159j107l788K825r58Q74L804m183j185
$$ plain form
1276 1541 -1890 -965 1610 -2325 434 1474 -2161 1645 750 -1968 2314 -33 -1183 2317 -1600
1291 -1600 -975 1805 -1965 302 754 -2899 684 215 -1837 2153 -827 -1271 2420 -723 747 2822
1307 2822 -1803 842 1884 -1118 2359 573 -2503 967 -832 -1276 1657 -2475 -1910 244 -2433
1322 -2433 804 1153 -2521 740 -54 -1047 3522 362 -693 1948 -1181 990 3320 -1209 240 116
1338 116 -2412 2020 750 -2121 486 -2426 -1198 2593 -1056 -260 469 -2831 1492 2203 -1043 1806
1354 1806 -930 -2138 2803 480 -354 1159 -3123 -985 1666 -1190 954 -734 -3417 1005 440
1369 440 -16 2706 -1574 -1160 2583 324 2288 2566 -2428 319 977 -314 2708 -857 -3437 -179
1385 -179 -1677 -134 1741 -3197 -1982 -293 -1456 2703 1596 -2192 633 -325 549 4353 170 -1015
1401a015J330k496L653R84m549J363j132o19N040k038j780J689l026K626L572
1416C602l492O52n38k877M815O9k383J365l714J39M525j985o3n1l881L248K318
1433A749j974J905k689k138M639l85K75J189m881Q47L117j353K250j537m494L017
1449d63N13r0K526m380j292K972j197K660R69m847J514J085p25M330k072l184
1465a681K125j189J722K892m382m96M90j772M266P2l811J198j744N14M871k466
1481F09j115M25k772L586K752l299P00j767j903M888l85j742K02l424J413L761
1497A929j924Q29j214l333M217J261j558J856l475j325M549q08N97M48m546J575
1513i22K268j063K238k459l311L189q2P98J898m609j92K127j040L166k92m426
$$ plain form
1401 -1015 315 -2181 1472 2456 -2093 -730 -1862 -2481 2559 521 -1259 430 -2596 30 3602
1416 3602 110 762 224 -2653 2162 2231 -152 1213 -2501 -2362 2163 178 115 64 -3817 -569 1749
1433 1749 -225 1680 -1009 -3147 1492 1107 1382 2571 -2310 -1463 1654 301 2551 1014 -3480 -463
1449 -463 50 -40 2486 -1894 -3186 -214 -1411 1249 2218 -2629 -1115 -30 -755 3575 1503 -1681
1465 -1681 444 -745 977 3869 -513 -1009 -519 -2291 1975 2047 -1764 -566 -2310 -1796 3075 609
1481 609 -506 -81 -2853 733 3485 186 886 -881 -2784 2104 1719 -23 179 -3245 -1832 1929
1497 1929 5 834 -380 -3713 504 1765 207 2063 -1412 -2737 1812 1004 1601 2049 -2497 -922
1513 -922 1346 283 2521 62 -3249 -60 -142 656 2554 -2055 -2247 -120 -1160 2006 1714 -2712
1529b712J996K30M2M150k883k751K100j146K143J823l831r5l47m32M100j291k798
1546a702J504k142J557M221l093q30M31k177L726J412k655P44k513m74M338j229
1562A118j372L33l184J814L000j850J134j934k239L989L00o17J800l992k21L643
1578A722j057J060k30m029J789J312l48K065l011j857K597j038J861J462m616
1593b318Q61J798j067L169r39l410K027o25Q85K771l197j135J098j681K710J091
1609B038l603Q27n44j50L398j563j255J278k413K305K475l049O82j53k352L239
1625A160O41k172P83k058R1K841j498L97o0k772K762J157j745J931j640j571L232
1642A479r37J4J140l440P99K339k070J678m88l020K158L82m02J822k450l40J958
$$ plain form
1529 -2712 -716 -486 -444 3706 823 -1928 172 -974 1169 2992 -839 -934 -1281 -1713 2387 1096 -1702
1546 -1702 -198 -2340 -783 3438 345 -485 -54 -2231 1495 2907 252 996 -1517 -1991 2347 1118
1562 1118 -254 79 -3105 -1291 1709 -141 993 -941 -3180 809 1109 492 2292 -1700 -1921 1722
1578 1722 665 1725 1495 -2534 -745 567 219 2284 -727 -2584 13 -1025 836 2298 -2318
1593 -2318 -1457 341 -726 2443 1504 -1906 121 -504 381 3152 -45 -1180 -82 -1763 947 2038
1609 2038 -1565 -738 -1282 -1432 1966 403 -852 426 -1987 318 2793 -256 426 273 -2079 1160
1625 1160 1801 -371 412 -1646 -1555 1286 -212 185 125 -2647 115 1272 -473 1458 -182 -1753 1479
1642 1479 542 556 1696 -1744 -945 1394 -676 1002 514 -2506 -348 34 -368 1454 -996 -1336 622
1659F22j341K088K18l327K021K40j605L337j776k410K523j096K38J891k562L8
1675i01Q48j362K679m42k028J857j259P5K922k378j23J066k323J998J289k801
1691h83J478p90j719K913o50j595J690j948O53K013j651J003o5j742K505k54j175
1708b17K133k398p66K870j965P1J489l069J303J254j743J591p56j367K237j016
1724c49N7J784k232N41J506k038J956r4k429K131q69j170K628k074o66K149j893
1741a062O63J317k101J212N03j476J889n97q97K083j836K83J834k487P26J026
1757A080k709K082K4k117K141r73q26J932j401k40J935j827J011R44j964J903
1773I95j14j455K158j228q45J995j906J9J401k349R17J123j989J593Kj647J584
$$ plain form
1659 622 -719 1369 1587 -1740 281 521 -1084 2253 477 -1933 590 -506 -268 1623 -939 -901
1675 -901 -53 -1415 1264 822 -1206 651 -608 -533 2389 11 -112 954 -1369 629 1918 -883
1691 -883 595 -195 -1914 999 349 -1246 444 -1504 -851 1162 -489 514 449 -1293 1212 958 -217
1708 -217 1916 -482 -1248 1622 -343 -272 1217 -1852 -549 705 -1038 553 -203 -1570 667 -349
1724 -349 -292 1492 -740 -199 1307 -731 1225 1131 -1298 833 -36 -1206 1422 -652 -1318 831 -1062
1741 -1062 -399 918 -1183 29 532 -944 945 348 -549 1534 -302 -19 1815 -672 54 1080
1757 1080 -1629 453 477 -1640 501 -472 -1298 634 -767 -1007 928 -899 112 1056 -908 995
1773 995 881 -574 1584 356 -489 1506 -400 -381 1020 -1329 -412 711 -1278 315 317 -1330 254
1790B54k36m58J663j752K5J785j878J671J53k290J577k82j473K373j473j222K023
1807D60j718N75J976k249M25Q80j312J994o5j647J929j367J42K141k057rP83k300
1825a419J762N68k406J626r77j256K730r83p23J647j962P80J914j589J164j01
1841G75j871K413k69q98J564k203n61K264j723N24O96l090J676Q94j357J980j067
1858b53j218K141m55K97J503k347L78R67j140J614k62k915J959p50n88K244k189
1875a014q86J576j246J433J360k229R69J43n93K699p98j370J255j760P89J900
1891B228k439Q2N1k092K168K94j806J280j449j90K872q37j25R21k103J415J804
1908B074j431Q46j022j680K320l93o07J152k757K21J644j039R36j26k543J831
$$ plain form
1790 254 18 -440 1223 -529 -504 1281 -597 1074 1227 -1063 514 232 -1241 1132 -341 -1563 460
1807 460 -1258 -683 1293 -956 -531 349 -963 1031 966 -681 1248 -119 23 2164 107 98 881 -1419
1825 -1419 343 911 -1495 131 -846 -2102 628 -355 -1078 569 -1393 -613 1301 -288 876 775
1841 775 -1096 1317 1048 150 1714 -489 -1050 1214 -509 15 711 -2379 -703 191 -1166 814 -253
1858 -253 -1471 670 215 512 2015 -332 46 1013 -127 1487 1225 -1690 269 -481 -1069 1175 -1014
1875 -1014 -1900 -324 -1570 -137 1223 -1006 -37 106 -487 2212 1414 44 1299 -461 328 2228
1891 2228 -211 -129 -78 -2170 -2 292 -1514 -234 -1683 -1873 999 162 37 958 -1145 270 2074
1908 2074 643 1489 467 -1213 1107 714 107 1259 -1498 -1277 367 -672 264 138 -2405 -574
1924e74Q09m44J765j732j295K281p55Q47R26l057Q12P32r60K163j121k387J654
1941c36q13P02J772k307K1Q91j018K181P88k243J053l44m03K772j507j311Q30
1958G28j811J249J630k414L83p15j311K760k09j452Q79j668P58K684j246J57K88
1975F90k003K148O25j331J187j972j122K673r23j19O87k560Q84J603j106J816
1991A177r18j998K209O7Q0J341k271l86J693r32J248O7k615J001J74m97K130j691
2009a21j695J486q45J031J703k612K19N69p09K389m10j874J396r89o3K752k068
2026A59o21P23j739J735Q94j979N89q44o19K527m39q16Q58j729J208K018j583
2043C42N89k91j697K245k9r49Q64j997n00K200j089K07L63k320J128J126p20J511
$$ plain form
1924 -574 235 -209 1556 -176 -1471 810 55 902 1828 -1229 -417 315 -645 1518 397 -1990 -336
1941 -336 -1149 -447 1325 -982 -961 -70 -1088 1093 1881 -362 691 347 -56 2716 1209 -102 728
1958 728 -1083 166 1796 -618 -235 -950 -2261 499 290 -1162 -283 -1951 -1193 1491 245 402 690
1975 690 -1313 835 1460 129 1316 -656 -1778 895 -28 -147 540 -2020 -1136 467 -639 1177
1991 1177 259 -1739 470 537 617 1958 -313 -699 994 62 1310 1377 -1238 -237 -63 -560 1570 -121
2009 -121 -1816 -330 -1175 -144 1559 -1053 -834 -265 -974 1415 1005 -869 527 -462 -525 2227 159
2026 159 -462 261 -1478 257 1151 -828 -239 -1083 -1702 825 386 -430 428 -1301 -93 1925 342
2043 342 931 640 -1057 1188 1159 210 1074 -923 -1423 777 -312 -105 258 -2062 -934 192 -528 983
2061I83j172j226J989o34O08J263k699N05J311j490J764m08k279J194k01k17J853
2078A144j758n73J101q63J233J094k010P95O1p54K292q21j230R39j203M75J694
2095A616k041J77M51j968J825N70j397R46j009j81K065j025J13P09j889J735Q79
2112A576j947J401p87j669K007m18q25J110j969J77J836j205Q00K56j963J794
2128A74N33q64J381j185o64J586q31M08O37k237R82M15j132J591p70j594J835
2145B65n79r7J673j679j27J063j180J663r1j564J082l62r24J968j070r57J273
2162C57j470P40J149j765P19K16j034J886k17j052J404j119j00J605j146J50N13
2179H36j695J231K27j274J325j221q44J866j052o5J529k083P83J322j407J163
$$ plain form
2061 983 -189 -1415 574 -60 548 1811 -888 -383 928 -562 1202 794 -1485 -291 -492 -709 1144
2078 1144 -614 -1187 -86 -949 284 1378 -632 163 224 -530 1762 941 -289 650 -553 -78 1616
2095 1616 -425 -248 203 -1765 60 630 -767 179 -830 -1011 1054 29 142 851 -1038 697 1576
2112 1576 -371 1030 243 -1426 581 163 -662 448 -1521 -1344 492 -713 87 343 -1620 174
2128 174 707 -157 1224 39 -625 961 130 538 1175 -1062 -80 335 -797 794 24 -1570 265
2145 265 -314 -411 1262 -417 -544 519 -661 1002 911 -653 429 67 -857 1111 41 -916 357
2162 357 -1113 -373 776 -989 -270 -54 -1088 798 581 -471 933 -186 -286 1319 173 323 836
2179 836 -859 372 599 -675 650 -571 -1415 451 -601 -666 863 -1220 -437 885 -522 641
2195F41j52j021J340m89l65J128j541R9J252j544Q07M51j717J162J63j123J639
2212G30n74o94J498j120J38J158j511M86N70j225Q92n1j228J182p48n07J396j454
2230a062M70J056j556P93R25j735J604J76j107J566q81n11J480j224K85P49j655
2247f27Q24L50j451J122k59r89J561j108k62J579j295L73R93j487Q88N67j468
2264f89J298k16r21J399j134k80J058j201N79N80j496J063L27j266J536m41q94
2281f98J477o64r1J166j401K25P58j418J113J7j299J214q76n82J871j376j69J281
2299E48j580P94J055j592Q80Q3r65J775n14q01J195j098n2J289j242L98K29j413
2317a011J339k3q68J089j028m86J535r13K38Q04j579O38J014j162J078l47j139
$$ plain form
2195 641 489 -532 808 319 -46 1082 -459 -360 892 -652 155 606 -1111 51 214 -909 730
2212 730 156 -538 960 -160 -22 1136 -375 111 681 -544 348 297 -931 251 -497 -1004 392 -1062
2230 -1062 -592 464 -1092 -299 626 -1109 495 671 -436 1130 249 -262 1218 -6 279 1028 -627
2247 -627 197 547 -904 218 -41 -1030 531 -577 -839 740 -555 -182 811 -676 212 779 -689
2264 -689 609 393 -528 871 -263 -543 515 -686 -107 473 -1023 40 367 -899 637 196 -698
2281 -698 779 115 24 1190 -211 14 772 -646 467 484 -815 399 -477 -1059 812 -564 -733 548
2299 548 -1032 -238 817 -775 105 188 -777 998 484 -317 878 -220 -272 1017 -225 173 402 -1011
2317 -1011 328 305 -563 526 -502 -988 547 -366 -128 676 -903 -265 749 -413 665 318 -821
2334h21J482n68j22J007j589J02J038j339J047K04j618J179k30n17J800j075o64
2351f84J345j024O32Q68j564N53K66j007J415n04j204J020r69R2J421j261k7P97
2369A65j191J320O66j303J109m74o82J700p35m32Q24j474L74J024j375M35j46
2386a95j337J626l18n26R42j143Q5J494r09N80M71j612R85O60r13J193r62q90
2404g69J349p22K61P98j919N57P18j086J311l05j027J239k53k66J522j262m80
2421c34R39j053R64M44j492L74J5n63J390p43j099R41r21N95J000j135M01J87
2439i0q39J653J43r56P09p17j52J612j066o8L58j406Q47N08j183R12n15r67J664
2458D47k71j74O96j199Q6J494q84M10j3j379J148J7m55R36j265o31J091p09M48
$$ plain form
2334 -821 661 93 -29 978 -611 -509 529 -810 237 441 -1177 2 -228 -745 1055 -20 -684
2351 -684 661 -363 269 1137 -427 126 392 -615 800 296 -908 112 -857 -765 656 -605 -632 165
2369 165 -1026 294 960 -343 766 292 -390 1310 575 143 967 -507 -133 891 -484 -49 -195
2386 -195 -1532 94 -224 -750 192 -951 -866 628 -281 299 770 -842 143 803 -110 1083 121 -769
2404 -769 580 -142 119 917 -1002 -445 273 -813 498 193 -834 405 152 -114 1408 146 -334
2421 -334 605 -448 516 960 -532 -158 -143 -706 684 -59 -1158 -217 -1138 -543 457 -678 -277 -90
2439 -90 -929 724 867 -89 620 -97 -249 1363 297 229 587 -819 28 536 -647 265 -250 -1217 447
2458 447 176 2 698 -501 -415 1079 195 605 592 -787 361 378 -77 859 -406 -1037 54 -655 -207
2477b07N67j545N03O50o99J476p49j005J324l79K23R33j204J1N69p68R59R5j353
2496e99P43m13k32J404r87o19Q26q45P67P76j073N05k52m90J360m42p04Q43j068
2515e00J65J240j150L01Lj339J040M56q66P39q80l96J587o70L68M83j203O54Q87
2534I19q51Q50n14j008J216j82l05P48j504J5Q87p92P04L22j519J000P1k70R75
2553G62o36n18J012q40M38P68j463N18M2n68R36k03j052P95o00P6J151j056LP78
2573C43j206J031P07j256P20l89l55J256l71n53N32j103L91R76j163L72k6j031
2591a125J139p7n35R39p17J6J238q36N18K10j052P45L50q74Q17o35q45J073n29
2610a80o9N67j274L34N67o60Q88J1q38Q58j35k03J096r81k15Q26q64O86L19j236
$$ plain form
2477 -207 360 -1185 -682 -32 -731 745 -4 -1009 315 -64 159 1092 -112 -101 468 -300 659 754 -599
2496 -599 144 -269 -501 903 -84 -703 123 -722 45 821 -252 253 1 -489 871 429 -275 568 -500
2515 -500 -335 905 -245 56 59 -1280 -240 216 -650 89 -791 -1187 400 -270 98 581 -622 32 919
2534 919 68 918 404 -604 612 430 125 873 -631 -616 271 -521 183 505 -1014 -14 57 -213 762
2553 762 126 -392 620 -220 218 986 -477 41 83 -485 451 248 -804 -9 -609 -533 618 -438 -435 343
2573 343 -863 168 875 -381 339 -50 -405 851 480 -73 459 -644 -253 723 -440 -68 -94 -1125
2591 -1125 14 -63 -598 341 -376 -360 878 42 560 770 -282 463 813 -61 756 121 -724 349 -180
2610 -180 -249 318 -956 -622 -55 -715 173 184 -654 204 69 -134 962 -19 -234 592 -272 414 733 -503
2630e03M35Jn80J145n27n21P01p41K66J197j319L89L93q29J014j10o50O97n64
2649a06l85J292r65j56N78j041P39K80q18O61jo18R66k71k92J006j112L24Q71
2668I52q90L99K06r53P12k52o78R87q50j07O67p45N23M08r84O08J34o49P84o7
2688B05o71R86q59J81O72r98L76N35j012P46l6q93J178m36k70Q71j074J38J041
2707F80r28L46O09r07P11j79o38P75l69m63P46q12J67N21r10L94L45r91R51L9
2727H7r29J112k88l54P78m19j64P26p86M13K92r59P02qo57R10n48k87O93n41R
2748b18N86p82O15Q4p87P81K4o83R37l76n40Q79p73J21L49r18Q21N1p34O36p4
2769ao39J132o85j22Q22q56L30P53j065O70p1q25R19j15o69O97n75j27P26p51
$$ plain form
2630 -503 -68 -67 -647 498 -29 -550 151 -590 -324 873 -446 -57 336 -493 521 411 -239 458 -106
2649 -106 -491 801 -164 -320 258 -783 -44 236 -582 79 78 -540 426 155 -137 869 -243 81 952
2668 952 62 461 667 -286 426 174 -504 483 -367 -474 193 -552 -29 379 -605 3 137 -512 272 205
2688 205 -466 520 -339 -158 514 -484 -108 427 -585 161 125 -768 410 -26 -296 575 -499 -361 680
2707 680 -248 98 707 -200 511 332 -306 469 100 -363 383 -429 -262 259 -651 -257 88 -903 48 87
2727 87 -842 270 -18 -372 406 -13 -177 549 -237 176 468 -491 211 203 -454 456 -92 -379 314 -227 -218
2748 -218 368 -414 201 285 -502 279 303 -380 557 181 -359 520 -253 -132 217 -701 120 171 -563 73 -1
2769 -1 -640 492 -193 -315 507 -349 -19 734 -331 339 268 -557 362 247 -422 275 -300 -427 299 -452
2789d52K34M76r14N71K67p17Q47j95n60R21m60r7P95j012L25M96p85M59o8o55
2809e24P07%m07P53p72p3N51m46M00K71j054O01K26o96J000n87m63R93o28J12
2829c6P11j036L80O1n75P16l9n28O13l40j02R13q04k09N67n80N92L42r39N93j08
2850A92p89J080l61m44P25r21N5J129j271N61P8p12Q40K19n85O50m69l44R98p54
2870a23K95K25r32N77L93q50O69l09m51R42m27j70N57p46K19M97o47N88L1r36
2890e98Q07q9m11Q02p34k27O26n87M60L60q97N21J68p14Q75j33o76O10l41Q7Q64
2911G73r38J5N76p06O12J53p12N44l85k91P72l35l85L74q75P73M31q54O33k8n95
2932d48P19J6m95M83n99m8Q38n54J22J36q38O74j0k73P12p04k74P20l39K2P64
$$ plain form
2789 -452 -218 258 -656 -85 182 -535 312 117 -443 478 18 -79 716 -296 29 525 -260 199 131 -524
2809 -524 183 183 -224 529 -243 -316 235 -211 189 460 -594 7 233 -463 537 -50 -513 480 -148 -36
2829 -36 675 -361 19 80 -495 221 182 -346 267 -73 -175 738 -66 -275 292 -288 304 646 -293 300 192
2850 192 -597 483 122 -322 403 -518 -463 666 -605 -44 34 -678 162 381 -204 446 -23 -367 631 -123
2870 -123 172 397 -535 42 435 -415 254 -55 -506 436 9 -161 396 -350 -131 366 -281 307 338 -598
2890 -598 209 120 -291 511 -223 -450 176 -411 49 409 -488 33 201 -513 362 229 -447 163 -178 -91 773
2911 773 -165 -150 426 -280 332 485 -227 317 -68 -359 413 78 -307 67 -808 -35 396 -458 175 147 -448
2932 -448 271 287 -208 275 -324 -372 466 -88 34 170 -668 6 -4 -277 435 -269 -543 177 -162 -140 624
2953F24j009K26N15o53P36k52o04Q20m14K1P86r66n8P54p33L86M04j127N83k36
2973a97j55P74l14n22N10n50K28P09p27K32m0m62O29J86o26L47l44j17Q22o03
2993b20J56M46j047O95M64p52P05l07l59O95l65j57O34q37J72N31n78L85k74n59
3013e72P51k36k74O39o60j64P33n65M13K61p84N47K68o99Q42k65o35P49m39J63
3033G3N25j049L39L27o42N88j01m75M36k69j63Q36o43J2L49m05L85M36q01N57
3053C15j07n32R07o01k39N82q06K91O22n76L5L16q36R37p1l76N84n48j54Q26l92
3074A77j96M05p60M51M8n74O45k67n30P03j39j92M59n12o1Q26o65O70k03o34P04
3095C55Jn24P40o29j98N55o29K16M59r07N17j8m66O76j16m87P21n07L4R04q13
$$ plain form
2953 624 -385 -159 356 -297 439 187 -417 403 -11 10 796 -170 -228 526 -207 179 583 -544 39 -197
2973 -197 -352 422 108 -414 96 -454 -226 483 -244 -12 -52 -514 115 301 -325 22 -322 -439 383 -220
2993 -220 -64 382 -665 30 494 -258 447 140 -219 476 111 -46 588 -249 -77 454 -124 261 -13 -572
3013 -572 179 -57 -331 308 -352 -516 217 -348 65 326 -458 89 357 -342 500 235 -400 349 -90 73
3033 73 598 -451 -112 215 -427 161 60 -415 21 -248 -411 425 -218 -206 143 -262 123 559 -242 315
3053 315 208 -324 583 -18 -257 325 -481 -190 432 -144 -109 207 -629 308 237 -139 445 -103 -257 569 177
3074 177 -19 386 -374 77 125 -449 196 -71 -601 102 -37 -229 230 -282 -343 483 -182 488 285 -349 355
3095 355 356 -168 572 -57 -255 300 -329 -113 346 -561 -44 -62 -528 148 32 -455 266 -241 -207 697 -116
3116a16L40L51q43O04o2p50Q14m28k02O54o77o9N89n80K24N38p38M90P2n28P80
3137D63k54n02P86p60J98N16q44M59O6p06N56k1n07P16l87k46O74l50p1N98p37
3158c53N24M19p48N61l0n24Q44o28j06N66p20M9N05p61M47J62p03O55p5o54Q68
3179B98l67j72O62p11J06N36o67K88K87n34M30q4m70O09m31k34Q07p16K87K79
3199B03o10N31K84q10O93k7o62R53m07k87O47p05K95K59o91M19om80O34n6n65
3220c88P57o10k0L80j97Q7K42n65O31l7o81O77k39l13N66m03k56N92o57K16M56
3241B38o96M86J48o19Q54l21m93P76m40m1O43q29M80J36n31M27j64p72J006k42
3261D6l81O31m19j44O09n05J60K35l31M40p5n27N69k55k30N54o32P4N64o75J70
$$ plain form
3116 -116 224 575 -268 336 274 -476 338 -90 -292 362 -315 -384 205 -375 -151 387 -351 139 211 -317 463
3137 463 209 -293 493 -267 -69 447 -397 62 128 -578 -22 -43 -550 166 -221 -467 207 -143 -214 384 -353
3158 -353 171 590 -158 403 373 -151 693 65 -41 525 -195 -146 359 -402 45 207 -496 159 84 -570 298
3179 298 -69 -241 421 -290 -184 352 -315 -27 260 -274 156 72 -398 211 -220 -454 353 -363 -76 203
3199 203 -407 124 408 -402 291 264 -398 555 148 -139 508 -197 98 357 -334 85 79 -401 233 177 -388
3220 -388 369 -241 -261 119 -78 9 251 -314 317 280 -401 276 37 -276 290 -113 -369 223 -434 -218 238
3241 238 -458 28 176 -443 411 90 -403 373 -67 -108 535 -294 186 322 -209 218 54 -718 288 46
3261 46 -335 296 -123 -267 342 -163 -3 232 -99 341 266 -261 308 53 -177 377 -255 -181 383 -292 -122
3282a22L32p37O50j54m03O46l84l14Q42m79L01K76p58K83K45m83N48j39l72N75
3302C53n25R5N08p70J74K71l11J58K78n58N39k57j74M91l58p4L11m23K65M08o10
3323b09J87O1m46O03j14l88O16m79Q5N70o95K24M35q73N50J79n03N79l24k33N67
3344C92m07j62M79n50J01L72o36N40j4n78N63k78J7N13n05O2O20p05L89K08p22
3365c01N60j71l27N89k70m51N65l83K07J56o69L94L56o96P22j0n83N94l47%O96
3386F31o59k53N26l87L50o3n73N38j48l62O06j92l02M69m39J08L31m39L96P9n99
3407c82O48j55k57O00o22ON53p03L07J42n05M47Q8m25N24k90k94P03l22L2L75
3428D70o57pN06m82J69L30p75N24j08j83M95o28pM27m63L44K78o97N93Jl50O10
$$ plain form
3282 -122 210 -527 123 -31 -434 212 -172 -486 356 -123 178 454 -304 -21 224 -259 289 150 -222 353
3302 353 -172 -77 431 -339 -165 106 -205 -47 231 -327 212 -45 -219 272 -86 -160 151 -272 -7 401 -209
3323 -209 -22 39 -407 196 82 -306 310 -169 -84 486 -209 15 450 -423 127 306 -197 382 58 -175 392
3344 392 -15 -177 302 -248 -147 225 -411 129 115 -463 100 -178 -161 352 -153 -91 529 -176 213 421 -301
3365 -301 259 88 -239 350 80 -371 194 -189 18 174 -495 -101 255 -441 281 271 -312 282 -65 -65 631
3386 631 -28 -281 245 -142 208 145 -428 110 -38 -400 206 14 -288 181 -258 -150 181 -258 138 217 -382
3407 -382 266 111 -146 454 -168 -162 391 -312 -5 137 -368 79 167 -258 266 -24 -318 385 63 95 470
3428 470 -187 -194 312 -170 -1 329 -446 78 -30 -213 282 -346 -353 74 -389 -45 233 -464 129 130 -220 390
3450C90l30l00N69m89P2N56o66L28N2n24M71P7m35M16l09l21P71l99J19L14o51
3471b89L66L23o75M44j40k08N27j92m56O58o34O8K25k19K77m1n66O52kl60O96
3492D54l89m77P68m27K70K71q96L39L92o84O05j34l72K75j43p5N10l95j20N26
3512B98n38M77L3n71M74L4l46N49k47n14N97m75K00L78n53K41J28o70O49o3n34
3533d53O73l62%N90m50J71L2l34N10O4q38O15k11m45P90n24rN45o36JM10m23L32
3556D8K00n13M92k69k75O33o08K11L86n17J78L19n86K85J28m19O01l57k92P53
3576C98n74j35N25n15K66K80o05N15j9l51M50k97rM87m94k98P17n74K01K70n20
3597b82K78Lm01N56k10q6K30l51R3N27n22J42J90n22N88p9k89K76l10j48N66m26
$$ plain form
3450 390 60 -240 329 -160 -88 468 -198 130 182 -342 129 206 -229 187 -122 -443 328 -71 48 362 -289
3471 -289 77 400 -275 169 29 -179 348 156 -300 358 -276 -208 17 -202 75 34 -532 120 118 -242 454
3492 454 65 -412 356 -71 199 470 -426 -87 305 -379 226 92 -280 -5 -148 -223 287 -108 -228 298
3512 298 -240 237 270 -301 173 207 -139 410 163 -351 246 -229 -29 349 -204 37 165 -505 144 81 -453
3533 -453 220 -142 -142 448 -2 169 201 -133 377 441 -397 218 7 -438 352 -172 -181 364 -272 -271 139 -284 48
3556 48 248 -265 227 -42 -317 316 -292 -81 305 -212 -34 285 -301 -16 112 -307 294 -63 -355 398
3576 398 -176 -311 214 -301 -35 245 -360 155 136 -215 235 -62 -71 416 -78 -376 341 -233 -32 238 -282
3597 -282 -4 -1 -402 154 -56 -142 88 -263 -170 357 -165 -23 167 -355 233 154 -135 141 -169 -317 249 -177
3619a77P8L79n60L65K90o77O33k87k16N34l31r4M81l98r5N25p24N69K3n79N03
3640B42k78k43M51n16P1M79n24K90L24p28M97P2m36M86m5k14J87r8k05N09o60
3661c39M22j2m78N40m7l25M24j68o0L10k42q8M76m35K34J00n61L95J91n89N74
3682C22k89l11M49m98j9N34l75J85K6k41J79J24l92M92o5k36L10k58k4M66o07
3703b28J23M21o47M35m9l81L98j02r7K78l84J44M27m48M70J17r01P07n8m19M21
3724B27j71k91M95k87j04K75m32J93J91m99M51P7l18L21r2j16M59m86l4M75n13
3745a79K16J34l11L12k90j90N21l71l9M27l47K19J72o07M54J08k69M60l64k51
3765a95M75j66q2K36l28o7M29n96L02J24l35K42j31l4J00K3k02L68j86j58L35
$$ plain form
3619 -177 -99 280 -280 85 375 -302 331 44 -172 362 31 -63 418 20 -75 450 -274 295 318 -261 242
3640 242 -36 -279 172 -344 -273 206 -318 -28 296 -432 65 137 -299 187 142 -72 115 17 -188 321 -339
3661 -339 83 71 -407 133 86 -239 185 17 -43 267 25 -63 413 -22 212 312 -249 146 337 -252 322
3682 322 33 -278 171 -327 -346 188 -187 -2 24 -217 -38 86 -306 186 121 -115 195 -63 -87 379 -228
3703 -228 -105 316 -331 104 55 -326 72 -30 -127 151 -233 -89 338 -110 360 477 -424 283 225 -194 227
3724 227 56 -235 260 -27 -131 144 -288 -95 96 -403 48 125 -193 128 36 -80 379 -107 -141 334 -179
3745 -179 37 171 -140 172 -118 -308 213 -158 -197 230 -117 102 274 -333 121 229 -40 420 56 -195
3765 -195 280 114 32 268 -60 -127 302 -294 8 132 -203 39 -92 -126 -26 -3 -205 163 -23 -181 154
3786A54l74L86r0l12N36k22k99M28m24m1L71l01oL18n00M43j04j74M05j27l69
3807c02O97j44l17L71m53K61K2l38K11m9j66L80k27K8K31m74K45J12k84K38K98
3828C40n04M39q1l07M44l37j38K87j76oL25n02K76O5m12M04q1m28N87k84r1N80
3850D00n10ML80n04M78j6m20K92j44k05N09j02l82M73o35M59M4k90K39K39n10
3871b01M31p0j78K17k97K1L33l09j2N7k45M56j21l71L94mm27N39l52O6L96n43
3893b20P0L06l98N32j23m27N54k75r7K89k45j81N32n18K39J74m61M16k58l1L17
3914A95k13j90O05m67jN03n24K26K34n47M52p4m41L16j67j13L89k83K6K73l49
3935a50M8L37k44J33k1j59K37j30k17L88m56J69K55n61L00J05m26N90j34j66L65
$$ plain form
3786 154 -220 166 76 -236 300 78 -221 207 -217 -258 113 -188 -194 124 -376 67 -37 -211 194 67 -302
3807 -302 395 251 -66 305 -148 113 135 -203 8 -41 -207 173 -54 -26 205 -269 -24 88 -196 42 340
3828 340 -164 275 194 -113 331 -6 -144 143 -33 -39 286 -216 60 125 -287 117 36 -392 195 -89 -180 400
3850 400 -110 -106 274 -230 248 232 -188 104 -40 -245 264 162 -220 253 -382 77 121 -169 70 309 -201
3871 -201 230 160 -18 199 -98 -77 256 -53 -65 -8 -253 203 82 -289 105 101 -326 213 -139 -73 323 -220
3893 -220 -150 156 -242 290 167 -260 294 19 -78 211 -34 -215 317 -201 38 212 -249 167 -91 -122 195
3914 195 -18 -208 397 -70 -71 432 -92 134 368 -179 273 199 -242 74 -93 -206 183 -100 -74 199 -150
3935 -150 -102 235 -9 124 103 -56 181 51 -166 222 -234 -65 190 -371 -71 34 -392 198 64 -102 263
3956B63l54R4R8j96P0K26m56L44M7l25K10Q4m24N36l56m3M31n87J71K73k88K94
3978A12O1m15M62k52K3L02l19o5L98m54J69N3l51J89J82l50L47k0l32L90k60j14
4000b44O46m65jK12m18M99O1n09N55l45j77M28l25j87K90p5l5K98l31J39K23n01
4022b62M01m1l05N47n55L5L01k69N1J4k25M07k4j37J10j01j23N81n36J13J38m1
4044G9j9jj63L05j29l91N72j89j53L74l14j07K11k44L8L38n41L85k6j72L67k96
4066g6j41K99k30M3K58l31J54J55j77L38k49k38L21q0j73L09k12J11M1l74K55
4087CK80m91L11j70M9J94k63P4K68l78J96J0j96J89L0k87L66j98l6K86k69j02
4109a34J71l21O3M21n88L92P9k22L52k98N8K94l01k10N50n17K63J11k53J25M6
$$ plain form
3956 263 -91 3 101 -95 -25 201 -255 89 136 -189 21 105 -319 217 -139 -182 249 -338 -167 106 -182 112
3978 112 173 -242 220 -32 -9 293 -26 -91 307 -147 22 75 -276 -87 95 -255 92 72 -260 130 -130 -244
4000 -244 402 -63 -64 148 -270 229 290 -219 336 -9 -186 242 -83 -270 20 -55 -90 208 -123 16 239 -262
4022 -262 139 98 -207 340 -215 -180 121 -148 -97 -83 -308 99 75 -62 48 -53 -176 405 -131 -18 120 79
4044 79 60 59 -104 201 72 -319 253 64 -89 285 -29 -136 75 -169 -131 207 -334 51 25 -147 220 -76
4066 -76 -217 82 -148 -105 153 -178 -24 131 -46 292 43 -195 126 46 -127 182 -30 81 122 -252 3
4087 3 283 -208 103 -67 -18 176 -87 -13 255 -123 73 83 -113 76 106 -181 185 -13 -49 237 -32 -134
4109 -134 37 -284 -221 200 -388 4 83 -139 213 -85 -27 267 -34 -244 306 -211 52 163 -90 35 81
4130H1k89L01M4k23M00k84l7K75m78L08Q4l79L78j14l32N43k57j59L16l65K42
4151E5J77m72J98j5k29M41j86o5K58j82l19O14k36k11L31p3K5J96l21J49R5n68
4173c38M16j7k36J61k19J17L49l57K21J30m34L44k24kJ80k4k16L05k17R2p8j37
4195a84J08M6k02K99N9l52M57l46m5K47j60R1J88k51P5K24n25N16p6j69L89k87
4217A02l39K69m8j10K18j41M8j5j61L36j4l17M87m66J6K69l73J87K21k62J86j16
4239b3r6L28k64j73M13l28m4L20l44J84K18o40N72m8k08L47l30N3J43j79K39J36
4261B76n24K37Q6k17K42j51p5L05l01Q0J83k26Q5J32m10M06J48m64K10J15k62
4282a25K89k50J12J77m24l7L62k24k5L78m22K15J4l21L31k27J09M40n23J42L24
$$ plain form
4130 81 -208 93 137 -86 314 30 -7 268 -210 98 182 -197 181 67 -265 278 21 -138 178 -187 55
4151 55 232 -240 -42 -57 -286 155 -31 -96 162 -20 -339 275 39 -172 159 86 111 307 -14 135 230 -338
4173 -338 78 61 -175 -14 -233 -116 233 -124 97 227 -207 137 -87 -89 91 67 -149 156 -61 31 -47 -184
4195 -184 -76 -30 -232 67 126 -226 231 -115 -160 87 -73 18 206 -45 30 254 -271 245 169 0 389 102
4217 102 -237 32 -16 -126 92 -49 -1 -16 -177 159 145 -172 315 -151 -135 134 -239 -52 169 -93 93 -23
4239 -23 -119 209 -55 -228 185 -143 -187 133 -211 -27 191 -449 123 75 -133 214 -116 -63 80 -99 140 276
4261 276 -248 -11 75 -142 100 -51 -126 179 -122 -42 141 -85 0 132 -278 128 276 -188 22 137 -125
4282 -125 164 -86 26 203 -221 -258 104 -120 -145 233 -189 26 40 -281 50 -177 -68 372 -151 -9 315
4303C15n58K89M4j50J62l0k20L81k50j72M02l01J03K48l43K12N2l42L41j76j36
4324a29M08l50J01J96m47J51J03k13J4K29l17N55n81N6M33k99K94N7l01J5K12
4345A87l16J19r3j20K45l0k16K08j16k00M25k24N7K6n0J02R4k31L03j40r4K89
4367B25m00K89l2o1n7K20l63J99K7j53K08j24%jl9J52N0l56K42J76m12L67L6l03
4391a10K87j92k5J75k68o0K62j56m3J12l18N64k07k54L08q6P0J02k45O3J98k71
4413i4J86Qk67K89j73j2J89l70R8K34k36J06J37k81M29k45%J62j00j64M05k48
4435E3k63M37k56j20K49k36Q8P3o3L0J50k30K63k98n2L24j30J3K12k96J64P9l81
4458a90L76k59j21K58R9k79L45l42O3K66m23K62j57K5M97m85P4J10j50P0J50l91
$$ plain form
4303 315 -243 46 90 -60 102 72 -148 233 -17 -189 213 -88 15 263 -80 132 184 -158 183 7 -129
4324 -129 279 -71 30 226 -221 -70 33 -180 -166 63 -254 301 -280 -224 209 -90 204 261 -40 -25 187
4345 187 -129 -10 -103 -223 22 -8 -224 -16 -132 -332 93 -131 -74 -48 -98 4 98 -133 170 30 -64 225
4367 225 -175 114 82 21 -36 184 -179 20 47 -106 102 -22 -22 -23 -62 90 140 -216 26 202 -210 157 193 -110
4391 -110 177 -15 -40 135 -133 -193 69 -87 -130 -18 -336 228 21 -233 75 -11 59 161 -84 -21 177 -94
4413 -94 92 100 -167 122 -51 -63 126 -244 -146 88 -148 -42 95 -186 243 -2 -2 160 60 -104 301 53
4435 53 -210 227 -29 -149 100 -136 -48 25 -38 -8 142 -88 175 -123 -175 149 19 32 244 -52 112 191 -190
4458 -190 186 -73 -194 64 163 -116 229 -113 -50 216 -207 55 -102 -77 420 -65 9 119 -31 39 189 -202
4480b02J73J30l02K14J3j82K38j82m7L11j38j50L11j86J47o0k99K45P7k07J88
4501I2j19r7M09m16K07k4k04J23J01j49J80k07J8J63n0k25M55k28j79M03l25K34
4523A62j49j53J76J62k35J64k82j8L54l19R6J97k68L01Mk71K04o0j30K71m59R1
4545a62K32k45J79J52k85J98J08k78J97k4l16L70j30q5J51j51J73n1j25K81rk26
4567d6J48j79p1L67j89n7K92k25J90o7l05J8J28n4J86j36k89M88j34k33K65r0
4589Gl5L53m65L21m8l73M02k61J78m3j00J02J29n11L89J00m22N53m0m32M06k21
4611a1j97M40k50L5j1q5Q3J23l55K79%m04L92j84j69N17j35P9J04m82L90m7j17
4634eR4L8j88L31l24M8J85l65k0K61l14L44n5k01K89K6k66L11m77K13L23l12Q9
$$ plain form
4480 -202 -29 101 -201 13 26 -156 82 -100 -147 164 26 -124 187 1 148 88 -211 34 111 -96 92
4501 92 -27 -124 285 -131 76 52 -152 -29 72 -77 103 -104 -86 77 27 -198 257 29 -150 253 -72 162
4523 162 13 -140 36 198 -37 127 -155 -173 181 -138 -42 155 -113 188 192 -79 125 65 -65 206 -253 -162
4545 -162 70 -175 4 156 -129 69 177 -101 96 72 -244 126 -4 -89 62 -89 84 33 -92 189 180 -46
4567 -46 102 -77 -148 219 30 -27 265 40 230 163 -142 -124 4 -50 136 0 -289 199 65 -168 97 7
4589 7 -28 325 -140 181 133 -240 162 -99 79 36 -64 38 167 -344 45 145 -277 276 236 -196 210 -11
4611 -11 -208 232 -18 17 6 -79 4 127 -228 51 51 -353 39 -145 -314 203 68 147 251 -231 159 112 -5
4634 -5 89 127 -61 270 -54 -6 179 -186 -206 55 -259 85 30 -171 118 144 -122 189 -288 -75 248 -64 25
4657B5J8l4J8O5m08L75n5j77K86j56k03L35j38k0Q9k34L31j0j75K28j37j82L87
4680B28l08P2P3ql7Q8k90K05j00j52K17q3j22L48k08J52J83k80q8J43J1J01m6
4703I9l39M73l65m2K38oj64J58j71J17J08j92O3N0p4K97j96q8K37j41JJ90k42
4726A1O7J9k74K60k0l09L88j60j43K05j39J1J75k06J12L58m16J33Lj87K64k17
4748f5l6K62k15K8J53k48J85j12l6R6J8k31L14j55j89K57Qj84L65k90Q9J69l11
4771a28J08j6o8J94j98O7L1j27P6k1m8K33j55mJ56l8k16L79o6j02J60k26m0Q7
4795C8j41L02p5j63J04j2k17J10n9J24J32o7Q6j25j25K43n5j19J66p7j42K54r7
4818H5po8o3L7O7k01Q7K28l01K86l8j55K61k89KK08j55K56o8l21L72j36n9J29
$$ plain form
4657 25 43 9 27 92 -316 59 4 -173 113 -43 -246 89 -49 -69 20 -214 117 107 -68 160 23 -159 228
4680 228 -80 -8 65 57 20 108 -182 23 -77 -229 -12 -95 -217 131 -77 75 258 -22 -110 33 44 145 99
4703 99 -240 233 -132 -174 64 58 -106 52 -119 -2 106 -86 -23 27 -47 250 54 -34 203 62 63 253 11
4726 11 78 97 -177 83 63 -246 142 -18 -161 44 -95 -84 91 -115 -3 355 -61 72 75 -112 152 -65
4748 -65 -101 161 -54 -26 127 -121 64 -48 -84 12 30 -201 113 -42 -231 26 34 -150 215 -75 14 183 -128
4771 -128 -20 -36 -104 90 -108 -41 -10 -137 -61 -82 -130 103 -52 -56 100 62 -154 225 159 57 217 -9 -49 38
4795 38 -103 199 124 -39 65 53 -164 -54 -113 11 143 76 162 37 -88 155 100 -19 147 70 -72 182 85
4818 85 78 10 -53 -16 51 -150 -63 165 -136 150 112 -43 218 -71 -69 139 -16 240 172 -149 223 87 28 157
4842A57j31j80K33j7j26P8j94J65J47k80mJ38l4J48n3J3l8j76J73N3l36L05j5
4865B6j36J51p0l5M60l49k42J84j11J32O8j53J91Nj12L97l64j81K46k38R9R9j37
4888g0P6mk44L44Jk26K15n5k34L79k15M9J94k23n4L49m29rJ02j61K13R4k34J23
4912a9N1j81K09k58K78Jk29J58O5k5j25P5Q9M9k56m7K63j55J54l4q1L0P6j06J51
4937A33k29k8K24j54K09j08j02Q6J74l62J36K2N5q6n1L1L36j78j00n4o9J8N0l3
4961h0R5J26k76K48o7q8R6j08J19J07l39J66J82l61M14j11j22R8k71M6J98m9q7
4984f4K24o7L1j03L3O2j20M6J45n3r8J97k36q3K29k32J75mk36K42k24O0L2q7J25
5009fJ27j20j9K17k31J52j17j78M31k52l6j0p9J42R0k08K16m3l29M63q5k10L16
$$ plain form
4842 157 26 -154 79 62 -64 14 -180 -15 132 -148 -152 -14 -48 100 47 60 22 -154 19 72 -264 41 26
4865 26 -110 41 -29 -64 396 47 -195 -11 -122 10 78 -75 116 121 9 406 42 -139 107 -131 -32 67 -70
4888 -70 6 2 -242 102 103 -123 92 37 -197 182 -33 16 210 -13 -67 282 -147 -156 -54 -215 -2 92 -142 -19
4912 -19 32 -149 60 -198 80 81 -148 10 75 50 -75 0 89 138 -118 -165 98 -57 97 63 -18 12 88 -18 133
4937 133 -96 -124 100 -54 155 47 -55 31 205 -157 -21 1 56 -30 -81 -50 286 108 8 -46 -115 -97 -47 -80
4961 -80 15 141 -135 113 46 -42 54 -54 65 172 -167 -1 181 -180 234 123 1 99 -172 -126 72 23 -64
4984 -64 160 93 124 21 54 116 -4 42 187 134 36 233 -3 -86 143 -89 86 82 -154 88 -136 -76 -44 -131 -6
5009 -6 121 1 -18 199 -32 120 3 -175 256 4 -32 -42 -121 21 111 -97 119 76 -253 210 125 -85 231
5032B31r9r3Ll5M8M5l28J77K23l57J60J95k13j0m1j9K99j08j41K05j23M6p0j41
5056a46J84r2O4J14k8%pk63J2K58k80J97J38j01P9L0k11K40j80P4J05o2j47O1
5080C9qJ82J3k18J23r1j53K33k20J0J91l07J32J38j49JL5j92L38o1j43P8J22j88
5104i5J85j16j8J7j59K03K48k76j2L4k79L08j57R4J54j78p7K22k20J95k4k78L93
5127A64o1j88M7n9%l9r3L25J7k37pJ38k40J81K7N6K43l67m5L84l16Q1L1j99K26
5152F9K9k12J04J12j42K9R3j67N4K2J4K18k35J22R0j53K6j07J7J45j35j75J95
5175A3o3J42j07J65j42Q8k16J46mn3J65m22K39J65k83K54l3r8J17M9l52L03k48
5198a75Q9J57r5m8J26j71J07J5j04L4J68k59K77k48R5J64j69j10J70R6k46K26
$$ plain form
5032 231 132 39 42 7 55 100 -228 -51 172 -185 -25 170 -43 -53 -94 -113 186 78 -63 142 19 65 -5 -146
5056 -146 38 -54 10 124 96 96 89 -174 -162 96 -184 13 151 50 129 159 -52 188 8 82 187 125 -22 39
5080 39 31 213 226 8 131 40 -113 120 -100 -90 101 -206 -74 64 -85 -84 -49 -241 97 36 -107 -29 93 -95
5104 -95 90 -26 -44 -27 -186 17 265 -11 -23 11 -268 40 -117 -23 131 -47 -124 98 -122 73 49 -229 164
5127 164 103 -85 -38 -97 -97 -136 -229 96 113 -124 -131 7 -233 -52 -25 31 274 -93 -138 246 -70 11 42 -157 69
5152 69 98 -114 -10 102 -40 -11 82 -85 -31 -9 5 223 -12 110 200 47 73 -34 -17 128 -7 -182 13
5175 13 -50 92 -15 150 8 96 -120 26 22 -31 134 -288 -49 116 -167 87 54 -44 73 122 -230 73 -175
5198 -175 -86 71 -24 -72 54 -117 -10 5 -99 -65 103 -156 121 -127 -32 132 -37 -147 23 119 -127 99
5220I9j16q2L7q0K82l33J51p3lO0Rp6J49J79l73K44m5k3r4P0J3J49j6j16P5k20
5246a33J00J66j33M0Lj12j0J37o4K89n28L55l0k05J83Q5k98J98J17j68k9J46j22
5269a3N2n0Pq0j46L94n7k28K01p3%jJ01q4RK1J7J0k04J99l1k50L23l8k04K32j98
5296i1K6K69l76J84P3j89K79j37Nj03nJ03J43j18j61M7q1J48J89k35j3n0M6J70
5320A23j84o6J64j19J67p4Q6j18k8Q4j03j33K40J22j23n9J06k16L3J38j79J55
5342A6%p5P7M7j79J20M7o3R5k24J95J45j81q8p0J93M9k20P3J36k03q0K37j18M1
$$ plain form
5220 99 -17 -99 -62 -142 140 -193 -42 -115 -118 -58 -49 -125 24 203 -170 74 29 6 -88 -18 -5 144 128 12 87 -133
5246 -133 -33 133 0 40 43 -69 -79 58 -6 283 -245 110 80 -125 58 143 -155 43 160 -8 -37 109 -13
5269 -13 39 -11 -4 -84 -230 164 107 -121 80 7 7 6 107 23 32 53 70 80 -124 75 44 -206 117 79 -125 107 -91
5296 -91 -65 204 -172 12 85 -104 175 38 43 -60 -65 38 181 63 -98 -51 -132 16 205 -30 -43 -93 -47 123
5320 123 -61 -127 37 -82 85 11 97 -21 -49 35 -68 -201 39 161 38 -21 85 -131 -98 40 -139 16
5342 16 16 -59 18 65 -114 6 53 -10 85 -139 56 201 20 -68 -138 55 104 -116 -43 93 -110 -190 47 -71 -30
$$ [...]
8191e3
##END NTUPLES=NMR FID
##END=
