##TITLE=1H_114-2023
 CDCl3
 8 sc, 
 23.11.2023
##JCAMPDX= 6.0         $$ Bruker NMR JCAMP-DX V2.0
##DATA TYPE= NMR FID
##DATA CLASS= NTUPLES
##ORIGIN= UXNMR, Bruker Analytische Messtechnik GmbH
##OWNER= root
$$ XWIN-NMR		Version 3.5
$$ Thu Nov 23 15:30:59 2023 Russian Standard Time (UT+4h)  she@DPX200
##.OBSERVE FREQUENCY= 200.1313
##.OBSERVE NUCLEUS= ^1H
##.DELAY= (6, 6)
##.ACQUISITION MODE= SIMULTANEOUS
##.ACQUISITION SCHEME= undefined
##.AVERAGES= 8
##.DIGITISER RES= 18
##SPECTROMETER/DATA SYSTEM= spect
##.PULSE SEQUENCE= zg30
##.SOLVENT NAME= DMSO
##.SHIFT REFERENCE= (INTERNAL, DMSO, 0, 15.7039)
##AUDIT TRAIL= $$ (NUMBER, WHEN, WHO, WHERE, WHAT)
$$ ##TITLE= Audit trail, XWIN-NMR		Version 3.5
$$ ##JCAMPDX= 5.01
$$ ##ORIGIN= Bruker BioSpin GmbH
$$ ##OWNER= she
$$ F:/spectra/data/she/nmr/H-F/1/audita.txt
$$ ##AUDIT TRAIL=  $$ (NUMBER, WHEN, WHO, WHERE, WHAT)
(   1,<2023-11-23 15:29:37.78 +0400>,<she>,<DPX200>,
      <created by zg, POWCHK disabled, PULCHK disabled
       configuration hash MD5:
       00 E9 B6 7A A2 85 ED C7 34 08 36 98 17 FE 4E 26
       data hash MD5: 16K
       31 46 39 95 A2 2A 89 D7 D3 D8 6A 48 6A BC FA 54>)
$$ ##END=
$$ 
$$ hash MD5
$$ 68 B5 27 C6 C6 F3 C7 91 B4 28 D3 67 B5 C4 CC 7C
##$RELAX= 
##$RELAX= 
##$RELAX= 
##$RELAX= 
##$RELAX= 
##$RELAX= 
$$ Bruker specific parameters
$$ --------------------------
##$DU= <F:/spectra>
##$EXPNO= 1
##$NAME= <H-F>
##$PROCNO= 1
##$TYPE= <nmr>
##$USER= <she>
##$AMP= (0..31)
100 100 100 100 100 100 100 100 100 100 100 100 100 100 100 100 100 100 
100 100 100 100 100 100 100 100 100 100 100 100 100 100 
##$AQSEQ= 0
##$AQ_mod= 1
##$AUNM= <au_zg>
##$AUTOPOS= <>
##$BF1= 200.13
##$BF2= 200.13
##$BF3= 200.13
##$BF4= 200.13
##$BF5= 200.13
##$BF6= 200.13
##$BF7= 200.13
##$BF8= 200.13
##$BYTORDA= 1
##$CFDGTYP= 0
##$CFRGTYP= 5
##$CHEMSTR= <none>
##$CNST= (0..31)
1 1 145 1 1 1 1 1 1 1 1 1 1 1 1 1 1 1 1 1 1 1 1 1 1 1 1 1 1 1 1 1 
##$CPDPRG= <>
##$CPDPRG1= <>
##$CPDPRG2= <>
##$CPDPRG3= <>
##$CPDPRG4= <mlev>
##$CPDPRG5= <mlev>
##$CPDPRG6= <mlev>
##$CPDPRG7= <mlev>
##$CPDPRG8= <mlev>
##$CPDPRGB= <>
##$CPDPRGT= <>
##$D= (0..31)
0 1.2 0 0 0 0 0 0 0 0.06 0 0.03 0 0 0 0 0.0002 0 0 0 0 0 0 0 0 0 0 0 0 
0 0 0 
##$DATE= 1700738977
##$DBL= (0..7)
120 120 120 120 120 120 120 120 
##$DBP= (0..7)
150 150 150 150 150 150 150 150 
##$DBP07= 0
##$DBPNAM0= <>
##$DBPNAM1= <>
##$DBPNAM2= <>
##$DBPNAM3= <>
##$DBPNAM4= <>
##$DBPNAM5= <>
##$DBPNAM6= <>
##$DBPNAM7= <>
##$DBPOAL= (0..7)
0.5 0.5 0.5 0.5 0.5 0.5 0.5 0.5 
##$DBPOFFS= (0..7)
0 0 0 0 0 0 0 0 
##$DE= 6
##$DECBNUC= <off>
##$DECIM= 32
##$DECNUC= <off>
##$DECSTAT= 4
##$DIGMOD= 1
##$DIGTYP= 9
##$DL= (0..7)
0 120 120 120 120 120 120 120 
##$DP= (0..7)
150 150 150 150 150 150 150 150 
##$DP07= 0
##$DPNAME0= <>
##$DPNAME1= <>
##$DPNAME2= <>
##$DPNAME3= <>
##$DPNAME4= <>
##$DPNAME5= <>
##$DPNAME6= <>
##$DPNAME7= <>
##$DPOAL= (0..7)
0.5 0.5 0.5 0.5 0.5 0.5 0.5 0.5 
##$DPOFFS= (0..7)
0 0 0 0 0 0 0 0 
##$DQDMODE= 0
##$DR= 18
##$DS= 0
##$DSLIST= <SSSSSSSSSSSSSSS>
$$ [...]
##$SUBNAM2= <"">
##$SUBNAM3= <"">
##$SUBNAM4= <"">
##$SUBNAM5= <"">
##$SUBNAM6= <"">
##$SUBNAM7= <"">
##$SUBNAM8= <"">
##$SUBNAM9= <"">
##$SW= 18.0517328524113
##$SWIBOX= (0..15)
0 0 2 0 0 0 0 0 0 0 0 0 0 0 0 0 
##$SW_h= 3612.71676300578
##$TD= 16384
##$TD0= 1
##$TE= 0
##$TE2= 300
##$TE3= 300
##$TEG= 300
##$TL= (0..7)
0 120 120 120 120 120 120 120 
##$TP= (0..7)
150 150 150 150 150 150 150 150 
##$TP07= 0
##$TPNAME0= <>
##$TPNAME1= <>
##$TPNAME2= <>
##$TPNAME3= <>
##$TPNAME4= <>
##$TPNAME5= <>
##$TPNAME6= <>
##$TPNAME7= <>
##$TPOAL= (0..7)
0.5 0.5 0.5 0.5 0.5 0.5 0.5 0.5 
##$TPOFFS= (0..7)
0 0 0 0 0 0 0 0 
##$TUNHIN= 0
##$TUNHOUT= 0
##$TUNXOUT= 0
##$USERA1= <user>
##$USERA2= <user>
##$USERA3= <user>
##$USERA4= <user>
##$USERA5= <user>
##$V9= 5
##$VALIST= <valist>
##$VCLIST= <CCCCCCCCCCCCCCC>
##$VD= 0
##$VDLIST= <DDDDDDDDDDDDDDD>
##$VPLIST= <PPPPPPPPPPPPPPP>
##$VTLIST= <TTTTTTTTTTTTTTT>
##$WBST= 1024
##$WBSW= 4
##$XGAIN= (0..3)
0 0 0 0 
##$XL= 0
##$YL= 0
##$YMAX_a= 161609
##$YMIN_a= -169308
##$ZGOPTNS= <>
##$ZL1= 120
##$ZL2= 120
##$ZL3= 120
##$ZL4= 120
##$ABSF1= 10
##$ABSF2= 0
##$ABSG= 5
##$ABSL= 3
##$ALPHA= 0
##$AQORDER= 0
##$ASSFAC= 0
##$ASSFACI= 0
##$ASSFACX= 0
##$ASSWID= 0
##$AUNMP= <proc_1d>
##$AZFE= 0.1
##$AZFW= 0.1
##$BCFW= 1
##$BC_mod= 2
##$BYTORDP= 1
##$COROFFS= 0
##$CY= 11.3945322036743
##$DATMOD= 1
##$DC= 2
##$DFILT= <>
##$DTYPP= 0
##$F1P= 15.7292609196834
##$F2P= 12.9074282941183
##$FCOR= 0.5
##$FTSIZE= 0
##$FT_mod= 4
##$GAMMA= 1
##$GB= 0.15
##$INTBC= 1
##$INTSCL= 1
##$ISEN= 128
##$LB= 0.24
##$LEV0= 0
##$LPBIN= 0
##$MAXI= 10000
##$MC2= 0
##$MEAN= 0
##$ME_mod= 0
##$MI= 1.114404
##$NCOEF= 0
##$NC_proc= 0
##$NLEV= 6
##$NOISF1= 3.799351
##$NOISF2= 2.8
##$NSP= 1
##$NTH_PI= 0
##$NZP= 0
##$OFFSET= 15.70392
##$PC= 1
##$PHC0= -24229
##$PHC1= 10.45269
##$PH_mod= 1
##$PKNL= yes
##$PPARMOD= 0
##$PSCAL= 0
##$PSIGN= 0
##$REVERSE= no
##$SF= 200.130013532006
##$SI= 16384
##$SIGF1= 3
##$SIGF2= 2
##$SINO= 400
##$SIOLD= 16384
##$SREGLST= <1H.CDCl3>
##$SSB= 0
##$STSI= 0
##$STSR= 0
##$SW_p= 3612.71676300578
##$SYMM= 0
##$S_DEV= 0
##$TDeff= 0
##$TDoff= 0
##$TI= <>
##$TILT= no
##$TM1= 0
##$TM2= 0
##$TOPLEV= 0
##$USERP1= <user>
##$USERP2= <user>
##$USERP3= <user>
##$USERP4= <user>
##$USERP5= <user>
##$WDW= 1
##$XDIM= 8192
##$YMAX_p= 0
##$YMIN_p= 0
$$ End of Bruker specific parameters
$$ ---------------------------------
##NTUPLES= NMR FID
##VAR_NAME=  TIME,          FID/REAL,        FID/IMAG
##SYMBOL=    X,             R,               I
##VAR_TYPE=  INDEPENDENT,   DEPENDENT,       DEPENDENT
##VAR_FORM=  AFFN,          ASDF,            ASDF
##VAR_DIM=   8192,          8192,            8192
##UNITS=     SECONDS,       ARBITRARY UNITS, ARBITRARY UNITS
##FACTOR=    0.0002768,     1,               1
##FIRST=     0,             0,               0
##LAST=      2.2672688,     0,               0
##MIN=       0,             -169308,         0
##MAX=       2.2672688,     161609,          0
$$ Real data points
##PAGE= N=1
##DATA TABLE= (X++(R..R)), XYDATA
0@%%%%%%%%%%%%%%%%Kj0J6j6J6j6J7k4L1l2L6m4M8n5O3p1Q3r2J03j16J29j44J61
39H5j79K00k21K44k70K98l30L63l99M39m83N33n87O47p15P91q79R79j095J233
59F54j398J601j855K182k625L252m199N777q814J6510o6428r0943K81455j2370
73A22799j30158J61329k3711j75034J02955N0323j33947K6565M2473j32943L6211
84e3138J49089j36644j03185J76109k1045j08819J45676j3113j20581J59288J9860
95I3497j60501R4896L7201j44621P1531O3032j49459J4548J35286p0130o5883
106h0603J07642m156p7924R4076J2574j16505Q5702N0999j26525P6826P6692j46576
118d7778L7404J10513j09894j2300P8768q5718k2138R4349m0424o5094O5540J3932
$$ plain form
0 0 0 0 0 0 0 0 0 0 0 0 0 0 0 0 0 0 2 -8 8 -8 8 -8 9 -15 16 -16 20 -24 24 -31 32 -39 44 -48 55 -61 68 -76 85
39 85 -94 106 -115 129 -141 157 -173 190 -209 230 -253 280 -307 340 -375 416 -463 516 -579 654
59 654 -744 857 -998 1184 -1441 1811 -2388 3389 -5425 11085 -55343 -146286 135169 122799
73 122799 -7359 153970 130259 -44775 58180 108503 -25444 1121 43594 -89349 -53138
84 -53138 95951 -40693 -143878 32231 11186 -97633 48043 34930 -85651 73637 93497
95 93497 -67004 27892 65093 -79528 -7997 55035 -94424 -79876 55410 -14720 -80603
106 -80603 27039 22883 -55041 39035 51609 -64896 20806 71805 -54720 22106 98798 -47778
118 -47778 -10374 100139 -9755 -22055 56713 -29005 -51143 43206 2782 -62312 3228 17160
130A7160o2457N3204L2539j07411L0237R7640r4955j6375J01160o8151j2750J04214
142G4055p0194m4952R4081l6768n4789O7087j2277o0930M6453L0733n7846P574
154a7773N3095n1384j8945Q0138m1031n2940Q5280j8323n8304Q0284j7159p4865
166e1927P3839J2790p1507L5287J7876m8098K7007L5191m6637j4902N4239r459
178A3699m0301M6766j039o2007N5846K2528p8783M0934L6587p1656L5501M6188
190D4263o6877J0905M6309m1610o580L5298k5325k6557L5370J1605m0435J4812
202h822K8990m2269J7586M3876o0844k68O2006m5786p684N2452m6746j1596N7848
215C8743l1421l3641L4773n958k7231K1374J1461l5694N077M5241k6229j9999
$$ plain form
130 17160 -45297 7907 40446 -66965 -36728 60912 -34043 -50418 50742 -17409 -30159 74055
142 74055 3861 -41091 52990 16222 -38567 28520 16243 -44687 1766 32499 -25347 -17773
154 -17773 35322 -16062 -35007 45131 4100 -48840 36440 18117 -40187 40097 22938 -51927
166 -51927 21912 34702 -36805 -1518 16358 -31740 -4733 30458 -16179 -31081 23158 13699
178 13699 -26602 20164 19125 -42882 12964 35492 -43291 -2357 34230 -37426 -1925 44263
190 44263 -22614 -11709 34600 -7010 -13590 21708 -3617 -30174 5196 16801 -23634 -8822
202 -8822 20168 -22101 -4515 39361 -21483 -21751 40255 -5531 -13215 39237 -7509 -19105 38743
215 38743 7322 -26319 8454 2496 -24735 -3361 8100 -27594 -22517 22724 -3505 -23504
227b3504M8223k3252k8244O0606j8531m3865N2138p230l7504M4398o098m1946
239b4809K9310R531l0177O817J4463j8681m393L1361q189k9442L5444Q338l8655
252a9082L3775R057n0844L4104K1208m9179K0326J8997l8036J4531J8938k7358
264a3563n25J6579n419q209J1298P013j6673J2259K0412k8867M116K5776l2109
277g912M427K7706l7394M34L0215k8437q28K2011k0398j563J6999o890m901N779
291g52P100n262m022J5476r102j1169K3808j2032j6351K5708j3761j4454K6309
304A1496j4278j2263K1538j0560n490J4236p531N77M979k984M467m837K079O897
318H326j2634O253O085j6738J2088M883j8782J3557J548j4686J4784l302r926
$$ plain form
227 -23504 24719 1467 -26777 33829 15298 -28567 23571 16341 -21163 23235 17137 -24809
239 -24809 4501 14032 -16145 -9328 5135 -13546 -17939 13422 5233 -24209 11235 19573 -19082
252 -19082 14693 23750 -27094 7010 28218 -20961 -635 18362 -19674 -5143 13795 -13563
264 -13563 -14088 2491 -2928 -11137 161 7174 -9499 2760 23172 -5695 -1579 24197 -7912
277 -7912 -3485 24221 -13173 -12739 17476 -10961 -11789 10222 -10176 -11739 5260 -1630 -6531 -752
291 -752 6348 1086 -2936 12540 3438 -7731 16077 4045 -12306 13402 -359 -14813 11496
304 11496 -2782 -15045 6493 -4067 -9557 4679 -2852 -2275 2704 -280 4187 -650 1429 8326
318 8326 -4308 1945 8030 -8708 3380 8263 -10519 3038 4586 -10100 4684 1382 -8544
331h544J2918n487k351Q786r112M935L740j0497R127l204q910J3357o303n593
345g138J3165r372k26J1166r228L123K670q855R727l038n380J1168j0627j018
359c863J4947j4803m84J2067j4955N297Q030j5230O820N751p885P293k913m051
373c979N885l912M015j095r924J1412k660r094J7516r457j0032K3064r068r606
387f935J9199j0946o564J7557o988o454N612j986J122j830Q6j765j2830J0464
401b258O063j9257J0719N360j6988K0968N306k2972J6935N689j6433J4480j07
414G505j6546J0449O248p873k737K971J641p713O744Q347k1152O261K1715k0792
428d932M644J9635k6124N404K2873k4279l298J3394j6644J119J2084j1138n950
$$ plain form
331 -8544 4374 -1113 -3464 5322 -3790 1145 4885 -5612 3515 311 -8599 4758 -1545 -7138
345 -7138 6027 -3345 -3571 7595 -1633 1490 4160 -4695 5032 1994 -3386 7782 -2845 -3863
359 -3863 11084 -3719 -4203 7864 -7091 -1794 6236 -8994 -2174 3577 -4308 2985 72 -3979
373 -3979 1906 -2006 2009 914 -9010 2402 -258 -9352 8164 -1293 -11325 11739 2671 -6935
387 -6935 12264 1318 -5246 12311 5323 -1131 4481 2495 3617 1787 1873 108 -12722 -2258
401 -2258 3805 -15452 -4733 627 -16361 4607 9913 -13059 3876 9565 -6868 7612 7505
414 7505 -9041 1408 7656 -217 -2954 17 1658 -6055 689 9036 -12116 -5855 15860 -4932
428 -4932 -288 19347 -6777 -1373 21500 -2779 -6077 7317 -9327 -8208 3876 -7262 -13212
441a3212Q685O870n584m61J0251j1991l54K5292j8400j3514K8151j4102j1233
454i602K9034j8793j8412K7770p938j6176J6794l934j1840J3921Q743j1048k916
467d397J5482m354j1803J7811q315k2454K7634M13k7750K5231Q44k7325K7776
480H793M466l1625J4948J0972j7523P993R792j2955r77J6722j980j7371J1287
493B542N023k2453J6362J1530l3268J4285K1916k8708J1451J7355l1868R644K2720
506A6531k3812M35J8673j3302m184J9316q28j8288Q322J3788k0056Q29J7538k5808
520a0846q59K8823k6264p294K9217k3075o491L1090k0078j4595K5780m732j0453
533i777J5357k17j3349R674J4166j6768p554K0755j3661j3073K9898j1797k3013
$$ plain form
441 -13212 -4527 2343 -3241 -3702 6549 -5442 -5796 19496 1096 -12418 15733 1631 -9602
454 -9602 19432 639 -17773 9997 2059 -14117 2677 -1257 -13097 824 9567 -1481 -4397
467 -4397 11085 6731 -5072 12739 4424 -18030 9604 10017 -17733 7498 8342 -18983 8793
480 8793 13259 -18366 -3418 7554 -9969 -1976 7816 -5139 -6116 10606 8626 -8745 2542
493 2542 7565 -14888 1474 13004 -20264 -5979 15937 -12771 -1320 16035 -15833 -6189 16531
506 16531 -7281 -6846 11827 -1475 -5659 13657 12829 -5459 2863 16651 -3405 -2576 14962 -10846
520 -10846 -11705 17118 -9146 -16440 12777 -10298 -16789 14301 -5777 -20372 5408 676 -9777
533 -9777 5580 5363 -7986 1688 15854 -914 -8468 12287 -1374 -14447 15451 3654 -19359
546a9359L3606j538k2204K5088n499k3326K2941J740k1417Q759M836j1515L912
559c976J1333j0196j2793J6119K641j8133J6024L039k4604K3443J2745l0624J4378
572f04J4762k4887J2010J3321k3084L281J5287q675k340P934l183q366J0290P924
586A3670j9643J411J6602j7888J870J8856k3846p22K4730j9263m284J7820j8095
599h782m075J9385r022j1568Q285N988l279J051P624q154l152J9307p777j2654
613f823J9304r129j2670K5933q588k0798J9897j576j3872J1608l437j0263R702
626g12L747o439l70P637k005p925J3483M09k1089J4402R455k1062J0660O473k0584
641a3920J4322Q971k0476Q867Q090j3544O149Q985q951l689Q867N280r374J020
$$ plain form
546 -19359 14247 12709 -9495 15593 10094 -13232 9709 11449 -9968 -1209 3627 -7888 -3976
559 -3976 7357 -2839 -15632 487 3128 -15005 1019 4058 -20546 2897 15642 -14982 -604
572 -604 14158 -10729 1281 14602 -8482 -5201 10086 1411 -929 7005 3822 -4544 5746 13670
586 13670 -5973 -4562 12040 -5848 -3978 14878 -8968 -9690 15040 -4223 -8507 9313 -8782
599 -8782 -12857 6528 -2494 -14062 -5777 211 -3068 -2017 5607 -2547 -5699 13608 5831 -6823
613 -6823 12481 3352 -9318 16615 8027 -12771 7126 5550 -8322 3286 -151 -10414 -712
626 -712 3035 -3404 -3774 3863 1858 -6067 7416 7825 -13264 1138 10593 -10469 191 6664 -13920
641 -13920 402 9373 -11103 -2236 5854 -7690 -1541 7444 -1507 -5196 3671 8951 -423 597
655E97P303j2203M317J2343k0305Q24J8034j8923J387J8979j9194k482J8383j0668
669a608l349R589o513k088O851L08o347J076R241p768m383J4815j1317r723K1388
684A0172q614j3325J9660q560j0273K0185p469j2150J4663j807q449P684K087
697C804o164j02Q467j877r258R905J011j3402J2724Q35j7741J4552L044j7357
711a1559J4280K346j6360J1871M418j1425O843K727o030K106M482k25o193L744
725A025N859j0761L392Q484j5117M326J1398j6172L939J0354j4351N600Q549j2218
739e693M305O206o872K524K261j964n13m97L641l680l182Q519o914l893J1797
754F045r106l482J3055r863j944J2223r887l68R806p436M26M720m659J500P11
$$ plain form
655 597 7900 -4303 14 12357 -7948 -7124 10910 -8013 -6626 12353 -6841 -9323 9060 -1608
669 -1608 -4957 4632 -1881 -3969 2882 3190 -3157 -2081 7160 -608 -4991 9824 -1493 -11216 10172
684 10172 1558 -11767 7893 -667 -10940 9245 1776 -10374 4289 2482 -5967 1717 3804
697 3804 -2360 -2462 6005 4128 -5130 4775 5786 -7616 5108 5943 -11798 2754 5798 -11559
711 -11559 2721 5067 -11293 578 4996 -6429 414 3141 -2889 -783 3699 3474 -2719 1025
725 1025 6884 -3877 -485 7999 -7118 -2792 8606 -7566 -3627 6727 -7624 -2024 6525 -5693
739 -5693 -1388 4818 -2054 470 2731 767 254 -243 3398 -282 -3464 5055 -1859 -5752 6045
754 6045 -3061 -6543 6512 -3351 -5295 6928 -2959 -3327 6479 -957 -531 4189 -470 1030 1741
769A741q14N17m184M132O61p562P471n52q792J0040k349q464J1374k938o459R866
785C688l683k874P721m154n64L279l280K639j360k423M815m984K28N099q733L227
801a359N386r748M834L469r028O664J738o449O460j384l256O267l583L33L019
816C363n575L717N76n433N822k627l662P770n280k160P049o495J214O076p432
831c077K631L533m771N456q02m551N569l578j469M476o809J291L272p037M640
846a226O78o434P504o12m281P090l234j234P540m191R69L189o002M569J096o361
862i40M048l376l834O198n071k333M832n655L528M292o950M604K270m376O546
877C783k230l954O419l290N7M547o743J743L225o530L983o87o366O493j145k587
$$ plain form
769 1741 927 1444 -2740 1392 2053 -5509 1962 1410 -7382 2658 309 -8155 3219 281 -6178 3688
785 3688 5 -2869 4852 698 134 3413 133 2772 1412 -1011 3804 -1180 -952 4147 -4586 -1359
801 -1359 4027 -5721 -887 2582 -6446 218 1956 -4493 1967 583 -2673 3594 11 344 3363
816 3363 -2212 1505 2081 -3352 2470 -157 -3819 3951 -1329 -3489 3560 -2935 -1721 4355 -3077
831 -3077 -446 3087 -1684 3772 2970 -1581 3988 410 -1059 3417 -3392 -2101 1171 -5866 -1226
846 -1226 -548 -6982 522 -90 -4371 2719 -515 -1749 5791 1600 2569 5758 -244 4325 5421 -940
862 -940 3108 -268 -4102 2096 -2975 -5308 -476 -6131 -2603 1689 -5261 -657 1613 -2763 3783
877 3783 1553 -2401 4018 728 785 5332 -1411 332 3557 -2973 1010 323 -6043 450 -695 -3282
893c282O267m179k48O079m766K245J818o467N520M32n694N011l177k953O625n481
909b250k279L970n605L691L551o856M206K005k436O465k276l267N672l318R49
924B222K995p051L289K467n742M908j978o093P264k565l408N292n859R0O811m772
940b130J514K376n149M942O69l921L591l602k43N995n628J009L794o181M982J657
956C675q203M944J87m406O138l354l714O681k359M46L573n557K555K440l443M053
972C656k489l082O213m054j005L956p672J832M956p231K685J807n721P044J083
987A978m612N109k309o00O081m837o47K734m474L504J94n759L800j771j890N403
1003A904n502m08O297n156K623M160p021N191L064n488M908j517n148N950k014
$$ plain form
893 -3282 2985 -1194 -1442 4637 -129 2116 3934 -2533 2987 3419 -2275 2736 -441 -3394 3231 -2250
909 -2250 -4529 -559 -6164 -2473 1078 -5778 -1572 433 -2003 4462 2186 -1081 4591 1273 2222
924 2222 5217 -1834 1455 3922 -1820 3088 1110 -4983 2281 -284 -3692 1600 -4259 -4169 2642 -2130
940 -2130 -616 1760 -3389 1553 2222 -1699 1892 -1710 -1953 4042 -1586 -577 3217 -2964 2018 3675
956 3675 -4528 416 603 -3803 2335 -1019 -4733 1948 -411 35 3608 -1949 606 3046 -397 3656
972 3656 1167 -1915 4298 244 -761 3195 -4477 -2645 2311 -4920 -2235 -428 -6149 895 1978
987 1978 -2634 2475 166 -434 5647 810 163 2897 -1577 1927 2121 -3638 162 -1609 -3499 1904
1003 1904 -3598 -4006 2291 -2865 -242 3918 -3103 2088 5152 -336 4572 3055 -2093 3857 1843
1018A843k904K673m575P14K470l784K801j831k595O731k755j781N763n594J516
1033a308P666p570O67M967o106L848K135o963K972K1k264L988k950j642L023k583
1049b099L543j4m929O118j223l385P324m556l245P684n647j256O151p888J03N948
1065B629n356J29Q39k360L668j069n51K896l922L441L610n219M262K10n638Q251
1081E820j499p801O774j244m651N596l735k809M314l071R60J908l517K489j59
1096f25J28M364n737L38O079o231J710M344q009L398L092o574M394K76n270N585
1112A262l81l218K804j885K117J912m435L444l90l316N703k503l860O008m181
1127i19j321O792o123q73N398m622J534J979m345L001j89j631K668l299J31L660
$$ plain form
1018 1843 -1061 1612 -2963 -2249 221 -3563 -762 -2593 -5188 1543 -1212 -2993 2770 -2824 -1308
1033 -1308 6358 -1212 -545 4422 -1684 2164 4299 -2664 308 329 -1935 2053 -897 -2539 484 -2099
1049 -2099 1444 1430 -3499 2619 1396 -1989 5335 779 -2466 5218 -429 -1685 4466 -3422 -3319 2629
1065 2629 -2727 -2598 -1759 -4119 -451 -1520 -2071 825 -3097 344 3954 -1265 2997 3207 -2431 5820
1081 5820 4321 -3480 3294 2050 -2601 2995 -740 -3549 765 -2306 -1346 562 -2955 -466 -625
1096 -625 -497 3867 -1870 -1532 4547 -1684 26 4370 -3639 -241 2851 -3723 671 947 -4323 1262
1112 1262 881 -2337 467 -1418 699 2611 -1824 1620 1230 -2086 3617 1114 -2746 3262 -919
1127 -919 -2240 4552 -1571 -2444 2954 -1668 -134 1845 -2500 501 312 -1319 1349 -1950 -1819 1841
1143A841m091L206J042o633O181J815o627N858r30m698O322j972l583M235k908
1158i42l49K621l467J472R0j581L946k791q80M611m303K072M283p642L603M206
1174D949p750M353K205p928M231J430m808K863p00j530J908l96J470r44j284N115
1190C184k968j600O959o007j408Q458p145j609O938p527j54O767o848k99M073
1205H14l200Q07J451N1p8j122L765o41l861O133j706n810Q331l656o766R341l350
1222E03o402Q491l351m838P337j831k814L674j34p11M24J813Q69m596L846K105
1238D385p920M985K208r091N909K540r652O346K420p763N825J789n603L833J895
1253B106k538J086Q18O17k187M55L515n594M40N896p857N62P130q145J234O979
$$ plain form
1143 1841 -2250 956 1998 -4635 1546 3361 -3266 2592 1662 -3036 3286 1314 -2269 1966 -942
1158 -942 -1291 1330 -2137 -665 -575 -2156 1790 -1001 -1881 2730 -1573 499 4782 -2860 743 4949
1174 4949 -2801 1552 3757 -4171 60 1490 -3318 -455 -1155 -2685 -777 -1173 297 -647 -1931 3184
1190 3184 216 -1384 5575 -432 -1840 6618 -527 -2136 4802 -2725 -2879 3888 -2960 -3259 814
1205 814 -2386 -1579 -128 -77 -155 -1277 2488 1847 -2014 4119 2413 -3397 4934 1278 -5488 3853 503
1222 503 -5899 2592 -759 -5597 1740 -91 -2905 769 635 -76 348 2161 3030 -1566 2280 4385
1238 4385 -3535 1450 3658 -5433 476 3016 -6636 -290 2130 -5633 192 1981 -3622 211 2106
1253 2106 -432 654 1472 2089 -98 357 3872 -1722 -1282 4614 -3243 -2681 4449 -3696 -2462 4517
1269D517q121J588N598o194K034L394m021R15J207p00j6j110K530j422k785N586
1285C000l022l897P256l480m143P975m518k844P810m136k271N163l350q6K637
1300B094k476M16n1L24J444l215J929J628m899L613Q33o321N420O79n651N882
1316A649p14m704O027j253k872L670k009m40K175j763J522r49j100L174k935l37
1332h59L591n095J234M290o426K162L663n648L459J900n365L424Q64k776K501
1347I19j362n28J827j885K414k43l004M375j709k729N078l686j857N419m368q99
1363b238M593m266O81L361l597J275Q95j752K514j193m02K117l207J783J995m931
1379b372K727P64n003M140o6m108M937q47k133M259k380k24L128k636J133M46
$$ plain form
1269 4517 -3604 -2016 3582 -2612 -578 2816 -1205 -290 917 217 201 -909 1621 199 -2586 3000
1285 3000 -22 -3919 3337 -143 -4286 3689 -829 -3673 4137 1 -2270 2893 -457 -543 2094
1300 2094 -382 34 -17 307 1751 -1464 465 2093 -2806 807 1640 -4681 739 1418 -4233 1649
1316 1649 935 -3769 2258 1005 -1867 1803 -206 -646 1529 -234 1288 339 -761 2413 -522 -859
1332 -859 2732 -2363 -1129 3161 -3265 -1103 2560 -3088 371 2271 -3094 330 1194 -1582 919
1347 919 -443 -971 856 -1029 1385 1142 -1862 2513 804 -1925 3153 -533 -2390 3029 -1339 -2238
1363 -2238 2355 -1911 -1230 2131 -1466 -191 704 -1048 1466 273 -129 1988 -1219 564 2559 -2372
1379 -2372 355 1119 -3884 256 190 -3918 1019 172 -1961 2298 -82 -306 2822 186 1319 1765
1395A765k678K752j009j912L472l550q29L734m334R09K601m475K511K568l759
1410b234K955L07k148L540j640r06K471l370J011K316l968J824Q44l377L504q23
1426C06k832L548k045p34L572l132Q30K393k694K654J62l219L343j368k315L348
1442A817l306r56L926l228M69K287l590K110J646k684K030o19j053L525j819L1
1458E86K007l730K201J358m818K684j85l390M623r65l370M239q93j358L336k761
1474d36n96K081j510J093q89j383K889k022O9L146m416J160L522m645J914K485
1490B462m885L415J513m293K285L96k798K554p22j373P50p00K093k69j589L375
1506B214k077j085N045l974k012N202m250o09M495m833l34L979l573L51J777k334
$$ plain form
1395 1765 -913 1839 830 -1082 2390 -1160 -1989 1745 -2589 -1680 921 -3554 -1043 1525 -2234
1410 -2234 721 1028 -1120 2420 780 -126 2345 -1025 -14 2302 -1666 158 1002 -2375 1129 306
1426 306 -2526 1022 -1023 -1757 1815 -1317 -487 1906 -788 1866 2028 -1191 2152 784 -1531 1817
1442 1817 -1489 -2445 1481 -1747 -1278 1009 -2581 -471 1175 -1509 521 -98 -1151 2374 555 586
1458 586 2593 -1137 1064 2422 -2396 288 103 -3287 1336 371 -2999 1240 347 -1011 2325 -436
1474 -436 -1032 1049 -461 632 -257 -1640 1249 -773 -704 2442 -1974 -814 2708 -1937 -23 2462
1490 2462 -2423 992 2505 -1788 497 893 -1905 649 -73 -1446 -696 -1396 697 428 -1161 2214
1506 2214 137 -948 4097 123 -1889 3313 -937 -1546 2949 -1884 -2218 1761 -1812 -1461 316 -2018
1522b018J060P87M84L07j210K692K36l023L878j473m539N188j600m897N659k005
1538d74m025N431j067k897L653k82p74J393k24K94p60R99J899m264J648K267n494
1555b677L016K123o810L488K729o166L688K610n092K800K399k918J253R91n44
1570H90r17L74J979k806p49M215m062p98M981n166r92O246n124r68N693m402l31
1587a937M864k814j030K307o13j051O7J681j305k321M345j455m191N848j452m973
1603d030O453j809m980O302r23m094N008j003l317L499N30k096K96J206r5k192
1619a245K478Q47n110L793K091o598L879K404p211M738K880o836L208L089m588
1634b181K145K514l147L36J998o09j809J050J957m207J095M379o350M23O220o362
$$ plain form
1522 -2018 -958 -171 313 620 -590 2102 2338 -685 3193 1720 -2819 2369 769 -4128 1531 -474
1538 -474 -4499 932 -135 -3032 621 339 -435 958 734 1028 268 1267 3166 -1098 550 2817 -2677
1555 -2677 339 2462 -4348 -860 1869 -4297 -609 2001 -3091 -291 2108 -810 443 1434 890
1570 890 -27 347 2326 -480 -1229 2986 -1076 -1874 3107 -2059 -3051 3195 -1929 -2897 2796 -1606 -1937
1587 -1937 2927 113 -917 1390 777 -274 -207 1474 169 -2152 2193 738 -3453 2395 943 -4030
1603 -4030 2423 614 -4366 1936 1013 -3081 1927 924 -2393 1106 1636 -460 -164 1042 947 -1245
1619 -1245 1233 2080 -3030 763 2854 -3744 135 2539 -4672 66 2946 -3890 -682 2407 -2181
1634 -2181 -36 2478 -669 -333 1665 1056 -753 297 2254 -1953 -858 3521 -2829 -2406 3814 -2548
1650b548J24O215o254J34O292n203p95M848l126j205L202n74k243Q39K315k208
1666a87j356M328l134k828O566l675m003P523l285m261P590k939m200O294j165
1681A268l408L489K69k395J427J652j691k082L400r21m749M885k9o294N859J196
1697A876o902N792J808o255N089J747n350K993K088l890J077J736j433j839K008
1712E45R97m304K015K918n643K142M283o635K688M813o507J625N035n614P68M005
1728C131l998j26K632q91j443J015J355k668m96L778l933j440N895m042k413O672
1744C028l611k285O751l496k527N315k318k280L449q81j804K59J494j113j981
1759b000K903q60l922M549J56n035N438L83m657N350M39m689M315K56m012K575
$$ plain form
1650 -2548 -2424 3791 -2463 -2329 3963 -1240 -2035 2813 -313 -1518 1684 1110 -1133 -294 2021 -187
1666 -187 -1543 2785 -349 -3177 3389 -286 -4289 3234 -51 -4312 3278 339 -3861 2433 1268
1681 1268 -2140 1349 1618 -777 650 2302 611 -1471 1929 1008 -3741 1144 1115 -5179 680 1876
1697 1876 -5026 766 2574 -3681 1408 3155 -2195 798 2886 -1004 73 1809 376 -1463 545
1712 545 1542 -2762 -747 2171 -3472 -1330 2953 -3682 -994 3819 -2688 -1063 3972 -1642 -874 3131
1728 3131 -867 -993 1639 748 -695 320 1675 -993 -1489 2289 -1644 -3084 2811 -1231 -3644 3028
1744 3028 -583 -2868 3883 387 -2140 3175 857 -1423 2026 1145 -659 -400 1094 -19 -2000
1759 -2000 903 43 -3879 670 826 -4209 1229 1612 -3045 2305 2744 -1945 2370 2626 -1386 1189
1775A189r9k352N73Q13m11j457J227J447l335J857K825m802J964L672n282K265
1791I4L660n315J879L126m666Q32J827k831M13O94l59n02M47J956j202q93L104
1808B264k592j361M503l495j772N165l317j245M912l182j371L561k250q00J555
1823E75q81l56K17J008j92j831K416q8l076L430p20l827M614k10l765M720q29
1840A205l147M260o95k680J989l66j257N91j89J19j145R37J689l110J187K178
1856A566l920K050K365m730K620K606l746K286J457l531J723O58k306M25j81m2
1872g00n5k67J767j227o02L326k421j051L637l183m04M052l310k44L051l149N25
1889b55J848k874L13P25j183R06k91K47R32j264J909J08k490K946m27k746L440
$$ plain form
1775 1189 1090 -1262 -689 124 -287 -1744 -517 930 -2405 -548 2277 -2525 -561 3111 -2171 94
1791 94 3754 -1561 318 3444 -1222 -390 1437 -1394 -981 -287 -646 -1148 -701 1255 53 -840 2264
1808 2264 -328 -1689 2814 -681 -2453 2712 -605 -1850 3062 -120 -1491 2070 -180 -980 575
1823 575 -306 -662 -445 563 371 -1460 956 868 -2208 1222 502 -3325 1289 1079 -2686 2034 1205
1840 1205 -1942 2318 1623 -1057 932 566 -691 -100 -289 -170 -1315 -378 1311 -1799 -612 1566
1856 1566 -2354 -304 2061 -2669 -49 2557 -1189 1097 2554 -977 746 1404 -902 -477 -658 -700
1872 -700 -755 -1022 745 -482 -1084 2242 -179 -1230 2407 -776 -1180 2872 -438 -682 2369 -780 -255
1889 -255 1593 -1281 -968 -243 -1426 -520 -811 -564 368 -896 1013 1121 -1369 1577 1150 -1596 1844
1906A844j483k340L835j354j588K640j745o08J678j559K9K72j096J738q44l6K026
1923A409j846Q34J556k892J132J013k903K214P09k912K300J68j889K092j382r63
1939a360J211j149Q28P98j693K036K35j467K328j222j000K313k075rJ590k449
1955a085P64J491k490J567p0j923J946l95j163J815j534L56K109k302J432R63
1971A481k523J947J59k259J649q93k53J591j845K61J711k069J383N80k518J957
1987C59j00j719K592j147q44K563j434l01J814k357N12R87j528Q65k63j102J954
2004H51j235j19J514k530R89J672k797J536Q55k189K190K92k080J809l90o75J695
2021A388j609q0R99j206J213l26j380J976j215r60K412k393k96K791k348J98K068
$$ plain form
1906 1844 361 -1979 1856 502 -1086 1554 -191 -799 879 -680 -651 -379 -1475 263 -581 -617 1409
1923 1409 -437 397 1953 -939 193 1206 -1697 517 1226 -1686 614 782 -1107 985 -397 -1360
1939 -1360 -149 -1298 -470 328 -1365 671 906 -561 1767 545 -455 1858 -217 -226 1364 -1085
1955 -1085 -321 1170 -1320 247 177 -1746 200 -195 -1358 457 -1077 -721 1388 -914 518 1481
1971 1481 -1042 905 1064 -1195 454 -439 -692 899 -946 -685 1026 -1043 340 920 -1598 359
1987 359 259 -1460 1132 -15 -859 1704 270 -31 1783 -574 -62 925 -603 262 -1 -1103 851
2004 851 -384 -503 1011 -1519 -530 1142 -1655 -119 736 -1453 737 1029 -1051 758 368 -307 1388
2021 1388 -221 -301 698 -508 705 379 -1001 975 -240 -1200 1212 -1181 -1477 1314 -1034 -836 1232
2038A232k356R70K132k167P33L78j282Q95p55p6O19j701J345K68k148K331l83
2055C5j901L192r77j919L270j241j113K829j704q14J765j268L5L9q57M37o48K19
2073f21J163k230J241J644k762J849J262l251K658Q97l410K491L25k556K352j77
2089H75j616J111m01k60K24n70P80j128L4K128k321P0K838l279P54K985l463Q57
2107c82K860l177P92J840k801P47J005j222J52l97L59k14q19K099j124j226L041
2124A533j460j382L794k298j413L939k623j286L123k418r00K195j566m82J020
2139b24pJ00m27Q84J58j883K444L41l066K948J98l207L163k58l309L146l57k596
2157a952K635l24j491J515M7k61j88J34P40j651J20J722k777R40K449l344J226
$$ plain form
2038 1232 -1124 -154 1978 -189 544 922 -360 535 -220 -296 323 -1378 -33 235 -1913 418 35
2055 35 -1866 1326 349 -1570 1700 459 -654 2175 471 -343 1422 154 189 228 -629 -192 -840 -621
2073 -621 542 -1688 -447 1197 -1565 284 1546 -1705 953 1850 -1560 931 1256 -1300 1052 875
2089 875 -741 370 -31 -291 -67 -637 143 -985 -951 1177 -1144 -1074 1764 -1515 -761 2224 -1239 -382
2107 -382 2478 -699 93 1933 -868 -121 884 -338 -186 -583 -224 -438 -1257 842 -282 -1508 1533
2124 1533 73 -1309 2485 187 -1226 2713 90 -1196 1927 -491 -1391 804 -762 -1244 -224
2139 -224 -231 -131 -558 326 484 -1399 1045 1386 -1680 1268 1466 -1741 1422 1164 -2145 1001 644 -1952
2157 -1952 683 359 -1132 383 430 169 -19 115 855 -796 -676 1046 -1731 -791 1658 -1686 -460
2174d60K472l467J552K052l025J173J245k409R56L87j067M58j89L28p13p87K281
2191G87j412p85L136k079j068L726k060j125L297k507r07K501j927m94J232j077
2207g62O3L03J09N61r59Q37P17k130J976L25k529K678r9k614L090p97k140K637
2225A266p77k009J974q22n58Q74o58L16Jk15J327j787P42J863k446J080J803l123
2243a149J727J666l196J625Q93k710J499L19k073J044J1o95N28j64Q99l34l53
2260d63J927j403r39K780k069q83L020k504n56L005k582k50J960k228K75J197
2276B87j217O12J13L52N61q95J235r9j762K207m97k668K887o21k473L220q75k083
2294a716K619q05j332J578j067k43Q78m45O21k04J79J015j454P60J125k674J534
$$ plain form
2174 -460 2012 -1455 97 2149 -876 297 1542 -867 89 476 -591 -133 -322 6 -707 -1494 787
2191 787 -625 -1410 1726 -353 -1421 2305 245 -880 2417 -90 -997 1504 -423 -917 315 -762
2207 -762 -699 -396 -287 274 -685 152 869 -1261 715 1040 -1489 1189 1090 -1524 1566 769 -1371 1266
2225 1266 489 -1520 454 -368 -926 -52 -710 -394 -393 -608 719 -1068 -326 1537 -909 171 1974 -1149
2243 -1149 578 2244 -952 673 1566 -1144 355 674 -1399 -355 -344 -1039 -511 -675 224 -110 -463
2260 -463 1464 61 -878 1902 -167 -1050 1970 -534 -1090 1915 -667 -917 1043 -1185 -910 287
2276 287 -930 -318 -205 147 708 -187 1048 949 -813 1394 897 -1771 1116 495 -1978 1242 367 -1716
2294 -1716 903 98 -1234 344 -723 -966 -88 -533 88 -116 63 1078 -376 384 1509 -1165 369
2311C69J308l109J656J232k878K012N37k436J359J71j275Q84j74k15N13m76J411
2328H89n83o51J847j678m21K016k280K88K059k439K29K154k385O81J419k083N68
2345c70O71j115O26J34K01M67r89J155j09j532J738l60j865K473j194j280K200
2362H51j158o43K004j497n89J553j119M89O30r65R39l55lJ137j596N74J021j992
2380g19J076O49k147J468M81k030J889n65j325J643p66n06J024r46N03P54j228
2397g45J060J8o49J469j061k70J462k001L49J410j895N39J063j611Q57L26j417
2414a096J395j02o61J056p97J34J075j081P56J82j320J108l87j224J783j371n70
2431a120J781j441j57J543j439M03J014j413J012K2m86J187q30q2J041j315M15
$$ plain form
2311 369 1677 -1432 224 1456 -1422 590 1127 -1309 50 221 -1054 -170 -344 -559 -46 -522 889
2328 889 306 -345 1502 -176 -597 1419 -861 -573 1486 -953 -724 1430 -955 -274 1145 -938 -370
2345 -370 301 -814 -188 -54 147 614 -375 780 671 -861 877 517 -1348 1125 -69 -1349 851
2362 851 -307 -950 1054 -443 -1032 521 -598 -109 521 -444 495 140 137 1274 -322 252 1273 -719
2380 -719 357 1006 -1141 327 808 -1222 667 102 -1223 420 -346 -852 172 -774 -271 483 -745
2397 -745 315 333 -316 1153 92 -178 1284 -717 -368 1042 -853 -314 749 -862 -5 321 -1096
2414 -1096 299 197 -464 592 -205 -71 1004 -77 679 861 -459 649 262 -962 821 -550 -1120
2431 -1120 661 -780 -937 606 -833 -430 584 -829 183 205 -281 906 76 -6 1035 -280 135
2448A35Q68j785Q40M32j445J181j7j494J774o61n70J581q24j05J090j114M21M78
2466G85j198J107l40j016J475j286l53J456j516L23P30j446J008O18j187J441
2482F01j83r41J566p59m50J305j312L53P03j378R22K69j501J307l47j230J637
2499E62q46l73J264j304M81P41r77O85J02j182J435n50o69J413r13k05J255j286
2517c67J43O78j260R28K76j216J161m36o58J495j104l1J319j218O47N71j161Q67
2535F34K74j542J233m44j094J420j227N2P97j217P48O34j219J255J85q39J346
2552I96o88l04J093r15j05Q58j487N85M43j607J247N8j310J172n5p67J340p61
2570b07j25J081j277P97P7j038J001j59r38J572p85m83J406j064o7Q83j289O71
$$ plain form
2448 135 1003 -782 58 490 -955 226 209 -1285 489 -172 -742 839 15 -90 1000 -114 307 785
2466 785 -413 694 354 -662 813 -473 -826 630 -886 -563 167 -1279 -271 347 -840 601
2482 601 418 -523 1043 284 -166 1139 -173 180 883 -495 427 696 -805 502 155 -1075 562
2499 562 -284 -657 607 -697 -216 525 -452 233 335 -847 588 38 -631 782 -131 -336 919 -367
2517 -367 -224 454 -806 122 398 -818 343 -93 -751 744 -360 -391 928 -290 357 928 -233 634
2535 634 908 -634 599 155 -939 481 -746 -694 103 -1114 -366 268 -951 304 489 -350 996
2552 996 308 4 1097 182 77 935 -552 33 476 -1131 116 174 -1136 36 -19 -786 554 -207
2570 -207 -332 749 -528 269 346 -692 309 150 -788 784 -1 -484 922 -142 -209 674 -615 56
2588E6L42j267R94J20q29R87m28k91R73q88L80O44j196R25J43j265J241l98j315
2607a072J440r04o69J303r22J43J031j086O44O81q82R84r1n34R49o54k94R91j271
2626b13K00N05j328P28L73j469J118P4j118J430n34k65J053n65J04L97p89O92
2644C93J5j026J060o17o73J340q01l81J413j335L95R44j363R19L67j255R27j81
2662A41n24J059o29j18R17j374P34O74j466R28J4j256J014n7r74J123o92k70J017
2681B61p85K24O90p44P76J32q35J119n32m21R12j101l0Q03j124M61M02j114Q57
2700d9J10q83J172j77n97J062o03n1R88j160M33L16j144Q17j23r61J171p30k43
2719f52J153j085J91J129j184M31O70j296R64Kq93Q80l21l77J054r39M5O36q35
$$ plain form
2588 56 398 -869 125 245 -584 403 -25 -316 657 -231 149 793 -403 522 665 -600 641 243 -1072
2607 -1072 368 -536 -1205 98 -824 -681 350 -736 -92 589 -293 691 600 66 1015 361 67 1058 -213
2626 -213 -13 492 -836 -108 265 -1204 -86 -12 -1130 300 -234 -499 554 -11 93 490 -299 393
2644 393 408 -618 442 -175 -848 492 -309 -690 723 -612 -217 727 -636 283 650 -605 322 141
2662 141 -383 676 47 -71 846 -528 206 880 -586 342 356 -900 114 57 -917 206 -486 -756 261
2681 261 -524 -300 390 -354 422 554 -281 838 306 -115 797 -304 -334 469 -655 -194 208 -906 -49
2700 -49 61 -822 350 173 -424 638 35 -16 972 -188 245 561 -583 234 111 -850 321 -409 -652
2719 -652 501 -584 -393 736 -448 -17 653 -643 321 323 -570 310 -11 -388 666 -273 -228 408 -427
2738d27M71K44r05J020n7p83J175o89m72J074r04j07J057j295M20M85p29O72O4
2757C14n39R10q04l6P46r50J51N74j319Q38O9r16J019k93n63J249o10l00J359
2776H99p62j6P28p64L14M17r22M90k71q20J108r92j02Q96r82M62P73j098P77L30
2796D65r10J054j04r82J338p96k01R24j003J8L40n50L03P9o60O34j36l62J370
2815H21j083j5J362j176J94O21j018P18Q1r83Q30j24o29J029o35m45P06q47L67
2834b26L81q82P57J68q11J151m15l72R62p62r0R79j035K37O30q87M50j9q60Q97
2854B53k80p31P33l95k84P77m96M01N08q69R65j85n85J218q46m14J044j054j14
2873c54Q09r34K76K48r50O85J98o62J009m56j87R26n35K11N65j018N58L65j257
$$ plain form
2738 -427 44 288 -617 403 346 -437 738 49 -423 651 -253 -360 697 -598 -178 307 -422 250 314
2757 314 -225 685 -119 -155 591 -359 -208 366 -953 -115 -46 -962 57 -236 -799 450 -160 -460 899
2776 899 137 121 849 85 399 816 -106 384 113 -707 401 -591 -693 203 -779 -317 456 -642 135 465
2796 465 -445 609 505 -477 861 65 -136 788 -215 -197 143 -407 -104 -25 -685 -51 -187 -549 821
2815 821 -262 -277 1085 -91 103 724 -294 424 505 -478 352 228 -401 628 -7 -452 254 -593 -226
2834 -226 155 -727 30 198 -613 538 123 -249 713 -49 -139 840 -195 42 672 -215 235 216 -644 253
2854 253 -27 -758 -25 -420 -704 73 -423 -22 486 -383 582 397 -188 1030 184 -230 814 -240 -354
2873 -354 455 -479 -203 45 -905 -220 -22 -684 325 -131 -318 608 73 284 849 -169 389 754 -503
2892e03R82m52q69J011n50m71J059n96k38R81r06M08O32p19O68R3q11J094n93
2911B20k51O87q14n6N60r78M35J84r69J113M7o55R39m51m71J075o71K3O84j157
2931e06P48J36p23P11l04o12J002p52m4P01r28K69Q04r50N44K96r75Q08J3q50
2951f12R52n06p5Q24p78K13M89j065R29J68r04P15j55o36R01p38j56N81o70N22
2971aL09q25N99J50q00Q78l95j60Q52p46J57O41r24K19N85j291O17K46p20Q61
2991B52j78l31O62p11J52P14p02K32L75p03N23L7o74Q11l86l96P09q18p6R02j057
3012f63L86N24j093R49K03p85Q62l17l69R96o03N4N74q62M14K69r90P38k73m69
3032d55P65l93n14Q23o54R4P14p85K83M19p21P00k8m99P99l45n28R39r75L04N38
$$ plain form
2892 -503 479 27 -842 169 -381 -852 207 -389 -627 354 -552 -144 488 -231 437 530 -281 813 220
2911 220 -31 656 -158 -214 346 -632 -197 -13 -982 131 178 -477 462 11 -460 615 -56 -33 651 -506
2931 -506 242 378 -345 366 62 -550 452 -300 -344 357 -571 -302 502 -448 96 392 -583 225 238 -612
2951 -612 340 -166 -241 583 -195 18 507 -558 371 539 -365 350 195 -441 460 -278 -434 147 -523 -1
2971 -1 308 -517 82 232 -568 310 -85 -245 607 -139 18 659 -265 -46 539 -752 -135 111 -609 252
2991 252 74 -257 405 -306 -154 560 -142 90 465 -238 285 322 -352 459 73 -323 386 -432 -508 394 -663
3012 -663 -277 247 -846 103 306 -479 383 66 -303 693 90 144 718 -144 270 539 -451 287 14 -455
3032 -455 310 -83 -597 226 -428 -334 380 -405 -122 297 -424 276 248 -251 548 203 -325 614 -361 -57 481
3053D81j074M96K09p91P46K59p65Q89n94o3R94r14P8O34j021M10L22p03O72k94
3073b9m73Q11o87q1O93p11K51M87q27N43K47o08R44k06m59Q14n29k16P08q75K56
3094E3O16q74L11K57r47P15k64m72P98m44j51P60q05R0N40n65O27Q3q41Q49k45
3115I1n57J070n74m00P54n78m1O49q65M91K23o18N93o3l54N87m06p3O00p18L60
3136A71L77j082P08J63r86Q61m10m75R17n17k64P42o70K09K87o48O87J97m66R31
3156G32m22m81Q45p29k37J028j044L63L50r28N87J07p60P65l39k20P22m87J12
3175c6M05o73M93N9o54P15p0q74J178o38k23P06p47r8P91o52O9M19p29O10j35
3196h4j20O97n75o6R41r24M72J69q58P07po26N92j19r58J001l96m11P24m46j04
$$ plain form
3053 481 -593 -97 112 -679 67 326 -439 450 -144 -207 787 -127 -49 585 -436 -26 296 -407 265 -29
3073 -29 -502 309 -378 -459 234 -477 -226 261 -566 -23 224 -384 560 354 -105 709 180 -36 672 -203 53
3094 53 669 -205 106 363 -584 131 -133 -605 193 -251 -402 358 -447 -357 183 -382 245 328 -513 336 91
3115 91 -466 604 30 -370 384 -194 -235 414 -451 40 263 -355 238 175 -179 408 2 -71 529 -189 171
3136 171 548 -534 174 337 -649 212 -198 -673 244 -273 -537 205 -465 -256 31 -617 70 267 -199 732
3156 732 310 -171 674 -55 -292 736 -308 55 405 -523 64 171 -589 176 -163 -383 339 -148 -36
3175 -36 369 -304 189 248 -406 309 239 -635 543 -95 -318 388 -359 -457 334 -318 -249 170 -559 51 -84
3196 -84 -204 493 -82 -148 793 -131 341 510 -348 359 352 -274 318 199 -759 242 -154 -565 159 -287 -391
3217c91O12o19M79L89o12N20j21l88Q16p69j44O38q20L18L98j031N18M39p91N71
3237A2n3l88P08k22k27O52n32L77N9n41P07l64o37R53o70n35R45o57k6R52r17
3258d04J70O14q18N99K30o36N73j58j58L51n42N2L64o51M09J53p35R04j09r44
3278g36J156k70o86R14l98j21N31m99J7L16n76L86J59o77Q56m21j46P66q98J94
3298a33O66j053M32N61j231R04n1p52Q44j2n60M80j88j03N74l68K62R5n20O53
3318E00n19m00Q31n90l32R33r40J40Q86r41K48N82q94M37M16n19M19j60j63M98
3338D32n55K19K20q57P74k3q01R03j72p39J071n87l64Q41n83l2O03n32K24K45
3358B87m71N66k79k40O17n83J55L33r12N13K82r39O40J47p19Q59k06m96P63l34
$$ plain form
3217 -391 221 -398 81 470 -142 378 257 -131 685 -84 -228 410 -410 -92 306 -725 -207 232 -559 12
3237 12 -41 -429 279 57 -170 482 -50 327 386 -155 552 188 -449 504 -166 -701 244 -413 -439 513 -404
3258 -404 -234 380 -438 161 391 -245 328 170 12 363 -179 -127 237 -414 -5 148 -587 317 208 -736
3278 -736 420 150 -536 378 -20 -141 390 -109 -92 224 -352 34 193 -484 372 -49 -195 571 -327 -133
3298 -133 533 -520 -88 473 -758 146 95 -657 187 175 -385 95 -93 -196 378 10 272 367 -153 500
3318 500 -19 -419 412 -178 -510 423 -517 -377 509 -432 -184 398 -496 -59 357 -162 257 97 -66 432
3338 432 -123 96 316 -541 233 210 -591 312 140 -599 472 -115 -479 362 -221 -253 350 -182 42 287
3358 287 -184 382 103 -137 480 -103 52 385 -527 -14 268 -671 -31 116 -603 256 50 -446 317 -17
3378a7j79N93m06n8L49n54N96n7m45M87m46m16Q87o81n1Q42q69J61N85o28K31
3399g6N59p91N63j69j57N09l25j43K30k10O3m7n52O47k63m71P54k95k78Q89o53
3420b16q4R92q41J49N76o08J38K73m63L19j61l69N51o46K19J87p56O82P9m05N82
3441A98K0o08P45o3m42O32n61k38P39m75l6O4l85M81k84m3M72n42m4P76n91p6
3463b61P17o76K55L82p38N27K47o78O20l41m21O58k76k31L28o04L99R4m28N87
3483A60qp25J039n56k39Q12n93J69K07n23K66L20m80K58J50o48N67l57o0M45o77
3504d73J85P22r70N04J23l28O56q8o37P45m03j26O63o92Q7K85m10P5J91n77P60
3525B92l15k61M93k15j15M66o08R4M56o17M20K82p70N84J1m61O46o60m4N20l21
$$ plain form
3378 -17 -196 397 -9 -67 282 -272 324 267 -178 309 -137 -553 334 -347 -398 444 -425 -264 321 -307 -76
3399 -76 483 -308 255 86 -71 438 113 -30 200 -10 53 6 -546 101 -162 -633 121 -174 -452 437 -216
3420 -216 -300 692 -149 0 576 -32 106 379 -84 235 74 -295 256 -390 -171 16 -740 -58 21 -384 198
3441 198 218 -390 355 292 -150 482 -79 -317 422 -53 -89 -25 -410 71 -213 -256 216 -326 -370 406 -185 -261
3463 -261 456 -220 35 417 -321 206 453 -225 395 54 -367 291 15 -216 112 -492 -93 1 -427 160
3483 160 152 -573 466 -90 -329 483 -110 59 266 -257 9 329 -151 107 257 -391 176 -181 -241 204 -473
3504 -473 -288 434 -536 -32 91 -237 419 331 -306 439 36 -90 573 -119 -32 253 -157 -82 109 -468 292
3525 292 -23 -284 209 -6 -121 345 -263 -169 287 -330 90 372 -398 186 197 -264 382 -278 -322 198 -123
3546a23K54K07p36M74j64k16O49k85m38O72k46k05O55o01L85J97o51L68p0m07
3566b81N24j99n05M16l39j39N89n42L25J34l05M76J87n70O58k33k22L30l59k00
3586b55O75o24K88m1k96L49q6n03Q14m56j86O22m95Q8M10n18K93K58o64M71J10
3607B54o21O77m19JL25m32n5N66o66J98L99o50M26L16l70L55l00M7M87o09J79
3628A08L20o57L02J22n67O34l17k90O96m37l28O50n39J27N10o01L22K20m46M62
3648B91j33l30L62k30p2L44m31J20K62o29M53K43o25N94j10l99Q54m32l44P41
3668E29n62N4J48m31L53K20l85K14m0l96P74o93L6M51n55J29K12n61N44J79n64
3689c44L33O9k22M48k76j5L88m51J77K13n20N88k72k32L10k98j18M95k17m40P04
$$ plain form
3546 -123 131 338 -398 76 -88 -304 345 60 -378 294 48 -157 498 -103 282 479 -172 196 126 -281
3566 -281 243 44 -461 -45 -384 -523 66 -476 -151 -17 -322 154 341 -229 429 196 -26 304 -55 -255
3586 -255 420 -204 84 43 -253 96 10 -493 321 -135 -321 301 -194 -106 304 -214 79 337 -327 144 254
3607 254 -367 310 -109 -108 217 -215 -270 296 -370 -172 227 -423 3 319 -51 304 4 51 538 -71 108
3628 108 428 -229 73 195 -372 262 -55 -345 351 -86 -414 236 -303 -176 334 -267 55 275 -171 291
3648 291 158 -172 190 -40 -112 232 -199 -79 183 -446 7 250 -375 219 109 -290 564 132 -212 529
3668 529 -33 21 169 -262 91 311 -74 140 100 -296 478 -215 -179 272 -283 -154 58 -503 41 220 -344
3689 -344 -11 58 -164 284 8 -7 381 -70 107 320 -200 388 116 -116 194 -104 -222 273 56 -384 320
3710C20n07J54M01n85L93J79l48J05J00l44K88k26k14L42k07J24K12n60N76j99
3730Dm49P14j46j99L26k73o3L84m49K44K90n07R8J74l77N08m33o4K11l51L15J56
3752A13m75N70Mo29M33R9l32N73j53l97N71m40j90M10l42J64J14l98L55o4l19
3773c33P16m90j6L95m11K92K73p26M74J54n48K92J10m46M77k12j32K85m30R2K52
3794F8m51N25km56N27q6m20O51l08l4N20m86j08M44m97r3M06l71J53o0j26K55
3816E1k51L9K06k17M27j75m61O90R0n96L81Q3p09P17k11k26L68l07r7Q4j3P3n7
3839a11J20J30j00j47M42m90J94L12m57J16K22n44M07K37p38M89k7k57K40j33
3859i5j38K66l60K77K27l83M92k46k13N76l52k06N66m93j13M78m28QK98l22J94
$$ plain form
3710 320 -187 -33 368 -217 176 355 7 112 212 -132 156 -70 -284 58 -149 -25 187 -373 203 4
3730 4 -445 269 123 -76 250 -23 -86 298 -151 93 383 -124 -26 148 -229 279 -154 -218 -7 -358 -43 113
3752 113 -362 208 212 -417 16 115 -217 356 203 -194 377 -63 -253 157 -185 -21 93 -305 50 -14 -333
3773 -333 383 -107 -123 272 -139 153 426 -300 174 328 -220 72 182 -264 213 1 -131 154 -276 -184 68
3794 68 -383 142 140 -316 211 125 -295 356 48 14 534 48 -60 384 -113 -206 200 -171 -18 -78 -204 51
3816 51 -200 -161 45 -172 255 80 -381 309 399 -197 184 267 -442 275 64 -162 206 -101 -198 -114 -127 -54 -111
3839 -111 9 139 39 -108 334 -156 38 350 -107 9 231 -313 94 331 -407 82 55 -202 38 -95
3859 -95 -233 33 -327 -50 177 -206 286 40 -173 403 51 -155 411 -82 -195 283 -145 -137 161 -161 33
3880C3k7j69K96j63j8J35j70j44M30m27M71J7n00M91p7o25Q05k68k79M89m34J7
3902a17M63m11L5J19k92K57q1k09M22l50K91J71n16K03M34p56M21L38n68L48j1
3923A91n71L52J1m35N50l55J26K05l70K39K3l05O26j35k39N02l77j48M97l84m2
3944c9K73n95L71k7k26O3P2j07J35J08j90K95l08K78K26o05O17k01m05N55k66
3965B4m11N11j33l08M55m52J29M15l02n1J29r6K48j65k7L22k68j97L46l35K69
3986A03J21m63M59m9l64M25n9m73L61j37j55L28l38J84L03n55N79l4l44M55l66
4007a9j35N63o15R9K23k78J48J62l54Q4L23l35K23r6r0L82l18J31J00m33L10J19
4029A94j64J7Mk15M21l16k14N94l76j43L35l89L1L31k74N7J15l39O70j97j72K15
$$ plain form
3880 33 6 -163 133 -30 -48 87 -83 -227 203 -224 247 264 -236 255 178 -447 358 90 -189 300 -134 -117
3902 -117 346 -65 -30 89 -203 54 -27 -236 186 -164 127 298 -218 -15 419 -337 84 422 -146 202 191
3923 191 -380 -28 -17 -452 98 -257 -131 74 -296 -57 -34 -339 287 152 -87 415 38 -110 387 3 -39
3944 -39 234 -361 10 -17 -243 -180 -108 -215 -80 28 -162 133 -175 103 329 -276 341 140 -265 290 24
3965 24 -387 124 -9 -317 138 -314 -185 230 -72 -123 6 -90 158 -7 -34 288 20 -177 169 -166 103
3986 103 224 -239 220 171 -193 232 173 -300 61 -76 -231 97 -241 -57 246 -309 270 236 -108 347 -19
4007 -19 -154 409 -206 -107 116 -162 -14 148 -206 -122 201 -134 89 -7 -97 285 -33 98 198 -235 75 194
4029 194 30 47 51 -164 257 -59 -273 321 -55 -198 137 -252 -221 110 -164 -107 8 -331 339 142 -30 185
4051A85j82R4P6j73QJ83m90L52p3l68L65Lj4Q1j76m9N19n38K25L4j75J95N7l26
4075a87M90m39l4L97m36K64J32m66K56K60m77L50j93k5K47o9l10M91m33J02K58
4096A78l26L15J4m68N78m15l8L78k20j74K30l14J0K41k22N17j87k34K66j24Q6
4117I1J40k57n8L67l02P4ok93L26k54PK80o6k61M47l07QJ34m35M71j98q9J54J69
4141A42k25J99j68k02N89l44j93K98k47J4O9l62M05J9j79K69m9q1L71l79K27R4
4163B67l36J24J11r9M2k07r6L37l58j0J35Qj37L98m16J93K08l57L69j6k59K27
4185A28k06L5L05l73M3K85l58L0K40l76L07j00j18L53m01J23K59l24Q2L44m58
4206a80Q4L65m19L18nk70L35k07j06K69l03j90M93m12M03q5l86L21J04k15J60
$$ plain form
4051 185 3 97 173 0 8 191 -299 53 -20 -388 -23 -20 -34 47 -129 -178 341 -197 28 62 -113 82 139 -187
4075 -187 303 -136 -170 227 -209 55 187 -279 -23 237 -240 110 -83 -108 139 70 -240 251 -182 -80 178
4096 178 -148 167 181 -287 291 -124 -162 216 -4 -178 52 -262 -252 -11 -233 284 97 -137 129 5 91
4117 91 231 -26 -84 283 -19 55 49 -244 82 -172 -165 115 49 -212 235 -72 -64 70 -365 106 -92 -181 -27 142
4141 142 -83 116 -52 -254 335 -9 -202 96 -151 -137 -68 -430 -25 -6 -185 84 35 -46 325 -54 173 267
4163 267 -69 55 166 67 109 -98 -194 143 -215 -225 -90 -82 -219 179 -237 -44 164 -193 176 160 -99 128
4185 128 -78 -43 262 -111 -68 217 -141 -111 129 -247 60 -40 -158 195 -206 -83 176 -148 -66 278 -180
4206 -180 -96 269 -150 168 163 -107 228 21 -85 184 -119 -309 184 -228 175 90 -296 25 129 -86 74
4227G4r5k01N19l74P5M46n10J55Q2k77K86j04k85J74n3j06M20l65l5L56l04K88
4249A66q2j22K13l7l25M67m11qM61m95J11K77n06K94o7p2J75j90M6K75k69q9M55
4272B67k42N2K26m96L71q1l73L70P6l11L44l06J90Q5m29J86J51k07R4K64j89J51
4294A93j61k02M92l13j65K91m07K43J57l32L19j81j76K99k8k70M65l09J7J24r1
4315c5K5M8PL7m3j39J6N9j83M21l17m5K92k93nJ73j91J25L5PJ62k40P4K22k13
4340aj7K63m41L38lk73J60q2l03N97l95M6K51m48L48O0k89J58J37j75K72n5l10
4363a62M08k51k34M08j47j37J45k7J03J2l88K20Q7j26K62j75k14M23j54L0J90
4384B73n13L58J5k67K62k04r2L69l10M6K18n10J93J85k29K28j57j58L97o1j99
$$ plain form
4227 74 -21 -222 297 -77 -2 444 -66 89 171 -106 180 76 -209 -35 -88 -194 226 -139 -174 182 -122 166
4249 166 84 -38 175 138 -187 280 -131 -139 322 -173 -62 215 -291 3 -64 -136 39 -151 -105 170 -99 -188 267
4272 267 25 77 303 -193 178 97 -276 94 170 -141 203 -103 87 172 -257 -71 80 -127 -33 231 42 193
4294 193 32 -170 322 9 -156 135 -272 -29 128 -204 115 -66 -242 57 29 -241 224 -85 -68 56 -35
4315 -35 -10 38 45 82 39 -100 -84 -25 -208 213 -104 -149 143 -150 -155 18 -173 -48 -13 -6 156 -84 -10 212 -1
4340 -1 -18 245 -196 142 139 -134 26 -56 -359 238 -157 -111 140 -308 40 100 -189 -31 106 -69 203 148 -162
4363 -162 246 -5 -239 169 22 -115 30 3 106 118 -270 -50 37 -89 173 -2 -216 207 53 83 273
4384 273 -240 118 133 -134 128 -76 -168 201 -109 -63 155 -355 -162 23 -206 22 -135 -293 104 43 -156
4405a56L90k29J09O5j99J55K1k88J23N7k46M25l15k06M73l11J4K77k75j6J58q8
4427f2K1K47k47M6k1p6K16l09K94P1m77M13j3l31J70K26m56M04n0j87M90l84q1
4450i6L71l22j1L41l49P0Qj18K53l01R8K58l76q2K64l01M18p1m05L87K00l30L40
4473B46m9k76K13j54N9J54j68k55L06l36K41N1j83J49j04r4L70k04n3K95l76L11
4495A43m4j12J54o1j60J95o6r8R7q2j17L16m16J18J86k54K88j00j39J53J66n7
4517A10k9K9n0M9k48J23K10l02K68J0k45J47j79n6L67k35m5J63l19K07K45l85
4539a65K47K8k68J93k09K17l6p9J2L05n41L53r4j25M77k50k31L47j44j85K43k61
4561a66J18J62l46L41P2l98M31k04L6J10k14N7O4k47K74K7l51K42qk32L17k35
$$ plain form
4405 -156 234 5 114 179 -20 135 156 -132 -9 48 -198 227 -88 -294 179 -132 -118 159 -116 -132 26 -62
4427 -62 -41 206 -41 5 -16 -92 124 -185 109 180 -297 116 103 -228 -58 168 -288 116 66 -121 369 -15 -96
4450 -96 275 -47 -58 283 -66 4 12 -106 147 -154 -56 202 -174 -256 8 -293 125 54 -351 36 236 -94 246
4473 246 197 -79 134 -20 39 193 25 -230 76 -260 -19 32 -151 -2 -106 -200 170 -34 -87 208 -168 143
4495 143 99 -13 141 80 -80 115 49 -49 48 -34 -151 165 -251 -133 53 -201 87 -13 -152 1 167 110
4517 110 81 110 60 109 -139 -16 194 -108 160 170 -75 72 -107 -163 204 -31 -76 87 -232 -25 220 -165
4539 -165 82 110 -158 35 -174 43 7 -72 -60 245 -296 57 -37 -162 315 65 -166 181 37 -148 95 -166
4561 -166 -48 114 -232 109 181 -217 214 10 46 156 -58 -1 63 -184 90 117 -234 8 0 -232 85 -150
4583a50Q0K91j20j08J3j57M8J29k1O2J0l06L04k64k06N38k58RJ48r4J40j5k02
4606a29J26J34l92M51l37Q4K24l24K03J15m82L69m2k06K22j40j23L32K6l04M87
4627B94m09J75R0q9q3J75l32K36K16l28J30o0l5N0n4l1l9p0M0J24j69K20k94K02
4651d1K41r6l94M28m5j08O4k14J10J03k30J97q1j68K38P1l8J15k00n4K28j24J1
4674A3J74k22O1k1N8R1j88l1J88l34J14J43k87K34n8m7K19m2j90K38o4k35K73
4697H7k08J29N2r6kN3j41K56q8l25M30l21J93Q4j61L5Q5k08K15P4k05J57k0k83
4721b08K33Op4K5j06J23M3j90J74J36j89lK02k57J6j0j54N13l42J57N1l08L11
4744A49Q2l57J21K7j60K13k93K31k5j12Q8M7r6J23Pl35M94k82O0J20j9j12K75
$$ plain form
4583 -150 -70 221 101 -7 6 -151 -103 26 5 67 77 -229 75 -189 -395 143 -115 -106 42 -52 88 73 -129
4606 -129 -3 131 -261 190 -147 -63 161 -163 40 155 -327 42 0 -206 16 -124 -247 85 111 -193 294
4627 294 -115 60 150 61 -22 153 -179 57 273 -55 75 15 -20 30 -24 -55 -94 -164 -124 0 -169 51 -243 -41
4651 -41 200 104 -290 138 93 -15 49 -165 -55 48 -182 15 -66 -234 4 75 37 152 -48 -102 126 2 13
4674 13 187 -35 26 5 63 154 -34 -65 123 -211 -97 46 -241 -7 -65 -112 107 65 -125 113 49 -186 87
4697 87 -121 8 60 -36 -38 15 -126 130 42 -283 147 -174 19 103 -58 -23 62 -146 69 143 -62 95 75 -208
4721 -208 25 31 -43 -18 -124 -1 42 -148 26 162 -27 -30 172 -85 -69 -79 -233 280 -62 95 146 -162 149
4744 149 231 -126 -5 22 -138 75 -218 13 -12 -124 -36 11 -85 38 45 -290 204 -78 -18 102 83 -29 246
4767B46l26k5L08l48J58j06k2K20j04j63J52j85J11K51k05k1J72k09K41r6j09
4788f0J69p3j69L45l05K1K06r9q9L9q4Q1l9j72K38k02K37J91k42J62L7k61J72
4811A03j17k18K85N5k27K27j45k5j3N0JJ26j93J56j03j11K72k38K52J84k80L6
4833G7j9j32M4J54k10N0J69k63K05o9j76J47k5j74M41l77J45J71l96K22qk02L16
4856I0r5L8L2k1j46R8r8J0R2k82O4K09q2J75kj27K19j57q3J86k62K33lk1M0k0
4882H7k05K34j14k23L53k00j35L00k75J39M8J37j67J90k63J14j43O8K27l13q1
4903b22K82J20k24K38l08J53n9j8K98k05j77L28r7j01k6r9K25j29o7L14j45k19
4925a38K20k2k00K16L6k01J71j92R5N3j41J30J11k71J98k7j59L92j93j46J78k84
$$ plain form
4767 246 -80 -105 203 -145 13 -93 -115 105 1 -162 -10 -195 -84 167 -38 -59 113 -96 145 49 -60
4788 -60 109 36 -133 212 -93 -72 134 35 -54 -15 -99 -18 -57 -229 9 -193 44 235 -7 155 192 -69 103
4811 103 -14 -232 53 108 -119 108 -37 -62 -75 -25 -24 102 -91 65 -38 -149 123 -115 137 321 41 77
4833 77 58 -74 -30 124 -86 -36 133 -130 75 6 -170 -23 -48 -222 219 -158 -13 158 -238 -16 -24 -226 90
4856 90 -5 33 65 44 -102 -4 -102 -92 0 -282 -218 -9 -91 84 82 -45 174 17 -66 120 -142 91 88 67 107 87
4882 87 -118 116 2 -221 132 -68 -203 97 -178 -39 9 146 -21 169 -94 20 -123 -55 172 -141 -222
4903 -222 60 180 -44 194 -114 39 -20 -38 260 55 -122 206 109 8 -18 -117 108 -21 -88 226 81 -138
4925 -138 82 60 -140 76 112 -89 82 -110 -15 38 -103 27 138 -133 65 38 -121 271 78 -68 110 -174
4947a74L11j5j72J9p0R7J92k27J5J46k26J09M0m3k37M09l05K72J8k52J35qJ48
4970A82p6j6j30O1n9J30M6j57j8M2o9J34R3j77K90k58J20q5r2J49j14k3J28k18
4994a17K14j31Q5j58K19r1j58L29j44K8j32Q3n4P9j8pn6l6J34j61J32r7O0J5k0
5019bj11J54J4k17Q1j33J89J1oq8J06l93N77r6j64K33k4j37n7m0N4K13k21J15
5043E8J26l01K51j08r9K55k39l0K53j39L3J30k96J81O2l10L08j12j42K71m4j47
5065c9Q0op4J94l57K19Ml1O1Qo3R7j8k48M29j79j27O9k3O9q9k7P6l2m3J44j1j15
5093c2J72j91J42j13j11R8K11pj23%l4J56k43j34K65k50J72J0q9R4O9m2n8K23
5117A85j2m0j14M6q3J34lpk38J90L1j82K26m7j31J07j79k9J81j33jJ05q2J18K3
$$ plain form
4947 -174 137 122 -50 -31 -101 -4 188 -39 -24 122 -104 5 45 2 -235 174 -131 141 159 -93 42 34 182
4970 182 106 90 -40 21 -38 92 138 -19 -37 5 -64 70 163 -14 276 18 138 53 -39 110 -4 -27 101 -117
4994 -117 97 -34 51 -107 112 21 -137 192 48 76 -56 27 -27 52 34 27 -29 -65 69 -92 40 -57 3 18 -2
5019 -2 -113 41 55 -162 -81 -214 -25 -14 -20 -108 -2 -395 182 86 -78 155 131 -6 -63 -103 -49 164 -57 58
5043 58 184 -117 134 26 -73 182 -57 -87 166 27 60 190 -106 75 137 -173 135 23 -119 152 108 -39
5065 -39 41 35 -39 155 -202 17 21 -10 51 59 -4 93 75 -173 256 77 -50 19 -4 65 -24 -51 25 -7 -50 94 83 -32
5093 -32 140 -51 91 -22 -133 -35 176 169 46 46 12 168 -75 -209 56 -194 -22 -12 -101 -7 62 20 -38 185
5117 185 173 133 19 65 -18 116 113 106 -132 58 89 -93 133 86 -45 62 -117 -146 35 -98 -99 6 -76 42 65
5142F5r7K20j25j67K32o3j77K63j56M5Qj05o2J99j27j02Q3q5J87j4k9R6k40KK59
5167A10o0M3m6j32J30k2j49K91j86q8K36k16K1K04k04M1n4k7J68%l2L8m6jj37
5192a18K01j67j1p0K71o6j34K18k49Q5J2j31J84%mo4J15j44J55m1L6P6k42J06
5216A8J41j19p1J90k00k9O7j65J14P5k23K04j38J13o7L2K35J05k18q3J81kj49
5239A1K4k61L18o9m4Q2j51J0J47j65J73m4j88L58j34p8j84K51q2o9Q1K9q8O1Q8
5264G6Lk31R2k2k8P8q2O0J05j59LO6K2J07Lj02K44k91J35l4k31J09Q5j16mJ42
5290C0J13j53M3j50Q2l3K2K53k77N9oj1K49j33o1j13M9p1J13J88l02J82j62k4
5314a13K80l37K17J75k90J64j20r2P4J46k1K9L4j77J55k41J33Jj00L8Mj78J50
$$ plain form
5142 65 -32 188 63 -104 128 65 -112 151 -5 40 48 -57 -119 80 -47 -149 -66 -151 36 22 -7 89 -151 -149 110
5167 110 50 93 47 -85 45 23 -126 165 -21 -109 127 -89 -68 136 -68 -27 -81 -108 60 60 28 66 20 19 -118
5192 -118 83 -84 -95 -165 106 40 -94 124 -125 -40 -28 -159 25 25 21 -43 72 -72 83 42 78 154 -88 18
5216 18 159 40 -31 159 -41 -70 -3 -168 -54 21 -202 2 -136 -23 -90 -58 177 282 64 -19 162 160 11
5239 11 35 -226 92 23 -21 61 -90 -80 67 -98 75 31 -157 201 67 -11 -195 56 -26 -95 -14 15 -73 -12 76
5264 76 79 -152 -60 -82 -110 -32 -114 -54 51 -108 -105 -39 -17 90 93 -9 235 -56 79 45 -186 -77 8 -108 -112 30
5290 30 143 -10 33 -117 -35 -68 -46 207 -70 -11 -17 -28 221 88 27 -86 -37 -108 5 193 -109 73 -89 -113
5314 -113 167 -170 47 222 -68 96 -24 -116 -42 104 83 112 146 -31 124 -117 16 17 -83 -45 -41 -219 -69
5337f9M1j24K16M1j0j47mK57K4k24j5LM2k35J69L2N6j66J2J64k42K36q3j43J68
5362aO8j94K78k70P8J86n3P6k04J01lm6l9rK0j92K13m7K22r0m2r2J34l00K87J23
5388B04l89K70m4q3J7P9k66L86j39J2j22O3n4k7jJ05L4o5j8Jj83M90k76%J17q5
5414B6J42M0k65K19k42j0J46j50k5J11P4j74P2j1J46J71k76J12r4L7K9M6j78J74
5438A20k11N3lK13l03K99l6j28j4k8l2J02n8P6k02O4J47j61P2j1oJ75j02k9Q6
5463H3k31J80N5j69O4K6o3M3l0M9Oj9j13O2R6j68J14Qj38K53k17J68j46r3N9J82
5489F1j45J20J2l98L69j90R3K3J37r6j08J40P6o1j22M8m5j3K30m9r5q3P0J57n0
5514H1k56K08n9o5J87K7k93J44o3rJ22j1J5o2K73k67K03l71K80j61J13J16q2P
$$ plain form
5337 -69 -28 -152 64 105 95 -52 -56 201 225 1 -14 -11 31 -204 -35 -3 53 -113 -101 63 -179 57 -26 -169 -1
5362 -1 67 -127 151 -119 -41 145 92 168 -36 65 62 16 -23 -32 -12 -204 9 -38 184 94 52 -40 94 -206 81 204
5388 204 -185 85 41 -42 -25 54 -212 174 35 47 -75 -12 -66 -93 -94 11 45 -20 -38 -37 -220 270 -6 -6 111 26
5414 26 168 208 -57 162 -80 -90 56 -94 -119 -8 66 -108 -36 -47 99 270 -6 106 12 49 78 124 -54 120
5438 120 -91 -38 -41 172 -131 168 132 4 -10 -38 -70 32 -26 50 -152 -88 59 -102 -30 -41 -47 128 26 -3 83
5463 83 -148 32 87 -82 -18 8 -55 -12 -42 7 13 -6 -119 -57 39 -129 -15 -7 -145 108 -109 59 -87 -180 -121 61
5489 61 -84 36 48 -350 19 -171 -78 -55 82 -14 -122 18 94 33 -89 -41 -86 -99 131 82 -13 -96 -26 131 81
5514 81 -175 33 -26 -91 96 123 -170 -26 -89 -98 24 13 28 -34 239 -28 175 -196 84 -77 36 152 70 77
5538G7j22R6j67N8R5M4j24oQ4Jo6P8j54J74R2k02m8p4J55JQ3k41K34L0k06L42
5564B34l02M4oJ11J09j00oq8o9L1J21j10J04o9K4r1K1j6M5jk90O27l87O5O0j78
5590a17L29o7k09J63j25k8N9N2j11J58j60K13n3j38L8l0Q6j89N7p0O8P8lmk5l1
5616e9J62j05j10J07q9J36l7l8J24j19J3K2L8m4P7j12J84k4K3n9j43J60j75M5
5640b3n9J72j81%M5J32k34J92j75K09j68Q9J06o6j30M4J62r5Q0p5J5n7P9M4k2
5665H4j70J31o8o5J01j38R4J83k07K17p9k05K42j38K8Q8j38K5M6m9K35k50lJ01
5689F5j41mJ93j48O4R5j12K4j03K7J59k05O8Q5l0J06q6q6pO6N6j87J01M0J4j17
5715f3P3J80p1l27P2K20jJ48k36J56j17k5l2N6J03j63J08j00lm2P1R6r9j10O6
$$ plain form
5538 77 -45 51 -116 -58 37 81 -43 -49 35 36 -30 48 -106 68 160 -42 -90 -164 -9 -8 75 -166 68 98 -108 234
5564 234 -68 -24 -30 81 190 90 84 -4 -73 -42 79 -31 73 4 28 -63 -42 -58 -13 -14 -304 323 -64 1 61 -117
5590 -117 212 145 -64 99 -26 -54 5 57 -54 104 -56 157 104 -34 4 -26 60 -129 -72 -142 -74 4 1 -3 -28 -59
5616 -59 103 -2 -112 -5 -94 42 5 -33 91 -28 -15 7 45 1 78 -34 150 126 149 90 -53 107 -68 -23
5640 -23 -82 90 -91 -91 -46 86 -148 44 -131 78 -90 -1 105 39 -91 -47 115 20 100 25 40 -17 62 106 84
5665 84 -86 45 -23 -88 13 -125 -31 152 -55 162 83 -122 120 -18 10 98 -40 -15 31 -18 217 -33 -36 65
5689 65 -76 -80 113 -35 29 124 12 36 -67 -40 119 -86 -18 67 37 143 57 -29 -36 30 86 -101 0 40 54 -63
5715 -63 10 190 119 -208 -136 84 83 231 -5 151 34 9 -23 33 136 -27 81 -19 -22 -64 7 103 4 -106 -40
5740d0n4J71r0K8K4j79R0J63j08l0J97j05oj48K8P7q1o8K79p8k18J89q3J0R3j98
5766a37J59o6J18j69K48k37L03j24j98m7J49N8p3l0J3L0j00o0K97jk91J44J3j0
5790a1mq4K8J33j00mO5q2J56j08R9O3k30K93k70j04K73r5r9J77l3K7N1k8j41Q3
5816E5n5K2j1k7r6m9pJ52j72J20m6K98M6k44l1J97o8p9Q9n2l5R2l6j43j8L2N4
5843a2k6K0K2r9J26j00J58q5Q8j90J04P2j06K7q9J25L9J5q1M0j37O0Q3j26J1J35
5869G4j54N0J76l39J02J35R1k29J13m9m9K0N6N7o9M2L4Kn8j56J46K4K7n7O5l1
5895B3L0l6p3J46m6J59k96R9r5J97k69J45Q1q3l9J25p5M5n5r0J94q2j07J05l8
5920c5o1K36k72L08q8j59k7Q3O7j17Q4M5QR7j35O9p7q9mL2p4Q6J29k5j55k2K52
$$ plain form
5740 -40 -94 77 -13 15 39 -140 -50 113 5 -25 172 67 61 -87 -59 18 -63 -131 148 70 -148 41 -42 -32 61 -137
5766 -137 22 -44 74 -95 153 -84 219 95 -103 -150 -1 57 -16 -46 -33 -3 -103 -163 134 133 -158 -14 -1 -11
5790 -11 -15 -99 -71 62 -38 -42 23 -59 97 -11 88 151 -79 214 -56 -160 113 18 -81 96 63 90 141 113 -28 55
5816 55 0 22 11 -16 -112 -161 -168 -16 -188 -68 -114 184 230 -14 -45 152 84 5 94 42 7 99 63 -80 -98 -66 -12
5843 -12 -38 -18 4 -95 31 -69 89 4 92 -98 6 78 -28 -1 -90 35 74 89 8 48 -89 -29 54 -72 -61 74
5869 74 -80 -30 146 -193 -91 44 135 -94 19 -30 -79 -59 -3 54 -15 27 61 63 5 -151 -5 19 46 -11 54 23
5895 23 53 17 -56 90 44 203 -93 6 -89 108 -161 -16 65 -18 -57 68 -7 38 -17 -107 87 5 -102 3 -35
5920 -35 -96 140 -132 176 88 -71 -98 -15 52 -65 19 64 72 169 34 103 26 -63 -67 -35 -109 -23 106 81 -74 -96 156
5947A56j86J16j74Q8Q8k2o5m0j42m3J17O2R4m1J9L0Nl1M2j25J42p8j7l8J31K2
5973A10l5j19Q2p0R8m7j04N6l7N5J19j66R3J1n0L2q6J93k08L2M1K6P5o6k21J46
5999d0K1j44L08j65o8Q3j5P0j77J7J08O9k10Q2%l6K59k14J9K13k27K38j28n2j32
6024a21JJ64k3p8O9L7k7L8k03N9PJ15j08K2o2K4J74o4rl8Q4o6M4p3M8n6K3j35
6052a54J27Q2K8q2J3Ll5m5j04J88j60J37j47R8P1R1r7q4P1M6n7Mr2QP1J30k29
6079a18l2Q5pP5o5J16q4J30J19j75r1J93j15n2o5J44J07n4j4L8p3j49J19Mn3J24
6105A07j29O0j84L69j48R9k94J41j27J23p6m9J92j72o7K27O0l2k08J60J64k61
6127d5J25m3j77K71n1O8j96KK06j87Q6k04J03L9j7L5Q7k2j16k8J1K76o9k20J81
$$ plain form
5947 156 -30 86 -88 0 88 66 1 -39 -181 -224 -107 -45 49 8 27 57 62 31 73 -52 90 12 -5 -43 88 110
5973 110 75 -44 38 -32 66 19 -85 -29 -66 -11 108 -58 35 46 -4 28 -58 135 -73 -41 0 26 101 35 -186 -40
5999 -40 -19 -163 145 -20 -88 -5 -20 50 -127 -110 -2 67 -143 -61 -61 -97 162 -52 -33 180 -47 191 63 11 -121
6024 -121 -120 44 21 -57 12 49 22 60 -143 -84 -77 38 -70 -48 -110 -86 88 24 15 -23 61 -5 39 -34 14 -42 -19 -154
6052 -154 -27 55 83 1 14 17 -18 -63 -167 21 -139 -2 -149 -51 20 111 14 -70 1 47 -10 -6 -98 -90 -19 111 -118
6079 -118 -150 -65 -72 3 -62 54 -30 100 219 44 -47 146 31 -21 -86 58 165 111 97 135 62 -87 32 36 -17 107
6105 107 -22 38 -146 223 75 174 -120 21 -106 17 -59 -108 84 -88 -155 72 132 100 -108 52 216 -45
6127 -45 80 37 -140 131 80 148 -48 -46 160 -27 59 -145 -42 -3 -20 15 102 80 -36 -64 -53 223 154 -66 115
6152A15k03k2L3p0J61K2J54j75P4j95J26j87J69p3K8N1k1K4J2R5k2r6N3j0j2n3
6178b2N0J60j93n0J35l2m6j54N0Q3J08j35J2N7j6o0r8J50j2l9P2p3Q8N3j01p9
6204i2nJ74p5o9J08j26Q2j15R9N1Rj10r5J33L4K2J5J16o4p8qo2K27k46J69K6O1
6231A81k21R6R9m7o3o1k8N7J3J28k21J2N8l9O4j10J29k2RP4r6mr8N6nK6l5O8j59
6260a39J49j55J65j23Q1p7P6K7L3q7k1O1r1lJ85nj68K55k50K95k08N1j7j30R7
6285AL4j88O6J00o7J64k17J32M1j54J21p0J06l4o4J80q5j42Q9j32J28j2J71j23
6309D5L5j21J0o0L4J04J8j77k8L2J07m3P8j6j43K90j37Q5mk78L3J25j2o5J40j06
6335e4Q9r9J58r2O7j53J96P2l24K94j97O8J2ql6j08J08n9L5J17j4j13q1K35p8
$$ plain form
6152 115 -88 -110 -77 -147 14 36 190 15 89 -106 20 -167 2 -71 -43 8 -13 11 23 118 96 0 53 43 31 -22
6178 -22 28 188 -5 -55 80 48 2 -152 -102 -19 89 -46 -34 23 7 -53 -151 -1 -13 -52 20 -53 35 88 -13 -92
6204 -92 -97 77 2 -67 41 -85 -3 -118 -19 32 41 -69 -164 -31 3 25 40 156 92 14 6 -56 171 -75 94 120 181
6231 181 -40 56 155 108 45 -16 -44 13 26 154 -67 -55 3 -36 28 -82 47 25 34 108 12 8 -90 -34 -39 -13 -48 20 -139
6260 -139 10 -145 20 -103 -22 -99 -23 4 37 -50 -71 -10 -101 -104 81 76 -92 163 -87 208 0 51 34 -96 1
6285 1 35 -153 -87 13 -54 110 -107 25 66 -88 33 -37 69 35 -29 151 66 -76 13 -119 9 -3 168 45
6309 45 80 -41 -31 -91 -57 47 65 -112 -140 -108 -1 -44 34 18 -125 165 28 113 109 -169 -136 -11 -23 -88 52 -54
6335 -54 35 -64 94 2 69 -84 112 184 -140 154 -43 25 37 29 -7 -115 -7 -66 -31 86 72 -41 -122 113 35
6360C5l5j48J72L9j6j6j62J95k01K18J6j53Q8k0pJ56k43K2q6O2K75l48R8M7MJ16
6386A08j30J06OLL8q9k8n1R0q2j34p8K07J44k83L0Q4O7l4J82j60J56l36PL20j87
6412d4k4K13j61m9Q1N4k00J88j09o3OJ54O8k11J84j10J08r9p8J17n2P9L7j66O9
6437hj94J76K18k42k25K33M7n1J2R8j11K9o8J06r6ON5j11J79N9j99O7p6K6K12
6462A42o7r6R3k36Q7j25Q2J40KJ43k34J0J15p8J51j05R8r6m6l4p2K3J16m4oJ45
6488A08o2P5k03j0J73L1o8Kl4P7k97J23L22l22O9Q1k39J70j59J64n3R8j91J68
6512B3M1k77K16j4L0J98k32l1J44n2n5K5o1R9l9j16J25j00J56j77J6K31j9j03
6536B8q1K5J36q6k1o1P5K7J9l2m6J04p9N8k28K47j50N6J15j90j51M22o0j75k5
$$ plain form
6360 35 0 -148 24 63 47 31 -131 64 -137 81 97 -56 32 12 5 161 -82 -60 -146 -84 191 -157 -59 -12 -8 108
6386 108 -22 84 90 93 131 42 14 -37 53 -29 -163 -241 -34 110 -173 -143 -59 8 -26 156 -4 152 -184 -177 143 -44
6412 -44 -68 145 -16 -65 16 70 -130 58 -51 -114 -108 46 114 -97 87 -23 85 -14 -92 25 -27 52 89 -77 -8
6437 -8 -202 -26 192 -50 -275 -42 5 -46 -34 64 -47 -18 -86 20 -76 -70 -15 -126 53 112 -87 -20 -96 -70 142
6462 142 75 -21 72 -164 -77 -202 -120 20 22 165 -69 -59 56 -22 129 24 122 26 -20 -54 -126 -103 13 -31 -37 108
6488 108 46 121 -82 -92 81 112 44 46 12 89 -208 -85 237 -85 -16 65 -174 -4 -163 1 -52 46 -145 23
6512 23 64 -213 3 -11 19 217 -15 -46 98 46 -9 16 -45 54 15 -101 24 -76 80 -97 -81 150 131 28
6536 28 -53 -28 108 22 1 -60 15 42 61 29 -17 87 8 66 -162 85 -65 -9 106 -84 -235 187 127 -48 -73
6561g3M5J0J43n3k3K7m3j40k3K69j70R9p1Q0M9j28m0L1O1l4P1j14J64j49j07M2
6587g7P2jj0j18K35q9Q2k33K30j32r5Nn1L0J1P3J84j70N1J08n4p8K40k08p3J63
6613I5q5J7o5Op5J42O5J5j84K6J0J4k18K34k14K87q4j93K68n0o0jJ25j13J25j11
6639b4r2J10K6k2r8J40Q5j36j56K09J44j98J4O4k40K96r5j4o0P2L9r9R6k64J46
6664e7J14k93K10O7r6K20l2j70R7j42K17k12J3O4p7k5O6j4J20k6m0k6M7M9k46
6689a72K44k19K00j07m5J9J11M1j2M4K1j18Kl5K5L0J55j71o2j3J1J16k87L27j78
6714g3J13J1Rm1k7O0j0J08j64J42j46J19p6J06l80K45L3k25J24Q9j78J42J12j60
6738f7O2pL3kl1j17K61j00Qj05J13M8j41N8M3m5j07J66L1k4K9j59J56k44J19J03
$$ plain form
6561 -73 -28 -18 125 72 49 76 33 -107 -130 139 -31 68 -3 77 126 -2 -42 -11 50 16 87 -27 137 -12 -119 -77
6587 -77 -5 -6 -16 -134 101 12 94 -139 91 -41 -136 -131 -182 -152 -141 -68 116 -54 -3 105 51 -27 213 5 -68 95
6613 95 10 27 -38 -32 -107 35 100 115 -69 -43 -33 -19 -237 -3 -217 70 -14 -207 61 11 -49 -50 75 -38 87 -24
6639 -24 -116 -6 20 -2 -100 40 125 -11 -167 42 186 -12 2 66 -174 122 27 13 -47 25 64 -35 61 -203 -57
6664 -57 57 -236 -26 41 -55 165 133 -37 60 -82 135 -77 -64 0 -77 -102 -36 -50 70 44 4 -22 25 74 -172
6689 -172 72 -147 53 -54 -99 -80 31 72 60 104 125 7 9 -26 -1 29 184 13 -49 -62 -51 65 -222 105 -73
6714 -73 40 51 60 19 -8 52 42 150 -14 128 -18 101 25 131 -249 -4 29 -196 -72 17 -161 -19 93 -67
6738 -67 -5 -12 21 19 -12 -129 132 32 40 -65 48 96 -45 13 56 11 -96 70 101 77 106 -53 103 -141 -22 81
6764H1r5j65N1J26r2J21o1R3j21N4m4l1M7L4k3k6k1J42k52K45j56J46j33K8lL5
6790b0j28J40j03j0J40j11Q4m7M2K1J3k07J68M6o7l4L2m0R9j2L7m2m9O1Lj8m3
6817d5j23P9J43r0r1K09k20J49j54K37r5J35k18J80j2r1k4J5r9P8j51J61L2k25
6841b20K03J02k29K1K66k00J63m9r5N9l9P6O9q0n9J4R6j48J20o4j40J21N1j08
6865g0l3J42j5J8j58J98k12J23Q3R1l8k35J83j39o3N5L15k53J34k32R1m7k3K6
6889e9k0jO8o5J1J27q1NL2N8j19o7J21j56K36j65K64j52j11R1m9kj24K98j19M5
6915F6j14J62n7n5M8r1r1M9J52j87M6J99j47J32j99J39j88J37J21q0j78J64k9
6938ak3j1J29p6M5j55J22k5m1J22o3Q0j17j6j20K93lo0j43J50ol6J25k79J2K25
$$ plain form
6764 81 -14 -179 -128 -2 -94 27 -34 59 -62 -8 -52 -83 -36 -2 -25 -51 -72 70 -182 63 -93 53 -80 -52 -55 -20
6790 -20 -148 -8 -111 -121 19 -92 -8 -55 -13 8 21 -186 -18 28 -39 -73 -41 -81 18 6 43 1 -48 13 16 -2 -45
6817 -45 -168 -89 54 -36 -127 82 -138 11 -143 94 -1 134 -84 96 84 -7 -31 -16 -115 -37 -188 -27 5 -220
6841 -220 -17 85 -144 -123 143 -57 106 57 -38 21 -18 58 127 47 -12 2 98 -50 70 6 -134 -13 38 -70
6865 -70 -103 39 24 42 -116 82 -130 -7 76 167 129 -106 77 -62 -125 -70 245 -8 126 -106 -15 -62 -85 -59
6889 -59 -79 -80 -12 -77 -66 61 -20 -15 17 75 -44 -111 10 -146 90 -75 189 37 -74 17 -32 -34 -158 140 21 66
6915 66 -48 114 57 2 50 -41 -132 -83 69 -118 -72 127 -20 112 -87 52 -136 1 122 42 -136 28 -1
6938 -1 -24 -35 94 18 63 -92 30 5 -36 86 23 103 -14 -30 -150 143 140 80 -63 87 81 45 170 -109 -97 128
6964A28l57J26M4j5o6J38Qj7q8J93P1l14J01K21p5kk0j80J72k66J75j8J71j69
6988c9k6J56k58J73r0O6k6J16j2j94K41j63LnN4J38r3J27k27J30o4j07J49j87
7012a38J06k1R2o0L7J7k5j57K43j20mj3K32k13o8j22K14K7o8n2K29j34O6k7O6
7037A07j44O1m5o8J54j74M3J4j6J64r6J89j16j17Oj38K07J9m4O0N8j70K1J35k2
7062H8j70J79l1O5k07Q2J10j15J2Q4n1m7Lk2j12J52M8n0q4M6k6Q5O9j04o2J04
7088D6j6j16J12J1j26J95j01p6k2K34j88K18j68m5K76j84m7j32K01j16K28j84
7110@q2R5K8j20n9K37l9n5N3p6j18J14K7j5K1j16L4J23K8j25J32j55Q2J50k84
7135a20K48L0j14k2J64j71j93J53N8k00Q7M7L04l20o2k0K1J41L0M9o2p5J15j66
$$ plain form
6964 128 -229 -103 -59 -74 -140 -2 6 -11 -99 94 165 -149 -48 173 98 96 76 -104 68 -198 -23 -41 130 -39
6988 -39 -65 91 -167 6 -84 -18 -44 72 60 -134 107 -56 -53 -58 -4 134 41 168 -59 71 7 -100 49 -138
7012 -138 -32 -53 39 -21 16 33 8 -149 94 -26 -30 -43 189 -24 -92 -214 0 27 -41 -93 136 2 68 41 107
7037 107 -37 24 -21 -89 65 -109 -66 -52 -68 96 0 189 73 -44 -38 -176 31 50 6 66 124 -46 -25 110 88
7062 88 -82 97 66 131 -76 6 116 1 13 97 46 -1 2 -20 -132 20 68 18 -66 -20 -46 39 108 4 -58 46
7088 46 30 -86 26 37 -89 106 5 -71 -93 141 -47 171 3 -42 234 50 3 -129 72 -44 184 0
7110 0 -82 13 41 -79 -138 99 60 5 58 -18 -136 -22 5 -10 11 -105 -71 52 80 -45 87 -68 14 164 -120
7135 -120 128 158 44 22 186 15 -178 -25 33 -167 -80 -33 271 -49 -111 -131 -110 31 61 110 48 -27 88 -78
7159g8J50p1J6J06r7Q2j86m4P7m2K2R4M0J16k37j4N8j16Q0m9J0J69n6j24L6R1
7185C3QL9o9L1l0q8l9O8K4j8p8J88j18l0J1p8P9J28m7Q8k29P4mk2N3N9j59N7N7
7214a2oj0j9l6j22K39Q0J19j71J31j60k47K16M4K9p3J14O9j90L3J33j30p1PJ50
7239A17o5j52L7M6N7N7qk81K80r7j5L6R7j8j24k0J39k5r7j0l3j61J98J56j20Q5
7265G9k22J82j22N2O3q6M0l6n6KK27j50K7M0l1N3j7k3o7R2o5l1P4J7p9K1Jj5N4
7294B4J14jj19J31o9j04J29j87J50k2p8n4J9J68j99J18L5q6n9K3L9M5o7J04K6
7319H0q9l4J75j81P7K6l4J09j67P6n8r8N8J73j28J84j35j11J96j50j10K91j88
7342c8K52k08J3J53j93J44q3O4m9o7o9P1J30j35j90K89j88P2rL5j2m9J44j1j14
$$ plain form
7159 -78 72 1 17 123 26 108 -78 -122 -45 -87 -65 29 69 185 -52 -66 -8 -124 -44 -93 -83 86 30 -94 -58 33
7185 33 41 80 11 42 12 -76 -115 -47 -23 -41 -119 69 -49 -79 -68 -146 -67 61 14 102 -127 -53 -57 -79 -26 33 -126 -69 -12
7214 -12 -18 -28 -47 -83 -205 34 114 233 62 193 33 -214 2 46 75 2 116 185 -5 28 161 31 -40 -33 117
7239 117 52 -100 -63 -17 40 97 89 -192 88 -9 -24 12 109 91 -33 -53 86 61 -36 -46 -79 -240 -42 114 -6 79
7265 79 -143 39 -83 -31 32 -54 -14 -50 -106 -104 123 -27 0 40 9 62 45 22 -45 47 -18 -49 25 42 -37 -16 -15 -30 24
7294 24 138 137 18 149 80 -24 105 -82 68 46 -32 -86 -67 101 -98 20 55 -31 -90 -67 -28 17 -50 54 80
7319 80 -9 -43 132 -49 28 54 20 129 -38 38 -20 -118 -60 113 -15 169 34 -77 119 -31 -141 150 -38
7342 -38 214 6 19 172 -21 123 40 104 55 -12 -81 -10 120 -15 -205 84 -104 -32 -41 -6 -18 -67 77 66 -48
7367d8J0P9k0r7J82o5j9N5j50J69n3j43J86j44K23j76L7J44j10l9RJ29m15K81
7391B5Pm0J48mk94J59j5M6m8J50j98M6p8J72j08%m3O6N7L0m0j22Q1J6M0j6N1k20
7419a32K06j09n4K09j53j4J60m5L4k02O2k2Q3P6o5p3Q2N6n5q3o2J88k03J99q0
7444Cq6J0N4m4J06M1k7K5o0M3o1J05k18P4Q0p6p3K95k56J53j51R0N8k04O7J11
7470E9J04p0j20p7J19RM0Q8k35K54k07m5J71j60j76J09K05j4K9q2K03j09j79p7
7494a61J67K5o9j1q5J68o0J54N9k17q5J19J20p8K62m72J31J08K0k5n0R9j87N1
7518a7L5NK7J00k12J52j3J93j73j30J06o9Mq9Q0p7J58R6j75J42n0jq4J00j09J08
7544A07q4r3Q8J2k42J36J10j17J48j01J52n0q9M3j15r5M2N7J48L0k5q5J12l6P9
$$ plain form
7367 -48 -38 41 21 -76 106 41 22 77 -73 96 43 -100 86 -58 165 -11 26 170 60 21 30 159 -256 25
7391 25 32 -8 140 136 -158 1 -14 32 -16 134 -64 -18 -96 76 -32 -32 -75 -9 48 78 38 -84 -3 13 53 37 88 -132
7419 -132 74 -35 -89 120 -33 -47 113 68 102 -100 -38 -60 23 99 34 -39 43 99 44 -39 -101 87 -116 83 3
7444 3 -83 -73 -19 -63 43 84 57 82 22 65 4 109 -109 -35 45 -31 -104 191 -65 88 -63 27 85 -119 -52 59
7470 59 163 93 -27 -104 15 24 64 152 -83 171 -36 -81 90 -70 -246 -137 68 54 83 1 204 95 -84 -161
7494 -161 6 31 -38 -49 -134 34 -26 128 187 -30 -115 4 124 46 308 -164 -33 75 95 70 20 119 -68 -17
7518 -17 18 23 50 150 -62 90 77 270 97 -33 73 4 8 -81 -1 -78 80 176 1 143 93 92 8 108 -1 107
7544 107 23 -70 18 30 -212 -76 34 -83 65 -36 116 66 -23 20 -95 -190 -148 -91 57 87 62 -23 89 53 132
7569A32n9J7k80L29j29M6j55Q7J15J06l75M07k53n7O4o1J42Jj91M3r4K55J01j24
7593F7q1J19k48R3L1k2N6J10l2l7K0L8%j54N1n6J69k80J52N3k0j85J10O9M0o1
7619Bl3n2k3oK63j89MK0J32J57l71J12M1k5JJ04j21l6j63L37K1j96J98k82J28
7644B3n7K24k43N5J15j19jm0L1p5P2J13p0oj25j02J14N1J10k74K95o1n3k5Q3p5
7670d0p4m6L24k13Q2JP1j42J73j0k83J63J81j75n6J02Q9o5k7RLq3LJ51q4Q9j15
7697B8%j6n9R0j26J04J8j53J13j43J13O0On7J9p3J83l4L5j73P2O1oP2j20Om8j32
7725a60J68J22p9k69L19j46J43k12J28M0p7Q2rr8O3Q2k31J00J82l0O5j81o8J21
7749E5J3p5j22J63j53Q4Lp3P9J77j01J0o2J33m1n3n2L1kj09J98j29o4j5O8K0N4
$$ plain form
7569 132 73 90 -190 139 10 56 -99 -12 103 209 -166 241 -12 -69 -5 -66 76 77 -114 -71 -165 90 191 67
7593 67 -14 105 -143 -50 -19 -41 15 125 93 56 76 114 114 -40 11 -45 124 -156 -4 49 29 -156 -46 23 63 2
7619 2 -31 -83 -106 -112 151 -38 -34 -14 118 275 -96 16 57 32 33 137 16 -20 -183 154 175 -21 177 -105 23
7644 23 -34 190 -53 2 117 -2 -3 -43 -12 -87 -15 98 28 22 -103 -205 -91 -40 70 -204 91 30 -23 -48 35 -40
7670 -40 -114 -160 164 -49 33 34 105 -37 136 126 -157 6 187 12 -44 58 147 82 55 64 67 -16 -13 138 54 143 28
7697 28 28 12 -47 43 -83 21 39 -114 -1 -144 -31 29 35 -22 -3 -76 107 73 108 -65 7 68 62 134 14 20 -28 -160
7725 -160 8 130 51 -218 101 -45 98 -114 14 54 -23 59 50 -48 15 97 -134 -34 148 118 183 2 -66 55
7749 55 68 -7 -129 34 -119 -35 -32 -105 -26 151 50 60 -2 131 90 37 -15 16 14 -95 103 -26 -90 -105 -37 -17 37
7776C7j14P8j5J26r4j75K47r7j9rQ6M9J30l50J48O7q2o8lL8J0J05p8J33j31J8
7802C7J50k73P6Q7J10l31N8L9L4j45J99r4J4M4M8P3k03J55r9j69K54k7l7l9m3
7827h2O1l9j12K25n9P9Ko3J13j66M8k6j54O3L2R0q7q8J49K5J85k98K71o6k20J26
7853IN9n5o8l8K00j23R7l9j3J27j67m1M9l6k8OJ38k21K46q3J13r9j53J13j04O9
7879d2l9m0q9J01Q4k4J76j29J38j46j17Q1j5j7J55j98J25r6k4K07j38J17m0P5
7903A05p4m8l6J4J16L0n4j61p5J21J10j06L7o9J16P6m6j95Q8L6k8K0j4l0k3L18
7929B28k36l6J30J1K4k58J86o3J14N4j09j8O7L5q8j69P8K1j2K7k2L2m3n8J2J20
7955B7n0p9J18j17J0N3j41J07M6Ol6K02j80O3q3k7P7J02k34R8N3j73K17j12J4
$$ plain form
7776 37 -77 1 -14 112 18 -157 90 -7 -26 -35 51 100 230 -120 28 95 13 -55 -58 -20 -10 95 17 150 19 37
7802 37 187 -86 -10 77 187 -144 -86 -47 -13 -158 41 -53 -39 5 53 126 -77 78 -21 -190 64 37 0 -39 -82
7827 -82 -21 -60 -172 53 -6 73 75 12 125 -41 7 -19 -173 -110 -78 12 -75 -163 -14 11 196 -102 169 103 -117 9
7853 9 68 13 -55 -93 107 -16 81 42 29 156 -11 -52 -3 -39 -67 -61 77 -144 102 19 132 33 -120 -7 -111 -42
7879 -42 -81 -121 -210 -109 -25 -49 127 -2 136 -10 -127 -46 -61 -78 77 -121 4 -92 -116 91 -47 70 30 105
7903 105 31 -17 -53 -39 77 107 53 -108 -183 -62 48 -58 -21 -90 26 102 56 -139 -51 -15 -43 -23 -37 -67 -90 228
7929 228 -8 -44 86 97 121 -137 49 -14 100 154 45 27 94 129 41 -128 -50 -29 -41 -14 -36 -4 -47 -105 -93 27
7955 27 -23 -102 16 -101 -91 -38 -179 -72 -26 -20 -56 146 -34 29 -54 -81 -4 98 -136 -38 15 -158 59 -53 -39
7980c9m6o4Q7K01L8k71n5J93Q9M4l25K07n3p6J39j01J03q7L1J55j53J68j49J12
8004A48r3n2k32J95J89j46K6j95J50J0n8K19k46j1O4J0M0j08J11q0M9nL5n3J54
8029A21j41Q4k13J22O1j18QJ39j6l9o6M9J13j07O5j55M0jJ11j08R2k6l9J1J1q7
8055h9J05q9J96j01P8j5p1n6J44n5k28M9K53j94J28k39K44J28Pj69r5j7J29j04
8079f1M3P5K0N8jj45j74L17j10k36J13J07J13j26l5O0m7qM9N3j37J18j38K3J09
8104D0M6l0P7j71J50r6n0M8p5n4Q8p8Np1K67J2r4J78k75K54j45l3R7p4N1j29L3
8131b9M6n1J17j3p5L9p6Q1k01K50p9j57K78o8n1O4q9J70q7l8j11K4Q2j4k8J27
8157A11k63l5L98r5k06R2M0J77k02J58j63j4o2kq9j7O3J31m7k4L2Q7j68Q2j36
$$ plain form
7980 -39 -85 -149 -62 139 177 -94 -149 44 133 177 -148 59 6 -70 69 -32 71 -16 15 170 17 185 36 148
8004 148 55 3 -229 -34 155 9 35 -160 -10 0 -58 161 -85 -96 -32 -22 18 -90 21 -59 -10 -15 20 -33 121
8029 121 -20 64 -149 -27 34 -84 -76 63 47 8 -58 -9 104 -3 62 -93 -53 -54 57 -51 41 15 -24 -13 -2 -89
8055 -89 16 -73 123 22 100 85 14 -42 102 47 -181 -132 121 -73 55 -184 60 188 195 26 -69 -86 43 -61
8079 -61 -18 57 77 135 134 -11 -185 132 22 -214 -101 6 119 -7 -42 18 -29 -37 12 65 -72 46 -92 -69 40
8104 40 86 56 133 -38 112 16 -34 14 -61 -115 -27 -105 -100 -171 96 108 14 192 -83 171 26 -7 90 16 67 -62 -29
8131 -29 17 -34 83 70 -5 34 -42 39 -162 88 9 -148 130 62 11 75 -14 156 69 31 -80 -56 26 12 -16 111
8157 111 -152 -187 211 116 -90 2 42 219 17 175 12 -2 -64 -66 -155 -172 -109 22 -25 -49 -17 70 -98 -16 -152
8182a52K48k66K69j4j61J24J2o8j20
$$ plain form
8182 -152 96 -170 99 85 -76 48 60 -8 -128
8191a28
$$ Imaginary data points
##PAGE= N=2
##DATA TABLE= (X++(I..I)), XYDATA
0@%%%%%%%%%%%qJ6j6J6k4L2m0M8n6O5p3Q9j11J34j53J77k08K40k73L13l60M09
33B17m64N27n93O65p45Q33r31J038j155J281j419J571j738J919k114K330k570
50a348K831l118L438l792M185m627N130n705O365p138Q060r177J0565j2345J4717
65H041j8057K3152l1960N1412j72718M5420J46674k21272J40112O5024j12967
76g7139J07112J31636j58355l650J02801p8805l7190J32153q8759j22255J47889
87E5438J4005j80165J01479N9388j58044Q3352R8560j42567O7898J03158j36759
98c4257L3091J23381j37783n4618J32495m1505j03844P7841J8305r0725P0948
109f671N6761j27539L2679J06912j06143O617J02428j20005j896J55584q5008
$$ plain form
0 0 0 0 0 0 0 0 0 0 0 0 0 -8 8 -8 8 -16 16 -24 24 -32 33 -40 49 -62 72 -81 96 -112 128 -145 168 -192 217
33 217 -247 280 -313 352 -393 440 -491 547 -608 673 -746 825 -913 1006 -1108 1222 -1348
50 -1348 1483 -1635 1803 -1989 2196 -2431 2699 -3006 3359 -3779 4281 -4896 5669 -6676 8041
65 8041 -10016 13136 -18824 32588 -140130 -94710 51964 -169308 -29196 35828 -77139
76 -77139 29973 161609 3254 -396 102405 23600 -13590 118563 29804 -92451 55438
87 55438 69443 -110722 -9243 50145 -107899 -24547 74013 -68554 -656 102502 -34257
98 -34257 -1166 122215 -15568 -70186 62309 20804 -83040 -5199 13106 -77619 -6671
109 -6671 50090 -77449 -44770 62142 -44001 -37384 65044 -54961 -56857 98727 13719
120A3719o6581J15669l0677n5086Q1186k4117q0882N9011L2234p7906K2231O5035
132E3836q0969j4700J03040o5923o1718J00042m2880o4726J10139k2547q1695
143f8101R2563J0653o9673N9409J0250p4331L6509N0056n9713k0368N8871k1744
155D381l8064O3148j6167p1370P5668J9339q7005N6133L2122q0312M9612M2260
167D9745p8527K1081M6428n4579J800M5330l6289k8786M5681M373m4077L2675
179D855K1332o2352L2173N4352p5094K237O0278o1833K725O3162o2760j5117O9952
192C3910k6169k7197L9316r619k7438K8811J2670m3489O63L9711l1867j2002M9394
205B6694l8231k4652O6279k8576l6886O0737k1292l5480O0864p432m3466L7788
$$ plain form
120 13719 -52862 62807 32130 -22956 58230 34113 -46769 12242 44476 -33430 -11199 53836
132 53836 -27133 -41833 61207 -4716 -66434 33608 -9272 -73998 36141 13594 -68101
143 -68101 24462 35115 -34558 24851 35101 -39230 -2721 47335 -12378 -32746 26125 4381
155 4381 -33683 29465 13298 -58072 17596 36935 -50070 6063 38185 -42127 7485 49745
167 49745 -28782 -7701 38727 -15852 -14052 31278 -5011 -33797 11884 16257 -27820 4855
179 4855 26187 -36165 -3992 50360 -24734 -22497 37781 -24052 -21327 41835 -20925 -36042 33910
192 33910 7741 -19456 19860 10241 -17197 11614 24284 -19205 -18542 21169 -10698 -22700 26694
205 26694 -11537 -36189 30090 1514 -35372 25365 4073 -31407 29457 22025 -21441 16347
217A6347R715l4111J4544J5515l5471r889M0894j4326l7702L8875L93m0771M9323
230A3336O841n9447M1051K2440m8184L1722J7230m5785K4380K7243l3880j766
242d819K0108j5131j2816K0562k738l3054K2525K2944l9768J5612L0873m6312
254b2014J4802M1788m6328J192L8043l3606n38L0523k5494r509K0959o603j3961
267a0746N469O521j4789J094K2929j9232p853L4063j7269j1384L5948k3231j5575
280a4055L7970j8736j7641K8100j4319j3822J9702o037j1148N353M056l372n536
293i485J1733m2j4204K0179K022k2898K2537K467k3812K3031j354k3144K0510
306G540j716j6825J4290l744p732Q355l587J093O03k238Q932p488j439J2748j3094
$$ plain form
217 16347 26062 -8049 6495 22010 -13461 -23350 17544 3218 -34484 4391 4784 -35987 13336
230 13336 20177 -39270 1781 24221 -23963 7759 24989 -20796 3584 30827 -3053 -4819
242 -4819 15289 158 -12658 7904 5166 -27888 -5363 17581 -22187 -6575 24298 -22014
254 -22014 -7212 34576 -11752 -10560 27483 -6123 -6661 23862 -1632 -11141 9818 3215 -10746
267 -10746 -5277 1244 -13545 -12451 10478 -8754 -16607 17456 187 -11197 24751 1520 -14055
280 -14055 23915 5179 -12462 15638 1319 -12503 7199 1162 -9986 -4633 -577 -3949 -9485
293 -9485 2248 2206 -11998 8181 10203 -12695 9842 12309 -11503 11528 10174 -12970 7540
306 7540 5824 -11001 3289 -455 -8187 168 -3419 -2326 -1723 -3961 4971 -2517 -3956 8792 -4302
321d302K625J3212j8175N423J1833j7638Q393O682j5685R572J272r344R853n246
335a525k232R669r019L436M849j1626J0282J284j3405J0608k730q072J3431o247
349a297m175Q822p151M616L609j0211R577j761q794J5165p430p450J7033j0117
363D36m675J4010j2647j286J0819j0269L078L265q088O354K37o62L889j0197N715
378b1N169j2942J0434j157j7377J9391J417j9215J6575o24j2990J7944j826j2707
392g929R613K630jR93j091K936o025M045R498j8773k37J2330j9239O159J3424
407H333k4431P547J7137j8486Q215J0326j7912O782J1719r389l011M020K127m186
421a209R47Q364j6234l977K3925j5522j0666K4111j5373n574L0842j4743j2673
$$ plain form
321 -4302 -1677 11535 -6640 -1217 10616 -7022 1371 8053 -7632 1940 3212 -6132 3721 -1525
335 -1525 -3757 5912 -3107 329 5178 -6448 3834 5118 -8287 2321 -409 -8481 4950 -1297
349 -1297 -5472 3350 -3801 815 4424 -5787 3790 2029 -6765 8400 970 -6480 10553 436
363 436 -4239 9771 -2876 -4162 6657 -3612 -534 2731 -5357 997 1234 572 4461 -5736 -21
378 -21 5148 -7794 2640 1483 -15894 3497 4914 -14301 2274 1650 -11340 6604 4778 -7929
392 -7929 1684 4314 4313 5306 4215 7151 1126 5171 14669 -4104 -4341 7989 -11250 -5091 8333
407 8333 -16098 -8551 8586 -9900 -1685 8641 -9271 -2489 9230 -159 -3170 850 2977 -1209
421 -1209 -262 8102 -8132 -12109 11816 -3706 -14372 9739 -5634 -11208 19634 4891 -7782
434g782K3139q687p364J3838j0575j0915Q603L364p932n082R126m657p231K1533
448I378p237k1725K6593Q45k1579K6187l335k6459K7613N208k5104J2949K744
461F078j7810Q674Q605j3294n594J5067L471j3321J2913N031k1927J8811J1843
474A8547l3176J3357J6778k9628J5695J8320l2394P069K1501k0873j570J3171
486F797j2523n151J5382K170j5090P536J3860j8363M649J8735k9386j190L0259
499A7685k4274n310K6654k4964l426L1398k0521j2980K1738q729j0692J7001J936
512E516j6791O711J9476j2750p106K2222j3502j1920K9643j4904k1601L0801j0061
525E734k1304L0223q960k5841K4464K149k0813J1384M333j4841O335J6225j0481
$$ plain form
434 -7782 15357 6670 -694 13144 2569 -8346 257 3621 -4311 -9393 -267 -4924 -12155 9378
448 9378 2141 -19584 7009 7854 -13725 12462 9127 -17332 10281 15489 -9615 3334 6078
461 6078 -11732 -3058 5547 -7747 -13341 1726 5197 -8124 4789 9820 -12107 6704 18547
474 18547 -14629 -1272 15506 -14122 1573 19893 -12501 -5432 16069 -4804 -6374 6797
486 6797 -5726 -10877 4505 6675 -8415 -879 12981 -5382 -733 18002 -11384 -12574 17685
499 17685 -6589 -11899 14755 -10209 -13635 17763 -2758 -15738 6000 -2729 -13421 3580 5516
512 5516 -11275 -4564 14912 2162 -4944 17278 3776 -8144 21499 6595 -15006 15795 5734
525 5734 -15570 14653 5693 -20148 4316 6465 -14348 -2964 1369 -13472 -7137 9088 -1393
538a393j1016K0505j536k0074K2303r47l1829K4814J2402l0314J7716J1301k4652
551a2720J8751J4071k4860M503J2595j1908l62J0412p152j2058J2901Q191j9810
564g446M800J1747k4667Q765K1673k9584J638K6099k1965O65K1702k0658n196
577a2427K0594p502q519Q607l63o621P802J0022j4981m123K0936j0315r505K0377
591A3982j4742j1176K8198j0768j5742K2420p771j2002J9756n429j7264P920N790
604C172p461l315N111l753o112J5349L65j7137J5459L314j7767K0942M165k5811
618a3479J6946J0889j8348Q527L473j3910P108N707r908k973O460R75p226P685
632A926O128j7908P803J8108k0827j68J6079j8233M067J5872k0599J004J5824
$$ plain form
538 -1393 -12409 8096 6560 -13514 8789 7842 -23987 827 13229 -17085 631 11932 -12720
551 -12720 6031 20102 -4758 -255 12340 432 70 10482 3330 -8728 4173 12364 -7446
564 -7446 -2646 9101 -15566 -6801 14872 -14712 -13074 13025 -8940 -8275 13427 -7231 -12427
577 -12427 8167 665 -7854 753 390 -6231 1571 11593 -3388 -7511 13425 3110 -6395 13982
591 13982 -760 -11936 16262 5494 -10248 12172 4401 -7601 12155 6726 -10538 -2618 3172
604 3172 -4289 -7604 -2493 -6246 -12358 2991 3356 -13781 1678 4992 -12775 8167 12332 -13479
618 -13479 3467 14356 -3992 4535 8008 -5902 1206 6913 -2995 -5968 492 1467 -5759 1926
632 1926 8054 -9854 -2051 16057 -4770 -4938 11141 -7092 -3025 12847 -7752 -6748 9076
645I076j4064j295J1415q584n512Q354M705p500j634J0288o053j961J5437j2938
659b66q115K1001j1509r839K1061j3008j2245K1693n345j1483J1282k678n747
672e198P310J92o396j57Q660k859q208J2634k092j3979J8009N03k0256J6359K138
687F660j7866J6320J560j7680J2726M285j2858O222M015p371r93P200K92q731
701f219O120P091j2189O865Q873j8085P322J2347j8860N956J0245j8063O452J0906
715H761j4649K074P231p225K26M567n90l875J656P195p053j461J2019j0177l503
730d804J5219j1707m597J4850j1778k874J3225j1149k178J0219p055m1M905l711
744a476J1J154K665o93m867P150r90p873J0111k980r248J3052m463r821J2723
$$ plain form
645 9076 -4988 -6283 5132 -3452 -8964 -610 4095 -3405 -5039 5249 -804 -2765 12672 -266
659 -266 -8381 12620 1111 -8728 12333 -675 -12920 8773 3428 -8055 3227 549 -5198
672 -5198 2112 2304 -4092 -4249 4411 1552 -6656 5978 3886 -10093 7916 8419 -11837 4522 6660
687 6660 -11206 5114 6674 -11006 1720 6005 -6853 -631 3384 -3987 -4980 2220 2512 -6219
701 -6219 -99 6992 -5197 1668 10541 -7544 -222 12125 -6735 -779 9466 -8597 -2145 8761
715 8761 -5888 -3814 3417 -3808 -3582 985 395 -3480 -1824 5371 -1682 -3143 8876 -1301 -4804
730 -4804 10415 -1292 -5889 8961 -2817 -5691 7534 -3615 -5793 4426 -2629 -2670 2235 -1476
744 -1476 -1465 -311 2354 1661 -3206 3944 2954 -4919 5192 2212 -7036 6016 1553 -8268 4455
759D455m747p115J1756n207m822Q352l186q00L557j672J592j982O72L448o628
774b327L749M210j0476N717M088j1135P390K319j1002P964P16q092P538p22l979
789d042N610k635N23K521l215M024j326k984O816n354j804Q406p814m01P299r295
805c671J777O466q644K721K441o005N562l61l208M894l180O09M160n753L162J782
821B752n965N994j066o152P771k971m343P534n625k005O501n213J646L626n528
836c044M596J472l586N576l325k391O234n703J24L729q052L413K964p955M192
851a756R6m899O868j959l351O283l294K087N273o080L436K741n063N757j370o019
867a250N126l752k474N320o945k8N123n992L546J982o317N716Q10l729N717l599
$$ plain form
759 4455 -292 -7407 4349 -858 -5680 2672 -514 -1314 2243 571 2163 181 853 4301 -2327
774 -2327 1422 5632 -4844 873 4961 -6174 1216 3535 -7467 497 1213 -6879 659 -63 -4042
789 -4042 1568 -1067 -544 1977 -1238 2786 1460 -1524 5292 -62 -1866 6540 -1274 -1675 5624 -3671
805 -3671 -1894 4572 -4072 -1351 1090 -4915 647 286 -2922 1972 -1208 -599 3561 -2192 970 2752
821 2752 -3213 2781 1715 -4437 3334 363 -3980 3554 -2071 -4076 2425 -2788 -1142 2484 -3044
836 -3044 1552 3024 -562 5014 1689 -702 5532 -171 -47 3682 -4370 -957 2007 -5948 -1756
851 -1756 -1660 -6559 309 -1650 -5001 1282 -2012 75 5348 -732 2704 5445 382 6139 4769 -1250
867 -1250 3876 124 -2350 2970 -3975 -4003 1120 -4872 -1326 656 -5661 55 865 -2864 2853 -746
883g46j456P177m160M60L059p385L792K363o954L712j219l674O653k764j814N434
899B478m568K454M430o925L626K384m834O353j781n585N970l187j857M490p584
914d136k79M188n444L511J484n597N597O75j984N293m724M1O467n513K039K676
930D294p205N918K214o919M601k672l814P156l606l421M297l861K330L629n505
945b564K653M49k930N350l526k942O335m487P16N541p386K330M897o300L401R9
961A636o955N932j9m022M440l748l91N727l843J562J000m505O075K14m143N512
977D472l644j310P252o330k227M459o258K043L329p411L447J573l307N864j877
992G5l197N569k341R67L515n574K189J868m363M601k842m808O114l383k425N421
$$ plain form
883 -746 -2202 4975 815 1275 4334 -3051 741 3104 -3850 -138 -1357 -5031 1622 -1142 -2956 2478
899 2478 -2090 364 4794 -2131 1495 3879 -955 5398 3617 -1968 4002 815 -1042 3448 -4136
914 -4136 -4415 -227 -5671 -2160 -676 -6273 -676 -1 -1985 3308 -1416 -1375 5092 -421 1618 4294
930 4294 -2911 3007 5221 -1698 2903 231 -3583 3573 -33 -3454 843 -3018 -688 2941 -2564
945 -2564 89 538 -2392 2958 -568 -3510 2825 -1662 -946 4595 -2791 -461 4436 -1864 1537 1636
961 1636 -5319 613 594 -3428 1012 -2736 -3127 2600 -1243 319 1319 -3186 2889 3103 -1040 4472
977 4472 828 -482 6770 440 -1787 2672 -3586 -1543 1786 -5625 -2178 -605 -3912 1952 75
992 75 -3122 2447 106 1073 4588 -986 1203 3071 -1292 3309 467 -4341 1773 -1610 -4035 1386
1008A386o533J110O885n851K091L197n312N976K258n376L302j077j494M187m079
1023F70m23J175m418M441p57n748N280k138l201P941n085k960Q167l986l64O010
1039D604o332J001L866l897L265q40m234L244j234K87J959n846L313K769n549
1054c624N306l60n789Q118r03n126P255l506l024P834m335l426L392k518R34P9
1070C07l509K333k258o09M839m856P13M292n805N298L649q847N389M103o411M784
1086C412k00n162M939j062k441K472l562k5K085k151K744k785k329P341l490k513
1102b727O728n092n44O473n999P43M090o527L070K530n573J989K92j000L161m036
1118b422Q51L273m282L849J386o138N250L7m381O633l313m596P100k518k298M220
$$ plain form
1008 1386 -5147 -4037 2848 -3003 -912 2285 -3027 2949 5207 -169 3133 2056 562 4749 670
1023 670 247 1422 -2996 1445 688 -5060 220 -1918 -5119 2822 -2263 -5223 2944 -1042 -1406 4604
1039 4604 -1728 -727 3139 -758 2507 1667 -2567 677 -557 -270 1689 -4157 -844 1925 -3624
1054 -3624 1682 1322 -4467 3651 2748 -2378 4877 1371 -1653 6181 1846 -1580 1812 -706 228 307
1070 307 -3202 -869 -3127 -3736 1103 -3753 -3040 1252 -4553 745 4394 -4453 936 5039 -1372 3412
1086 3412 3212 -1950 2989 1927 -514 1958 -1604 -1629 456 -1695 1049 -1736 -4065 3276 -214 -2727
1102 -2727 4001 -1091 -1635 4838 -1161 -418 3672 -2855 215 2745 -2828 -839 -547 -1547 1614 -2422
1118 -2422 -1571 1702 -2580 1269 2655 -3483 1767 1804 -2577 4056 743 -3853 3247 729 -1569 2651
1134B651m040J019K835l640J998p96j972M355l212n60L424n921K882M828p529
1149c678K855L349o241M898J899n635M296r4k916M050k368r02J603k857K502p99
1165c8l523M520k148j592N761n444m97P531o064P48N993p013J433N449n577J046
1181E85J568l616J554j54j282J35k326L636k00m492O112j370m484Q739k813n269
1197c677Q786l481m147Q236m543m070N846k815k180K373j287o50j020J916J558
1212H45m599M089K432o692O243K154r035P674K328r651O811R03q149N832P44o075
1228d146L371O81k379R46Q19J057k775J848M690n845J421O657q160J687O732r510
1244b906J687O511q717J775M946p177J558L751l882M22J563K66p97j70L949k676
$$ plain form
1134 2651 -1389 -370 2465 -1175 823 27 -1945 2410 -802 -1362 2062 -3859 -977 3851 -3678
1149 -3678 -823 2526 -3715 1183 3082 -2553 1743 1649 -1267 2783 415 -487 1116 -1741 761 -38
1165 -38 -3561 959 -1189 -2781 2980 -2464 -2961 4570 -1494 -746 5247 -1766 -333 5116 -461 585
1181 585 2153 -1463 91 -63 -1345 -1210 -3536 100 -100 -4592 1520 150 -4334 4405 1592 -3677
1197 -3677 5109 1628 -2519 5717 1174 -2896 2950 135 -2045 328 -959 -1609 -2629 -713 845
1212 845 -3754 335 2767 -3925 2318 4472 -4563 3111 5439 -4212 2599 3502 -4647 1185 1929 -4146
1228 -4146 -775 -94 -2473 -1527 -708 349 -2426 -578 4112 -1733 -312 6345 -1815 -128 6604 -2906
1244 -2906 -1219 5292 -3425 -1650 3296 -3881 -2323 1428 -2454 -2032 -469 -203 -1000 -1170 2779 103
1260A03k224O732l951l837Q407n079l810Q491n641l503Q109m859j784N482l896
1275a260l70K944j369q3k33R75N87l361L730L86n507N922j23o987O711k83o440
1292d761P035j132n219N891j225k796M192j750j031J208r25J801j742l74L377
1307B549l768J096L956o231K274M117p070K731K669o323M125K078n328L153M27
1322D55k299K814j172l93J190j951K890p02k438M425k530j890N243m765j089N810
1338C598n125P5M471n302J197L523m025J611M54k153K321j581L24J621l322K562
1354B49J317l856M400n40m208N612j359m375N124k545k097M547k896j157K964
1369A180k385J202M15j937K543j599k92L856l671P09L569m886J793K291n492K427
$$ plain form
1260 103 -2121 4611 660 -3177 5230 151 -3659 4832 -809 -4312 3797 -1062 -2846 2636 -1260
1275 -1260 -1630 1314 -55 -138 -371 604 1191 -2170 1560 1946 -3561 2361 2238 -4749 1962 1679 -4761
1292 -4761 2274 1142 -4077 1814 589 -2207 1985 235 -796 412 -513 1288 -454 -828 2549
1307 2549 -1219 -123 3833 -2398 -124 3993 -3077 -346 2323 -4000 125 2203 -3125 28 455
1322 455 -1844 970 -202 -595 595 -1356 1534 832 -1606 2819 289 -1601 3642 -1123 -2212 3598
1338 3598 -1527 -1452 3019 -2283 -1086 2437 -1588 23 477 -1676 645 -936 -612 1009 -2313 249
1354 249 1566 -2290 2110 1570 -2638 2974 1615 -2760 2364 -181 -2278 2269 -627 -1784 1180
1369 1180 -1205 -3 412 -1525 1018 -581 -873 2983 -688 21 3590 -1296 497 2788 -2704 -277
1385b77J260m709L388Q6k988L976j093q34K672k486J747J548k986K773q20k493
1401a236M470k098k402M004l796q13L692m150L64K453l354K680Q16k406L092p77
1417E39j376L580l179j07K717l485J914J456m004K589K21k977L504j934k086L132
1433E04j948M08K665l409K458J572l296L208n57l108M183j895k549L257k652l24
1449a483L476l552Q0J399k062K420l69k083L204j813N12L483l761P96K764m400
1465a389K206J232n119K977J158l286L107n06k368L210q15k21M60k258K257o4
1481E81j939L300k505j592M939l408j376M273m052N06M538m961R50K918k857J569
1497H84Q46k784J019l4OJ86k601K056L91k648M505r55l801N570j350l241N294
$$ plain form
1385 -277 983 -3726 -338 -252 -3240 736 -357 -1191 1481 -1005 742 2290 -696 2077 1257 -1236
1401 -1236 3234 1136 -1266 2738 -1058 -1871 1821 -2329 -1965 488 -2866 -186 630 -1776 1316 539
1417 539 -837 2743 -436 -543 2174 -1311 603 2059 -1945 644 865 -2112 1392 -542 -2628 504
1433 504 -1444 -1036 1629 -1780 678 2250 -1046 2162 1605 -1503 2680 785 -1764 1493 -1159 -1483
1449 -1483 1993 -1559 -1479 -80 -2142 278 -91 -2174 1030 -783 -271 3212 -549 247 3011 -1389
1465 -1389 817 2049 -3070 -93 1065 -2221 886 380 -1988 1222 407 186 646 -1612 645 581
1481 581 -1358 1942 -563 -2155 2784 -624 -2000 2273 -1779 -1273 3265 -1696 -746 2172 -685 884
1497 884 1730 -1054 -35 -69 -63 123 -2478 -422 -31 -2679 1826 871 -2930 2640 1290 -1951 3343
1514C343k627k762M983k484j707K843k376n78J364j299j5j066J121J909k744K731
1530F36K011m832M337K206o536L990J380n955L475J059n100K834Q19k668J644
1545g00j29k35J72K48K298k292P9L893l627K3M760n741J76N369o166M59M178n494
1563b729K37M071l282n0K191p88j17J77J540j019j779M019j421l175N402k544
1579G33l691O593k936m426O099k422l737N353j416k805L232Mj008J79J042j16
1595F78k463K973Q42m942L821J880n919M468J602o674M589J882o066L477J296
1610A444m494L017J712k757J28J285L80j866J229K148l951J446M272n742O50N365
1626D266o566R24N735p127L62N342m932L1L907l042o94K539J7j642O33K284k438
$$ plain form
1514 3343 716 -2046 2937 453 -1254 1589 -787 -1365 -1 -1300 -1315 -2381 -1260 649 -2095 636
1530 636 2647 -2185 2152 4358 -2178 1812 3192 -2763 712 1771 -3329 -495 324 -2344 -700
1545 -700 -829 -1064 -892 -644 1654 -638 -559 3334 -293 -270 4490 -1251 -1075 4294 -1872 -1413 2765 -2729
1563 -2729 -2492 1579 -1703 -1753 438 -350 -467 -290 1250 231 -1548 2471 1050 -2125 3277 733
1579 733 -2958 3635 699 -3727 2372 -50 -3787 1566 150 -2655 577 581 -427 -248 794 678
1595 678 -1785 1188 2030 -2912 909 2789 -3130 1338 2940 -3734 855 2737 -3329 148 1444
1610 1444 -3050 -33 1679 -1078 -950 335 715 -1151 78 2226 -1725 -279 3993 -1749 -1099 4266
1626 4266 -2300 -1376 4359 -2768 -2406 2936 -1996 -1965 1942 -1100 -1794 745 762 -880 -247 2037 -401
1643d01r01M868l799k518O735l922l834P382l950l330O885l169l802N671j627
1658B88k641L377k6k512P47K332j058k524L950n20m310N395k00o221O260K47p126
1675d542O435L07o719N116J386n281K981J588l200J157K255j016j715K739J184
1690B675m259K634K770o523K667L872p944K543M823p088K075M647n958J670M239
1705B843l869PK701r71j439J433J911l211O3L859m472q74N654n175j828O651n160
1722a877j643O740l983k218N771k700k106L545q77j725J214J681j940j053L665
1737B494j391l524M920j477n112N848j203n380O327n16m811M970M44l914L606
1752A281N65k577R03J556o25j834K086P56m091K500J830n614K488K848o406L000
$$ plain form
1643 -401 -1302 3566 -233 -2751 3984 62 -3772 3610 -340 -3670 3215 46 -3756 1915 288
1658 288 -2353 1024 998 -1514 -767 1565 507 -2017 1933 1413 -2897 2498 2298 -3923 2337 2584 -4542
1675 -4542 1893 2200 -4519 597 1983 -3298 -317 1271 -1929 -772 1483 467 -1248 1491 2675
1690 2675 -1584 1050 3820 -2703 -36 3836 -4108 -1565 3258 -3830 -1755 2892 -3066 -1396 2843
1705 2843 -1026 -1019 1682 711 -728 705 2616 -595 -532 3327 -1145 -2019 3635 -1540 -3368 3283 -1877
1722 -1877 -3520 3220 -763 -2981 2790 90 -2016 1529 652 -1073 141 1822 -118 -1171 2494
1737 2494 1103 -2421 2499 1022 -4090 1758 555 -4825 1502 986 -3825 1145 1589 -2325 1281
1752 1281 1846 -731 172 1728 1103 -731 1355 2111 -1980 520 2350 -3264 -776 2072 -4334 -1334
1768a334L376n532K865L294m030J814K249k751O65J039o55j574K49J580k317k47
1784a309L558l794o38M707m206j052N473m161o81N273l585n26L638k147r13J659
1800A296j369p44L4J207p57j477K842n36k789M531j312l882M797j169l821M822
1816A673j018l055M085p21j981K106n58j041L60N01r9j748J529J561k936J901
1832E59J235m420K822J918n280K823J671m422L377J654l425J989J275j841O42
1847E77Q1l03p59J53J657k261n07L309k886l68L505m124k82M077l570N7L393l215
1865a466J273K658k235K51Q75r81J2r72N96l98j651K767l33k826L720j169k098
1882a977L925j751k409M052j363j184L044j761p00J748j522L3j62r56P61j080
$$ plain form
1768 -1334 2042 -3490 -625 2669 -1361 453 2702 -49 616 1655 1000 -574 -325 1255 -1062 -1309
1784 -1309 2249 -1545 -2183 2524 -1682 -2734 2739 -1422 -2103 3170 -415 -941 2697 550 -363 1296
1800 1296 -73 -817 -783 424 -333 -1810 1032 496 -2293 2238 926 -2956 1841 672 -3149 1673
1816 1673 655 -2400 1685 964 -1017 1089 531 -510 -150 351 252 -1496 33 1594 -1342 559
1832 559 1794 -2626 196 2114 -3166 -343 1328 -3094 283 1937 -1488 501 1776 -65 577
1847 577 658 355 -404 -251 1406 -855 -1362 1947 -939 -1307 2198 -1926 -2208 1869 -1701 -1644 1749 -1466
1865 -1466 -193 2465 230 481 1356 375 387 -585 11 -387 -2038 729 396 -2430 1290 121 -1977
1882 -1977 1948 197 -2212 1840 477 -707 2337 576 -124 1624 102 135 -27 -983 -222 -1302
1898a302L48J307k207J733J612l304K538P88l562L007O76l352K492N1j755K386
1914A456p91q55R29j189M71m0j558J686o36q46K576j738j16K541k593N99J949
1931A845l473J326J688k400J701L09j772J826p30r90J074j999M42J357k005J728
1947g3M98j850K458k56j537K406j700n72K571k146R9J556k303J253P06k216J455
1964C49o97r65K190j812l99K288k074R34J650k139J089N66j806J503m94j200J813
1981G96j134o6J807k444O10J689k369J209Mk161K485l44j333K307j073n80K224
1998A627j467m9P14j488J411k61j320J757r80o56K569k592l63K500k798P03J634
2015I41k564J151J058j504J485j19j189J540q94K79O66j532J295J50j630K131
$$ plain form
1898 -1302 -954 353 -1854 -121 1491 -1813 725 1513 -2049 958 1634 -1718 774 825 -930 1456
1914 1456 665 -190 739 -450 21 -19 -1577 109 -527 -1373 1203 -535 -651 1890 -703 -104 1845
1931 1845 -1628 -302 1386 -1014 687 996 -776 1050 320 -670 404 -1595 -1153 204 -1801 -73
1947 -73 425 -1425 1033 777 -760 1646 -54 -626 1945 -201 -102 1454 -849 404 1110 -1106 349
1964 349 -348 -1313 877 -935 -1334 954 -1120 -186 1464 -675 414 980 -826 677 183 -1017 796
1981 796 -338 -404 1403 -1041 -431 1258 -1111 98 102 -2059 426 82 -1251 1056 -17 -597 1627
1998 1627 160 111 825 -663 748 487 -833 924 -56 -712 1857 -735 -1098 1402 -1396 -693 941
2015 941 -1623 -472 586 -918 567 448 -741 799 -95 184 850 -682 613 763 -867 1264
2031A264p83k025L061j547j692K728j899q44K960j925l6J627j152R18K62p82R27
2048A062r90K29J157k494R48P85k673K022P04l367K790M09k759K855pk207K559
2065A023j4j049J131p09L17k04o86J150j517m04K253k569J27K303k632P95K546
2082A861l377R88K160k943J509J243k234J039N91p53N67l68K04l21r22J911j314
2099a59j601K967j927j397L704k396j093L565k264r40L466k197k96J971j165j26
2115A12L67l23L77q38O14o8k147K103K32l002L259j61k898L744l48k659L536n69
2133A331k352K452p53j350J123l18m57n82J62J157j831Q16J752k825J464J918
2149A707l545K178J690l834K177J545l380J647J188k607J195P79j060K31R0R02
$$ plain form
2031 1264 481 -1544 1517 -30 -1722 1006 -893 -1737 1223 -702 -738 889 -263 655 917 135 1062
2048 1062 72 301 1458 -1036 -88 697 -1976 46 750 -2617 173 582 -2177 678 671 -1536 1023
2065 1023 1009 -40 1091 382 699 495 -191 959 -558 -962 1291 -1278 -1151 1152 -1480 -685 1861
2082 1861 -1516 -528 1632 -1311 198 1441 -793 246 837 84 651 283 487 166 -756 1155 -159
2099 -159 -1760 1207 -720 -2117 1587 -809 -1902 1663 -601 -1541 1925 -272 -568 1403 238 112
2115 112 479 156 533 -305 309 241 -1906 197 429 -2573 686 525 -2373 1371 1023 -1636 1900 1331
2133 1331 -1021 1431 678 -672 451 133 -324 -906 -744 413 -1418 -602 1150 -1675 -211 1707
2149 1707 -1838 340 2030 -1804 373 1918 -1462 185 1373 -1234 -39 740 -320 -89 1 903
2165I03p29n00J873j823r52L014k490j176L297k683m17L315k507l0K714k129l
2182c23J693j167J39J13k16K16j067J286l71j776K024m18k697L462m75k408L196
2199A211n78j961L029q23j426J747r09q28P78n44K78o33J92J029j670Q55J354
2216A101k580J354J460l171K093J306l080K134J069k645J762L05j634J193n17
2231A50m55K31p21Q45o42o24K122j845n15K551k120k43L127k733J37K725k481
2248d91O90J758j991M43Q41j473L20l80j31J84j179J447R6j706K674o25k090L111
2266A498j355j784L265j261j558K827j497r86J923j316n77O50p16K76n51O94Q98
2283D30j459J492J097k729K035P86l105K245P06k987K101O85k323J633J17j581
$$ plain form
2165 903 174 -326 1547 -276 -1228 1786 -704 -1880 1417 -1266 -1683 1632 -875 -905 1809 -320 -323
2182 -323 1370 203 342 455 239 455 -612 674 303 -1473 551 133 -2564 898 423 -1985 1211
2199 1211 633 -1328 1701 878 -548 1199 290 -538 240 -304 -26 -659 -467 562 -1108 -253 1101
2216 1101 -1479 -125 1335 -1836 257 1563 -1517 617 1686 -959 803 1108 -526 667 150
2231 150 -305 -74 -795 50 -592 -1216 906 -939 -1454 1097 -1023 -1266 1861 -872 -735 1990 -491
2248 -491 199 1957 -34 409 1250 -223 97 -283 -414 -230 -1409 38 134 -1572 1102 477 -1613 1498
2266 1498 143 -1641 1624 363 -1195 1632 135 -851 1072 -244 -821 -171 -887 -611 -1162 -468 430
2283 430 -1029 463 1560 -1169 866 1652 -1453 792 1498 -1489 612 1297 -1026 607 724 -857
2299h57J014l02k25m8l63Q79p98j16J862j635L6K437k707K42K447k910P41K318
2317B015k772O57J668j902L77L84j008L73l78K55L21j161J372M2j230K253r16
2334C50j500K818j752j147K796j801p71K568j844j69J401j248j04L85q09O91m45
2351e81K72J167j366Q73R79k194J537L53k134J765L7j932K321q10j267J794p67
2368D7p96R67q79J28L75n89J101n52k65J320j068l6J700j919L54J351j899P98
2386A38J029k017J396J81j593J247n17m46J031j280L50L94p40J176k55j007J750
2403H37n66q70J970j405o54J835j431j11J396j698N44O37j293R26l13q47J281
2420B38m87k12J147j185R47P11j663J394j0j624J568m71j268J744j032p32J482
$$ plain form
2299 -857 157 -145 -370 -418 -781 98 -700 -816 1046 -589 -553 1884 -823 -581 1866 -1044 -303 2015
2317 2015 -757 -100 1568 -334 43 427 -581 -208 -586 -331 -10 -1171 201 243 -987 1266 350
2334 350 -1150 1668 -84 -1231 1565 -236 -1007 1561 -283 -452 949 -299 -403 -18 -827 -136 -581
2351 -581 -309 858 -508 365 1344 -850 687 1040 -1094 671 708 -1224 1097 287 -980 814 47
2368 47 -749 218 -661 -533 -158 -747 354 -198 -463 857 -211 -247 1453 -466 -112 1239 -660 138
2386 138 1167 -850 546 727 -866 381 -136 -582 449 -831 -481 -87 -827 349 94 -913 837
2403 837 271 -599 1371 -34 -688 1147 -284 -395 1001 -697 -153 484 -809 117 -196 -1043 238
2420 238 -249 -461 686 -499 448 1159 -504 890 880 -744 824 353 -915 829 -203 -935 547
2437E47j153j60J017j027O77Q7j042J552m12m40J335j100J19J282j451K82P97
2454I10j955J230K97j593J472n04o45J115p15j14J178j147Q05M73j184R68j41
2471D50r20J628p76j002J418j304k04J250j506O34L42j262J253J66j127J490m79
2488E1n40J270r64J68J100j444N95M83j364J177r8j209J299o02n12J331j169J92
2506b36R75j502Q21M52j489J179m3q82J387p07l18J125j189K02Q09j266Q07L30
2524D55j206J091l86q82J320p37k51J170r38P3J154j401J124M95j237R73l08q80
2542c71J065q16n21R82j350L28Q47j266Q83K91r80J335j78n92J483q01n86J349
2560A102j261K72P19j376M85M67j275J027m4q59J226p32k04J029j053M05N76j291
$$ plain form
2437 547 -606 -766 251 -776 -99 -12 -1054 498 86 -354 981 -119 0 1282 -169 113 910
2454 910 -1045 185 482 -1111 361 -143 -788 327 -388 -502 676 -471 334 807 -377 591 450
2471 450 -470 1158 382 -620 798 -506 -710 540 -966 -332 10 -1252 1 167 -960 530 51
2488 51 -489 781 -183 -15 1085 -359 236 719 -645 532 434 -775 524 -78 -590 741 -428 -236
2506 -236 739 -763 58 510 -979 200 157 -725 662 -45 -363 762 -427 -225 584 -682 125 455
2524 455 -751 340 -46 -928 392 -345 -596 574 -364 -291 863 -538 586 1081 -156 817 509 -371
2542 -371 694 -122 -643 339 -1011 -683 164 -1102 -219 72 -908 427 249 -343 1140 339 -247 1102
2560 1102 -159 113 832 -544 -59 408 -867 160 116 -743 483 -249 -453 576 -477 -72 504 -787
2578g87J128j33j142J321k54r35J831j127k96J381j458K95R51j604P80M02j054
2595g01R91n03j57R84j072L72R75j333O76Q40j465J110J12j409J191m45r25R47
2613A88q38m15J103j157O02M47o73R73pq15J271m01m38J529j259k6J184j730N93
$$ plain form
2578 -787 341 208 -934 387 133 -802 1029 -98 -394 987 -471 -176 775 -829 -49 353 -701
2595 -701 290 -213 -370 614 -458 -86 889 -444 232 1072 -393 717 829 -580 611 166 -759 188
2613 188 -650 -1065 38 -1119 -517 -70 -743 230 223 -592 679 278 -160 1369 110 84 1268 -462 131
$$ [...]
8191@
##END NTUPLES=NMR FID
##END=
