##TITLE=1H_112-2025 Bay
 200.13MHz, CDCl3,
 8 sc
 
 9.9.2025
##JCAMPDX= 6.0         $$ Bruker NMR JCAMP-DX V2.0
##DATA TYPE= NMR FID
##DATA CLASS= NTUPLES
##ORIGIN= UXNMR, Bruker Analytische Messtechnik GmbH
##OWNER= pz
$$ XWIN-NMR		Version 3.5
$$ Tue Sep  9 13:45:19 2025 Russian Standard Time (UT+4h)  she@DPX200
##.OBSERVE FREQUENCY= 200.1313
##.OBSERVE NUCLEUS= ^1H
##.DELAY= (6, 6)
##.ACQUISITION MODE= SIMULTANEOUS
##.ACQUISITION SCHEME= undefined
##.AVERAGES= 8
##.DIGITISER RES= 18
##SPECTROMETER/DATA SYSTEM= spect
##.PULSE SEQUENCE= zg30
##.SOLVENT NAME= CDCl3
##.SHIFT REFERENCE= (INTERNAL, CDCl3, 0, 14.3821)
##AUDIT TRAIL= $$ (NUMBER, WHEN, WHO, WHERE, WHAT)
$$ ##TITLE= Audit trail, XWIN-NMR		Version 3.5
$$ ##JCAMPDX= 5.01
$$ ##ORIGIN= Bruker BioSpin GmbH
$$ ##OWNER= she
$$ F:/spectra/data/she/nmr/H-C/1/audita.txt
$$ ##AUDIT TRAIL=  $$ (NUMBER, WHEN, WHO, WHERE, WHAT)
(   1,<2025-09-09 13:43:55.79 +0400>,<she>,<DPX200>,
      <created by zg, POWCHK disabled, PULCHK disabled
       configuration hash MD5:
       00 E9 B6 7A A2 85 ED C7 34 08 36 98 17 FE 4E 26
       data hash MD5: 16K
       67 F7 B5 24 70 98 CF CD 40 9C 05 E5 A7 78 61 AC>)
$$ ##END=
$$ 
$$ hash MD5
$$ 5C C4 33 1E CF 75 0A B3 D4 CC FB 95 D1 C2 38 DC
##$RELAX= 
##$RELAX= 
##$RELAX= 
##$RELAX= 
##$RELAX= 
##$RELAX= 
$$ Bruker specific parameters
$$ --------------------------
##$DU= <F:/spectra>
##$EXPNO= 1
##$NAME= <H-C>
##$PROCNO= 1
##$TYPE= <nmr>
##$USER= <she>
##$AMP= (0..31)
100 100 100 100 100 100 100 100 100 100 100 100 100 100 100 100 100 100 
100 100 100 100 100 100 100 100 100 100 100 100 100 100 
##$AQSEQ= 0
##$AQ_mod= 1
##$AUNM= <au_zg>
##$AUTOPOS= <>
##$BF1= 200.13
##$BF2= 200.13
##$BF3= 200.13
##$BF4= 200.13
##$BF5= 200.13
##$BF6= 200.13
##$BF7= 200.13
##$BF8= 200.13
##$BYTORDA= 1
##$CFDGTYP= 0
##$CFRGTYP= 5
##$CHEMSTR= <none>
##$CNST= (0..31)
1 1 145 1 1 1 1 1 1 1 1 1 1 1 1 1 1 1 1 1 1 1 1 1 1 1 1 1 1 1 1 1 
##$CPDPRG= <>
##$CPDPRG1= <>
##$CPDPRG2= <>
##$CPDPRG3= <>
##$CPDPRG4= <mlev>
##$CPDPRG5= <mlev>
##$CPDPRG6= <mlev>
##$CPDPRG7= <mlev>
##$CPDPRG8= <mlev>
##$CPDPRGB= <>
##$CPDPRGT= <>
##$D= (0..31)
0 0.7 0 0 0 0 0 0 0 0 0 0.03 0 0 0 0 0 0 0 0 0 0 0 0 0 0 0 0 0 0 0 0 
##$DATE= 1757411035
##$DBL= (0..7)
120 120 120 120 120 120 120 120 
##$DBP= (0..7)
150 150 150 150 150 150 150 150 
##$DBP07= 0
##$DBPNAM0= <>
##$DBPNAM1= <>
##$DBPNAM2= <>
##$DBPNAM3= <>
##$DBPNAM4= <>
##$DBPNAM5= <>
##$DBPNAM6= <>
##$DBPNAM7= <>
##$DBPOAL= (0..7)
0.5 0.5 0.5 0.5 0.5 0.5 0.5 0.5 
##$DBPOFFS= (0..7)
0 0 0 0 0 0 0 0 
##$DE= 6
##$DECBNUC= <off>
##$DECIM= 32
##$DECNUC= <off>
##$DECSTAT= 4
##$DIGMOD= 1
##$DIGTYP= 9
##$DL= (0..7)
0 120 120 120 120 120 120 120 
##$DP= (0..7)
150 150 150 150 150 150 150 150 
##$DP07= 0
##$DPNAME0= <>
##$DPNAME1= <>
##$DPNAME2= <>
##$DPNAME3= <>
##$DPNAME4= <>
##$DPNAME5= <>
##$DPNAME6= <>
##$DPNAME7= <>
##$DPOAL= (0..7)
0.5 0.5 0.5 0.5 0.5 0.5 0.5 0.5 
##$DPOFFS= (0..7)
0 0 0 0 0 0 0 0 
##$DQDMODE= 0
##$DR= 18
##$DS= 0
##$DSLIST= <SSSSSSSSSSSSSSS>
$$ [...]
##$SUBNAM0= <"">
##$SUBNAM1= <"">
##$SUBNAM2= <"">
##$SUBNAM3= <"">
##$SUBNAM4= <"">
##$SUBNAM5= <"">
##$SUBNAM6= <"">
##$SUBNAM7= <"">
##$SUBNAM8= <"">
##$SUBNAM9= <"">
##$SW= 18.0517328524113
##$SWIBOX= (0..15)
0 0 2 0 0 0 0 0 0 0 0 0 0 0 0 0 
##$SW_h= 3612.71676300578
##$TD= 16384
##$TD0= 1
##$TE= 0
##$TE2= 300
##$TE3= 300
##$TEG= 300
##$TL= (0..7)
0 120 120 120 120 120 120 120 
##$TP= (0..7)
150 150 150 150 150 150 150 150 
##$TP07= 0
##$TPNAME0= <>
##$TPNAME1= <>
##$TPNAME2= <>
##$TPNAME3= <>
##$TPNAME4= <>
##$TPNAME5= <>
##$TPNAME6= <>
##$TPNAME7= <>
##$TPOAL= (0..7)
0.5 0.5 0.5 0.5 0.5 0.5 0.5 0.5 
##$TPOFFS= (0..7)
0 0 0 0 0 0 0 0 
##$TUNHIN= 0
##$TUNHOUT= 0
##$TUNXOUT= 0
##$USERA1= <user>
##$USERA2= <user>
##$USERA3= <user>
##$USERA4= <user>
##$USERA5= <user>
##$V9= 5
##$VALIST= <valist>
##$VCLIST= <CCCCCCCCCCCCCCC>
##$VD= 0
##$VDLIST= <DDDDDDDDDDDDDDD>
##$VPLIST= <PPPPPPPPPPPPPPP>
##$VTLIST= <TTTTTTTTTTTTTTT>
##$WBST= 1024
##$WBSW= 4
##$XGAIN= (0..3)
0 0 0 0 
##$XL= 0
##$YL= 0
##$YMAX_a= 596440
##$YMIN_a= -849453
##$ZGOPTNS= <>
##$ZL1= 120
##$ZL2= 120
##$ZL3= 120
##$ZL4= 120
##$ABSF1= 10
##$ABSF2= 0
##$ABSG= 5
##$ABSL= 3
##$ALPHA= 0
##$AQORDER= 0
##$ASSFAC= 0
##$ASSFACI= 0
##$ASSFACX= 0
##$ASSWID= 0
##$AUNMP= <proc_1d>
##$AZFE= 0.1
##$AZFW= 0.1
##$BCFW= 1
##$BC_mod= 2
##$BYTORDP= 1
##$COROFFS= 0
##$CY= -3
##$DATMOD= 1
##$DC= 2
##$DFILT= <>
##$DTYPP= 0
##$F1P= 0
##$F2P= 0
##$FCOR= 0.5
##$FTSIZE= 0
##$FT_mod= 4
##$GAMMA= 1
##$GB= 0.15
##$INTBC= 1
##$INTSCL= 1
##$ISEN= 128
##$LB= 0.25
##$LEV0= 0
##$LPBIN= 0
##$MAXI= 10000
##$MC2= 0
##$MEAN= 0
##$ME_mod= 0
##$MI= 1.114404
##$NCOEF= 0
##$NC_proc= 0
##$NLEV= 6
##$NOISF1= 3.799351
##$NOISF2= 2.8
##$NSP= 1
##$NTH_PI= 0
##$NZP= 0
##$OFFSET= 14.38212
##$PC= 1
##$PHC0= -1561.611
##$PHC1= 17.19228
##$PH_mod= 1
##$PKNL= yes
##$PPARMOD= 0
##$PSCAL= 0
##$PSIGN= 0
##$REVERSE= no
##$SF= 200.129724274929
##$SI= 16384
##$SIGF1= 3
##$SIGF2= 2
##$SINO= 400
##$SIOLD= 16384
##$SREGLST= <1H.CDCl3>
##$SSB= 0
##$STSI= 0
##$STSR= 0
##$SW_p= 3205.1282051282
##$SYMM= 0
##$S_DEV= 0
##$TDeff= 0
##$TDoff= 0
##$TI= <>
##$TILT= no
##$TM1= 0
##$TM2= 0
##$TOPLEV= 0
##$USERP1= <user>
##$USERP2= <user>
##$USERP3= <user>
##$USERP4= <user>
##$USERP5= <user>
##$WDW= 1
##$XDIM= 8192
##$YMAX_p= 0
##$YMIN_p= 0
$$ End of Bruker specific parameters
$$ ---------------------------------
##NTUPLES= NMR FID
##VAR_NAME=  TIME,          FID/REAL,        FID/IMAG
##SYMBOL=    X,             R,               I
##VAR_TYPE=  INDEPENDENT,   DEPENDENT,       DEPENDENT
##VAR_FORM=  AFFN,          ASDF,            ASDF
##VAR_DIM=   8192,          8192,            8192
##UNITS=     SECONDS,       ARBITRARY UNITS, ARBITRARY UNITS
##FACTOR=    0.0002768,     1,               1
##FIRST=     0,             0,               0
##LAST=      2.2672688,     0,               0
##MIN=       0,             -849453,         0
##MAX=       2.2672688,     596440,          0
$$ Real data points
##PAGE= N=1
##DATA TABLE= (X++(R..R)), XYDATA
0@%%%%%%%%%qQqJ6j6J6k4L2l2M0n4O9p9R0j10J30j51J75k04K34k71L11l52M00
33B12m55N17n81O53p34Q20r16J021j134J260j395J543j707J887k081K292k524
50a322K781l066L378l725M114m553N051n619O277p050P972r096J0502j2316J4759
65H087j8255K3699l3416N6065k10084o7633M69997K70753R7227l8509N158k3561
77E39528j50255k58716j61020j55969j47981j02069k2342Q7565J45607J06373
87a19279J59811J40611O2948P0205N8790k8666q8803j39578q5400l0124p3044
98g2529o4193j6260j4071M8558P4287K7113l276j6841K8390O0097m3553o9956
110f2234J9660M0024O646l1938q741Q8718M0095q7442n4881K4719K5227l8044
$$ y = [0, 0, 0, 0, 0, 0, 0, 0, 0, 0, -8, 0, -8, 8, -8, 8, -16, 16, -16, 24, -30, 39, -40, 50, -60, 70, -81, 94, -110, 124, -147, 164, -188, 212, -243, 274, -307, 346, -388, 432, -484, 537, -597, 663, -732, 811, -896, 991, -1090, 1202, -1322, 1459, -1607, 1771, -1954, 2160, -2393, 2658, -2961, 3316, -3734, 4238, -4858, 5644, -6672, 8087, -10168, 13531, -19885, 36180, -173904, -241537, 228460, 499213, 596440, 557931, 563089, 539528, 389273, 130557, -30463, -186432, -334413, -436482, -458824, -371259, -225652, -119279, 40532, 181143, 244091, 314296, 373086, 344420, 255617, 116039, 30639, 515, -72529, -136722, -152982, -167053, -118495, -44208, -17095, -20371, -37212, -8822, 51275, 7722, -62234, -42574, -2550, 4096, -27842, -36583, 52135, 92230, 4788, -50093, -25374, -147, -38191]
122c8191r0343j5968N3795K0781L7312N9723K6397L0801K9530K4885K2700n1527
134A09895q0071l1050l7741m5184l0945j9100L0186K8450L726N9386Q0278M6271
146A14101K5212k0267k3972Q173j4737l9437o7578q0878l282K6864j7434q570
158a01805J6279M0206N7717J5896J0841M1449J0555j2297k0446k6286J321j8192
170A5238m8256j3286p746o571K3830P167l291R951Q346L5052K3184k8214j3807
183A597M435L069J4713j7095k4673J0976O4r75R100r118L685R33k0932P946J2346
198c929PJ4391j1340j4222K5944J7176O881l140k9041k088J1740q907j333j5276
212a3137j9860J4509M984j16J9110K51J114R056q988P122Q551j5296m952j3044
$$ y = [-38191, -128534, -144502, -90707, -69926, -32614, 27109, 53506, 84307, 113837, 138722, 161422, 109895, 29824, -1226, -38967, -84151, -115096, -134196, -104010, -75560, -71834, -12448, 67830, 114101, 139313, 119046, 95074, 103247, 88510, 49073, -18505, -99383, -102665, -75801, -93235, -101805, -85526, -45320, 12397, 28293, 39134, 80583, 91138, 78841, 58395, 32109, 33430, 15238, -33018, -46304, -54050, -60621, -36791, -29624, -32915, -22964, -14618, 20434, 43618, 15404, 1597, 6032, 9101, 23814, 6719, -17954, -6978, -6914, -7889, 1211, -7907, -4222, -3289, -24221, -16275, -3929, -3922, 10469, -871, -15093, 10851, 28027, 34908, 31768, 2727, 639, 12379, 3472, 2139, -13137, -32997, -18488, -13504, -13620, 5490, 5741, 6855, 15911, 6923, 14045, 22596, 7300, 2348, -10696]
226a0696j2418J8633K254r738M912n682P625J6047q251o51O24p499J3198J3j1999
241c628J0941r89k500J0499r376m754M442j1896o65J070o836R364m167o795J7512
256B222O375L276R064j3077l971Q137p307j689q217j7913K061l08O42J4722k709
271h692o54J3774P71Q151J1030p212n55n577j2526N215l068r735M52j0882M15
286a9093J5158j071L962P742k552Q482K995m308P335o999j0500J633q813j788
300g817N094r445K288P473l216O718K841k063P672n979n561O202q033l768L935
315c659p657L718L358p163P955N689r05O350n191j559Q259p366o99M593q818P09
331b386J93n850Q507J402n463N192k940J441Q503n411J597N062r404J008K503
$$ y = [-10696, -23114, -4481, -2227, -11965, -7053, -12735, -5110, 10937, 2686, 2035, 2659, -4840, 8358, 8371, -3628, 7313, 6324, 3824, 14323, 4947, 193, 4635, -7261, -7926, -6856, -13692, -4328, -8495, -15290, 2222, 8597, 11873, 20937, 7860, 3889, 12026, 4719, 3030, -5187, -23100, -21039, -21347, -20705, -5983, -8692, -9346, 4428, 5199, 13350, 24380, 17168, 16613, 11036, -1490, 3725, 657, -9078, -8626, -19508, -19093, -3935, -5006, -1044, 6698, 4146, 12628, 15623, 11315, 18650, 11651, 1151, 2784, -6029, -7817, -2723, -12168, -9880, -2407, -5623, 1095, 3936, 1873, 9545, 3566, -1995, 4207, -3826, -7594, -3659, -11316, -7598, -4240, -11403, -3448, 2241, 1336, 7686, 2495, 936, 9195, 1829, 1130, 5723, -3095, -2386, -2193, -8043, 464, 1866, -3597, 1595, -1345, 96, 8599, 3188, 4785, 9847, 443, 1451, 3954]
346C954m232O025l872o100O562k500L12P069n612J735J272j2405J545K323o860
361a0784J737m333l067R892R55N009J1033k652K694K936p641M248j515j2345k485
376f318o885m895O977l74M314Q527l028P454J0216j417L515l450j0182J966m512
391A908o994J877n278k0M422l563P524P803m048L374l70m555M481m821o900P58
407d402n554q01K447n276L566M953q73Q681L051k969O303J241n10K150r160l644
423g97M08o497M95j43l989O049p1j280J0343M895J465M29q349J441N563n615j528
440B819m667o040N997K030n29N886l488l459K312l483Q82p41p841M37j079j606
456a2570J0290N455R97M821k216L267O652p079p472o367p044J904k922n814N673
$$ y = [3954, -278, 5747, 1875, -4225, 2337, -163, 149, 7218, 1606, 3341, 4613, -7792, -6247, -3924, -10784, -9047, -13380, -16447, -6555, -5600, -591, 10442, 7790, 10484, 13420, 5779, 10027, 8512, -3833, -6318, -13203, -18098, -11121, -11495, -7181, 1346, -1682, 5772, 15988, 14571, 18086, 14636, 4454, 6420, 1908, -5086, -3209, -8487, -8507, -4085, -7648, -124, 7679, 3631, 7005, 6635, 2080, 6561, 1740, -5160, -4402, -9956, -10757, -8310, -13586, -10020, -5067, -5940, 2741, 5792, 2823, 9126, 10367, 9857, 12007, 2847, -797, -389, -6886, -6391, -6534, -10523, -4474, -4545, -5825, 4518, 9413, 10878, 11307, 2958, 4399, 9962, 4347, 2819, -1848, -7888, -1891, 139, -390, 5496, 2008, -1451, 861, -2622, -1740, -2481, -10322, -9885, -10964, -12570, -2280, 3175, 4172, 8993, 6777, 10044, 16696, 9617, 2145, -4222, -11266, -9362, -12284, -18098, -12425]
471a2425K599M857R232Q65L776O583l479j401k091o015R38n515p675L592P00J094
487d365M531m625J736O979q9K909j081o906L739K183n60K509o436l203N332k818
503a65j481P95n027L68j126l293Q121M098j849J496l111J988Q346k786l963m519
519b108o144K965K396m694J015j625P85Q126l4J453O255k348n99J55l172K585
535E011r14o747m26j842M14N529l306j620M376M85M159K512n595J428L154o23
551E995Q12m271l864K544l203j266P16n042Q27J044k391M782K707K38L436k141
567I23j57O472M13k017l289o723J794L018l792j554l242j227N321J184J491M424
583C039j512J787L418j525L046Q74n336j450l060j413M247l004l137M02j474M438
$$ y = [-12425, -9826, -4969, 4263, 5128, 8904, 15487, 12008, 10607, 8516, 2501, 3439, -2076, -9751, -6159, -5459, -4365, 166, -4459, -2723, 4256, 4167, 7076, 5995, -911, 2828, 5011, 4451, 6960, 524, -2679, 2653, -165, -1646, -851, -5878, -5510, -6636, -9929, -1808, 2290, 441, 1937, -1174, 814, 9160, 6374, 2411, -2108, -8252, -5287, -2891, -7585, -6570, -8195, -7410, 716, 682, 2135, 8390, 6042, 5443, 5598, 2426, 5011, 4097, -2650, -3076, -4918, -4504, 1025, -2281, -3901, 475, 960, 5119, 7631, 2036, 3464, 6618, 5995, 6807, 2536, -1328, 1216, -1987, -3253, -2537, -7579, -6752, -5708, -8099, -3317, -610, -372, 3064, 923, 766, 7238, 7651, 5634, 2345, -4378, -2584, 434, -3358, -4912, -8154, -9381, -4060, -2876, -1385, 3039, 1527, 3314, 6732, 5207, 8253, 9127, 3791, 2341, -719, -2132, 2115, -889, -4026, -3624, -5098, -660]
599f60M005l440K63P92j088L499j980l447J672k268m93J264k180K337K368k731
615b087K603J686r54K416k356k552K454j572n00k32m847J700L959n87K092r35
631B88j632N562J521l01J182l401j016Q50l569P38j66m013J32r74m64N777K39
648G53j688Q30j608K623L104l276n85j213l027L328M18j350K410j475P2L729j123
665A922N76R50m035L09q18k693K319m51k639K147L97K433L632j903N12K497j620
682C535K92j643l525J126o20k494J711j257k29K499q68J826J857k581J143k14
698E58q71K496j077k036J246q64K27L209j462p6o26k633K071R87j874J50k242
715b817r80L015n16J45K020j739M61J094m73K912p43k572P38n79j54K384k509
$$ y = [-660, 3345, -95, 168, 960, -128, 3371, 1391, -2056, -384, -2652, -3145, -1881, -4061, -1724, 644, -2087, 516, 2202, 1248, 3664, 1308, -1244, 1210, -362, -862, -1094, -5941, -4241, -282, -869, 1223, 288, -1344, 4218, 5739, 5438, 6620, 3219, 2203, 3053, -516, 222, 56, -3957, -3825, -4799, -5263, 514, 753, -935, -105, -1713, 910, 4014, 738, 153, -1060, -4087, -759, -341, -1691, 719, -756, -684, 3045, 1922, 2498, 3448, -587, -278, -1096, -3789, -1470, -1921, -4560, -2413, -2016, 417, 4049, 2146, 2658, 5155, 3535, 3827, 2184, -1341, -215, -835, -3329, -1618, -2875, -3104, -605, -1473, 353, 2210, -371, 772, 558, -313, 2183, 1106, -930, 316, -548, -321, 2888, 1426, 1350, 724, -1909, 162, 1149, -725, -575, -2817, -3797, -782, -1298, -1153, 867, -872, -411, 683, 210, 3122, 2379, -193, 545, -34, -188, 2196, -313]
732c13l52M83j518J078J066j403J440r51j011K694o44o58K007j950L16J393k093
749d16J067P69j575R65q22j200J511j810j017K596j888K84Q94j726K104J169j014
766a09J305p51o79K069r81l70J021k697K92J127r51J253K06k315J605k63j88K487
784B061k115j97P32j830J216J671j468Q24o67j140K168l72m21J154k421l99J486
801B82j670J120P94k155R76N7j008K070o26k85J459j481K34J505j306J172L44
818A482j816P11o3j402J910j254j225J157j549N59J659j040J236M03j162J052
834F58N29l96J357j651r30J353j885P81J278j795O25q3j251J612m2q46J115j259
852h30j49J419r69P41P58j337Q76L35r28J775p22j350N56j234j89J220j149K87
$$ y = [-313, -665, -182, -1700, -622, 444, -959, 481, -470, -1481, 1213, 569, -89, 1918, -32, 284, 1677, -416, 651, 1420, -155, 810, -12, -1212, 299, -1511, -2528, 68, -1820, -1536, -642, -2368, -264, 905, -109, 1196, 445, -234, 1835, 854, 484, 1505, -1192, -900, 227, -724, 529, 735, -1580, 25, -238, -426, 2061, -54, -251, 481, -1349, -133, 1538, 70, 894, 227, -913, 1255, 883, 462, 1616, -805, -1204, 282, -1388, -268, 526, -1629, -653, -596, -1604, 466, -160, -445, 1014, -467, -233, 1272, -34, 1138, 1482, -334, 377, 314, -1088, 822, -432, -1657, -500, -2049, -1490, 169, -871, 365, 768, -394, 658, 1187, 791, 2148, 497, -433, 920, -965, -184, 1094, -701, -76, -159, -1410, 202, 160, -686, 429, -830, -979, 440, -529, 212, 970, -367, 509, 844, -84, 1691, 969, -381, 175, -1059, -1248, -28, -1177, -890]
870h90M04j339J544M76o43J745p34q41J422j130J85J045j803L20K62j135J532
887D20M14j132Q62q00l09J401j128J93N51j678O85M64j204J880k31j007J072m03
905E0J61J272j256J95K33j754P55M17j290J061o73o22J216m26N62J404q05l9M68
924I29j197P92P58j342P77n51q15J434n51k31Q45j381J48M35j295J118L37j737
942a527Q90j26l23J913q30lJ123j493O28M54n54M85p87j704J476q84l04K030j102
961f38m18J013p64J514Q79j653J109m28n26R26m06o98J275j422j64J125j046J088
979G66M87j374R49l49o73J289j027l35M20q15k33J074j204J367O6j170R16J57
997C11q08J705r68q04M18j027J50R02j124K84kp90J031R9m1J372l99m39O59l61
$$ y = [-890, -486, -1825, -281, 195, -448, 1297, 563, -278, 1144, 14, 199, 1244, -559, -239, 23, -1112, 420, 834, -298, 564, -236, -545, 856, -272, -79, 472, -1206, -521, -57, -1261, 619, 388, -619, 453, 50, 211, 1483, 227, 422, 655, -1099, -344, 73, -1217, -156, -829, -1451, -235, -661, -99, 1305, 500, 461, 929, -268, 524, 1282, -60, 717, 166, -649, 785, 234, 3, 848, -533, -385, 50, -1245, -127, 210, -1527, -637, -763, -1086, 827, -3, -6, 1117, -376, 252, 706, 152, 637, -150, -1854, -378, -1262, -1566, 464, -638, -1056, -43, -807, 707, 1586, -67, 1042, 614, 88, 1014, 608, -90, 1185, -237, -401, 724, -322, 766, 1253, -121, 828, 479, -194, 1095, 68, -267, 153, -662, -895, 179, -1025, 342, 408, -762, 154, 311, -497, 1208, 240, -564, -146, -1173, -1023, -121, -1245, -961, -963, -1753, -722, -623, -664, 708, 309, -130, 529, 168]
1017A68M26Q96j289J4J57o08J217l25r99Q39j136J09Q42p66M04Q69j505P86P60
1036H59k10J248n20o72N88q93R0M00j356M7pj157P56J97n95R66j1n48J063n34
1056b89N64J028j094mL08j206P85l11r38Q61m55o52R03q67N59P90j176P22K30
1075b42o34J372j7j046J085p61K08J188p31K27J72j145Q22K11o74Q60k05j314
1093f24R68k33L0Q76j048M2M05o76R06N58r95N42l86o01R53p29m52R85j291l36
1113a106N17o79P51l11p76R32k30k13J409q59M12O23p34Q06K71r93J049j11r73
1132b15O09n76l82R29o05j18Q11j069J068N90p96P15l02o36Q17l11k79J056j330
1151b4l7K85o56N05L22j098J85Jp99J267O1m92N43p19K99O35n40P65J70j037Q37
$$ y = [168, 594, 1490, 201, 215, 372, -236, 981, 656, -343, 496, -640, -531, 311, -455, -51, 818, -687, 99, 859, 649, 1897, 1377, 705, 1293, 400, 490, 890, -466, -419, -426, -1583, -827, -630, -1225, -259, -270, -818, 245, -289, 275, 1303, 209, 205, 513, -693, 92, -219, -1157, -296, -751, -1403, -500, -1367, -808, -18, -1194, -472, -242, -876, 496, 479, -567, 518, -243, -35, 1153, 422, 649, 821, -324, 498, 709, 35, 895, 690, -624, 344, 111, 141, 1017, -31, 11, 416, -260, 646, 1204, 209, 751, 365, -236, 717, -12, -464, 521, -770, -1106, -589, -1268, -517, -828, -1604, -672, -902, -1115, 294, -565, -153, 470, -264, 542, 813, -180, 869, 758, -215, 394, -182, -564, 365, -240, -358, 453, -616, 452, 1042, 246, 961, 659, 23, 840, 529, 250, 1306, -24, -61, 224, -432, 73, 395, -703, -518, -517, -1316, -49, 12, -480, 63, -656, -357, 278, -262, 503, 673, -364, 473]
1172D73l4n54J008q53k95O89o83J22O12p66N3R2q09Q88q8n07R59n02k11R01m00
1193I5N34J63q94K56q5n63R51o18n15N93q13K41Q65n22L68J39n34P60P5l52R69
1214A113r36m61N09n19J75O07n38L75J41j174O49K96l97J93l04j85N27l93PM87
1234A72o10N82k20o73J281j54l78L85o35k5O47m83K37K15r33K73L73n29N54J13
1254A92n43N45l32n6P41p09M08K19r08J029j95k13M14m08o98P22m07m92J076r38
1274e53k7P49j040J111k7k43P33j75p37P85o81N10K26j311K25N29o37M92j2o99
1294g82P62l87L9R43n38p2K42q67M71M40p12P46l30n05J007o34K47O27o89j31
1314a23N06q58M70J31n32K85j87j05L78j26mO94o21J79M00k81O84k61p18L45m97
$$ y = [473, 439, -115, 893, 40, -255, 434, -249, -127, 485, -281, -228, -136, -945, -57, -145, -652, 307, -195, -406, 495, 95, 629, 792, -102, 154, 69, -494, 457, -161, -676, -83, -896, -655, 210, -312, 56, 195, -339, 421, 496, 144, 1113, 177, -284, 225, -294, -119, 488, -50, 325, 466, -708, -59, 237, -160, 33, -271, -456, 71, -322, -315, 172, -438, 144, -76, -749, 532, 378, 0, 385, -250, -275, 372, -111, 126, 341, -592, -319, 54, -475, 79, 192, -351, 194, -138, -194, 547, -162, 246, 465, -443, 586, 391, 178, 592, 184, -514, 208, -199, -691, 385, -553, -580, 169, -871, 240, 213, -30, 703, 528, -209, 576, -105, 405, 631, -680, -455, 74, -563, -71, -83, -782, -20, -407, -368, 575, 37, -35, 207, -660, -189, 251, -461, 285, -45, -550, 457, -177, 70, 697, 8, -123, 383, -475, -5, 126, -406, -121, -308, -413, -35, -161, -165, 529, -92, 87, 487, 206, 890, 629, -89, 256, -241]
1335b41k3N81q12j40M59q91L28O23l16P44O3j028J377j66k50N76m14n12K82n29
1355b89K20K65q40M94m06k58O17K0l26O44q4j25N35k69L30p4l37L60k54p51O46
1376A18m84JK45n07L61O49l80K85M85r83P93l47m60P03m55n53O74p28K50O91n32
1397a74N8J87o50O60j08r5N97m30m47M90l34M2L22r96M87J72m62R34q6j34N24
1418E57m34oP32l90k32L29m12k90J98m17L09j97l38M52n85L18O79l24L93p8j59
1439A05N48Jk32O36n94o17K13l74k0L06q94L45R8k89L66M76m08O29k62N7O05l24
1461C71j70L15q84J07L80o47N85K0m82K67P9J18L55r6q6J88q08L85o2m65O16j84
1483i8k86O89J17m15O79m75J56J32o15L67k61l99M47m04o16R30m17L12L16o10
$$ y = [-241, -264, 317, -495, -635, -176, -1067, -739, -116, -432, 312, 375, -653, 724, 558, 308, 884, 470, -42, 240, -289, -69, 196, -644, -150, -556, -814, -197, -177, -503, 141, 57, -68, 467, 198, 528, 454, 117, 477, 223, -528, 118, -366, -365, -120, -627, -266, 383, 3, 288, 773, -210, 583, 236, -224, 479, 24, -529, 145, -583, -333, 358, -174, -116, 71, -579, 81, -27, -122, 475, 45, -402, 88, -246, -204, 118, -878, -391, -219, -681, 253, 167, 33, 557, 123, 117, 849, 459, 227, 556, 144, -146, 52, -365, -56, -253, -591, -139, -724, -406, 273, -51, 342, 264, 105, 653, 654, 422, 1058, 464, -153, 60, -314, -334, -28, -922, -577, -479, -768, -402, 74, -334, 295, 33, 90, 695, 371, 201, 516, -368, -261, 119, -528, 57, 77, -405, -138, -59, 59, 414, 318, 232, 420, -388, -3, -65, -530, 86, -98, -384, 305, 422, 7, 686, 211, 367, 499, -116, 251, -10, -409, 38, -366, -982, -52, -469, -157, 159, -451]
1503d51J89M46j81L22K68p28L69m46l3M51j51k68J56j95M5J55l20M60l37l53N88
1524a4j61J63P70p32O7M04n50N29K7m69J94K26o82J85o3k53P6o9q0N68m16L97
1546A17K91q23P81k49P7J23l32K39j83o24K63M18m30P3L39n31O57L18l48K82n78
1567a20m6K90m55K16M53n99N88l2m66L38K27j49K23m80M1L09n03j82J84m01M24
1588a40j55k85O86l25LM72m30K68N64j81j72J87q34M25L8k78K06m82pK94r2K54
1610A6l8j94K55L63n50M73j59j12M20k89k57L87m47K42%k99L25k31m51P63l7m91
1632c11M70m42n7M50j69J8J68m05L62N8j87N11k04m57J68q9K6M39l63k42K24l28
1654c60K64M9l24O17k35j90K65Q8k57K42j5j58L50m47M86l91j19M5J29n81P08
$$ y = [-451, -262, 184, 3, 325, 593, -135, 234, -212, -245, 206, 55, -213, -57, -252, -207, -52, -372, 88, -249, -602, -14, -175, -12, 758, 26, 93, 497, -53, 476, 503, 34, 228, 454, -228, -43, -106, -359, -283, -352, -432, 136, -280, 117, 408, -415, 366, 117, 194, 317, -15, 224, 41, -583, -320, 98, -332, -259, 80, -451, 206, 524, 176, 458, -120, -166, 124, -331, -115, 338, -261, 327, 295, -171, 167, 394, 245, 468, -12, 29, 338, -165, -347, -163, -564, -140, -295, -580, 106, -219, -216, 256, -174, 94, 658, 477, 305, 492, -342, 83, 121, -157, 49, -433, -440, -146, -238, 16, -22, -216, 39, 402, -148, 325, 166, 54, 474, 185, -72, 315, -132, 110, 110, -189, 136, -95, -546, 217, 180, -311, 159, -283, -340, 110, -59, -41, 127, -278, 84, 142, -45, 466, 262, -195, -27, -116, -90, 349, -14, -256, -32, -360, -96, -47, -371, 246, 11, -179, 86, 174, -83, 159, 144, -14, 336, -111, 375, -16, -135, -90, 39, -542, 166]
1675A66o02J39L68l79Q8L93l60M38Ml49L34j48j54M13k62j43K73p18L38J61j35
1696a35n8k03j51L97j47rP31m90Q1N36o39P18j47m39L8k34j96M22p9l40M27j59
1718g6j53N03o40L99L71q00P82n57nN51m80o8L72j97K22J6j55M8J73k92L07Ll36
1741a2L55o88k42M50r8J50M14o53L58J27l46O83k88j28K12l21J17j21l06K84k13
1762b66m51K96K21j11M39l16J77M88k02j36J45k37K15Q5m80L89j15j35L84m26
1782c6J10L79l85J9Q9l09J45p9n68L74J97K9L84m8k88L85k84L24k45l17K82j24
1804C4l38J31n9k02N49m71L39L9J01qj07k99N08j72j52K35k57R5L4j75O34k04
1826B55k66K59nr2j46o5q5J72j48l11O04k20K76L56m55k02K96jL5j07m58L98k37
$$ y = [166, -436, -297, 71, -308, -220, 173, -187, 251, 255, -94, 240, 92, -62, 351, 89, -54, 219, -499, -161, 0, -135, -193, -396, -547, -150, -297, -306, 425, -65, 16, 552, -87, 631, 484, 45, 83, -151, -347, 75, -4, -344, 83, -76, -229, 274, -366, 33, 404, -396, 386, -171, -176, 375, -105, -173, 199, 2, 224, 240, 85, 133, 306, 14, 321, 324, -12, 343, -345, -587, -137, -235, -85, 329, -324, 34, 161, -185, 498, 210, 82, 294, -27, 90, -31, -337, -53, -266, -717, -421, -200, -311, 128, -188, -11, 477, 275, 139, 284, 47, 262, 347, -133, 256, 141, 6, 390, -36, 74, 453, 68, 87, 176, -133, 12, -67, -635, -261, -64, -35, 349, 301, 13, 398, 114, 438, 193, -124, 158, 34, -304, -173, -232, -434, 115, -356, -17, 22, 123, 115, 8, -291, 217, 45, -107, 128, -129, -34, 0, -175, 459, 255, -11, 248, 243, 151, 5, -60, -145, 27, -121, -432, 172, -48, 228, 584, 129, -73, 223, 222, 257, 150, -308, 90, -147]
1849a47j65K53L8lo0j70K30J15k24J35Q8l58L17J06j99K69j3M0J27o53M17J39
1871B82j50J48k93m94L35k2J58J10k96J08K02k54K83J93l57L79m1n12M08k34k12
1892b59M50n95J86M34m35K92K6j61L8k0l58M81j62J93J45o73M86J71l10J93n2
1913G0k16L90po4j70m40L97M5k36L36n9l17M30j79k5L59l16Q0J0l59K48J90j78
1936a1J57R0k48J19l10K93J0m14KM47m86J54J77k57L80J06l94O10j76k36K87l05
1958ek10K19j09J31kj61Rk17j02M25K1l23M34m53J73L82p8J10J50l94O4L41l27
1981G8K99m41l12J99o3N2K59Pk00Q9k24L90l54q9N74l99K32p3k35K62N1k99J06
2004i1K79j52J76p8n1K2j67j74K54j02o8K75p86O49oM4J74j82J53jj09K09J78
$$ y = [-147, -312, -59, -21, -24, -84, -254, -24, 91, -133, 2, 90, -268, 49, 155, -44, 225, 212, 252, 379, -274, 143, 282, 132, 280, -13, -507, -172, -194, -36, 74, -222, -114, 88, -166, 117, 310, -47, 332, 291, -221, 187, -47, -259, 191, -404, -218, 216, -219, 73, 99, -62, -24, -44, -402, 79, -83, 110, 255, -418, 68, 239, -71, 122, 70, -146, 244, 237, 173, 3, -437, -40, 5, -231, 105, 46, -271, 159, -20, -45, 314, -2, 78, 88, -271, -23, 167, -11, 146, 236, -12, 107, -203, 90, 100, -314, -312, 135, -351, -197, -20, -277, 103, 209, -185, 425, 249, 13, 300, -5, -215, 4, -105, 26, 24, -137, -128, -345, -447, -22, -1, -324, 110, -343, -170, 212, 134, 244, 394, 0, 64, 405, 78, 377, -64, -376, -177, -240, -188, 71, 78, -122, -33, -257, 133, -221, -310, 264, -135, 97, 24, -211, 51, 102, -197, -91, 188, 36, 212, 134, 83, 105, -62, -236, 18, -84, -152, 123, -663, -14, -20, 24, 198, 16, 169, 168, 59, 268, 446]
2027D46n5J2j02m25J80q4l18K86j41j13L2j0K05L08l17L32o9j91m2N41o84J92
2049a7p0l83K52J5o2J86n9m4K47j16K18Ol09K94j79j6L79l82j49K02l51N71k29
2072Dj6K05l40O0K06n2p8N5j12R7k9j4n7L02m11K76j13RL50j81o5J76L9l86K60
2097A85n09M96k19L14m04k29J96K97k11K9L09l45J7K08k73J78K05l73Q6J00j78
2118a21K70k63k20O40q35L86O4m03L91n2K7K31L00l72K69k95j4J31j6J59k68J
2140A0J04k77j97M66j07K05k9j64j80K70l2j05J92k14K16j21%J04o6k93K65l7
2162A0k01L57m47q3K97j74K57J57k01j14k0J47L09n5r9R7l78J50J84l48L98J0
2184B53m08J07M8r7J79l59N01k61j19J22j16J07L05l50M5R0k46J02K65l58K94
$$ y = [446, 391, 403, 301, -124, 56, -28, -346, -60, -201, -314, -282, -292, -87, 221, -96, 236, 167, -24, -66, 475, -209, -17, -87, -470, -218, -203, -265, -79, -138, -182, 65, -51, 167, 173, -136, 158, -21, -37, 342, -40, -189, 13, -338, 233, 4, -12, 193, -147, -87, 119, 67, -11, 44, -68, 29, 0, -14, -71, 231, -180, 96, -17, -8, 342, 161, 96, 272, 311, -75, 185, -324, 172, -47, 267, -137, -366, -170, 127, -84, -55, 254, -91, -74, 134, -139, 39, 244, -129, -43, 57, -121, 149, -114, -334, 306, -529, -143, -79, -482, -91, -143, -116, 115, 415, 43, 312, 17, 3, 134, 118, 277, 9, 10, 114, -163, -360, 106, -1, 204, 175, 11, -169, 101, 69, -36, 156, -58, 158, 37, 37, 141, 75, -218, 47, 10, -191, 166, -281, -364, -67, -241, 16, 173, -28, -142, -162, -15, 294, 239, 140, 237, -141, 9, 193, -155, 243, 253, -155, -48, 0, -97, 82, -277, 224, -37, -156, -34, -150, -43, 262, -88, -43, 47, -199, -97, 168, -190, 104]
2205A04j21j53M23l11L96n40J72k78M26l43k2J15k63K49J81R7J08J12l43K90k47
2226E2J2r4J31k73O4m36K80M7o4j8L24k13P1K03j25J41j26J01J7k67JK65l4K49
2250C08l37K8J63q2k33K85l07J79R2j64j52K27p7J3Q6J99j29R0j23L20o94K94
2272a4O2k16M01j04k04J13k21o9L92l5j10k62k1L19n8J70q4j17k7K59J3q5J75
2295B77k59j61J80k02k9M34l56L5q3J0L27k86J51L7r2mL31m87K13K8k05J88R9
2318A46l18J10J83j0K8m20J82J75k69O6J03k94M70j98O3kJ05j66L30k58Jm3k57
2341b73K58r5K12Mk18L07l56k23L42K39K0j29Jj68j01L19l18J75O9r6K49j19k42
2364a43J93Q9k15L34l33j29n2pJ99j30J76K41j10k16O74o90J70K68k36K71l79
$$ y = [104, -17, -170, 253, -58, 338, -202, -30, -308, 118, -225, -247, -132, -395, -146, 35, 132, 240, 352, 9, 299, 52, 64, -30, 101, -172, -108, -544, -264, -217, -281, -299, 25, -188, -117, 86, -39, 102, -24, 77, 94, -173, -172, 93, 59, 308, -29, -1, 162, 80, -153, 132, -175, 4, 96, -68, -220, 7, -70, -57, 29, 228, 99, 189, 66, 386, -308, -14, 48, -168, 233, 129, -75, 38, -183, -252, 140, 105, -5, -267, -288, 31, -27, 143, 59, -58, -85, 174, 187, 102, 277, 18, -143, 37, -165, -194, 240, -116, -81, -164, -154, 173, -113, 38, 75, -17, -21, 310, -177, 36, 64, -141, 47, 146, -172, -62, 121, 111, 139, -281, -99, 76, -193, -127, -24, -318, 152, -46, 17, 15, 120, -46, 284, 26, 27, -16, -273, -15, -110, 102, 106, -112, 195, -161, -384, -42, 197, 217, 88, 89, -79, -180, 139, -179, -4, 65, -31, 218, 99, -143, 50, 139, -76, 258, -75, -204, -256, -263, -64, -194, -18, 223, 113, -103, 571, -119, 51, 319, 83, 354, -25]
2385b5mj10Jm2M29m48K89J59k67K76l7k89J20K00k73K33l82N2J99K6k6J57l18
2408h0o6K49k97N28k46m50K55l14L62J25p5j72K12j10Q7J29j97K42K07l97n2J30
2430G0k2kJ96k41k35J56k22N62m40M44l36J83k30K92j85O6J35n0k36j7J57k45
2452b00M27l71K39l49N62k10l38P2j2O4J73o8M0k1k43J61J63J26L5k13k48J23
2474h8J45o0L5l15K87k9k22M07j28J2N3R7l95L16l45K92k02J07l4j6K02n8n6K7
2498C2K02k68q5J59k65L1J77o3%K94q9J31j67J88l38rK50j61l40J25j22L27L4
2521D3k67J8M05l26j30K40Pl7J32p4j75L29j84mM05n20k6J29k9j01J11J3j54K1
2545a74J66j23j30J64J42q6J88j59p2J91l61L59o9k0j25J00J61k1j55r8K19j19
$$ y = [-25, -29, -139, -138, -180, 249, -199, 90, 249, -18, 258, 221, -68, 52, 252, -21, 212, -170, -118, 81, 107, 81, 238, -80, -146, 103, -194, 334, 88, -362, -107, -421, -59, 66, -9, -181, 31, -79, 8, 137, -60, 182, 389, -8, -60, 70, 48, 46, 242, 1, -234, -78, -300, 262, -178, 266, -70, 113, -117, 175, -10, 56, 191, 141, -95, -112, 45, -200, 227, -144, 95, -254, 308, 98, -240, -168, -180, -116, 57, -11, 29, 8, -235, -74, 89, 215, 250, 37, -211, -88, 57, -3, 32, -283, 4, -25, -247, 160, 32, 44, 97, 194, -201, 115, -230, 62, -140, -33, -67, -83, 119, 61, 5, 32, 234, -34, -119, 40, -225, -194, -17, -80, -80, 214, 125, 256, 89, 277, -61, -70, 180, 19, -321, -196, -318, 9, 43, -224, -206, 199, -127, -257, -17, -10, -47, 85, 11, -164, 165, -19, -23, 382, -138, -164, -35, -64, -165, -54, -41, -195, -174, -8, -131, -261, -97, 45, -41, 147, -12, -84, 107, -254, 105, 36, 16, -109, -9, 152, 131, -24, -122, 97, -22]
2567b2l07L58k19K51j72n6L4j8K51k13j2Lj40L75j69K47k22k32M66l22J82p8k07
2590b22K06j41P7K18k18NJ08j16Q3K36l85L61l87M9M7Q6J26j42j75k34L99q7J0
2613i6O8Q3K25k45k07J31M8J12J08r0l76M06j22pP8o4l2P9j90k9l4Q8K42k05K07
2638A78l20J05n9J92k63L80j59j98N87l66J85j82m4R0R7j61j60P0j85J37j45J21
2660a00K57J85m53L34n75L33M0Q0j4K6m21L97J48l94K58p4j2J88j98rK57k71K7
2683Ij67M2K53j90PO4k55L92K75l91O9k3l24L65o4r7J96k17J13m29QN28R1n72
2707c17L26r2J45l6j90M36j54k71k17N45l53K03n9l36L01J72k94J80M1k18P2p
2729a23J8j0O5J12j59J72k2J41r1k8m0j91J21p0lK10k40K9K86n08M50l5j99N6
$$ y = [-22, -329, 29, -190, 61, -111, -167, -133, -151, 100, -113, -125, -122, -262, 113, -56, 191, -31, -263, 203, -119, 63, -15, -222, -16, -157, -80, 138, -80, -75, 33, -83, 0, 236, -149, 212, -175, -126, -79, 7, 133, -9, -184, -418, -19, -106, -96, -28, 55, 280, 35, -172, -41, 7, 119, 227, 137, -239, 167, 45, 38, 116, 52, 20, 99, -91, -120, -154, -66, 176, -29, 178, -142, -37, -96, 96, -167, 213, 54, -144, 443, 77, 262, 80, 36, 126, 223, 62, -98, -28, -213, -76, -221, -100, 157, 342, -111, 223, -352, -19, 21, 101, 87, 113, -308, 89, 237, -157, 101, 27, 15, 203, 5, -4, 253, -18, 9, -158, -116, 137, -53, -46, 18, -237, 155, 430, 39, 108, 85, -239, 126, 62, -35, 161, -56, 57, -372, -364, 164, 255, -317, 9, -83, 62, 26, -164, 272, 118, -153, -370, 175, -178, 25, -34, -370, -69, 103, -191, -11, 30, -188, -116, -123, -105, -115, -50, 62, -97, 75, 53, 194, 103, 75, 35, -156, -35, -105, -108, 102, -138, -109, 177, -331, 119, 84, -115, -59]
2753e9K97j70n6k27K59n6p9R1J21k8Oj69J26o0l5j45K52n1j14K4O6r2J76k23L89
2778B43l35K06k22Q6J69o7J72l62k14K62K10j84Q1j63J91k20L18Rj41R8n2m47
2800c62K12J85OK3P5k12L3j38N4L23m24L02M7m10K74l42M28q5j92K63k47L89q2
2823A20R6m1oJ51l65K60m26J58J65j65L0q9M2j1k1K13j2j38j48M70l66J0K21r8
2847E0M9Mj68L23j57l10K88l7L1O4k2l11k2K90p3j21O0p3L22o5p5j19J77k6j17
2872c8K52k01P9j2j93P6O9j75O4K70k82j57J6MJ75k9K2O2K28q6k6L08l98M7j84
2897a09l5K47l12K29R3m94L09K4j04M04k55J24q2J11j86P7j23L06j75j19r9M28
2919B59m50J81J81k26KL0J8m2l64M14q2k20M54K20m50K29k53jK80j0j63j70j28
$$ y = [-59, 238, 68, 12, -215, 44, -12, -91, 0, 121, 93, 99, -70, 56, -4, -39, -184, 68, 17, -97, -73, -7, -99, 77, -146, 243, -92, 114, -108, -22, 147, 80, 252, -110, -324, -62, 148, -36, 45, -118, 73, -147, 171, 180, 39, 137, 85, -362, -150, 35, 41, 64, 139, -73, -40, -178, -124, 199, -225, 77, 124, -286, -12, -354, 74, -11, -203, 60, -187, 202, 120, 216, 175, 169, 320, -45, 215, -211, -53, 112, -53, -23, -112, -70, -81, -102, 111, 99, -39, -187, 283, -83, -73, 148, 50, 99, 103, -65, 258, 101, -209, 79, 42, 73, 137, 115, -196, -218, 72, -1, -122, -62, -135, 187, 122, 47, -72, 105, 79, -38, 214, 13, 92, 80, -113, -37, 32, -143, -79, 191, -91, -248, -232, -228, -53, -82, -60, 2, 230, 144, 118, 426, 28, 75, -109, -144, 103, -209, 20, 113, -381, -72, -48, -152, 252, -3, 121, 39, 150, -36, 41, -82, 224, 49, -70, -169, 259, -191, -10, 171, -55, -53, -23, -5, -47, -411, 3, -79, -299, 155, 375, -75, 154, -99, -100, 180, 170, 7, -163, -291]
2942b91lL66m21L94k01J03j0J44o7%j78L50j31Q4r0k6J79J85k12k3k70J40j52
2965a30j83M49p4m75L79J70j66j27K46k11K48r9p9K43j77k37K29P9O2o1l77M48
2987A57l15L6J9p0j65J82M2J02j04K84q0M5N6j05k1j37P7j50M46l16k16r6K36
3010i3K20j81J47k35J41O6k20J51J49l13n4M4O3J78k8j00o5N4o3R2r5J90J54l05
3034a03J71m0N5k35L4K64k29j1K64k46m9K27k22K36R7j67j51L52l21j61K56j16
3056i5L35l13K3o3j8K77r7j77p3J90qK12M8k30LJ90k55Q5R4l7k63M81n32N0K77
3081A04K2j12n2q6K25k46m3M19k13P6q2k97L61j40K40k33l0R2J45k55M8J19j34
3104g2P6k33j25J02M51j27J87k80J72l1l03j08J39N8K8J13O0J42j49K95m15R0
$$ y = [-291, -294, 72, -349, 45, -156, -53, -63, 81, 14, 14, -164, 186, 55, 139, 49, 23, 202, 387, 175, 152, -118, 22, -130, -313, 136, 62, -413, -34, 136, -30, -157, 89, -122, 126, 27, -52, 191, 14, -223, 6, 85, 147, 86, -291, 157, -158, -122, -103, -173, -338, -156, -114, -12, -116, 168, 88, 133, 189, 84, 63, -74, 3, -147, 299, -17, -233, -329, -93, 127, -54, 93, -142, -1, 65, -155, -4, 145, -168, -222, -178, -115, 63, 35, -65, -130, -76, -139, -47, -142, 48, 202, -103, 68, 28, 83, -152, -118, 146, -83, -94, 170, -76, -125, 102, -120, 116, 213, 46, -105, 247, -74, -235, 21, -95, 240, -73, -50, -113, -131, 146, 49, -128, -201, -11, -19, 193, 241, 11, 14, 204, -51, 34, 128, 91, -172, 309, -223, -173, 104, 126, 14, -38, -124, 101, -145, -188, 231, 18, 94, 12, -285, 76, -64, 176, -57, -87, 5, 150, -105, -57, 62, -72, 4, -229, -354, -252, 199, 72, 259, -21, 151, 120, -183, -291, -152, -94, -66, 47, 107, 249, 100, 395, -20, 70]
3126G0R5K1k51J93k19K7k9J34J53j03j39J43k5j03J08j86j79L21J13l73M15k06
3148b0Q9%l30J32P3j40K00o8J06Q3k43M9J3Q7j57K87q8j95L92l08j07N0J29k63
3172b29M15N8k44P5k91J43L12k07R6q0q9K2R4Q2M2m5j78J72j75J31m51K74p2J80
3196C5k7K64k06K53m18K34K5k0p5j38K28j39j14p0N15m98K48k2j60J01j0j79K37
3219F4R5p5K8q7j59ML41m90M95k16J25J09M5k85j61J58j34o3J26K81k5m70K74
3242b0j31N4j36J66J12j81J6j5j14J02J24O8Q6j9l58K09K5Q0n9N4J00K8k65J15
3266D1J74m4j01R7j09k00K13j29K76l56r8M01m34K84Ok97K74j12J40j50N4K76
3288B06k2L3k08L56l50K39j80m26M44M3k5l10j42N88k18n5k36L19n7j32K76k65
$$ y = [70, 165, 186, -65, 128, -91, -64, -93, 41, 194, 91, -48, 95, 70, -33, 75, -111, -290, 31, 144, -229, 186, -20, 69, 69, -261, -129, -56, -196, 4, -64, 42, 125, -118, -69, -56, 31, -126, 161, 73, -122, 270, -38, -145, -95, 34, -229, 186, 244, 0, 75, -216, -73, 239, 32, 128, 48, -41, -19, 75, 157, 199, 154, -24, 148, -27, 104, -347, -73, -145, 35, 8, 272, 66, 319, -99, 135, 160, 140, 65, -73, 155, 16, -98, -168, 347, -151, 97, 75, -85, 16, 6, -173, 64, 159, 84, 112, 25, -134, -130, 211, -279, 216, 0, 125, 234, 279, -6, -167, -9, -143, -206, -80, 201, 176, -294, -20, -151, -97, -233, -67, 45, -136, -120, -135, -249, -147, -23, 45, 131, 112, -246, -37, -12, 68, 9, 63, 163, 191, -74, 41, 215, 171, 70, 167, 58, -142, 71, -58, 218, -138, -236, 165, -269, 15, 21, -276, -2, -114, 26, -124, -70, 206, 184, 217, 9, 365, 15, 254, 74, -352, 92, 135, 110, -200, -342, 246, 28, -27, -263, 56, -1, -133, 143, -122]
3310a22O7m3J4J89J75m77L72r7r6o9K30O4n40K60j56J65m1r0QK45J61j10j16q6
3334i3M5l2M47j19p3K78n69J59J30j56J78j13l9l17J47K4M5L3k26J68J30J67j91
3357B3k75M59j12J41j93l0j11J45j64j0j37J85m4J88l3k54N3p8K67n2J71m3j09
3380a3j51J22L5J66Rk08j61O6J42J2J63m10P8mO7N46k58Pk78J24o8K6o9J53k37
3405a41J49k51J84j14L38J38k03j30J85l25M05k99R0P7J16q5m59J00L08K3j35
3426b9O8o9j82J74J54m34L62n2m2n9J45j51O9j45K45O2j53P6k47J18J57j06Q0
3449D1l4k07M69l68r8J64q6K44l30L87j77J9J99j91j28j93K45J56j35m0k91L22
3471c2J96k40R7q5o3M3K0L08q2j5j73L4l37N09k77M6J47p0p9k2K0J50p1k09J84
$$ y = [-122, -55, -98, -84, 105, 280, -197, 175, 78, -18, -87, 143, 207, -333, -73, -229, -64, -105, -195, -187, 58, 219, 109, -7, -93, -48, -80, 367, 248, 175, 453, -116, 43, 173, 17, 195, 82, 43, -274, -127, -103, -58, -25, -251, -83, 47, 214, 23, -252, 207, 95, 236, 43, 13, -98, 47, -117, -127, -264, -79, -123, 65, 32, -222, -169, -247, 20, -32, 139, 96, -13, -164, -42, -7, 159, 168, -40, -201, -135, 7, 19, 182, -228, -150, -154, -87, 459, 201, 208, -70, 54, -14, 12, -57, 96, -141, 8, -243, -59, -173, 165, 303, 100, -30, 155, -170, 235, -64, 26, 103, 219, 134, -325, -225, 83, 106, -29, 39, -30, -212, -38, 116, -318, 44, -8, -50, -109, 36, -115, -46, -191, 54, 116, -37, 39, -208, -90, 67, -39, 41, 7, -200, 269, -99, -197, -33, -119, 125, -205, 182, 5, 24, 223, 32, -96, -289, -44, 112, -23, -63, -354, -32, 164, -76, 21, -64, -127, -84, -64, 244, 162, 147, -26, 8, -329, 180, -97, -51, 96, 26, -53, -75, -55, 95, 24, -185, -1]
3496ap9K5O7j06j12K74R7m4o6m1K03K1k65j14J01R5Q3J59o11M91P0l5R7o01M71
3521A79k47l5k1L02%j38j8p0K48k59n7K36j52o9j09K65l9k65L19J09l87K87l7
3544D2k33k01j3L32r4Q2K16l4p0k07J84K8j04L14k83K4J96j5m9j59k09K09%L2
3568a2J08k78J90n0J29j38J12j24J08j65O0K94j68k21K18P2j50K40O1kk89m3K31
3591A83k97L0N9n0Q4j29O6pp6P5K4m4J9n9J48j44K56k10J06K95m83J55K2k21J50
3616d8K10M1j15j05o0Q4j29J53K91l18n4J32J11K13k74p8k17J82Q8j36M6p6k45
3639c04K74k25J17K55j83J54r4R0j58jJ58l8jj87J52j40J79N5k35K08j91J20L3
3662C8nq2j47M45q7m37M72j0j42J37n35K34P0mn2M8%M8J09k18L39m28Q4L15K0
$$ y = [-1, -80, -55, 12, -94, -206, 68, 165, 121, 55, 14, 217, 238, -27, -141, -40, 55, 138, 297, -314, 177, 247, 212, 309, -292, 179, -68, -103, -124, 178, 178, 40, 22, -48, 200, -59, -116, 120, -32, -101, -210, 55, 16, -249, 70, 179, -208, 79, 42, -191, -392, -405, -73, -167, -85, 131, 97, 27, -180, 4, 32, -72, 242, -41, -17, 179, 164, 115, -44, -253, -44, -44, -12, 96, -182, 8, -42, 87, -51, 61, -63, 45, -120, -60, 234, 66, -155, 63, 135, -15, 225, 286, 284, -5, -48, 183, -114, -84, -25, -75, 9, -120, -54, -61, -137, -62, -38, -82, -63, -122, 26, -118, 138, -72, 34, 329, -154, 1, 23, -198, -48, 162, 203, 88, -17, -77, 7, -122, 31, 322, 4, -50, 82, 193, 406, 132, 54, -163, 19, 107, -29, 17, -59, -304, -30, -255, -138, 117, -66, 88, -6, 84, -74, -75, 83, 45, 44, -143, 9, -131, 48, 103, -132, 76, -115, 5, 38, 33, -49, -196, 249, 162, -275, 197, 187, 45, 182, -353, -119, -49, -53, -105, -57, -57, -9, 100, -118, 221, -207, -123, 192, 212]
3687B12k90j53N03n99M30N2j78N6q8k51L04R4k64J19m4L22j72l3k00k8J18K3m6
3710a13M4j80K63p7L87n28J83N8k14L55j19J37Q4k62j1n5q0Nqp8M5J76k3J15k25
3735a21L6o0J70Q1j2k06n2J50J18ql23M27k05p5%L30n15N31k35M8j13k2Q6J61
3759A91j77m3L6Q8J8j62j22J21J79l22J24L9O1k00K48K3j39r9J84P4j13k50rL22
3783G2j9r7J64k68Q2R4ON5j27J78j15J38j61n7J67j38n9J38J74j91qj12J38k58
3807b04K41K45j97o6J8l29K22pj25L48k00j85K73j78m5J72J15M5q9L1l93K44j55
3830b19J0R8J4J95j16k8J15J69p3l93rK57j9O8o%k8k2P6j32ON3k43k8J73j55L30
3857I3Q9J57l20k40J86O1j9R8j53kj18K4J71o4j42J41j7j81K84K91j47k2k60n1
$$ y = [212, -78, -231, 272, -327, 103, 155, -23, 33, -55, -306, -2, 92, -172, -53, -97, 225, 53, 20, -180, -208, -90, -67, -113, -69, -249, 14, -63, 324, -204, -21, 37, -177, 178, 59, 196, 280, 18, 7, -48, -128, -123, -131, -209, -164, 12, -11, 104, -121, -85, -145, 25, 106, 94, -112, -164, -14, 104, 96, -227, 200, -5, -80, -80, 250, -265, 266, 31, 79, -34, -56, 30, 191, 14, -29, 7, 95, 113, -49, -171, -50, 129, -193, -69, -30, 31, -169, 79, 102, -37, -136, 48, 122, 9, -241, -250, 72, 53, -44, 120, -148, -66, 28, 34, 89, -38, 140, 25, 163, 2, -55, 112, -26, -85, 53, 227, 36, 28, -84, 54, -204, 37, 282, 85, 19, 37, -292, -70, -77, -202, 146, -54, -239, 34, -144, -189, -17, 98, 143, 54, 85, -308, -64, -219, -209, -111, -97, 98, -18, -46, 69, 238, 165, -228, -237, 20, 1, 69, 63, 63, 35, 13, 89, -43, -37, 16, -227, -255, -82, -237, 93, 182, 339, 19, -221, -35, 26, 7, 105, -48, -50, -168, -144, 27, -37, -179, -38, -55, -236, 48, 339, 192, 170, -90, -141]
3881a41n2L52k03l8J88k27J60J36j90J30N1k56J83N7J22l91lJ04J30Q9l6l77L41
3904A29q8k30QK65p8P9j34J73Q5n3r4k9lP8l10K33q7P0q7J48r9J38k01o8J88j02
3930f9J3L15k79j31L60l93M9k1K43P0J30l89J53J4j33L22l30P7k0O2j01J73k30
3953a15L37j87j97L18k97J67j46J59j28J09P7P4J19P0l14Q5J2O2k76K67m3q8r3
3976b8k58L95j34J28j80K5K38l62J91K31j64m3NR0RJ10j10j55J94m26K19j12m5
3999a82L98j66k84M7J27P1l8K56j25K7j10k08J89l0P4j3n2Q5j37J24j45K25j41
4022hR7l11J79K09q4j89J27j43J34k18J76o6K81p4J4j52k5j3P7j3R6J22l77J24
4046c7j16K2J77K5j30J36K9j59j01K65m6J06j41J16k92L21k65L54k98J20m0r9
$$ y = [-141, -193, 159, -44, -82, 106, -121, 39, 175, -15, 115, 166, -90, 93, 150, 272, -119, -122, -18, 112, 201, 165, -212, 129, 41, -189, -181, 84, 6, 85, -49, 124, 209, 156, 62, 33, 30, 108, -202, 31, -56, 14, -73, 75, -24, 114, -87, -155, 33, -69, -56, 259, -20, -151, 209, -184, -135, -156, 87, 157, 287, -102, 51, 65, -68, 254, -76, 1, -19, 43, -58, 115, -115, 222, 35, -162, 156, -141, 26, -120, 39, -89, 20, 97, 171, 290, 360, 46, 131, 143, 205, -71, 196, 153, 65, -28, -286, 109, -25, 103, -77, -52, 186, -176, 15, 246, 82, 39, 44, 134, 143, 253, 143, -12, 182, -244, -25, -137, -182, 216, 50, -234, -187, -60, 11, -27, 229, 104, 131, 21, -187, 2, -28, 46, 33, -19, 66, -71, 53, -92, 133, -8, 89, -222, -43, 166, 82, -107, 20, -123, 11, -207, -31, -97, 184, 110, 124, -28, -53, -66, 11, -2, 94, 216, -161, -37, -153, -131, 46, 71, -59, 77, 106, -53, -154, 111, 65, 171, 30, 146, -146, 175, -90, 264, -34, 86, 46, -53]
4068e3j50K36k76K78m1M4o8J34j45J83j30j35J25J47j26l2o04N31K29m69M75n3
4090A00k85R5K27j46m6L3O6j06K25k15J62j23Q8m6J11O7j54m6n1k33K04j3R4K11
4114B19j40J8j27J2K1J8O4p5r4j07L01k21Oj33J50p7R1l1Q9J18j83J42j03J33
4138I1j65K32l77J37p7K56k57K19p5Q3j30O7O2P8l1K4J59m43J83j33J84L5Q5l81
4162a74K31N8j62p7m4J70J18j88R7M4j59j50K53P2j68O9j44K00l4k09J22J05N3
4185H3J0%j31R5L4j44O0R3J6p0j35J41j36MJ29l8k91M8M85l15J38Q6k53J51j59
4210i9k55K20N1J03Pk19K40j0oP4k49J38P5p4J28k01l2n2P7J15m3k58K12J3M5
4235@J13L5l14j09K47J87k19o8M9p5K20j48K04k84J52M9k60M2K95J03km34K4J19
$$ y = [-53, -203, 33, -243, 35, -6, 38, -30, 104, -41, 142, 12, -123, 2, 149, 23, -9, -613, -82, 147, -322, 153, 100, -185, -90, 137, -9, -55, -22, 44, -62, 163, -52, 110, -13, 75, 29, 140, 207, 53, 7, -44, -277, -73, -86, 8, 219, 79, 97, -30, -18, 3, 21, 85, 10, -84, -191, 110, -111, -105, -238, -88, -165, -74, -105, -16, 102, -81, 61, -42, 91, -74, 158, -219, -82, -159, 97, -160, 59, -16, 67, -63, 4, 66, 144, 113, 137, 296, -147, 36, -97, 87, 122, 207, -174, 57, 115, -47, -124, -168, 2, 120, -68, 29, 73, -86, -236, 17, 89, -79, -10, -154, 46, 12, -197, -75, 30, 83, 93, 93, -38, 57, 91, -53, 7, 100, 116, 46, -89, 52, -84, -80, 49, 11, -280, -232, 253, -62, 76, 162, -91, 60, -99, -354, -134, -83, 20, 27, -192, 48, 38, 32, 106, -143, -5, 70, -4, 124, -77, -109, -161, -84, 31, -12, -270, -58, -45, 0, 113, 148, -166, -275, -28, 159, -60, -128, -79, -154, 66, -82, 122, -162, -10, 39, -221, -179, 116, 219, 217, -217, -193, -74]
4259g4K06k41nJ12l41j7L05J08l3p3J25k10J09j3J33r8J50j93J91l12J92%J76
4282A97k00j85J74o5p7q3K79o6j39K42J15l57L02q4l39K27m3J07P6n7no3N9o5
4306e0K02M6p1P4l86L82j19l70P82p97L93j23P5j2j01L75r1j01k03M27l59j32
4328a59K87r9k24P0K3J89j81k33J37L84j21l5o4q5J35P6q6k3p0J72O2j83L3oJ77
4353A76n0j74o6m%N89l65j6q5QK4R7p8J49q1o2p2K23q7j98L5K73k07k6K22r7j37
4380ik07J11J02J37l4j78L68j84j39k30M58l21J12k22Q7J91o3M3J24j47j05K01
4402I5r3J3O7k4j2j38Jk20K64l7J88j29j84M13k54M23m38L05l40J2J35M7K43l22
4426A5J95k09k96K84k44L08k59p4K03L95l66p7K31m3q5k12k7K55Jj33J9L16j44
$$ y = [-74, 132, -109, -114, -2, -343, -360, -55, 53, 20, -53, 72, -138, -29, -42, 91, -7, 143, -50, 141, -171, 21, 21, 197, -3, -188, -14, -79, -156, -239, 40, -26, -165, 77, 192, -165, 137, 53, -286, -59, -102, 5, 81, 24, 19, -44, 15, -50, 152, 198, 127, 201, -185, 197, 78, -292, 490, -307, 86, -37, 38, 26, -75, 300, 209, 108, -95, 332, -27, -159, 128, 29, -195, -125, -102, 87, -94, -327, -190, 194, 73, 38, -26, -111, 24, 100, 14, -9, -79, 93, 155, -28, 5, -1, 176, 126, -48, -114, -118, -118, 471, 106, 90, 5, 13, 37, 134, 56, 205, 124, 62, -10, 213, 126, -72, -37, 236, 29, 3, 225, 128, -9, -216, -105, -3, 134, 100, -78, 290, 106, -33, -263, 195, -126, -14, -236, -149, 42, -21, 22, 146, -1, -106, 95, 2, 15, 82, 58, 46, -92, -91, -311, -47, -84, 104, -25, -209, 204, -50, 373, -65, 240, -100, -88, 47, 94, 337, 15, 210, 1, -295, -11, -255, 53, -206, -280, -77, 318, -48, -125, 106, 63, -22, -234, -261, -6, -5, -138, -119, 197, 53]
4449E3l40K84J29K54k42j66P1P2l7J61k25l21L87J49n34N29k72m7N0o4N7q9M7
4472i4K84k22J42l3L9l20K00p9j09j7J33R5l4N2j1j22K15j60k5k1M80l14L2P8
4496A89k99J19k08L29j53J22j38L46l66J53j2k68J52Kj93J02p8R5q6N1K74Q1n05
4519b91M10k67K3p5J42K05k59J44Q0m72K70k47K98J47j24J83J1j90l8J79k41J33
4541B1j88P3J18k84K52J51o3J01j78j57K94r0J49O6k64O7k97K43r5j09j82M81
4563A09k01K09R4r1l19J76OK5J94m12M35k83J20j23K25nJ33j31j56j74K03k68
4585b34L17n7K8Mj12K7J10J5MO2k14L1J30k8j64P9J92l1k92J51J89l01K01l2J26
4610B01k07j00J92k24M49j75k3q3j7j6k35M42l60K65P1l46L62j82J9J15j7j32
$$ y = [53, -287, -3, 126, 380, 138, -28, 43, 115, 78, 239, 14, -307, 80, 229, -305, 224, -48, -95, -45, -109, -52, -141, -94, 190, -32, 110, 77, 116, -204, -4, -83, -192, -209, -76, 19, -15, 37, 26, -96, 119, -41, -66, -87, 393, 79, 111, 189, -110, 9, -199, 130, -23, 99, -39, 307, -59, 94, 82, -186, -34, -32, -225, -123, -201, -106, -192, -141, 133, 214, -291, 119, -148, -125, -200, -58, 147, -112, 32, 112, -360, -90, -337, -39, 108, -16, 167, 178, -12, -50, 129, -112, 21, -167, -94, 24, -260, -8, 143, 80, 181, 3, -154, 140, 50, 199, 265, 1, 68, -229, 14, -81, -190, -372, 109, -92, 117, 211, 120, -199, -23, -17, 8, 202, -210, 225, -58, 62, -61, 164, 159, 292, 161, 5, -169, 34, -234, 83, 26, 54, 58, -54, -27, 83, 98, 102, 164, -50, -19, 111, 83, -81, -2, 190, 159, -133, 18, 207, -94, 107, 75, 201, -6, -106, 86, -138, 311, 136, 113, 30, 13, -3, -238, 204, -156, 109, 180, -166, 196, 14, 33, 148, 131, -1]
4632aq8M2K11l64J77K9J11L5j70m2j71L75j98j04J27j57L02l81L73j29O3J15J71
4655C26k77J3J07n26M29q2k05J3M10P8k44J15k58Q4l1M6j09K14j16Q6K48j91o6
4678F4R7k15N4J13k18O2K9oN9j30q4K57jj27K3O1r7p9L24j90N9J19o0o8o2J91
4704A75q6j28j08M2M60l82k87J68K19k10N7J19pj64J62k84K32J46m9k01L49j33
4726I0j59J7k1p8K66P0l42J77Mj7K49j00j31l23M00k62n8K10o3K0N8J18j98K0
4750e3m0O6r3q3N94n42J80m3m18N69j98J35j36J65kJ78n49K40l2j91L51o0n1M1
4774B8J99k85K1J70Q6j20j69J4J8J21j73K17k56N0R8j00J94k38J49J08K7J8k93
4797a16JJ43j94P4K80l17K73p1k6n2On3M2K25qj97rj1N3J37k00j47j26J51JJ36
$$ y = [-1, -89, -47, 164, -200, -23, 6, 117, 152, -18, -60, -231, 144, -54, -158, -31, -188, 114, -267, 106, -23, 40, 155, 326, 49, 62, 169, -357, 72, -10, -215, -202, 208, 286, 42, 157, -101, -17, -48, -2, -111, 103, -13, 73, 321, 130, 64, 161, -54, 0, 113, -105, -43, -14, -20, 39, -91, -175, 82, 81, -46, -23, 38, -59, -138, 186, -4, 55, 174, 114, 46, -16, 175, 89, -39, -147, -105, 355, -27, -314, -146, 73, -137, -80, 39, 32, -132, 30, -254, -22, 124, 75, -126, 223, 90, -69, -52, -73, -151, 115, 185, -157, 20, 24, 7, 256, 156, 25, -298, 102, -160, -218, -8, -71, -51, 7, 125, -73, -53, -93, -27, -120, -203, 391, -151, 29, -14, -432, 137, -61, 74, -62, 103, 101, 279, -270, -30, -62, -253, 98, 38, -13, 28, 227, -58, -37, 133, 219, 99, -70, -56, -38, 83, -90, 127, -129, -79, 19, -81, 113, -125, 24, 132, 159, 177, -116, -115, 28, -166, -92, 188, -129, 144, 73, 47, -5, 1, -52, -10, 215, 207, 10, 1, -10, 43, 180, -20, -167, -293, -142, -141, -5]
4823eJ95j68l04L93N4j97PJ01m08L25J62l00M19k25j03J01Q0J28k63j68K55j08
4845b9J43Q0Q0k66j93O8O8OJ75j50k43K40K51j19k0L4k39N4o5K53j30j00L43O2
4869C03l46K49j37j87N4j52J58m7L35r0K9j77j13j03K98j26j94K06o7R4K08k82
4891h7o9K84P4J50n30N6K49l2k01j00L67M7j74J5k28M81k91m9j3N4lR3n5R0K5
4916A53l67L84l28K32J34j85L2l3q6l2j56K37K39m03j13K98L4p4K84j87J2J41
4938B16k56J1N9j66J81L1K44m59K29l34M48l72K08m2k83M4j53N26k76m3J51J28
4960I2j80J14l35K90l0N2k50O1L01l84J19M05N7k23k9n08L99j32K50k30M43k66
4982A6J0j2J84l59K79j11j06m4J2L93k66R7k22m0J37l2l8K69j92n7k86K64K89
$$ y = [-5, 190, 22, -282, 111, 165, -32, -25, 76, -332, -7, 155, -145, 274, 49, -54, 47, 127, 255, -8, -176, 79, -29, 114, 194, 274, 8, -185, -117, -49, -43, 132, -18, -261, -21, 230, 111, 91, 125, -114, -60, -125, 128, -2, -102, 241, 303, -43, 206, 69, -118, -64, -216, -58, -105, 230, 140, 169, -8, -121, -224, 74, -52, -246, -40, -107, -13, 195, -87, -156, 128, 202, 352, -178, -122, 127, 95, -106, -206, 161, 208, 34, 49, -179, 302, 11, -38, -51, 3, 0, 93, 38, 128, 153, -214, 170, -158, 74, 208, 23, 55, 22, -64, -96, -252, -15, 224, -179, -292, 6, 40, -34, 250, 63, 75, 216, -40, -29, 30, -136, 45, 76, 320, -139, 90, -244, 204, -168, 40, -2, -285, -241, -394, 132, -144, -187, -36, 92, -88, 26, -309, -19, -49, 3, -247, -186, 115, -269, -150, 255, 312, 89, 60, -448, -49, -181, 69, -161, 282, 16, 26, 14, 198, -161, 118, 7, -99, -143, -131, 262, -4, 93, -129, -169, -32, -64, -102, 167, -25, -82, -368, -104, 185]
5005A85l49r0J57L69m4j49r3m5J28j36m7J3Q3J76K34m12M2k33J35j42L57j18J06
5028A27k77J46k42K91J53j76j20L11j04j17J65k95K4k4L9M4n2J6J09j91J3K6Q1
5051e3K33k34N8j88m4L33j2k34K36j24J37N1M1n07J16J49n0J31L9j50P9lJ20k03
5075g9K71l8k38K37O5J4p4j82j34L18l94M04n1k04J33K2r7k1J35k6R5O7l05K27
5099A45j21j5K36m58K26P9m20K98l0n5k09J85L34j03k6l38J80J45j61J03r3J64
5121F6j04m2Q2L4M2j8m2J7J29j43J75m23L13K0O0m64J84M63j38j88J6K21l4m2
5145A84j40P7n2k04K17j21k29N24r6p1k37R9J31j91P4L7n7K5o1j9K41k21M50m75
5169a15L72m94L85MJ23n07M64m14K8J11j93K82l3j52OK96l46M5J09R7j19J1K2
$$ y = [185, -164, -254, -97, 272, 228, 79, -14, -59, 69, -67, -114, -101, -18, 158, 392, -20, 22, -211, -76, -218, 139, 21, 127, -150, -4, -246, 45, 198, 22, -98, 213, 109, -8, 157, -138, -114, -138, -99, -55, -107, -91, 18, -173, -160, -134, -53, 180, -54, 4, -184, -228, 105, 93, -141, 95, -29, 108, 159, 200, -307, -191, -42, -92, 39, 78, -72, 7, 4, 124, -79, 192, 154, -84, 153, 218, 232, 158, -24, -158, 160, -234, 170, 119, -85, 48, 70, -27, -48, 87, 61, 156, 223, -82, 145, 24, 9, 245, -213, 13, 92, -328, -30, -60, -115, -324, -139, 195, 92, 66, -272, -92, 53, -108, -5, -98, 66, -38, -80, 2, 36, 78, 60, 18, 35, 164, 21, 196, -227, 86, 106, 166, -298, -114, 349, 211, 23, 39, 260, 226, 184, 44, 121, 69, -135, 82, -39, -268, 256, 160, 89, -148, -49, 82, -109, -35, 2, -55, -30, -91, -110, 131, -90, 360, -115, 257, -237, 148, 152, 275, -232, 232, -182, -154, -43, -236, 46, 13, -139, -133, 163, -183, -138, -29, 68, -51, -40, -18]
5192a8Nj27O0K13m66K92Lm7J17j47K63n5j36K5K64k79j64K71j36L22m51J7K58
5215H4l0K07j58Jj1m2j77J38j48J19j5R6l9j94J84Mj35N55l19k75J21k2L6l2J41
5240H9m15J73jm4L19o4k61J86J25m0J14l30K40j75K77j90k17J6K98k67K37j0j7
5263D3j41j62Q1L05o0R2k32o9L1k32M55K2k55J84K7j16j90K58j6m8Q2l6J1J50
5287A84j84Q6l61M59j45k13O6K16mJ11l38M4K6K86m04lmr1M10j49J4k7Q5k35J05
5312f6R2k38oL32k69O4j59J76J34K53p49K12J51K70k34R2Q8j81J50j70O3R4j21
5335b2j81K44j88j2J00K30k31k09M36j72J80M4l66J61q8n1r6lK48L15l58Q1j79
5358a17Q0J69k71K47p9k56K31N0l1p6P7k51K42p7K82j79J31k87q2M7K94j06k27
$$ y = [-18, -13, -140, -80, 133, -333, -41, -38, -85, 32, -115, 148, 93, -43, -18, 246, -33, -197, 74, -62, 260, -191, -174, 84, 54, 261, 103, 104, 93, 51, -126, 12, -136, -17, -32, 64, 25, -169, 15, 19, -116, 439, 120, -155, -34, -56, -20, -52, 89, -326, -153, -154, -198, 121, 57, -204, -18, 107, 67, 181, -149, 91, -84, 193, 3, -214, -198, 100, -167, 70, 60, 43, -98, -260, -179, 126, 66, 158, -74, -143, -112, -344, 111, 133, -122, 62, 89, -27, -217, 41, 25, -23, 59, 23, 34, 184, 0, 86, -275, 184, 39, -174, -108, 108, 104, 215, -123, -79, -53, 233, -171, -174, -178, -269, 141, -8, 6, -21, 64, -171, -66, 26, -212, -218, 114, -155, -91, -250, -74, 60, 313, -436, -224, -73, 197, -37, 55, 143, -38, 112, -58, 5, 99, -22, -203, 41, -147, -159, -59, 171, -60, -269, 167, -5, 175, 219, -147, 14, -74, -125, -221, -224, 24, 339, -19, 62, -117, -37, 132, -139, 108, 29, -227, 4, 54, 23, -53, 24, -227, 15, -62, 220, 41, 172, -115, -197, -150, 144, 38, -189]
5381a89Q8Q7mJ96j63K6L5n5r6o4J11J75n16M40J47j99l7k06J43rL3j83O9J17P
5406d7Q0J53l53K03p5q7K07K23q8j19j4k47N6J79L67n44L6J11l11K26K01q7j48
5429g8J8k08L35J54Lm26L03j56K35m07L1K17k91K41K52j78J92k31j02m4J91j54
5451a03j5l2j54L65J30l74P4J62J65j28k1l77M42L3l20J83k8j73J76M2j45K09
5473A11q5L14l21J55j86L1P6j51j28OJ21M1j09L65k10k29K39r1n3J5o4L99j67
5496G9k03J46P1r6Q7L8j77N0K7K7r0p9M84l54O5j90J41j16K59o4m08K93o8j69
5520b47K50K36j70l21L79l16NM43j31k40J20q3l8K35k72R1j02Q0Q8k30M33p1m96
5543c57L21N3J30P7o4n9L4j89J8j9N3J00j64K00k14K55m9n40M13j30J58K18k27
$$ y = [-189, -101, -14, -18, 178, 15, 41, 76, 21, -75, -139, -28, 147, -369, 71, 218, 19, -18, -224, -81, -90, -57, -240, -171, -54, -47, 33, 186, -167, 36, -39, -126, 81, 304, 216, 97, 83, -164, -108, 71, 438, -106, -70, 41, -270, -44, 157, 70, -78, -60, -268, 67, 221, 224, -202, 101, -55, 180, -227, -196, 21, -270, -29, 223, 45, 237, 6, -96, -140, 51, -103, -118, -150, -304, 61, 191, -183, -109, 53, 218, 90, 69, -308, 134, 167, -153, 30, 2, -171, 5, 47, -98, 111, 26, 340, 19, 174, -12, 19, 95, -56, -184, -178, -57, -16, -125, 240, 30, -199, 40, -51, -104, -89, -153, 246, 79, -124, 22, 93, -3, 84, 122, -55, -5, 22, 49, -41, -120, 364, 10, 75, -115, 26, -90, 169, 105, -303, -10, -78, -247, 3, 239, 69, -252, 127, -189, -184, 259, 128, -112, 8, -75, -113, 122, -150, -59, -161, -81, 7, -223, 210, 139, -357, -36, 17, 147, 224, 160, 101, 135, -54, -36, -55, -2, 98, -66, 134, -80, 175, 126, -414, -1, -131, 27, 245, 18]
5566A8O1O6J55k62k02M03q0k85J40L7R8k78M95l78P3k1l1j77J07K38j09K9lRn0
5591E3k37L27n6k41Q8J14J0P8j67j33J87J14l28K24j72J68J46l32J29j44K87J11
5613B26l40J77O8k20J92k74K27J28k67M22k74R3k62J1K53m49L16k99K05j29R0
5634a06M77l16j72P0R8q9j16J11j75J04J2J6l4M8J60j37j47K4k16M27j8q0J38
5657G9p8p7j35J93j34K44l94L19J68l03rK10n4R6j28K16j30j38J05J08l91K32
5679aL4r3j55K54lK30m01K17J0j06q2jL9p5K92k32j90J62qJ08J69q5J6J81k53
5704B7j8M7m1M2J8j5k03J27K0K3n5j53K04k42O1J97Rj55J2R5K32j93l74K75O6
5729Fj56J97n3L6m1l3j22J40m7K61j99j90K26p3P3J74r9l0L9j13j5m1J2J96k4
$$ y = [18, 79, 145, 300, 38, -164, 239, 159, -126, 14, 51, 149, -129, 366, -12, 61, 40, 9, -168, -61, 177, 68, 97, 94, 103, 53, -184, 143, 87, -154, -66, 48, 58, 136, -31, -164, 23, 137, -191, 33, -139, 29, 175, -157, -28, -172, 115, 226, -114, 63, 131, -89, 103, -171, 56, 184, -83, 339, 65, 158, -104, -93, 160, -289, 27, -272, -67, -196, -106, 371, 55, -117, -47, 51, -38, -154, -43, -218, -114, -102, -86, -120, -72, 88, -49, -196, -172, -388, 39, 21, -59, 79, 1, -76, -211, -18, -152, 92, -302, 17, 185, -118, -127, 83, 29, 125, -3, 213, 83, -55, 50, 158, -233, -1, 33, -60, -215, 39, 36, 266, -135, 82, 92, -14, -96, -97, -58, -133, 159, -73, -263, -101, -109, -1, 168, 83, 99, 280, 27, 9, 56, 15, 57, 75, 60, -143, -16, 4, 27, -28, -181, 23, -219, -158, 39, 48, -107, -95, 0, 232, 39, -335, -60, 6, -150, 47, -6, 30, -11, -44, -166, -26, -73, 188, -11, -201, 25, -48, 25, 199, 100, 70, 109, -4, -19, -60, -48, 148, 124]
5754A24J12l51J89p8n8P0M1P2K2l78J07J81L9k60J65J80k15M2K8K08j11k63n0
5777a84K04k18L98l89M61l93J40q8l72Q3M89k25o5P5K3j28K19r3M6L0q7QK75j47
5801F2O5l8l99K22J02J19k20J66m09L34K08j74j53k14M39n4K5L4Q8j71m7r6J14
5824Cn5N9j51K2r2l2K04r1L54l26J66j44K95l95pK49j82J45J3m3R4j66J13Q1j3
5849A01l71K82k69N09k74P9j9p6R7k61K17J58j77K81q6k13O4l27J87J34M1J3J67
5872B57o6j07J92l15P4j77K21O7N6j59j22o8L91k34J25l23K79J40j71l59K36K18
5894A55j02M7j87jO4k0J72j60K51j55n3r5kJ98j41O5m0l13K21J19%j97J4M43l29
5919d6K54l31J14j1l83N04J15O4j35pk47J11j27J49j04K24j66K01k04J13o5j77
$$ y = [124, 236, -115, 74, -4, -62, 8, 49, 121, 143, -235, -128, 53, 92, -168, -3, 177, -38, 4, 32, 240, 129, -134, -184, 20, -198, 200, -189, 272, -121, 19, -69, -441, -358, 131, -94, -159, -84, -61, -189, 30, -63, -17, 13, -74, -66, 209, 62, 127, 89, -310, -88, 14, 133, -87, 79, -330, 4, 212, 38, -115, -329, 110, 56, 81, 115, 203, 32, -15, -111, 3, -52, 7, -144, -122, -214, -246, -42, -133, 221, -105, 61, -83, 212, -183, -190, 59, -123, 22, 35, -8, 86, -80, 33, 114, 101, -270, 12, -257, 252, -22, 57, 38, -38, 59, -202, 15, 173, -4, 277, 191, -22, 42, -285, -98, 36, 77, 90, 257, 191, 84, 276, -39, 35, -142, 79, 146, 202, 43, -79, -147, 244, 10, 135, -188, 91, 231, 60, -299, -63, 155, 53, 100, -87, -88, -24, -44, 128, -32, 219, 64, 11, -84, -86, 112, -29, 36, -4, -317, -96, 23, 23, -174, -160, 283, -46, 208, -123, -9, -20, -403, 101, 216, 280, 145, 138, -109, 2, -125, 24, -80, 144, -22, 179, -25, 88, 23, -154]
5941a54K0M2L55l06L50k65l7K08k39J86l15K34j10k03J98m8P8n4J55j12j22J08
5963c1j65K96k6J22k56K25J32k95j75K90rj02n0K81j81J80k36R4j00O7J37l15
5985a17OJ16J44k54K08l5k22J00O2J64L5l55L67l23P8O1J9k72J87l6p3M22j34
6008A48L9l8n1l53K04l5R9J00k2r4K2q4j3r1J44k1Q1J6O8l9l53O3m3L09J58n1
6034A63r3j56P7n2j80K61j20J91K6rk56J44J44j17r2Lk4L3N5k9KrO2l1Q7j65N5
6061c0q6N4J0K74k20k43L89k72j11L69K9k10o5K39k81J34l1j12L43l40L79j32
6083H7M1j96J12J18o4qj56O8k35K19j78J92J60j79L56k79r2L84j82K89q03N15
6105A69l38J84J00l24R2K11j80j16J16o1J7n7L41k23O2K00k93p9J99k0j80L53
$$ y = [-154, -134, -92, 263, -43, 307, 42, 5, 213, -26, 160, -155, 79, -31, -234, -36, -84, -6, -60, 95, -17, -139, -31, -196, 100, 74, 196, -60, 165, 297, 2, -173, 117, 108, 6, -44, 237, 56, 236, 0, 94, -6, 61, 198, -117, -111, 5, 149, -105, 103, 68, -154, -54, 8, 172, 207, -148, 219, -104, -26, 35, 54, -218, -31, -67, -140, 282, 148, 187, 149, 98, -255, -51, -86, 13, 113, 91, -3, 19, -65, -78, -169, -25, -46, 35, 51, 119, 80, -273, -210, -253, 56, 214, 163, 70, -86, -9, -61, -241, 20, -100, 91, 117, 108, -148, -4, 140, 23, -69, -66, -90, -57, -2, -31, -29, -38, 24, -7, 80, -85, -30, -116, -62, -52, 222, 2, -241, 148, -124, -235, 134, 163, -47, -112, 127, -154, -20, -51, -163, 180, -160, 219, 87, 128, -68, 44, 162, 98, 90, -66, 2, -233, -14, -192, 0, 160, -19, 337, 58, -34, 350, 168, 457, -346, 169, -169, 15, 115, -209, -117, 94, -86, -202, -86, -147, -130, -187, 154, -69, -7, 193, -100, -179, 20, 0, -180, 173]
6127A73r3N9m5k69K54n1j61J00j0q8kK44j40p1J99L0j92n1J89l9R9j70n5R6k0
6152a4K80j26k44P2k36K46P4Nj76J61o8P4R4k21j07R5K06j29j20K01K25l79J95
6175A08j8j01J87l02J83K51k92j47L71k10J18J43m11J34P9J04m28J02K10j40K09
6196A50j15j37K80q0k5k07O2P4j66Q1j20L2L01j64j78K55r5L08n4J65l26k14K71
6219I8N5j09J9K86l13N0j35J60j98j74J35J46r3K58l13k4j2J45j4J91j59P9M8
6242A26k22K1M7j10p9K46l5Q6r5K59j45k13K5K84L5k21k7l2k52M19k97K10k81
6265b51P9J67o1J37j85RK89l09J39k47M18l5j12P4j5j8k51L83n6l73K74K1j78
6288a01J77J56j38j58L0q9L29k56M1q6L1L1r8J22P1k9K56l68p1L08j47k16K57
$$ y = [173, 80, 139, 94, -175, 79, 28, -133, -33, -43, -131, -133, 111, -29, -100, 99, 129, -63, -114, 75, 36, 135, -35, -90, 6, -14, 266, 140, -104, -32, -268, -22, 52, 57, -119, 42, -26, 48, 142, -79, -186, -91, 115, -14, -134, 67, 292, -87, 108, 90, -11, 176, -126, 57, 308, 16, -131, 240, 30, 148, 291, -120, 14, 93, 197, -231, -129, 81, -59, 150, 35, -102, 178, 98, 73, -134, -72, 2, -164, -83, -203, -171, 130, -34, -212, 43, -52, 256, 202, 367, 41, -173, 98, 153, 44, 63, 349, 36, 86, -49, 111, -87, -261, -126, 20, -73, 185, -128, -152, -164, -19, -33, 158, -1, 78, 126, -96, -75, -28, -138, -217, 29, -6, 80, -15, 244, 99, -114, -89, 195, 230, 9, -18, -50, -302, 117, -180, 30, -251, -172, -5, -66, 71, -114, -105, 184, -125, 14, -233, 185, 150, 38, 112, 97, 79, -172, 211, 155, -218, 56, 77, -101, 76, 232, 94, -64, -34, -123, 206, -50, -9, -95, -64, -33, -131, -9, 62, 33, 289, -79, -150, 158, 11, -205, 52]
6311E2p5ro1J21K04l30L08j26J62m43K84P2k42l60K53Q9L40l96L9k44Q4L25q0
6334c3M5M3o0j4J39l30J46J64j88L4O8j55R0L68m25L01j63j29J58J36j79kN0k
6358F2J16l97L14k03O4p5R4K51j77k78MK45j70J51J2k51K41L0j05R7M9j17J54
6381A11j13n4J00k73K89l46L06j98J88J47j01K4N5j18K51j10j04N8R1m00K91j84
6403i0j70J05L7K26r5J14k28L02o2l46K6L7JK07J81l68K67m56K45J24J03p2J18
6426B06j95j56mJ26o7K01M5n3R8n4r1N9o7m1J16k14K34j86K4J41k44n5K13J09
6450A45j82j76J74r4K67o4k05J95j64M3k37L32Q6j34J39l06J73p9k80O22j8k47
6472a0K60k34N8O1l20Q8j09J35J00k0l4J28j06J1K23l49J16J18j03j5k03L25N1
$$ y = [52, -23, -32, -93, 28, 232, -98, 210, 84, 246, -197, 87, 159, -83, -443, -190, -101, 239, -157, -118, -362, -278, 47, -33, 12, 55, -5, -19, 120, -210, -64, 100, -88, -54, 14, -141, -51, 317, -108, 193, 30, -99, 59, 195, 16, 14, 64, 62, 178, -219, 95, -108, -44, -119, -25, 226, 49, -229, -225, 20, -150, 1, 13, -238, 3, 33, -72, 25, 74, -43, 111, -2, -56, 44, -229, 60, -286, 20, -178, 10, 157, 56, 80, 135, 17, 268, 158, 54, 112, 203, -197, 94, -90, -260, -155, -118, 108, 13, 127, -101, 201, 139, -207, -181, -144, -143, 64, 245, -123, 144, -312, -67, 57, 160, 88, 206, 11, -145, -149, -23, -90, 111, 156, 103, 201, 147, 56, 115, 48, 7, 123, -91, 143, -43, -19, 122, -122, -177, 36, 145, -37, -213, -39, -133, 134, 70, -135, 60, -104, -61, -298, 34, 120, -14, 125, -181, -8, -87, -367, 255, 237, -10, 250, 16, 74, 135, -185, -97, -206, -71, 29, 9, -25, 103, -3, 8, 231, -118, -2, 116, 13, -2, -205, 120, 171]
6495A71l23J19J57Q9l61Q2j83R5J90j91L19p0k71J45r8K22J12l2k52J97j14J17
6517A20o7J85l41NpK18o4k38P3L72m03J51P4j77J59k38J29r6J45Ok8K71j25k65
6541a41K11r1J03lK0j24K91n02J04K08j48j16J34K56k30j6p0K36kq7j11J96l31
6564b13J26L2J30L3q2j40J14k55K59j6j11M7K56l30J98J16j70lj04P1j42J88q6
6587h2K9P2J40l27J21r3J36j52K89l10K47o8q2L99n40L36k95Q9j91K66JP2P4Q
6611A39k4k39K44k54K78l6k32J30q2o0J76j07R9j3q3K29l09J73L17l17k34M58
6633B53l21OJ07n2J50j19M3j91J31K4K38l09j04K78j54l3J48o4k24Q2P1j00J32
6656hJ24J46m70K32m6K16l73K33j46r4J7J88L7P1P4J10l14J92j78N1O3j93l8J77
$$ y = [171, -152, -33, 124, 213, -148, -66, -249, -154, 36, -155, 164, 94, -177, -32, -130, 92, 204, 172, -80, 117, 3, 120, 53, 238, -103, -98, -105, 113, 49, -189, -116, 256, -147, 4, 78, -99, 60, -178, -49, -145, 0, 6, -22, 249, 124, -141, 70, -21, 82, 79, 99, -25, 266, -236, -132, 76, -72, -188, -54, 202, -28, -44, -114, 122, 120, 33, -78, 118, -213, -87, -55, 75, 108, 26, -114, 0, -255, 4, -12, -123, -76, 180, -150, 48, 164, -6, -9, -113, -42, -184, 4, -82, -53, 19, 159, -168, -47, -140, -4, -156, 133, -177, 70, 2, -80, 319, -221, 115, -180, -91, -282, -16, -15, 57, 131, 139, 115, -124, 120, -134, 144, 108, -124, 6, -76, -136, 40, -67, 32, 19, -64, 165, -144, 29, 346, 29, -205, 253, -68, -62, 45, -7, 143, 24, 67, -124, 7, 31, 269, -40, -144, 134, -20, -53, 95, 31, -193, -111, -40, -140, -8, 116, 262, -208, 24, -22, 194, -179, 54, -92, -186, -169, 19, 56, 127, 201, 311, -3, 189, 11, 62, 125, -68, -106, 71]
6680G1J25j13k99J11R0l8j47L07j30j53N11l45K06j69j02j23N4N5R0N8J3k09J67
6703C0J36o9J07j11l64K69q0kO2q9l50N82j80p5K99j32k3J23K13m02Q1M9o0J2
6727B6K1r5J33J25n60M02J11l42J33k9K48k59R0k94L11Q3k96J54j15K15k63J89
6749a2N2j07R2J00J49m13R7K54k61K74k33j3k78K29j99K47j04O0Q5J40m44K98
6771A3J49p7P3Q5n03JM14k76L66j98k7l19L22j30J81J25k62L05k46rl17P8K42
6794a0k3J69m68O28n48M35k87P0Q9k44L06k55q3K24P4q1P7k30J18L9K30m13J61
6817b2M2j13J91J23k30Or2Q8o7k8L9J31q0P9j85K41j48q9K17j03k71M58k36J62
6841A13K7m07Q7K93J92l07L4p3K44m29L22k06L54l09n6J80j76K38r3l3K2P0l4
$$ y = [71, 196, 83, -216, -105, -15, -53, -200, 107, -23, -176, 335, -10, 196, 27, -75, -198, -144, -89, 1, 59, 72, -137, 30, 166, 97, 204, 93, -271, -2, -82, -84, -22, -111, -461, 121, -59, -134, 165, 33, 10, 133, 346, -56, 25, 74, 14, 26, 47, -48, 85, 210, -350, 52, 163, -179, -46, -75, 173, -86, 4, -290, 21, 104, -192, -38, -153, 62, -201, -12, 40, -67, 25, 125, 274, -139, -42, 212, -49, 225, -8, -21, -299, -70, -269, -22, -126, -66, 19, 159, -285, 13, 162, 85, 158, 243, -260, -259, 155, -121, 245, 47, 20, -299, 23, -107, 74, 199, -63, 242, -4, -13, -330, -252, -10, -33, 136, -332, 296, -252, 183, -104, -34, 55, -189, 117, -138, -221, 3, 77, -4, 73, -157, -39, 0, 230, -183, -22, 20, -93, 98, 221, -9, -3, -95, -7, -74, -102, -63, 68, -12, 67, -118, 123, -25, -114, 103, 0, -271, 187, -49, 113, 140, -267, -180, 113, 305, -2, 32, -41, 203, -226, 96, -110, 244, -65, -121, 59, -117, 121, 28, -5, 17, 87, 53]
6864E3j22J19J48l57j05L26j08k80K73O9p5k9K34n7k20M7n6J26k65J68R7K03j57
6887C2j05J82k9j65n9K16k16L25l76L36j76L04l61K86j50j28R1p0P7k10J8J55
6909b3J95j1mm69L08k95L74oj01N8jj08K7K0rM1J37K26m49J33j18K22k6k12J38
6934D7j86m9K08k2Or2J64o4L6n2l6j07K28R4j79L2k0j12J86J60j34j1j15M7R1
6959A20j40R2J11l40J2J77pK7j97K58j26r8p8K53N0j11J67m3k47o0R0K54l36L09
6983A37k66L14m57K35j10P6R6l62K67KJ23n2N1J36q6k0j73N5P4J24j80K25P0m19
7007a40p4O7L06j36L7k60K62l23j05L95J46k32K8Q0m9J56l04J69o0j83J16M51
7029C47j92J67q0l21P1k06R2j35K62K9J94j61j08j05L6K69l20J13M8k22K80j72
$$ y = [53, -69, 50, 198, -159, -264, 62, -46, -326, -53, 16, -59, -88, 146, 89, -131, -84, -140, -14, -279, -111, -14, 189, 32, -73, 109, 80, -85, -144, 72, -144, 181, -195, 141, -35, 269, -92, 194, 44, -84, 7, -63, 14, -196, -178, -23, 172, 161, 157, -312, -4, -299, 75, 69, -32, 26, 25, -83, -56, -36, -45, -4, 133, 359, -90, 43, -75, 147, 121, -91, 47, -139, -188, 20, -2, 4, -88, 76, 12, 48, -4, -40, -147, 81, 175, -4, 28, 8, -104, 82, 242, 108, 97, -18, 29, 120, -20, 72, 183, -157, -145, 32, 25, 52, -145, 113, -13, -111, -189, 64, 114, 3, 170, 127, -120, -180, -90, 164, -172, 137, -129, 185, -272, -37, -147, -71, 25, -337, -70, -68, 55, 3, 54, 190, 104, 84, -89, -34, 40, 164, -16, 209, 279, -140, -214, -147, 159, 23, 60, -200, 62, -261, -366, 29, 175, -57, -29, 51, 2, 158, -146, 23, -37, -220, -104, 347, 155, 322, 242, -79, -8, -214, -122, -257, 5, 34, 228, 67, -41, -146, -110, 159, -161, -48, 0, -222, 58, -114]
7051a14J31M1l49K99J13j14j8k2m6l2R3k6P7N5k19J65Q4J23M8k78L7j61p3J85
7075aj12j12L16j19J20J8J05l02N2r3L45k55K3j11K4J44p5K16n12L88j96M2K12
7098A17k57L34k53JK07j74pP2J8M3J44j32l58K65l4k04J61K20l66M43l35J67j63
7121i1K30p0n82M49K13k9k95L02j53R5q0J28l1J04j10k74J23q6J77M1k25L34l03
7144a33J00N1j45J23M0K64o76K26j82L22k19K08j2k43J34J79R1Q6k44L15m5k26
7166A4P6j95J14k34J54L35k03pk5k35L46j22r5K7r3p3K87L4k24O3M4M0N9j28o8
7191a09J81K03L0m88R8n4L03m24k0K56j84J15L6J96M7j67J46l3k02P1q4n6J70
7214C1j32Q6k98K75J29j29j08K36o0n7R1K20j58k91L34j06J39l95J69J57k27J78
$$ y = [-114, 17, 58, -291, 8, 121, 7, -11, -33, -79, -111, -18, -44, 33, 88, -131, 34, 118, 241, 289, 11, 48, -113, -186, -1, -113, -225, 91, -28, 92, 110, 215, -87, -35, -128, 217, -38, -15, -126, -102, 42, -33, 183, -329, 59, -137, -95, 117, -140, 194, -59, -58, 149, -25, -32, 40, 58, 101, 245, 113, -245, 20, -14, -218, -57, 163, -203, 240, -95, 72, -91, 139, 69, -513, -64, 149, 120, -175, 127, -26, 69, -11, 117, 86, 190, 80, -194, -71, -157, 20, 61, -164, 170, -133, -33, 18, -127, -4, 36, 300, -376, -150, -332, -10, -229, -21, -33, -276, -142, 37, 128, 214, -30, 285, 240, 14, 90, -105, 9, -225, -71, 264, 61, 54, 29, -206, 140, 18, -77, -50, -143, -216, 71, 105, -119, -56, -12, 28, 87, -41, -109, 72, 275, 305, -183, -85, -139, 164, -260, -280, -24, -208, -93, -57, 139, 186, 19, 165, 132, -70, 1, -83, -139, 31, -101, -15, -313, -38, 91, -38, -146, 90, 30, -27, 64, 284, 126, -165, 169, 63, 202, -193, -24, 133, -94, 84]
7236H4J90l55K50k18L3K02k44n1J86kj30j69L19J50o7R4j64l21P0K32RJ13n19
7259c08L49l67N83l58K27k89L0R0J8J66k41K8NJ63j32J16l3L0q7j24NK29k36J20
7283a6p1jL05m21k5K65P4j17j13J01j46J06J8N9L7j55M6K35k11j57K35k06K58
7306A00M8j39P1N9j43J71k44m3J76K2J64N9k35qm3j23K83k37p8Q3oj40K38m0k71
7331b76M17m22J48L20j46k94K00K26l33m2K53J04l48M4K08L88l59j75K01k67J90
7352C7K39m55J58J01K0n3j84J02L1l12M58j00k47J58j23J24K51k31K50k35kJ8
7374ER4j54K9M7N0j40J46O1L7k58K20l95pL31k80K82l29L14M0k72L6M08l00k0
7398e5j43J16J86k1n26M59K9J68k19j64J28P0K9Q7j22N7j7j9k1j03J02j94J32
$$ y = [84, 274, -81, 169, -49, -16, 186, -58, -109, 77, 75, -55, -224, 95, 245, 178, 272, 108, -213, -143, 89, 98, 211, -308, 41, -326, 257, -101, 126, -163, -133, -43, -25, 141, -100, -72, -67, 96, -36, 80, 47, 77, -10, -134, -129, 100, -136, -16, -87, -88, 217, -204, -229, 36, 110, -7, -120, -19, -165, -59, -41, 18, 55, -100, -54, 181, -30, -187, 48, -158, 100, 148, 9, 80, 139, -4, 167, -77, -120, 56, 78, 242, 301, 66, 58, 15, -108, 175, -62, -140, -57, -63, -203, 35, -5, -276, 141, -281, -133, 187, 41, -253, -53, 173, -160, -202, 51, 155, -193, -149, 59, 447, 88, -87, 114, -153, 37, 276, -179, -21, 80, 100, 47, -137, -35, -4, -316, 142, 42, -205, -47, -170, -46, 205, -26, 224, -11, -13, 5, 99, -55, -26, 21, 71, -69, 77, 138, 175, -83, 137, -258, -265, 66, -214, 68, -261, 53, 93, -179, -143, 265, -35, -55, -198, -82, 104, 83, -443, 16, 45, 213, -6, -170, -42, 28, 57, 144, 22, 79, 62, 43, 22, -81, 21, -173, -41]
7421d1L5J05O8k78Q9k5N8J55l14L5N7J63k38K43o9k8j18j59J42K31q5n8m2J90
7445A16j24j55L03l94J6M00l68K02J83l5N5m75M97l30J44j16J49p8O4K10l1k57
7467b4j58O6J81j59P1L8K5J23m14J1K91N6Jn3j49K3K66k80j18K40k19rL29o7K4
7492I5j52J38l37J8J18q2L91j75m8oj4q0j69L61m7J20k06J94j65O2K7j43K4J31
7516E5j74J77l6j8r4O8j59J53k28L44j5O3P5m27M07m16r7L91q9n1M7O6q6j13J1
7541a46j94N77l45j67L21j91J84R0r4j67K44L9j64K3j14J42K2K4k65J8j50K87
7563b6j8K14k82n5K80j69q7L29k72L5K09l1l61Q4J38j70K87P7k87L01l36J4k74
7586d00N92q6J99n90M30k46Q9j23r2R8L6j24L72q0j80l8rK92j50j55mK90m52L88
$$ y = [-41, -6, 99, 167, -111, -22, -47, 11, 166, -148, -113, -56, 107, -131, 112, 43, 15, -103, -262, -120, 111, 26, -32, -74, 116, -8, -163, 140, -254, -238, 162, -206, -4, 179, 144, 199, -276, 221, -109, 35, -81, 68, -10, 54, 264, 233, -24, -182, -116, 65, -94, -23, 15, 40, 163, -251, -240, 51, 107, 108, 55, -94, -71, 195, -85, -203, 37, -182, -191, 138, 71, 95, -57, 81, -256, -238, -120, -202, 189, 14, -34, -40, -54, -134, -303, 58, 11, 131, -75, 119, -46, 16, 43, -100, -76, 55, -119, 58, 22, 4, -90, -22, -181, -28, -256, 88, 73, 136, 211, -216, 191, -225, -322, 69, -20, -71, -24, 42, -44, -157, -146, -340, 237, -108, -275, 46, -145, 39, 129, 35, -132, 112, 151, -13, 10, -104, 38, 60, 84, -181, -163, -313, -26, -44, 170, -112, -167, 113, -56, -143, 186, -86, -51, 158, 127, -234, -150, -12, -182, 105, 182, -105, 196, -140, -126, -400, 192, 106, 305, -285, 145, -101, -12, -135, -227, -129, -93, -217, 155, 75, -105, -143, -152, 140, -10, -165, -169, 121, -331, 57]
7610E7K3l3j57j41J8L30J27j46K6l30K30J78l34N5j79M18R7l93K01R5P9j81j84
7633a44o3J95L8j80J56K7j82J81n9J06o3m42N50k73L74j89l0p0R1k2l3k92M48
7656A24j14m9j08J70j60M6K05p5J10j07N1p4k54M9L99m8k44J24J37j3o9k33L43
7679B10l52J89op4k7m7r8M6L16N7k98L71l52J2M16m70K84l31K9P5rQ7J85k65L28
7704B76k25o4K61K4m40QJ65j02J74K3J12l14o0J12j38J63J44l55K21N4r6P5N5
7727G3n7K39k55p6P8J6k83%L6K34k36K92q1J7L01j60j12l5j38L64n5k52L07k69
7751e2J15j2k20K07o1L5J70n8j12k46N9M75l75J02O4j09r5J70J43M3l82m3M3J33
7775fJ97r4J5L9j02r5l89K24K0o0l9L02n0K1k38J20M9k6p3J66R6J63k41k18K18
$$ y = [57, 80, 47, -110, -251, -233, 97, 224, 78, 104, -226, 4, 182, -152, -97, -276, 142, 239, -154, 47, 142, 221, 40, -144, -207, -12, 26, -154, 2, 29, -153, 28, -31, 75, 12, -430, 120, -153, 221, 32, 2, -68, 23, 1, -32, -324, 124, 10, -39, -147, 23, -137, -91, 114, 39, 149, 42, 93, 19, -235, -186, 213, 165, -79, 45, 182, 169, 100, -133, 210, -142, 47, 41, -33, -60, -107, -205, -159, 157, 214, -84, 287, -65, -53, 363, -107, 177, -154, -125, -50, -59, 28, 213, -52, 276, 51, -13, 248, 272, -168, -160, 5, -97, 77, 100, 212, -102, -162, -50, -188, -25, 119, -236, -15, 39, -57, 18, 73, 16, 255, 0, -76, 2, 18, -265, -265, -229, 5, -231, 61, -20, -3, 298, 138, 26, -9, -147, 217, 162, -90, 217, -52, 63, 51, -169, 38, -23, 12, 182, 124, 12, -234, -175, 300, -75, 27, 91, -18, -113, 57, 200, 243, -139, -182, -139, -6, 191, 97, 112, 151, 49, -46, -435, -211, -191, -251, -290, 12, -38, -17, -255, -135, -86, -112, -185, -19, 77, 240, -1, -219, -1]
7800aK68j49P4j6nj38J09j73P2j1pk30J98O7k45P4j09L42j1q9k08L2O7J91n90
7825d88M68J1pO0k9K4j90R6N0j26J41%J78r5j09j18N11l98p9K58k51L15m21L25
7849A26r8j5q7O3l5N9K13n3P7k32L2j28MQ7J4m0J34j71q0J65N5j87K83j72o7R9
7875D6M9j58J12J47j96j6r6o8m7J99K0J18j56P8MJ72k4o53L01K84k5k9k10m4J35
7900e7L78n30J95j98K44o9j00K64q2k64J4J30J22k23L76N6k13l57K72k2J66n3
7922D9k76L69k49KO7R9j62o5lP8K03k00J57oq3n7R0o5J43j5j09M6P9j26m0k71
7948c45K29O5K34qj49q0J93Q1l75J07J41J94j74k87J19J39k17O3N3J04r3J89j32
7971E1k37Q2J84K6O6j30j19O5k0J73j82pJ32K8k27J23k71K74m01M64o9J5k74L20
$$ y = [-1, 267, 118, 192, 176, 171, 33, 142, -31, 41, 30, 23, -207, -9, 58, -187, -113, -222, 120, 109, 20, -188, -156, -89, 102, -488, -20, -9, -16, 44, 15, 39, -151, -55, -5, -131, 10, 10, 188, 93, -16, -134, 377, -21, -100, 158, -93, 222, -199, 126, 28, 13, -74, -11, -46, 13, 226, 173, 250, 18, 50, -78, -74, 13, 27, -13, 121, -50, -130, 35, 90, -97, 186, 14, -53, 46, 95, -63, 49, 196, 0, -16, -112, -180, -227, -28, -8, 110, -46, 32, 36, 208, 184, -469, -168, 116, 91, 62, -148, -192, -57, 321, -209, -14, -212, 32, -37, -137, 127, 45, -219, -205, -75, 47, -176, 200, 256, 43, -314, -42, -64, 102, 49, -227, 142, -107, -105, -38, 61, -101, -166, -169, -91, 112, -88, 69, 63, -20, -77, 13, -52, 91, 76, -33, 13, 92, -34, -74, -345, -116, -51, 183, 175, 26, -54, 139, 220, -155, -48, 93, 287, 113, -174, -55, 84, -133, -70, -17, 87, -6, 183, 51, -186, -104, 80, 106, 172, 42, -77, -12, -32, 141, -41, -48, 84, 112, -115, 8, -263, 11, -390, 74, 5, 20, -254, 66]
7995F6N8M5qm70L87j41J18oj30L16l27L9K05p5P4j79J13l2J32r4j76K37j71R6
8019G7o8l9L49m19L80o18L44J0M5l99M91P7m36L28m64K53L48j57J37q5q7k69r9
8042c01M50n3j1M8j31Q9j67L04l16O4q4J74J77j30j21o5J2p3J89q0K09K79n44
8065h1J92l08K80k11J53RK97k60j21L4n8J34j23K19k73J33q0j45L15M7j09K43
8087B87k33R3k55Q5K94On10M98m91K33J43j69j31K56%j06O6j02o7P4k28K86M6
8110G5j8l99N13k80K83j25k8O8j81N1J1%p9j47K21k0K19o5m08R9J35L31l32p4
8134a50K49j1j07n1K34r5k95L18j85o6K48j94J47J2K9j90o3j24J04K49j64l6J05
8157c6Q4PK3j04N7j31J13r8J21O3K09m19K5Q6m5K28l0r2J18k1k99J77nN6Q4r3
$$ y = [66, 124, 169, 161, -309, 78, -63, 55, 49, -81, 235, -92, -53, 152, 77, 151, -28, 85, 53, 185, 91, -85, 152, -19, 77, 9, -30, 319, -100, 280, -338, 6, 16, 61, -338, 153, 230, -206, 122, -342, -89, 259, 102, 239, 154, 67, -202, -301, 149, 96, 85, 133, 2, 91, -76, 228, -88, -24, -108, 66, 243, 113, -8, -73, -61, -134, 55, -25, 184, 463, -81, 111, -197, 83, -128, 25, 34, 331, 71, -50, -16, -74, 60, -63, 156, -117, 16, -64, -209, 106, 153, 44, 287, 54, 147, -108, -23, 271, 277, -233, 265, -226, 7, 150, -19, -150, 106, 106, 0, 66, -36, -103, -29, -257, 29, 75, 57, -342, 171, -109, 174, 49, 21, 89, -92, -41, -30, -30, -109, -256, -35, -55, 164, 99, -309, -210, -75, 256, -76, -150, 99, 88, -19, -70, 164, 69, -226, 92, -93, -159, 89, -105, 42, 54, 83, -107, -170, -294, -190, 59, -105, -141, -36, 48, 55, 78, -26, 31, -100, 13, -85, 36, 99, 308, -111, -86, 0, -45, 183, 153, 61, 179, 158, -141, 36, 31, 87, 171, 78]
8183G8k07L62k74n7K66j45p7N8
$$ y = [78, -129, 233, -41, -98, 168, 23, -54, 4]
8191D
$$ Imaginary data points
##PAGE= N=2
##DATA TABLE= (X++(I..I)), XYDATA
0@%%%%%%QqQj6J6k3L1m0M8n6P2q8J04j28J60j92K26k66L13l66M28m96N70o57P52
31D00q60R79j109J254j412J590j783J993k228K482k756L060l394L757m153M584
47B404n055N573o142O769p458Q217r063J0009j1073J2278j3657J5256j7125J9353
61A0286k2069K5457k9823L5695m4071N7084q0297J34580n06815m29480L50609
72d98844m5127J47042K06922L51616J68586R2236O2708N0761j31537j43188j76966
83H4209j24203j19151j25776p5651L1618J3508R8026J48750J05478N8021N0676
94A45505N2387P6559k5173p6600m6520n2057l7894j509m8417n0023j7028K9572
106e1198N8076k0411o1835L7040M9438j3155l5511p434O9192M4036p1371k3353
$$ y = [0, 0, 0, 0, 0, 0, 0, 8, 0, 8, -8, 8, -15, 16, -24, 24, -32, 40, -48, 56, -72, 88, -104, 122, -144, 169, -197, 231, -265, 305, -352, 400, -460, 519, -590, 664, -748, 842, -941, 1052, -1176, 1306, -1450, 1610, -1784, 1973, -2180, 2404, -2651, 2922, -3220, 3549, -3909, 4308, -4755, 5254, -5819, 6459, -7198, 8058, -9067, 10286, -11783, 13674, -16149, 19546, -24525, 32559, -47738, 86842, -419973, -849453, -498844, -543971, -396929, -190007, 161609, 330195, 422431, 485139, 535900, 404363, 261175, 84209, -39994, -159145, -284921, -360572, -328954, -315446, -217420, -68670, 36808, 94829, 145505, 197892, 274451, 249278, 172678, 126158, 74101, 36207, 34698, -13719, -63742, -80770, -51198, 6878, -13533, -75368, -38328, 11110, -2045, -37556, -44990, 24202, 68238, -3133, -26486]
118b6486P8516M7489l4785q0074k6504L5160k5766n0902q748k2446n744L7957
130h2333M4863N8071K3983j982N2107L9245j6240k5112m2483l7827m1373p5243
142a04324k4762K2539l960K703J6793L7410Q7187O7266J8933j346k3401J0435
154A05473J6582o4289p7668l7370k1729k556j7024j2572M4007L8913J5513K9752
166A7032K6398L3811J5811l2777j3299j363k5933p966j5801l2586l910N270J7370
179a7943J9005k4260r125K8460J3851J0340q687k3132J4582J2394q455O631o728
192F933n916N293j7546Q25J4632j2005l677r429j7761K3314K1245n442j286j1347
206a2167Q346L1062j154o021o143j9300Q988N237j6932K763m945j2404R917n80
$$ y = [-26486, 52030, 99519, 64734, -15340, -41844, -6684, -32450, -83352, -92100, -114546, -120290, -82333, -37470, 20601, 44584, 42602, 94709, 133954, 117714, 92602, 50119, 12292, -29081, -104324, -129086, -106547, -110507, -107804, -91011, -53601, 33586, 100852, 119785, 118439, 95038, 105473, 122055, 57766, -19902, -57272, -79001, -81557, -98581, -111153, -67146, -28233, -12720, 17032, 43430, 77241, 93052, 60275, 46976, 45613, 19680, 11714, -4087, -36673, -40583, -35313, -17943, 1062, -23198, -32323, -3863, 9988, 20328, 11641, -11491, 3091, 15485, 7030, 13661, 6933, 1017, 6310, -11236, -10411, 4221, -7784, -11461, -20890, -38651, -15337, 5908, 466, -820, -12167, -3821, 27241, 26087, 20066, 13923, -5377, 3611, 8848, -8084, -5321, -10266, -22670, -12753, -13333]
220a3333O626J9352o598j838N648m970J6703L698k3555l451m577m319J0946r873
234i541q549Q454k000J0205Q582j2046Q012O544q653P828l726q780J0329m244
248B415k098Q159o211J847p19j4253Q279M387j1306M063n584j785K0363M798J186
263A3541M940r487L943M353j1162j556j3008j9171M780j681o29J3843j10M765
277f639J3763J748J2918P272j1922l580r783j1142N360q842j1043M955k262O487
291a2710J1924K85J0441M267p321O461n90o573M009r632o660P315n927J91N451
306I31l835O017Q47n772R019j026o423O312n046k761M590r322O67O221o829J282
322e128j103l820J0373o18l137R182l885j773N064n673K832K084j0796P27R25
$$ y = [-13333, -6707, 12645, 6047, 4209, 9857, 4887, 21590, 25288, 1733, -1718, -6295, -10614, 332, -9541, -18090, -9636, -11636, -1431, 7151, -4895, 3117, 9661, 1008, 8836, 5110, -3670, 6659, 2415, 317, 8476, 2265, 4112, 3393, -10860, -2581, 1806, -9500, -5437, -11021, -12806, 7557, 12355, 13541, 18481, 8994, 12937, 17290, 6128, 4572, -8436, -27607, -22827, -24508, -25137, -11294, -11404, -6639, 7124, 8872, 21790, 29062, 17140, 13560, 3777, -7365, -2005, -10847, -21890, -16935, -19197, -12710, -786, -501, 9940, 14207, 6886, 13347, 12757, 6184, 10193, 561, -6099, 1216, -4711, -4520, 931, -2904, 3113, 3960, -1812, 7207, 6181, -242, 6070, 1024, -1737, 2853, -6469, -5802, 419, -6410, -5128, -6231, -10051, 322, -296, -3433, 5749, 1864, 91, 5155, -518, 2314, 4398, -6398, -5671, -4746]
337d746l548P963k546k225Q890m507j9Q215l992R50l70r157M859J588l627P698
353E426j096o62P388o022J043Q294q246l248l339q784L476j795n703O222l239
368a0285j130R683m25O904R021p505R08J635o212L023m135q755k71p843k432R436
384h383j642K202O021j193R696P434l693M199k810o399L35p904l382L442p395
399i472o29O238K16Q951O115k659N935j06m645j29j0271o559o20q211j57L051
415a2952l908P644Q426K161P672p87j641N552m863m804j308q476j086P9n238P360
431f169N943j917J984k069L127R262l819m801p14m636N064M734l859M404m1l587
447B906N871P1j064K32q779l668m51n809L232K627o065K232K064L359J0775p51
$$ y = [-4746, -8294, -331, -2877, -5102, 3788, -719, -738, 7477, 3485, 4435, 4065, -5092, -233, 1355, -2272, 5426, 4330, 3668, 11056, 5034, 6077, 14371, 6125, 2877, -462, -9246, -5770, -7565, -13268, -7046, -10285, -11415, -1732, -2157, 4747, 13768, 6263, 7171, 8806, 2594, 5617, 1482, -7273, -7544, -15387, -17819, -8383, -10025, -7823, -1802, -2995, 6701, 14135, 10442, 14641, 11831, 5432, 5767, -2137, -5519, -2077, -9472, -10101, -3863, -3647, 5304, 11419, 8760, 14695, 14589, 9944, 9815, -456, -7015, -7635, -15846, -16003, -12952, -16860, -9216, -790, 1371, 9043, 8256, 6615, 12167, 7304, 2500, 1192, -7284, -8370, -8291, -13529, -6169, -226, -2143, -159, -2228, 899, 10161, 6342, 1541, 827, -3809, 1255, 5989, 2130, 6534, 6493, 2906, 8777, 8848, 7784, 8016, -763, -4431, -4882, -10691, -7459, -4832, -10897, -8665, -6601, -3242, 7533, 6782]
463F782l549K985n09K842q86j0194j023n39n709J991l301j550O797L49J176O546
479B208J324N297K358n657L877J576n337j700o937m369N049k141j897J016l630
494h963N551P527n63K470k239l487O978o68m386R33m748j585J094l948M534L512
510B012n786o11L35J310Q687p65n114J647q35M239N068o074k779j507l761K808
526a126k433m530L534j205j888N086J208M280L703m252O75J314k156J279m847
541a358o888K544j83l79K573m043K667P264Q81K342p62j704M973N15l115J156
557F483l638k213J543l886j23J840m440j73o82j047O862K012k386Q01r37M266
573D282O233l953m129j909l504K098j388n198J049k493q01N093O59K878M650k559
$$ y = [6782, 3233, 6218, 5709, 8551, 7665, -2529, -3552, -4091, -9800, -7809, -11110, -12660, -5863, -5514, -4338, 2208, 3532, 8829, 11187, 5530, 9407, 10983, 5646, 3946, -2991, -7360, -2311, -4452, -6349, -5333, -8963, -3412, 4115, 3552, 6022, 3783, 296, 7274, 6606, 2220, 3153, -1595, -3180, -2086, -6034, -1500, 2012, -3774, -4385, -4050, -2740, 5947, 5182, 68, 1715, 880, 5119, 10187, 4113, 1334, -173, -3934, -1126, -3559, -8089, -4555, -5760, -7648, -2562, -1354, 2926, 6629, 2377, 3052, 4366, 2210, 3489, -1358, -8246, -5702, -5885, -6264, -3691, -7734, -5067, 2197, 3078, 5420, 4658, 2954, 7927, 8442, 5327, 6483, 2845, 632, 2175, -1711, -1834, 6, -4434, -4607, -5289, -6336, 526, 2538, 152, 953, 16, 4282, 10515, 6562, 2433, 524, -2980, -882, -2270, -7468, -6419, -8912, -9713, -4620, -3961, -1083, 3567, 1008]
589A008J095K549j33L629k022o103J51j396J073K935m733j385L128oK558P82l081
606D9J876N29k090J378k325r50J958l481l97K730j602K018R8j880M285J140j918
623A418R68l398m11L787l817k389j187k907L679L209j646K285K1J049M941o98
639D904J74K039m500j157N9k604K402o14m632J089P57J989M278k399j859J208
655A134j361J546J053l885k01o64j799L473K60n32K996j907K51K589k332P14j6
672A319m980J42N68j323K174j889o74M369L12J343J924j746K452J922l159O30
688C384j296k243J444j524j012J839k325K39K060r97J752M68l454J284J81j120
704a320K584j216j934J552j387K195K731k550l94k50j558J982m08k270J463k083
$$ y = [1008, 2103, 4652, 4519, 8148, 6126, 23, 174, -1222, -149, 2786, -1947, -3332, -204, -210, 2348, 3130, 49, 1925, 2454, 364, 1742, -583, -1533, 425, -3056, -3453, -723, -2325, -307, -209, -2089, 2196, 3336, 1418, 2386, -1012, -1423, 2364, -1453, -3842, -5029, -7936, -4257, -1048, -2694, -409, -388, 661, 5602, 4904, 5078, 7117, 2617, 1460, 1519, -1085, 1317, 703, -3929, -2840, -2083, -94, 4184, 1785, -74, 1134, -227, 1319, 2372, -1513, -1714, -2378, -4177, -704, -444, -976, 2020, 113, 364, 2953, 621, 1335, 1319, -3661, -3519, -2951, -4274, -2100, -3989, -4663, -294, 18, 1361, 3285, 1539, 3991, 5913, 2754, 3384, 2088, -155, 1289, -235, -1247, 592, -1733, -1494, 566, -431, 1321, 1789, -1665, -381, -200, -1320, 1264, 48, -1886, -334, -1721, 474, 3205, 655, 261, 11, -1547, 435, 27, -2243, -780, -2863]
720b863m92K192k41J523J229k684J709J562m89K166j798k023J675j105k0J637
736A978k199L53k44j315J706K34k059J308q23q94K155j297M00K061j327O63O61
753A361j425J676l90j562J571j148j532J185j441O80J432j873M17R81j165K340
769A107l32r02J400j492j88J986o95J11K30k280P84R38j069J325j071j709J866
786Ir28K96J854j730m16J208j585K073L82j860J321q11o06K263n83k42J385k353
804c23j33J258j554J211k80k228J860r34n57K254j094J03J705j584N54J293j229
821C22Q73q9j816J281q70o77K089j502o26J115j870P95R73j016J341l44r26J768
839H21p9m45J507j340m02J040j589R05M18j742N95j09q22J841n56q41J472j697
$$ y = [-2863, -3355, -1163, -1404, 119, 1348, -1336, 373, 1935, 1446, 3612, 1814, -209, 1466, 361, 341, 1978, -221, 132, -112, -1427, 279, 513, -1546, -238, -1061, -1955, 200, -1097, -697, 1364, 37, 700, 1361, -64, 1612, 1222, -340, 1231, 83, -1449, -264, -1705, -1025, 407, -1466, -1049, -68, -1233, 1107, 775, -127, 1273, -219, -407, 1579, 884, 995, 1225, -1055, -271, 667, -402, 923, -148, -1857, 9, -919, -623, 1231, -499, -915, 293, -1292, 781, 1163, -697, 624, -187, -793, 1470, 887, 645, 2030, -323, -456, 802, -752, 459, 179, -2049, -189, -1123, -1680, 574, -520, -417, 1288, -296, 258, 1551, 322, 1195, 1106, -710, 571, -299, -976, 1113, -389, -1015, 100, -1770, -975, -2, -1018, 323, -21, -947, 821, 742, 297, 1804, 464, 62, 1102, -487, 418, 836, -906, -311, -420, -1242, 599, 43, -798, 674, -1023]
857a023K46J592r84P97J78j399J086J20m70J705j090o90N34j440K13Q78j709O25
875h31K78j286J754Q1l18J488q17o42J318j363P44P11j835L83M35j027J224M74
893G71p79J286j087o23J251j233P15j36j902J010K50l99J467o7n61J295j049M31
911F40J269j675L87m98j089M98J4q23J316n78r05J362o04P68J045j834N87O45
929E25j425J374K76r41J497r42l13J085o75J22P21j941K22M35j276J758o39j132
947a269J141j78k46J904q19K02L50j274M93O15j405J108o14j686O42j84J64J365
965C09j957M11J407r11J010N82j195J061k19j349J440n24k89J039j438L33J147
982H57r84J453l88j006J192k61j021J028n08o73P44j433O09Q91p35R87J30j202
$$ y = [-1023, -777, 815, -169, 628, 806, -593, 493, 613, 143, 1848, 758, 68, 602, -838, -625, 253, -1456, -831, -553, -1839, -85, -4, -322, 1166, 349, -293, 1025, -338, 406, 1117, -718, -335, 100, -927, 297, 771, -8, 1278, 191, -432, 819, -414, 301, 165, -1737, -727, -477, -876, 591, 524, -37, 1258, 209, 640, 1909, 234, 621, 123, -966, -468, -454, -1277, 39, -539, -1444, -82, -686, 82, 1127, -707, -120, 525, -900, 474, 750, -191, 1306, 364, 51, 1136, 461, 583, 1304, -637, -415, 20, -1256, 502, -137, -1269, -128, -306, -552, 1352, 533, 735, 1085, -189, 304, 919, -486, 622, 8, -1678, -1036, -1220, -1056, 309, -1648, -1237, 170, -741, 269, 851, -344, 717, 498, -851, 589, 65, -224, 815, -623, -290, 857, -127, 1326, 938, -68, 1124, 863, -158, 870, 362, -311, 433, -1000, -391, 500, -235, 752, 882, -320]
1000c20R25k02m9J134j352l62L58r22J62M95j015O91k34j345J496k3k46J269j030
1019e70j69J073n00Q95j67q68O65l97l90J119p53m58N44j265J87J071j009R62
1037c0J58j267J235P57j02J141p38k33P20r34J22L46j286K88J24j530J051l7q89
1056a104J968j162M7Q23o38O74M78j165L82L59j227P65l40n70J013j240nO56p65
1075a051O29J82j168P39J54m02J238j55n37J210r24j66J335q45K37N1j096P50
1093A81K10n61Q66p72n31J137q76q7J177j314M01K21o21J250M2r50J316j124J56
1112A21J037o73j55K15j308L01P14j236J128k04j014J141l74J65J116o05R8N92
1130A059j263P35R2n95L90m26o14K05k22p2Q92j208J28N11p96N19N64n62N80L9
$$ y = [-320, 605, 403, 354, 1488, 136, -226, 132, -790, -628, -133, -1148, -457, -691, -2036, -540, -563, -809, 460, -570, -739, 334, -166, 729, 562, -306, 359, -38, -428, 691, -62, -520, 24, -1241, -1054, 17, -992, -30, 128, -1139, 96, 853, 751, 1892, 1154, 921, 1641, 707, 829, 1175, -111, 177, 301, -1229, -178, -215, -1104, 864, -298, -251, 572, -66, 608, 1086, -79, 303, 662, -565, 200, -140, -710, 303, -937, -942, -286, -1051, -422, -240, -1408, -669, -515, -917, 321, 166, -371, 839, -85, -251, 1084, 239, 476, 527, -569, 181, 391, -170, 696, -76, -607, 530, -346, -433, 744, -570, -169, 52, -569, 681, 723, -227, 1089, -35, 121, 1158, 485, 330, 545, -763, -462, 252, -984, 144, -60, -1074, 67, -307, -142, 974, 369, 467, 1059, -204, 531, 623, 28, 418, -8, -622, -417, -639, -711, 181, -1027, -899, -388, -1184, -665, -101, -663, -83, -44]
1150d4o61J324l09J87L11j004L97K39o24Q87j57q55N64k54o4P24l55j99N56p69
1170a06J03L36k18N82k44r61J231l44k66P32j046j88M91p97M28L91j172Q68n49
1189g29l30P89k61kR30p96K79M68l16N15K58q35M77m16l29N41o32J58N80r00Q5
1210d66P83n59Q30k12p28O56J04n02R43q13n12Q93r80M87O60r38P45l16o08Q92
1230C59j15m15N09r28Q4N63p42P66M18j113O72L44m87Q53o43j24J20m96J38N12
1250B75n83M24J32q12M38K01o34R87m74p21R24n65R9Q54n38J89J53o04P90J16
1270F51p37R00o65l84K48l57K6N64n16k16L84l90J150n93l25J177n33l13N01n29
1290D3k3K68j197M58K93m32N22K29o40Q02o11j02Q79o65l1M47p74N47J41m66O96
$$ y = [-44, -705, 619, 310, 497, 808, -196, 201, 440, -184, 703, 546, -309, 255, 1, -63, 661, 306, 107, 663, -106, -3, 333, 115, 697, 453, -508, 723, 379, 113, 845, -201, -389, 102, -695, -267, 124, -1048, -180, -729, -1059, -270, -531, -533, 397, -399, -120, 348, 32, 547, 805, -30, 447, 31, -298, 243, -389, -231, 349, -551, -466, 317, -242, 588, 376, -352, 304, 408, -94, 849, 36, -476, 417, -563, -76, 584, -354, 391, 75, -533, 359, 244, -171, 338, -590, -506, 57, -685, 81, 499, -614, 58, 402, -85, 768, 125, 1, 121, -375, -237, 275, -308, 116, 248, -564, -126, 75, -559, 428, -46, -767, 157, -408, -309, 545, 7, 196, 349, -255, 535, 651, -86, 814, 149, -235, 13, -344, -318, 246, -270, -486, -102, -492, 658, 65, -260, 917, 384, 71, 572, 43, 20, 288, -909, -451, -158, -590, -68, 161, -479, 323, -288, -390, 489, -176, -207, 240, -534, 13, 154, -312, 384]
1311C84n57k25R20l13l7N63n18k39N13r68M87K06r97R06r53J4R71n00K37M41l46
1332a1L06K29j53N43j50n76Q7k71l74Q16p52n5K22n99K63L77l54N13K06p35Q48
1353C80k79K42O37p35l5M1l64K9L72j286O09q8m52O53k3l8Q05o77L36O65r49Q88
1375G31Lq69L19m24l10P13j80m51L45k78L76M67m78M58M5o10O64j78m21M80p06
1396c04J57L63q22M95K81m18L06K49m49M39P5k46M81q42k04K85j39M4J36p01N42
1417b72j69l03Q90j22o8O12p10K64M57m39L16K80r16N00J1o03K79l53l47M06k90
1438e77K16O50l54O33l43j50Q46j61l58N00p03l64M87m86j30M01r91K60M50n04
1458f78Q64j97j52P10m21k78M91k41J86O5p24R1K91j92M88m22k98P40m07RO32
$$ y = [384, -173, -398, 522, 209, 172, 735, 217, -22, 491, -477, 10, 216, -781, 125, -828, -814, 157, -343, -106, 335, -11, 295, 524, 371, 914, 764, 188, 275, 4, -370, 446, -306, -361, -139, -738, -475, -98, -452, 61, 267, -468, 380, 101, 343, 980, 245, 210, 251, -113, -84, 288, -998, -389, -477, -929, -276, -299, -337, 468, -209, 127, 792, -157, 731, 734, -135, 184, -240, -550, 163, -17, -468, -123, -401, -25, 442, -36, 422, 467, -143, 521, 343, -78, 402, -304, -147, 216, -606, -111, 170, -248, 58, 307, -142, 297, 372, 126, 607, -235, -439, -154, -293, -249, -113, -814, -272, -441, -744, 146, 24, -44, 568, -142, 122, 579, 140, 456, 736, -180, 320, 331, -272, 7, -346, -693, -287, -577, -361, 289, -65, 568, 225, 75, 921, 760, 402, 902, 199, -165, 322, -164, -294, 107, -884, -624, -174, -678, 186, -11, -163, 547, 126, -152, 339, 98, 284, 349, -375, -284, 7, -185, 303, -119, -417, 323, -84, -75, 557]
1479E57n45K55n04l61Q13n30o8M22j73q4Q38k62j76N03n29L6J22k79J23j17m60
1500d19J78n96o6P93k23K24L63m37N33n3l90O35k66n76O56m07k62P61m92J04Q6
1521A46n61M14J17l30L52m16l34O15k77J78N00n88N20K23m15M30j50m28K44n54
1541c14k65O13o47K29R8o14M62L87m33Q61k93r5K33k78P4K15k58j98N13n32J04
1562a38M20l02O01j62n02N66m53j85M34n73J28J87o58K61O80n78O39j72j69N69
1582E93q9o17M77o72J63K44m55K86M3o55L31J60k17M20j57K27L03k97P0M19j83
1603C94J33r6n21J91m7j84J63m24R6K19m22N37K23l92K11l4k73O02N2l16%O1j75
1626bM27m93K79P7o30L76l6l42O60m33k02J18j86K36K03o4L74r3n98O13o5l86
$$ y = [557, 12, 267, -237, -598, 215, -315, -383, 39, -134, -218, 620, 358, 182, 685, 156, 192, 314, 35, 158, 41, -419, -241, -837, -903, -110, -333, -109, 254, -183, 350, 297, -93, 542, 276, -300, 356, -51, -313, 448, -44, 60, 146, -415, -1, 116, -214, 138, -278, -612, 3, -274, -96, 404, -184, 336, 559, 144, 574, 424, -4, 240, -314, -579, 34, -613, -384, -286, -900, -438, -51, -484, 377, 84, -11, 222, -56, 18, 233, -25, -223, 290, -242, -138, 282, -20, 581, 419, -83, 483, 30, -155, 279, -294, -166, 21, -637, -376, 304, -274, 365, 193, 24, 593, 504, -113, 364, -308, -145, 99, -356, -70, -27, -682, -351, -191, -408, 12, -145, 82, 385, 88, 158, 577, 394, 527, 431, -90, 101, 54, -130, 33, -391, -295, -76, -498, 39, 262, -130, 81, 47, -226, 376, 428, 112, 112, 173, -2, 425, -68, 211, 288, -342, 34, -2, -344, 316, -117, -319, -201, -387, -151, 52, -12, 362, 269, -329, 284, 219, -167]
1648a67M51m7n00J73k87L30K98l91L32k48O1qR3m18L33j61k48N37k56K2M76p00
1670c25N45J82o9K72k58l92o1j00l42P48o74L05K33n54K13K06N7M95n19j10J51
1691CO08n58K85o9Q5j11l33J46j03k32N43p64o7M12r2K15J88n34R6P10p56O63
1713C35J5k69J18m65J20K23l31J66J55k43K96Q0l89M28m6p06N99k30K14J43j84
1734B9l24O94n80L15j3j52L77k24o8K73l54j63N85p48l1j68j42P35j1m5QJ02k78
1757a83M37M9j52M03o35k09L41l74J40P2m05N42k9OM06m76J15R3l96O1M66l47
1779g5L94k0o43N11Q8q8P2j46m85M37l16J73J15l35K81j86m55P98j58q6N22m10
1801a2J27K93n72N95l70j42n3k35J46N48n22q3L81m86K98K36l20L84j77m93N50
$$ y = [-167, 284, 237, -263, -90, -377, -47, 251, -140, 192, -56, 5, -3, 90, -328, 5, -156, -404, 133, -123, -101, 375, -325, 220, 402, 333, 605, 347, -45, -106, -206, -548, 200, -474, -169, 64, -490, -277, -71, -14, 481, -38, -148, 3, 611, 53, 338, 269, 354, 243, -90, 56, -47, -279, 264, -500, -567, -155, -247, -32, 156, -378, -282, 428, -328, 335, 350, 81, 199, -266, -146, 77, -254, -88, 67, -176, 120, 200, -189, 239, 193, -513, 86, -144, 70, 213, 29, -295, 399, -181, 134, 121, -31, 346, 122, 54, 327, -27, -190, 395, -353, -384, -552, -694, 41, 30, -15, -7, 95, -183, 254, 303, 151, 554, -81, -290, 51, -323, -183, -111, -516, 26, -3, 3, 409, -67, 48, 141, -255, -194, 272, -75, 319, 299, -344, 167, 255, 167, 239, 93, -392, 45, -271, -98, 17, -318, -37, -223, -678, 120, -38, -124, 398, -12, 115, 408, -164, 431, 61, -81, -134, -369, -223, 325, -197, -280, 101, -385, -87, 149, -171, 213, 36, -457, 93]
1822I3J5j90K68m75r4K87J57o5L73n50K22J00l75M93j33m16K74j73j9J48O8l7
1844b9J86J38j75L36n18N15j56k07p3j08L4L15n66M51p1p26M97J64k10N75l46
1865B6l01M18m25J84R9R6j79L74k34r2L20l80K84l94m30N59k18k5L22l29J01L15
1887I1m7QR0j47L40k15j75N06m87MJ48l72K40o3p2P1J76l69L86j08n4K41l05N5
1911e8J59l51N74l39l0R0Q0M4Lr2m5L67p56K26J15k05K57K11l46j23j90K93N52
1934D36m00K32J25l44J78q5P6k28J27m07L46Mk05O05m05m43M65j13nP7j75K61
1956A22Q4m67O87l75L9M10m16q7j32K2J88R1o19K41k88j70N62k04K93K99q54N26
1978d8J73j49J6j3q8K90j50l58M19K0k83J38m4J67J60n93L29n6k49O35l24r1L97
$$ y = [93, 108, -82, 186, -289, -383, -96, 61, -4, 369, -181, 41, 141, -234, 259, 126, -290, -16, -189, -208, -60, 8, -29, 157, 295, 120, 456, -62, 453, 297, 90, 17, -91, -57, 258, -308, 143, 72, -654, -157, 7, -203, 372, 26, -275, 143, -282, -98, 1, 97, -82, 292, 58, -34, 286, -94, 190, -204, -634, -75, -293, -318, 4, -325, -224, 91, 44, 52, 142, -5, 335, 120, -55, 451, -36, -32, 116, -256, -16, -79, -151, -80, 96, -273, 113, 5, -49, 192, -113, -58, 101, -250, 324, -15, -45, 45, 125, 169, 172, 80, 35, 402, -354, -128, -13, -218, 39, 250, -96, -219, -409, -116, 436, 36, 268, 393, 49, 227, 142, 218, -10, 117, -290, 56, 60, -145, 460, 55, -388, 77, -36, -41, 36, -139, 122, 206, -261, 426, 51, 90, 500, 84, -3, -135, -113, 75, 166, -453, -212, -500, -670, -108, -312, -19, 280, -574, -48, 125, -24, -8, -21, -109, 181, 31, -327, 92, 112, -171, -33, -77, 90, 250, -343, -14, -70, -319, 316, -8, -99, 298]
2001B98k01J54j28k97K64K18q38P75k02l31M69k87J73L05l92j0k2l17J39n7n8
2022c45P5j83M10L78l12r0L09j80R2J05k22K83m07j91K21l1l03J94K88l41K27
2043b3L6L40J50m61J42K00k05M2nk60K04K4m40K94m35L97M0j20k8J02q9Q3J4j72
2067a70L36j02M5K07k68L6k57j15J90K00k41K05r0p3J54k68J98L04o37K61J30
2088D5k14K28k44L7O01m04J51Q6j54L11j67j98m0j10q6K86j92k18J87m8J5L27
2110A99j75J34Jm48O08k13k07L28m3m81K35J33l93M55n58L25l8J12j20J45k02
2131b03K89r6k20L56J41j74J69k9j44r4L5L26m03j84K16J38o30L08K14m28N69
2152A56p4j39J42k46L81j79j23M16j41k71L76l94K9J0j66L52K85k32j68Q2m73
$$ y = [298, 97, 251, 123, -174, 90, 308, -530, 245, 43, -288, 181, -106, 67, 372, -20, -30, -52, -369, -230, -287, -345, -270, -453, -43, 335, 23, -67, 242, 62, 154, 259, 37, 320, -87, -278, -57, -88, -391, -197, 91, -250, -23, 13, 353, 503, 42, 184, 384, 179, 221, 216, -44, 160, 184, -256, 38, -397, 0, 40, -80, -108, -6, -95, -12, 2, -170, 166, 64, 109, 316, 48, 84, -173, -288, -98, 102, -139, 66, -24, -97, 57, -211, -13, 291, -346, -85, 45, -169, 59, -185, -148, 453, 49, 200, 286, 132, 443, 276, 78, 38, -72, -158, 128, -64, -282, -95, -143, -128, 199, 24, 158, 159, -289, 319, 106, -101, 227, 184, -297, -62, 71, -322, 133, -425, -100, -138, -26, -146, -1, -203, 86, -10, -230, 126, 267, 93, 262, 233, 89, -5, 30, 356, -47, -231, -15, 123, -507, -199, 15, -413, 156, 82, -57, 85, -161, 220, 41, -82, 334, 193, -78, 298, -96, -67, -57, -223, 129, 414, 182, 14, 96, -377]
2173c77M78j45o8J29j11L8K01j81J80k1P2j84p6k26L14m51K22L7j0k49N40j29
2195a7l5L15j92J70j33k30p2N3q7M33k22K42qJ97l89p7j52N07r2k93L06k18l07
2218c01L87l93l3N60m49K0M5K9Q6N1K37j91j58j63N23k10Q4j94j33K3J54o8K19
2241A25Q5m99K67L1k8J65N7l68J70j22K65j3M5l8l5j52j80J74J37J18m05L26l2
2264I3p3R5j08l3K21k44J2L0l01K14L48j65j01K05k63O3J48j39J01Pm02M75j60
2287B3j54O5j93J28L81m10K06J51j36l5m7J97q4j64n0j25j10K24K5J02J90k57
2309g3j29K67M1p0M1M0j4O9l37J87K59j85n8q0Q7O8J9k82O0m0l1K25j80J82j89
2334a23R8K42K0k70J94M9oj24No3m5o4k60M43l78L55lk55K19m7N7P7n7J77m1k95
$$ y = [-377, 101, -44, -112, 17, -94, -56, 145, -36, 144, 123, 195, 11, -65, -291, 23, -428, -206, -169, -179, -428, 112, -17, -52, 263, 71, 241, 108, -122, -194, -141, -228, 205, -17, 225, 217, 414, 25, -52, -204, 303, 211, -82, 224, 6, -301, 86, -307, -340, 220, -229, -209, -164, -135, -49, 2, 239, 48, -110, -273, 250, 40, 124, -70, -203, -180, -26, -94, 125, 210, -289, -22, 9, -19, 146, 203, -165, 5, -117, 148, 135, 180, 142, 107, -45, -225, -51, 86, 204, -201, 125, 93, 20, 115, 7, -26, 195, -49, -37, -7, -308, -94, 254, 89, -12, 193, -70, -7, 141, 2, 103, 110, -292, 183, 23, -131, -66, -259, -131, 250, -160, 46, 197, 61, 26, -21, 176, 92, -72, -122, -247, -357, -133, -108, -6, 184, -73, -202, 65, 106, 36, 77, 117, 103, 172, -165, 22, 281, 96, 38, -42, 45, 113, 132, -150, -90, -130, -161, 64, -116, 66, -123, -25, 217, 237, -33, 161, 210, 204, 80, 85, 22, -23, -87, -347, 96, -282, 73, 70, -185, 34, -13, 44, 121, 64, 241, 200, -95]
2360i5K3J38p7L58m02L8P3j25J44j07J43k0r7m71M03j79K22k2L8k19M53l7j37
2383D5N71n51Q5J04k48K66k8l46nR8L1k33k0n4O00l20J21j30j65K80j89j29N52
2406C35n14k32P28j75r8J13k54l8J13J83l00P4p4Q2j41J89K96l04K68J10n29K79
2428A11N2k56L54n6j64j72K93k19K26l33MK69k56J27O1j63L09j15k19J29J49Q2
2450B13j73k30L8N14l55J30Rj11o0j9n3J74l63Q4K22j59K63K4k04K15r5k58J64
2473c0J55l24L05j30j30L34n93M73o4j31J46m01K45L79l12j6K20k83J66K13j75
2494D7J59J08l55L0O7L8j81l6K09O4k58O4J44j74K06j20k43M28k39M5K14l20q6
2517a89P1J47k1Q0qJ0Jm98N08j93N0j2p2o6K49J36p0j20oN4j18K30o7n1R4j19
$$ y = [-95, -72, 66, -11, 347, -55, -17, 56, -69, 75, -32, 111, 91, -6, -477, -74, -253, -31, -53, -15, -234, 219, 182, 45, 616, 65, 150, 254, 6, 272, 244, -102, -107, -9, 22, -211, -231, -285, 315, -5, 116, -14, -179, 101, -88, -217, 335, -179, -411, 317, 142, 44, 157, -97, -135, -22, 161, -139, -65, -139, -57, -198, -9, 287, -17, 251, 361, -168, 111, 163, -93, 261, 205, 41, -131, 162, -57, 169, -164, -160, 109, -147, -20, 41, -122, 187, 72, -147, -18, 131, 213, 40, -190, -152, 362, 7, 137, 146, 35, -25, -44, -97, 77, -286, -202, 20, -139, 124, 148, -56, 159, 64, -194, -30, 125, -199, 106, -24, -154, 180, -413, 60, -4, -135, 11, -390, -145, 234, -78, -94, 126, -157, 9, 222, 47, 206, 314, -41, -11, 56, 94, -87, -123, 86, 150, -108, -44, 100, -74, 132, 12, -231, 197, -42, 3, 217, -103, -189, -118, 29, 8, 88, 80, 90, 91, -407, 101, -92, -42, -54, -126, -192, 57, 193, 123, 3, -3, 51, -67, 163, 96, 45, 139, 20]
2543B0p3P9m1K9P6Nm06L73j84K5O26n37O8L44o32K67K01k51J05j20m2J13k17J62
2567a0q6J17k46K26p6M2J44k07j6J97k05L09k41J9K61l46J18l9L01r0j1n00L06
2590c3K23n45M10j43r7J96k81K82J47j6l55L43l60J86O5J18n7o7J44p8m32O75
2612C25j74k56l1K34k55K28K28m47L91m11J36o1R1j50J81k23k3N38n91N41j73
2633I8O3o4r1m8K58Pk7M6m42K47k23j05L18K1m0M37j92l10J35K6r2J51k56K11
2657A28jl06J93j08k55L66j56K27l38J86j0o5J62p2J18k89J10m8k1M92o07J90
2679a04K73J9l41L06j21o5L48n11K0K89l42N21k99m5J59j08N9K35l36J39p1j43
2701a18r0L0m3K96Kl75J66N9j3L11m06R8M35m46L06l14R3P1o60N44P4O0J75J0
$$ y = [20, -53, 26, -15, 14, 90, 95, -311, 62, -122, -97, 529, -8, 60, 404, -228, 39, 240, -11, 94, -26, -68, 45, -172, -10, -96, 21, -225, 1, -75, -33, 111, -96, -112, 85, -120, 189, -52, -33, 228, -118, 0, -39, 262, 172, 161, -339, -33, 190, -355, 55, -88, -185, 11, -270, 12, 159, 143, -212, 131, -229, -43, 22, 140, 83, 16, 160, 82, -350, 325, 151, -105, -136, 98, -157, 71, 299, -148, 243, -168, -32, -93, -2, -152, 29, -194, -217, 321, -270, 271, 98, 161, 97, 6, -42, 216, 223, 196, 242, -200, 47, -176, -281, 37, 58, 18, 455, 263, -47, 88, 114, 22, 173, -83, 128, 127, -179, 14, -94, -349, 17, -139, 88, -250, -64, -74, -139, 23, -49, 69, -220, -110, -158, -179, 313, -294, -104, 169, 188, -153, 153, 32, -33, 315, -196, -176, 113, -229, 292, -7, -52, 107, -1, 58, 293, -43, 96, 25, -118, -208, -178, -221, 75, 77, -298, -132, -73, -86, 225, -181, -83, 352, -94, 212, -102, -9, 62, -598, -54, 20, 80, 255, 265]
2725B65P3k91n0j53J67k07J83m4j74J20J5K25j22k9N0K07L5j27K7J12m95M72j5
2748B44n09L79l23J21K74k97K22N0k62m5J98N5J89m59K98p9k51K31J11k43Q8j43
2770a51K76j92J84L5Q0m19L1K58n45K87M1J32j50M01j72k27K55qK2K5p0q5k73
2793b65L42K6k86R6k48L98j75K81j24L56q25L84j90J03j32P15n14P4j34j59M47
2814A70m9L6k46j72L07j26k6M8j41L3N5K12j51L05k92j40L07j37L9k2n3J98j93
2837c8jm6R2k70N48n86M4J45O0L08j83k47M00k64j38N20m08J9L06k70k7q2K05
2860H7J5oL5k11J99j46j4n8N7J92m76K12K10J3k26m0j1M35l4k78Rj2N8Mq0M9J87
2887A70k78K90j99L5k6J02OK0rJ98j18k78K78j1l17n7J75Q4P2l15O1J70k32L07
$$ y = [265, 338, 47, -3, -156, 11, -196, -13, -57, -231, -111, -96, 129, 7, -22, 28, 235, 270, 143, 170, 282, -213, 259, 244, -265, 114, -209, -88, 186, -111, 111, 161, -101, -146, 52, 107, 296, -163, 135, 56, -195, 36, 147, -96, -8, -151, 125, -67, 117, 152, 232, -187, -156, 102, -443, -156, -115, 17, -133, 268, 96, -131, 124, 116, 138, 163, 93, 8, -265, 77, 103, -183, -87, -335, 63, -112, 169, 45, 401, -424, -40, -230, -127, -259, 456, -58, 16, -118, -277, 170, 121, 157, -89, -261, 46, -80, -106, -58, -199, -166, -111, 101, -50, 255, -37, -177, 130, -7, 32, 10, -43, 155, -38, -39, -85, 7, -263, 285, -301, -257, -112, -52, 256, 73, -174, 226, -38, -176, 344, -64, -45, 261, -9, -36, -118, 87, 102, 96, 131, -80, 119, -27, -41, -99, -42, 150, -326, -114, 96, 109, -117, -157, -168, 267, 233, -45, -36, -48, 10, 14, -66, -17, 170, -108, 182, -17, 18, -8, 94, 100, 120, 111, 309, 191, -87, 191, 180, -137, -194, -19, 65, 137, -178, -117, 53, -179, 128]
2911A28m6k39L73k43p9K57P3R2k48K31n33M58j26k45M11k38l9Q7p0J20j44K6J08
2934A14l9j13Q7o8l5K03j84o5N2J01j24O0O9j21q5K55j36K07j6j10r0O9j9j15
2958a03K99l06j38M85k35K3P7k11L52k99J02P7l9k09K12l96J18j1O7M33l11k71
2980b84L77J15k85N9j26K94j53J75j73J0l71M13M26m49k61M99n64K39p3M1K39
3001A48k47K7K8k50L42j1J05L1J12j02mK2k20J39j11j30J53m4j8j04M9J42n3k54
3025b50K34K17m37M99j43p3K9k59J82o1r2K70Mj33RO5J5O3J37m51L34j89qJ75
3049A37k75J68q7j58m1K55L7J5k5j40J28k21J89j4J19j37P4K28k77j58o9J41K62
3072A51k95K34q9J81k10J21k75L24l39L08k18p6K52k41K04m7K16k82K54n9j75
$$ y = [128, 82, -157, 216, -27, -106, 151, 224, 316, 68, 299, -234, 224, 98, -147, 264, 26, -13, 74, 4, 124, -20, 6, 114, 75, -38, 49, -19, -54, 149, -35, -100, -48, 53, -71, -11, 58, -63, -148, 107, -29, 178, 162, 52, -38, 31, 12, -103, 196, -110, -248, 237, 2, 25, 102, -109, 243, -56, 46, 123, 84, -125, 87, -309, -191, -202, -135, 298, -13, -284, 93, 208, -77, -18, -144, 150, -3, 172, -1, 9, -362, 51, 477, 28, -233, 266, -298, -59, -132, -91, 148, -99, -72, -44, -294, 48, 37, 142, 173, 285, 183, 179, 201, -19, 120, 9, -121, 32, -12, -30, -134, -85, 57, 4, -250, -16, 201, -236, 263, 120, 47, 76, -183, -1, -62, -154, 116, 120, -13, -4, 61, 76, 139, 276, -175, 159, -30, -38, 137, -138, 30, -57, -215, -256, -1, 36, 51, 26, -114, 14, -207, -18, -32, 87, -50, 24, 252, -25, -183, -252, -111, 151, -144, 90, 1, 182, -28, 93, -182, 142, -197, 111, -107, -183, 69, -172, 32, -15, 201, -81, 173, 114, -61]
3093f1J00l11L91q6j44j31K51j6N9r2P0j4k27M58k58R1R0k97j36K03J33oP8M8
3117A93j78j1K4J12l95J19J95j2l4M83n85K90ml47k6K38m7k2K29m20J82N0K7R6
3141A57j42m8k1j49K64j02n5K33j8j29J90j89k12L54k0k74K68k03K49J07j78k5
3163E7j86k9L34j88p5L02l10k3N18l25L4J68n26L07p8PK27k50k3J74k25K82r5
3186G7k00K91m89K93K46j36J2j41K2J91l04l4K19j76J46Lr1P3j17L7L35j6k20
3209B1K21j41K49k97O6P6m1J3K2o5J9J93l07l30L17l08p3L45P9k00L01j86j49
3232a75J11q5K46j09j32M39n9k74J74j84J48j22J92l74K20K03k20o9J68l26K89
3253F1k80K89n0p4J00K02m12P1k37K48K82Q9n9k88J01j4j17k2K37j38L43k11j87
$$ y = [-61, 39, -272, 119, 33, -111, -242, 9, -7, 52, -40, 30, 16, -211, 247, -11, 80, 170, -127, -263, -60, 73, 67, 145, 193, 15, 4, 28, 140, -255, -136, 59, 47, 13, 496, -89, 201, 197, -150, -176, 62, 15, -7, 222, -198, -16, 34, 61, 157, 15, -33, -54, -203, 61, -41, -96, 137, 119, -10, 180, -9, -221, 133, 113, -161, 107, -96, 153, 260, 82, 57, -129, -158, 176, -12, -87, 215, -95, -118, 400, 75, 109, 277, -249, 58, -20, -13, 214, -36, -59, 115, -110, 172, 77, -123, 168, -321, -28, 218, 82, 94, -47, -25, 166, -138, -172, 47, -129, 17, 20, -71, 2, -115, -78, 257, 241, 21, 242, 101, 350, 53, 119, 195, 154, 167, 189, 124, 143, 336, 29, -301, 16, -292, -365, -20, 59, -141, 160, -26, -175, -64, -149, 97, -12, -144, 295, 236, -38, 136, -48, 100, -22, 170, -204, 16, 219, -1, -70, 98, -228, 61, -219, 70, 20, -54, 46, 248, -164, -93, -330, -82, 200, 289, 230, -58, 43, 29, -88, -110, 127, -11, 332, 121, -66]
3276f6j90K95j88J21j55K23k05L67j83J1p5K04k31K00r8O6j53j17L24j26J69l17
3298a24K44j65K81k15qj52J67J39m41M90l12J76L5k4k74K18N4k88K87r7j47K77
3320A21j61K05N5p6J09k02J39j44k20L55K0l22J16O4l22M30j54k86K64l40M49
3341A00p6j48J76K51o07K54L03l07J39k4l66O17m23J15p3q7J67Q8l50K84Q5k68
3363a50J81Qk0J60j77r8J16j42N9L0k20L85J48m75n9Q5L37k4p4r4K5j93QL4J58
3388HL7M8j01j45L07k01r9M12m31J00P8n4L39n12J22j8J55K1O9k25L55j54O0j11
3412F0J11k49J5o9K59J9J22l04J17j81L15m14P7R6J41l61L31j48J55j77k57O26
3434B84m94J09L31j63j60r6K14J3J6p1J81n0j35K10j12l89M17j01p3J65k3qj97
$$ y = [-66, -256, 39, -149, -28, -183, 40, -165, 202, 19, 30, -45, 159, -72, 128, 30, 96, -57, -174, 150, 24, 193, -124, 120, -45, 236, 21, 13, -139, 28, 167, -274, 216, -96, 80, 115, 91, -183, 35, 89, -199, 88, -9, -156, 121, -40, 165, 220, 144, 253, 51, 190, 46, -174, 181, 201, -121, -5, 59, -263, 167, 13, -273, -9, -349, 100, 24, -124, 52, 303, -304, -50, 253, -54, 85, 61, -305, 312, -111, 4, -69, -156, 11, 99, -251, 33, 118, -150, 31, 39, 19, 179, 2, -96, 20, -122, -63, -33, -253, 132, 280, -195, -254, -169, 168, 144, 70, -24, 1, -192, -184, -150, 8, 45, 93, -8, -153, 154, -47, -146, 266, -165, -65, 13, -41, 298, -214, -92, -110, 45, 66, 135, -90, 265, 111, 171, 60, 171, -78, -63, -132, 127, 146, 268, -36, 81, -100, 215, -199, -122, -26, 115, -246, 85, -63, 92, -85, -342, 284, -210, -101, 230, 67, -93, -189, 25, 38, 54, -17, 164, 114, -21, 189, 77, -312, 105, 4, -69, 96, 73, 65, -132]
3457a32M5j7J45k16M24l22R5R8k89qJ46J1J18j69n5J28N3N3j51mJ79j77J98o83
3481e30P60j58j85J69j52J25m2n3N7J41k05K91k84j56J42O6M0J00k54L62m53J75
3503d4JP2j3l0K23j47Q1j28K23O7m14j8K48j88K07N9q3j05l3L27l14J76J20l92
3527a05k16K33J13o4P6O5k11K0J14p3j12J23j6J52j08MK20m17J18R3p1K15l24
3550a71J15N24m66J53k31K00j70J79j40j07L10k57K98l05K23J4l77L04k98J41
3570f1K58k26j05J58j81M8Pm4J45q8p4K59m2j67J74j72Q2L25k61m6K38k57r2P5
3594d7J42k29L47j62j59R5j74R1K2K88j94J76j59j76J59P2J10r8k45J1N6N9q6
3617a01l9k7K58L1L3j23K8j16J72j99K21k25j97K88Q0N7k02ML8L07m48J99r1J14
$$ y = [-132, -87, -104, 41, -175, 249, -73, 22, 120, -169, -177, -31, -20, 98, -71, -126, 2, 55, 108, -43, -47, 132, -45, 153, -530, 230, 72, -113, 56, -96, 29, -13, -66, -9, 132, -73, 218, -66, -222, -80, -14, 26, 126, -128, 234, -219, -44, -43, 29, 16, -14, 209, 62, 143, 15, 238, 305, -109, -127, 121, -67, 140, 199, 116, 11, -22, 305, -9, 167, 287, -105, -321, -88, 25, -39, 37, 102, -109, -89, 25, -48, -160, -37, -53, 99, -9, -5, 215, -202, -84, 9, -62, 153, -171, -56, 468, 2, 155, -76, 124, -46, 133, -7, -114, 196, -61, 237, -68, 155, 169, -208, 96, -202, -61, 197, -29, -134, 24, -157, -109, -102, -146, -1, -89, -163, 96, 54, -113, 61, -111, -29, 296, 35, -11, 227, -30, -122, -47, 95, -134, 213, 51, -108, -13, -187, -96, -74, 214, 20, 196, 37, -139, 20, 92, 202, 104, -141, -130, -74, -15, -101, -140, -167, 91, 122, 155, 32, 60, -56, 116, -83, 138, -87, -284, 4, 84, 141, -61, -57, -19, 288, -160, 39, -52, 62]
3641F2j04J01j10k95N26M9l59K02k13R1K98n6n00K97j7k81L32j40L05n8j48J13
3663I5k48K06k5k33K28j92L2K89N5K8k78K99l95J90r5J7j9O9K07l20k10L25j9
3686Fr8P0J77k95M44m85O3K77l35K39j03J33J08m07J96j11K09k75j32M79j82K50
3708B28M7j55m15K78r6j60K59k14J85P4J92j10k08M73n74O33n05o3L17k00J71
$$ y = [62, -42, 59, -51, -346, 180, 229, -130, 72, -141, -50, 248, 192, -308, -11, -28, -309, 23, -117, 188, 130, -18, 95, -153, 53, 28, -205, 23, -169, -137, 152, 207, 235, -43, 256, -139, 51, -44, -27, -46, 23, 230, -90, -300, 25, 6, -92, -22, 155, -140, 304, -181, -118, 159, -176, 63, -40, 93, 201, -206, -10, -121, 88, -187, -319, 160, -22, 228, 275, 120, -295, -17, -113, -273, -14, -228, -43, 31, 223, 113, -95, 378, -196, 437, -68, -131, 186, -14, 157]
$$ [...]
8191A59
##END NTUPLES=NMR FID
##END=
