##TITLE=1H_111-2025
 200.13MHz, CDCl3,
 8 sc
 
 11.9.2025
##JCAMPDX= 6.0         $$ Bruker NMR JCAMP-DX V2.0
##DATA TYPE= NMR FID
##DATA CLASS= NTUPLES
##ORIGIN= UXNMR, Bruker Analytische Messtechnik GmbH
##OWNER= pz
$$ XWIN-NMR		Version 3.5
$$ Thu Sep 11 13:42:09 2025 Russian Standard Time (UT+4h)  she@DPX200
##.OBSERVE FREQUENCY= 200.1313
##.OBSERVE NUCLEUS= ^1H
##.DELAY= (6, 6)
##.ACQUISITION MODE= SIMULTANEOUS
##.ACQUISITION SCHEME= undefined
##.AVERAGES= 8
##.DIGITISER RES= 18
##SPECTROMETER/DATA SYSTEM= spect
##.PULSE SEQUENCE= zg30
##.SOLVENT NAME= CDCl3
##.SHIFT REFERENCE= (INTERNAL, CDCl3, 0, 14.3821)
##AUDIT TRAIL= $$ (NUMBER, WHEN, WHO, WHERE, WHAT)
$$ ##TITLE= Audit trail, XWIN-NMR		Version 3.5
$$ ##JCAMPDX= 5.01
$$ ##ORIGIN= Bruker BioSpin GmbH
$$ ##OWNER= she
$$ F:/spectra/data/she/nmr/H-C/1/audita.txt
$$ ##AUDIT TRAIL=  $$ (NUMBER, WHEN, WHO, WHERE, WHAT)
(   1,<2025-09-11 13:40:47.31 +0400>,<she>,<DPX200>,
      <created by zg, POWCHK disabled, PULCHK disabled
       configuration hash MD5:
       00 E9 B6 7A A2 85 ED C7 34 08 36 98 17 FE 4E 26
       data hash MD5: 16K
       EC 91 FB BC 00 CE 89 32 F4 5F 68 E5 6A 3D CE 27>)
$$ ##END=
$$ 
$$ hash MD5
$$ 2D 63 15 C1 09 FE DE 6B 98 12 59 C4 11 36 4D 8F
##$RELAX= 
##$RELAX= 
##$RELAX= 
##$RELAX= 
##$RELAX= 
##$RELAX= 
$$ Bruker specific parameters
$$ --------------------------
##$DU= <F:/spectra>
##$EXPNO= 1
##$NAME= <H-C>
##$PROCNO= 1
##$TYPE= <nmr>
##$USER= <she>
##$AMP= (0..31)
100 100 100 100 100 100 100 100 100 100 100 100 100 100 100 100 100 100 
100 100 100 100 100 100 100 100 100 100 100 100 100 100 
##$AQSEQ= 0
##$AQ_mod= 1
##$AUNM= <au_zg>
##$AUTOPOS= <>
##$BF1= 200.13
##$BF2= 200.13
##$BF3= 200.13
##$BF4= 200.13
##$BF5= 200.13
##$BF6= 200.13
##$BF7= 200.13
##$BF8= 200.13
##$BYTORDA= 1
##$CFDGTYP= 0
##$CFRGTYP= 5
##$CHEMSTR= <none>
##$CNST= (0..31)
1 1 145 1 1 1 1 1 1 1 1 1 1 1 1 1 1 1 1 1 1 1 1 1 1 1 1 1 1 1 1 1 
##$CPDPRG= <>
##$CPDPRG1= <>
##$CPDPRG2= <>
##$CPDPRG3= <>
##$CPDPRG4= <mlev>
##$CPDPRG5= <mlev>
##$CPDPRG6= <mlev>
##$CPDPRG7= <mlev>
##$CPDPRG8= <mlev>
##$CPDPRGB= <>
##$CPDPRGT= <>
##$D= (0..31)
0 0.7 0 0 0 0 0 0 0 0 0 0.03 0 0 0 0 0 0 0 0 0 0 0 0 0 0 0 0 0 0 0 0 
##$DATE= 1757583646
##$DBL= (0..7)
120 120 120 120 120 120 120 120 
##$DBP= (0..7)
150 150 150 150 150 150 150 150 
##$DBP07= 0
##$DBPNAM0= <>
##$DBPNAM1= <>
##$DBPNAM2= <>
##$DBPNAM3= <>
##$DBPNAM4= <>
##$DBPNAM5= <>
##$DBPNAM6= <>
##$DBPNAM7= <>
##$DBPOAL= (0..7)
0.5 0.5 0.5 0.5 0.5 0.5 0.5 0.5 
##$DBPOFFS= (0..7)
0 0 0 0 0 0 0 0 
##$DE= 6
##$DECBNUC= <off>
##$DECIM= 32
##$DECNUC= <off>
##$DECSTAT= 4
##$DIGMOD= 1
##$DIGTYP= 9
##$DL= (0..7)
0 120 120 120 120 120 120 120 
##$DP= (0..7)
150 150 150 150 150 150 150 150 
##$DP07= 0
##$DPNAME0= <>
##$DPNAME1= <>
##$DPNAME2= <>
##$DPNAME3= <>
##$DPNAME4= <>
##$DPNAME5= <>
##$DPNAME6= <>
##$DPNAME7= <>
##$DPOAL= (0..7)
0.5 0.5 0.5 0.5 0.5 0.5 0.5 0.5 
##$DPOFFS= (0..7)
0 0 0 0 0 0 0 0 
##$DQDMODE= 0
##$DR= 18
##$DS= 0
##$DSLIST= <SSSSSSSSSSSSSSS>
$$ [...]
##$SUBNAM0= <"">
##$SUBNAM1= <"">
##$SUBNAM2= <"">
##$SUBNAM3= <"">
##$SUBNAM4= <"">
##$SUBNAM5= <"">
##$SUBNAM6= <"">
##$SUBNAM7= <"">
##$SUBNAM8= <"">
##$SUBNAM9= <"">
##$SW= 18.0517328524113
##$SWIBOX= (0..15)
0 0 2 0 0 0 0 0 0 0 0 0 0 0 0 0 
##$SW_h= 3612.71676300578
##$TD= 16384
##$TD0= 1
##$TE= 0
##$TE2= 300
##$TE3= 300
##$TEG= 300
##$TL= (0..7)
0 120 120 120 120 120 120 120 
##$TP= (0..7)
150 150 150 150 150 150 150 150 
##$TP07= 0
##$TPNAME0= <>
##$TPNAME1= <>
##$TPNAME2= <>
##$TPNAME3= <>
##$TPNAME4= <>
##$TPNAME5= <>
##$TPNAME6= <>
##$TPNAME7= <>
##$TPOAL= (0..7)
0.5 0.5 0.5 0.5 0.5 0.5 0.5 0.5 
##$TPOFFS= (0..7)
0 0 0 0 0 0 0 0 
##$TUNHIN= 0
##$TUNHOUT= 0
##$TUNXOUT= 0
##$USERA1= <user>
##$USERA2= <user>
##$USERA3= <user>
##$USERA4= <user>
##$USERA5= <user>
##$V9= 5
##$VALIST= <valist>
##$VCLIST= <CCCCCCCCCCCCCCC>
##$VD= 0
##$VDLIST= <DDDDDDDDDDDDDDD>
##$VPLIST= <PPPPPPPPPPPPPPP>
##$VTLIST= <TTTTTTTTTTTTTTT>
##$WBST= 1024
##$WBSW= 4
##$XGAIN= (0..3)
0 0 0 0 
##$XL= 0
##$YL= 0
##$YMAX_a= 324836
##$YMIN_a= -774729
##$ZGOPTNS= <>
##$ZL1= 120
##$ZL2= 120
##$ZL3= 120
##$ZL4= 120
##$ABSF1= 10
##$ABSF2= 0
##$ABSG= 5
##$ABSL= 3
##$ALPHA= 0
##$AQORDER= 0
##$ASSFAC= 0
##$ASSFACI= 0
##$ASSFACX= 0
##$ASSWID= 0
##$AUNMP= <proc_1d>
##$AZFE= 0.1
##$AZFW= 0.1
##$BCFW= 1
##$BC_mod= 2
##$BYTORDP= 1
##$COROFFS= 0
##$CY= -3
##$DATMOD= 1
##$DC= 2
##$DFILT= <>
##$DTYPP= 0
##$F1P= 0
##$F2P= 0
##$FCOR= 0.5
##$FTSIZE= 0
##$FT_mod= 4
##$GAMMA= 1
##$GB= 0.15
##$INTBC= 1
##$INTSCL= 1
##$ISEN= 128
##$LB= 0.25
##$LEV0= 0
##$LPBIN= 0
##$MAXI= 10000
##$MC2= 0
##$MEAN= 0
##$ME_mod= 0
##$MI= 1.114404
##$NCOEF= 0
##$NC_proc= 0
##$NLEV= 6
##$NOISF1= 3.799351
##$NOISF2= 2.8
##$NSP= 1
##$NTH_PI= 0
##$NZP= 0
##$OFFSET= 14.38212
##$PC= 1
##$PHC0= -1558.854
##$PHC1= 11.99228
##$PH_mod= 1
##$PKNL= yes
##$PPARMOD= 0
##$PSCAL= 0
##$PSIGN= 0
##$REVERSE= no
##$SF= 200.129724274929
##$SI= 16384
##$SIGF1= 3
##$SIGF2= 2
##$SINO= 400
##$SIOLD= 16384
##$SREGLST= <1H.CDCl3>
##$SSB= 0
##$STSI= 0
##$STSR= 0
##$SW_p= 3205.1282051282
##$SYMM= 0
##$S_DEV= 0
##$TDeff= 0
##$TDoff= 0
##$TI= <>
##$TILT= no
##$TM1= 0
##$TM2= 0
##$TOPLEV= 0
##$USERP1= <user>
##$USERP2= <user>
##$USERP3= <user>
##$USERP4= <user>
##$USERP5= <user>
##$WDW= 1
##$XDIM= 8192
##$YMAX_p= 0
##$YMIN_p= 0
$$ End of Bruker specific parameters
$$ ---------------------------------
##NTUPLES= NMR FID
##VAR_NAME=  TIME,          FID/REAL,        FID/IMAG
##SYMBOL=    X,             R,               I
##VAR_TYPE=  INDEPENDENT,   DEPENDENT,       DEPENDENT
##VAR_FORM=  AFFN,          ASDF,            ASDF
##VAR_DIM=   8192,          8192,            8192
##UNITS=     SECONDS,       ARBITRARY UNITS, ARBITRARY UNITS
##FACTOR=    0.0002768,     1,               1
##FIRST=     0,             0,               0
##LAST=      2.2672688,     0,               0
##MIN=       0,             -774729,         0
##MAX=       2.2672688,     324836,          0
$$ Real data points
##PAGE= N=1
##DATA TABLE= (X++(R..R)), XYDATA
0@%%%%%%%%%%%qJ6j6J6k3L1l2M0m8N6p1Q3r7J14j32J53j77K04k34K68l08L51l98
34b12M48n04N68o35P10p93Q84r82J088j207J337j478J632j801J985k187K408k652
52a391K925l228L565l943M374m869N443o114O916p896R122j0708J2854j5935K0762
67A1877k9480N0268j97997k31270J32109Q6843K31982J56859k8922p5162N6804
78A63911P7406j0133j88593j31113M572O397M5096J31771L2151r2801j50150m1752
90a53238J20723O1344n9770L674M2380M7437N2573K1881k1467j44502k22003j8615
102b69583J57510J05882K6809M813M4037O1168q394J1362J1590j34671j44405
113a33882J7141J26507J14839k8161j03479l0366l7627n0082K9956L4329k2346
$$ y = [0, 0, 0, 0, 0, 0, 0, 0, 0, 0, 0, 0, -8, 8, -8, 8, -15, 16, -16, 24, -24, 32, -39, 44, -53, 61, -71, 82, -95, 109, -125, 143, -165, 186, -212, 236, -268, 300, -335, 375, -418, 466, -516, 572, -635, 702, -776, 856, -945, 1040, -1147, 1261, -1391, 1534, -1694, 1871, -2072, 2302, -2567, 2876, -3238, 3678, -4218, 4904, -5804, 7050, -8885, 11877, -17603, 32665, -165332, -396602, -264493, -177650, 54332, 211191, 182269, 107107, 163911, 241317, 231184, 42591, -88522, -83950, -77553, -32457, 99314, 131465, 38664, -111486, -153238, -32515, 28829, -30941, -27267, 15113, 62550, 115123, 137004, 115537, -28965, -250968, -269583, -112073, -6191, 20618, 25431, 69468, 130636, 122242, 133604, 145194, 10523, -133882, -116741, 9766, 124605, 96444, -7035, -37401, -75028, -125110, -95154, -60825, -83171]
124h3171m6908K2716J66632J19623o6780q7303m1888l2578Q869L9662N6444J020
136E6338j04398k5880J03193N0738l8164o1011j4980O4890N4202N0082O7694o3864
148A38840j71675j04512n663L4092k5379o0471N0108R5416N2407Q2810O2453m4188
160A04238j09411q4455M8106J03583J91k5190K1553Q600o26j3816k1230l3644
172b101j07619n9948J07810J23042L2914k1908l3559o636k9462m6774J8396r503
184c5348q1996j6101P6234R8746L4570o6151m0852P690k3494J5321O2493K0813
196E1925k5105m1444K2824Q3795j3370p8257j5830Q703J5626L4328L1795J9580
208I4570o6297j08595l595L6682j7556k3202K373N3492P0495K6768M1382K1201
$$ y = [-83171, -130079, -107363, 59269, 178892, 112112, 24809, -17079, -49657, -40788, -1126, 55318, 56338, -48060, -73940, 29253, 79991, 41827, -19184, -34164, 30726, 84928, 135010, 202704, 138840, -32835, -137347, -143010, -108918, -134297, -194768, -144660, -49244, 3163, 85973, 148426, 104238, -5173, -89628, -41522, 62061, 62252, 37062, 58615, 67215, 66589, 52773, 31543, -2101, -109720, -169668, -61858, 61184, 94098, 72190, 38631, 31995, 2533, -44241, -25845, -35348, -117344, -133445, -57211, 41535, 76105, 9954, -30898, -23208, -46702, -31381, 31112, 51925, 26820, -14624, 8200, 91995, 78625, 368, -15462, -6759, 8867, 43195, 74990, 94570, 28273, -80322, -83917, -47235, -64791, -87993, -85620, -32128, 38367, 65135, 106517, 127718]
220A27718q7869r6211j8152L1514L0528k3743q504N2984J3258r759K8138l873
232C6029n1284n5619l319Q3082N0964k8129l056P934j7233j0934o996R394r247
245A586n3602J2396P1752J0126m0679m3668j9071Q206q138K5209P5498J7477j8047
258C9045K2264L2029K855n7636p8161j8957j1204k3397L3288M8955J3641j2825
270a0103j2959L9888L5840l6360k0075K3396P799K992M484R730m257o0845l7361
283e7831L4449J4630j6558l375J1421K5109n069k0373J9928j880m1447r52L9253
296b695M5845J4700k0353Q370N894m9280l1004K298j2095j8687j0057L5766N8861
309B7563J133j1393K1708m78j8734j3691k010J5741j9283l3407K0877J4127k5027
$$ y = [127718, 39849, -56362, -74514, -43000, -12472, -36215, -44719, 8265, 21523, 11764, 39902, 36029, -15255, -70874, -74193, 8889, 59853, 31724, 28668, 36602, 19369, 8435, 1439, 10833, 1586, -52016, -39620, 32132, 42258, 1579, -42089, -61160, -52954, -61092, -35883, 39615, 57092, 39045, 61309, 93338, 96193, 38557, -39604, -58561, -69765, -93162, -59874, -10919, 2722, -10103, -23062, 16826, 52666, 16306, -3769, 19627, 27426, 30418, 34902, 44632, 40375, -20470, -57831, -23382, -8752, -25310, -28685, -17264, 7845, 2776, -17597, 2331, 451, -40996, -41948, -2695, 43150, 57850, 37497, 45867, 51761, 2481, -28523, -26225, -38320, -57007, -67064, -31298, 27563, 28696, 17303, 39011, 38533, 19799, 6108, 4098, 19839, 556, -32851, -11974, 2153, -22874]
322b2874j6026L961K6028J5481o905L3242L2851k6532k5589n704j0422j9313l2548
335e4350M238M0693N059M237L5982J7814r255l0611k5485M458k1742l6149J7333
348d7778K5444K251M168J2791L1873J1640k4630Q712J8179k2288j7662o24M163
361F239k760l0785n448L1740J895n660J8294J2965L083j7107j3461J6461j3930
374A526l9227K659J7161O328p4k592J6763L017k7551P384K3050p878j3203k758
388a5395J9077K5186j0518m987J5599j4041j8230N293J2538P153k3126k1030K1404
401a077N604j8512P36M340r66j425M066L2719J5378k7368j1199O050m872j1123
415g649j8485l629P965j1005J2939M3386J4100j1822j4067k123Q930k0302k9354
$$ y = [-22874, -38900, -34939, -8911, 6570, -335, 32907, 65758, 39226, 13637, 7933, -2489, -21802, -54350, -50112, -9419, -4360, -123, 35859, 53673, 44418, 13807, -11678, -7220, -28962, -65111, -47778, -22334, -20083, -15915, -3124, 28749, 40389, 15759, 24471, 42650, 20362, 2700, 2076, 6239, 3479, -27306, -32754, -1014, 881, -4779, 13515, 26480, 29563, 12456, -1005, 15456, 1526, -37701, -35042, -17881, -11553, -11627, -14219, 2544, 5561, -21990, -14606, 8444, 566, -12637, -15395, 3682, 28868, 18350, 13363, 28962, 14921, -3309, 1984, 14522, 21675, -1451, -22481, -1077, 4527, -13985, -13249, -8909, -9875, -11300, -7234, 25485, 40863, 13495, 2296, 8346, 3474, -7649, -26134, -29763, -21798, -32803, -19864, 23522, 37622, 25800, 11733, 9610, 18540, -1762, -31116]
428c1116k625j3047j5184J9653L6004L3079Q288q443K1017J7500j8628j9179j9795
441G524k6717k0644j2051K2013L2513n039n5K8150J9832N814j2089j9220j3871
454F160l3335k2263J8437O865j3905q200O962L0851J9053n634N350k588k1165
467a3412k5J5763J4486k485k2854O252L0039M195k019n65j4308j5656j2922M901
481h610K1293j0794k0704J1399J6667J0965K143j2737p000j6629k1930J3922J5299
494f716j3159j5038l343K0431K4874o60N436J0257j1706M76K0679J2611o704l3804
508C634k5432O448k323r241L981m96J827J0096J7790L2125K705l1527j3423J614
522b222j884j653q462n24K770n388K0495L1773j740j7318j1168K420J3800m484
$$ y = [-31116, -33741, -46788, -61972, -42319, -6315, 26764, 35052, 26609, 47626, 65126, 46498, 27319, 7524, -19193, -39837, -51888, -29875, 2638, -2401, -2456, 25694, 45526, 51340, 39251, 20031, 6160, -27175, -49438, -31001, -24136, -38041, -46241, -39279, -8428, 10625, 4991, 10341, 7753, -13412, -13437, 2326, 16812, 14327, -8527, -2275, 27764, 31959, 29940, 29375, 15067, -589, -13511, -8610, 12683, 1889, -18815, -7416, 9251, 20216, 22359, 9622, 2622, -14007, -35937, -22015, -6716, -19875, -34913, -38256, -17825, 7049, 6389, 11825, 22082, 10376, 10852, 31531, 44142, 37438, 3634, -21798, -15350, -17673, -26914, -22933, -23429, -21602, -11506, 6284, 38409, 41114, 9587, -3836, -2222, -4106, -5759, -14221, -14745, -11975, -17363, 3132, 34905, 33165, 15847, 4679, 7099, 20899, 16415]
536A6415j1775j829j5794j2613J3011J5309M955j6206k0080J0934J1295p183k706
549a6267n964j0924p33J2134L1748K3117j0785n051J0594K933l067j3671j6585
562b521p548j0014Q674L3809J3002q770r006k319Q503n091k0404r087j3921j6948
576d1641Q398J7628P202j0034k1747K331J7165K973O659Q626o05M526R384J8582
590B9447J7232j4895k0446K096N225K994k587r677n220j1814p725J7287Q368j2421
604b136q075R23J4501J0642r268p026r825k1538l441J2127R000K061j0405L319
618a9141K2341P410p50J505q201o226J663J2193K0903k309j8236p18L330k714
632A1050l096j1065n742l970n365J5146J5942q331j1906o239M336J1581k187j294
$$ y = [16415, 4640, 2811, -12983, -25596, -12585, 2724, 7679, -8527, -28607, -17673, -6378, -13561, -16267, -22231, -33155, -33888, -21754, 9994, 33111, 22326, 17275, 27869, 30802, 27735, 14064, -2521, -10069, -20083, -11409, 22400, 35402, 26632, 17626, 15307, 23810, 18719, -1685, -10772, -24693, -41641, -33243, -15615, -8413, -18447, -40194, -37863, -20698, -17725, -11066, -2440, -3045, 1481, 10865, 29447, 46679, 31784, 11338, 13434, 18659, 21653, 19066, 9389, 4169, -7645, -15370, 1917, 10285, -2136, -10211, -9288, 5213, 15855, 6587, -439, -10264, -31802, -35243, -23116, -14116, -12055, -22460, -19141, 3200, 10610, 9860, 11365, 3164, -3062, -1399, 10794, 31697, 29388, 11152, 10434, 13764, 11050, 7954, -3111, -8853, -12823, -18188, -3042, 12900, 4569, -7337, -13576, -9240, 2341, 154, -1140]
646a140N856p384k429J0715L639o636j7678j2334J2028J0442L032J0526J633m970
660E300r05k81P348k008k0217m658R714O755O812L1l154k682j0655J711J3298
675F409l533r272j07O067J3298K850n125K567o376p700P824P525n66j0011j6066
690a2216l03L974q304j297J648k199M781Q665J5164J0714j2549j1785M03l099
704f403k613j210q63M390J068M067J6676L479r804n689k105N691K774m572K901
719G787O95q628K651O749N2m555r576J839J0616j035j459P32r168q383l302J812
735a3173Q302l507n935Q403O584J732J43n145k684n543o201J0444R968k486J563
750B465L728M634L221p153l443K55r092n12Q211M333J167n268k413Q020j225m581
$$ y = [-1140, 4716, -2668, -5097, 5618, 9257, 2621, -15057, -27391, -15363, -4921, -1889, 8637, 10270, 5300, 4395, 4114, 11462, 9454, -10763, -15421, -5707, 1048, 7860, 7891, 4737, 2055, -8600, -6889, 6409, 2876, -6396, -6503, -436, 12862, 15712, 10587, 13154, 6778, -922, 6902, 14427, 13861, 3850, -12216, -12519, -8545, -16849, -18146, -16498, -18697, -13916, -5251, 9913, 20627, 8078, -3707, -3304, -6403, -9016, -10226, -11089, -6699, -5631, -1564, 15112, 18591, 8787, 3098, 993, 6684, 9458, 4886, 7787, 8482, -146, 2505, 9254, 9306, 4751, -4825, -2986, 7630, 6595, 5136, 5868, -3300, -11683, -14985, -13173, -4871, -8378, -14313, -5910, 674, 2406, 2549, -2596, -5280, -10823, -17024, -6580, 3388, 902, 2465, 6193, 10827, 14048, 6895, 3452, 3707, -5385, -5897, 2314, 6647, 7814, 2546, 133, 8153, 6928, 2347]
766B347L182k505m606p27p62N486k829j2536J448M891L03M348K703K320J520o449
782a866J064M696o611n041J656L315P520R72o84O126m724p178K648J17k316l705
798d011m295P235L410n143J598m40n706p45L74O465O390m633J470O759k309k493
814C926k386l379Q61m299j84J0105J228l093K086J13N23l305n686K745q2n567
830f394L119L886l13r79m122K567M621m110L10M239k670q61q01J052M137n012
846a331l197O784J145j392J646j673L69m097p117L425P62m073L148L628L403K471
862C901l039J821K614o931j429L011K37J325r52J733O477l307k861L039j571k470
878A598j07o0M460j325n276K805o48m560j488j064J223Q86m530L086M057l992
$$ y = [2347, 5529, 3024, -1582, -2309, -3071, 2415, -414, -12950, -11502, -6611, -6308, -1960, 743, 3063, 4583, -1866, -802, 3894, -2717, -7758, -6102, -2787, 4733, 5705, 5021, 11147, 6423, -755, 1893, 2010, -306, -4011, -8306, -1071, 2339, -2804, -1206, -1646, -7352, -8097, -7723, -1258, 5132, 499, 1969, 8728, 6419, 3926, 1540, -1839, -978, -5277, -5461, 4644, 5872, 2779, 4865, 4978, 5501, 2196, -3490, -745, -827, -6394, -3275, 611, 298, -681, -4803, -2236, 2385, -1725, -1415, 2824, 154, -707, -1508, -456, 3681, -1331, -4528, 2256, 3401, 2009, 3655, 1982, 2351, -1746, -8863, -5438, -4676, -8749, -5601, -1973, 1430, 3901, 862, 2683, 5297, -1634, -3063, -52, 185, 1510, 558, 2291, 8768, 5461, 2600, 5639, 4068, 1598, 1491, 1431, 5891, 4566, -710, 2095, 1447, -3113, -4601, -5665, -4442, -3556, -8086, -5000, -943, -4935]
894d935o03J084m35M15k430J479P190q85j61N082N14q8j021k097L339j818n062
911d32K915N76j981O0j343K621J929m729J995L319m639j746n49j210J399m130
927e945l29O299q65J3M052p77m09l390m897L213j332m437K873K583J247K935P8
944I12L948J381n745P85K235k596o7l07J195L407k278j28L595k422l011O80j111
961D73J544k518l901L396l39l004K491N36q10m86k654L238K264m845K24J352j501
978d540J496L10J665M197k576l04M817k94p31K46j222K476j029k304L630r67l819
995A051L34l35N78j086m782J856J037l309N34P96j321R6k242J253N138j609J82
1012a829L585n18P96P19q76K765k656l916L357P23j402P52q39J479j01l283K296
$$ y = [-4935, -5538, -4454, -4889, -4474, -6904, -5425, 1765, 880, 719, 5801, 6315, 6227, 5206, 3109, 6448, 4630, -432, 2483, 3059, 1078, 1138, -205, 2416, 4345, -384, 1611, 4930, 291, -1455, -2004, -3214, -1815, -5945, -6274, 25, -840, -827, 3225, 2448, 2039, -1351, -6248, -3035, -4367, -8804, -5931, -3348, -2101, 834, 912, 4860, 6241, 496, 1281, 3516, 920, 853, 546, 1741, 5148, 2870, 2742, 6337, 3915, 904, 1584, 473, 2017, -501, -4402, -1006, -1345, -4349, -1858, -1322, -2132, -2618, -5272, -2034, 230, -4615, -4391, -3039, -4540, -3044, -2734, -1069, 3128, 552, 248, 5065, 4771, 4040, 4286, 3064, 5540, 4511, 2207, 5837, 4870, 1051, 1385, 1050, 1628, 542, -4240, -2384, -1347, -4656, -4122, -3326, -4647, -4551, -6793, -5540, -402, -2011, -1829, 1756, 1238, 2034, 2753, 1877, 4642, 1986, -1930, 1427, 2150, 748, 1500, 661, 2140, 2039, -1244, 1052]
1029A052J132m081KP82N28J607l000J71L232j823l73K116p81r7j397o28M274j315
1047A401k696K509r3m44Q30j419K530j019m610J326J352k272K04j048J34K080
1063a235k522J427L409k476l02J890M19J868j493j244L607j052j521K517m74p35
1079B083k43j609K681Q13l643R09L73j851M0q95K82J180m133j08L070j962K85
1096b728j17q7J849j423n83L939r06j210K184M56J494q5j957J887J053k506Q41
1113B101J19j179j73k037J147J927l121j29J708j575K14J43R7J600k247j114L071
1130E52l78j308J126p71J056j09k138K315M43k273P16M65J00P40j995J189K447
1147B177k216L19J856j347L68o95j78K111k070j805J673o49o83O71j013K045o44
$$ y = [1052, 2184, -1897, -1895, -1113, -585, 1022, -1978, -1807, 1425, -398, -771, 1345, 564, 467, -930, -1558, 2716, 1401, -1295, 1214, 1121, 677, 1507, 88, 2618, 1599, -3011, -1685, -333, -2605, -2401, -3449, -3315, -1235, -3757, -2330, 1079, -1397, -1699, 191, 610, 2478, 985, -259, 3348, 2296, 775, 3292, 2818, 2083, 1840, 231, 2912, 3725, 82, 991, 1364, -487, -447, -1342, -1060, 120, -4013, -4121, -1051, -3013, -2728, -2845, -2932, -1083, -2506, -3089, 850, -56, -1266, 918, 1374, 2868, 2783, 826, 2713, 3766, 1260, 2101, 2220, 1041, 868, -1169, -22, 1905, -1216, -1345, 363, -1212, -998, -855, -758, 842, -1405, -2519, 552, 174, -1134, -8, -779, 277, 168, -1970, 345, 788, -1485, -769, -304, -204, 536, -1459, -270, 2177, -39, 280, 2136, 789, 1157, 462, 284, 2395, 325, -1480, 193, -456, -1139, -468, -1481, 564, -80]
1164h0k411K686O95j365J029Q9P1Q01k212J773J438k426j20J122j258Q62j573
1181h79o16K269j739j158J776n75K45j29o65K669p83k102J990L48j578O86n48
1198g89L79P45k580J216K217j413P25L02p9J535j198l36K487j247r68J162n63
1215A595K43m52j709K277q45l081J367n31j301O47j493O76J041k269R65J401r78
1232b447J047J86K13K108j740k40L067o50k23J074p5J105p79j494J776j1k209
1249G08J048l55n10qj547Q18Q13k932L87P78r27J62o68o3J649j680o50K232j053
1268a798j66J071l76J706k02r14K726K12j295Q67m92K78j7j477R75J142j884N30
1286H86J95n98M88j082j74J235j974p59J278r07L46K14o1J735o51j046J549j92
$$ y = [-80, -2491, 195, 890, -475, 554, 643, 714, 1515, -697, 1076, 2514, 88, -32, 1090, -168, 694, -879, -1495, 774, -965, -2123, -347, -922, -677, -806, -1471, 1198, 415, -1687, 303, 651, -927, -241, -789, -410, 335, -2245, -1029, 1188, -225, 500, 802, 723, 2258, 1060, 724, 3211, 1964, 996, 2158, 1595, 1838, 1386, -323, 1954, 1109, -1972, -605, -1136, -2437, -1790, -3283, -2607, -1566, -3835, -2870, -1469, -2447, -1400, -1214, -1001, 1107, -633, -873, 2194, 1544, 1321, 2395, 2320, 3425, 2646, 1152, 2928, 2917, 708, 1756, 1401, 891, 883, -664, 154, 967, -1965, -1578, -800, -1727, -1565, -2233, -2296, -647, -2327, -2977, -745, -1798, -1964, -893, -1269, 437, 235, -679, 2047, 2259, 964, 1831, 1339, 1617, 1600, 123, 1098, 2240, 356, 886, 1081, 483, 971, -111, -285, 950, -1024, -1783, -505, -1412, -1066, -852, -913, 822, 171, -875, 674, 482]
1304D82j009M25o21L67Q25j741J966J106j185O93m03p50J27j714m03J471j466
1321a830J68J412l30O63M08p76J519p44j436J165r5j79Q73q50J470M99j779J079
1339A237L97j890M38n26n38N98j386M68J936j086P05Q63m42N61o60j092J321j071
1357a67j344J098p20j4P85p82O82P11j887J167K54r61Q10J56K69J039j142L10
1375B64J316j344k05M23p10R16p72l32J798o49n72R35m59r4M71j104J723L54j649
1394C10R73m94r39J94j248k47P24j206M6J641p89O26k04o12Q28j186p31J090q4
1413a308j69J367k29J304L76q13J719pj461Q87m24q96J92j001N56R45j062K56
1431B32R77o67N36l58o44N61j298j385J178N3J25R42k30Q38k24j429M07l69j231
$$ y = [482, -527, -102, -723, -356, 469, -1272, 694, 1800, 615, 1308, 905, 155, 282, -1432, -1835, -364, -1830, -1662, -250, -580, 83, 491, -285, 1234, 490, -946, 219, 124, -55, 818, -32, 1438, 1937, 158, 1237, 1634, -256, 182, -344, -882, -284, -1670, -1202, 734, -352, 353, 1216, 774, 1335, 675, -417, 904, -167, -1511, -413, -1133, -1147, -362, -1144, -462, 249, -1638, -471, -217, -1178, -368, -212, 57, 1096, -46, 264, 1580, 236, 31, 454, -256, 660, -112, -444, 1354, 705, 133, 1068, 609, 515, 986, -118, 1605, 1959, 310, 1283, 789, -150, 44, -1204, -1451, -727, -1933, -1887, -246, -1035, -409, -613, -1225, -397, -1583, -2314, -1224, -1308, -1477, -110, -339, 965, 1341, 528, 2247, 2240, 779, 1666, 1242, 346, 538, -463, 93, 1038, -24, 232, 1209, 542, 1078, 720, 76, 637, -661, -2046, -868, -815, -690, 252, 22, 860, 636, -793, -386, -755, -1986]
1450a986M73j9K27J300J03R88J182j046k16j40q71Q1p24l62J108l09p18J287l05
1469E3J04K35m49O90l36j238R75l6o47K38k82M46P66p33R65J113q25j56k92n62
1489B9L38r35l65J248j41J76P55k51j14l8j171M73k82j138R03j37J03L96l10O59
1509A98p4j333M81R75q92L13K60l96O89q33j25J070l97L0Q27k14N64l43k55K23
1529G68m10j052M51K38K88P90n18Q07O58j716Jk61j251M8M1j50Q47m90K72R30
1549B91p31n3J05O0P04j31o04J183k37q07J56n04M01J96n45O47O12p56M37o8m63
1570a07N06n99l44R96l27K44J002n77j14n32o38K59k98q29Q38J43K43N43l56k82
1590b29J53j002N38R35n85N68K22j35J03l25J02K37o49Q2R44l98L61j08o95K19
$$ y = [-1986, -1513, -1532, -1305, -5, 98, 1086, 2268, 1222, 1006, 866, -5, 76, -648, -1010, 98, -211, -929, 358, 53, 157, 392, -57, 633, 297, -941, 34, -2, -649, -411, -693, -247, 519, -214, 751, 1864, 1039, 883, 591, 29, 367, -568, -933, 315, 174, 350, 1105, 854, 740, 702, -469, 4, -278, -1416, -513, -650, -547, -151, -461, 198, 124, -1209, -728, 247, -645, -332, -72, -468, 221, -612, -737, 333, -64, -34, 793, 579, 1143, 800, 545, 768, 358, -694, -243, -5, 283, 1073, 555, 1362, 2020, 304, 305, 44, -1207, -1159, -1118, -1268, -421, -911, -639, 291, -440, -493, -388, -328, 376, 245, -359, 824, 587, -220, -64, -568, -167, 29, -516, 131, 743, -13, 424, 356, -107, 399, -200, -544, 452, 125, 369, 1371, 794, 680, 148, -490, -231, -529, -1358, -520, -377, -134, 409, 53, -229, -76, -1078, -540, 395, -190, 378, 600, 465, 568, 243, 345, 582, -67, 15, 959, 561, 922, 814, 119, 338]
1610C38p99q16R31l8k22Q67j35O72l5j140k7J76j385N75K78j69Q99l01M2M01o82
1631e70n82M93k34R23K04J73J248L5m58J66l90m00j64k30r4O77m93L97J95p09
1651A87k7o26l47O63r95K5N74n16M8L10o20K42r8j5J503j54n28O15l55m49L99
1672a64n74Q48N03m86J019O11n12J82r06n89K09p19N62P03O3M86K33l42j38j115
1692a26j242k12l39Q0N58M55M87N10l40N73K79q21J81n1k91N93o6K28J18n56J3
1713C1J31K12K84j01m88N15l51k78K40l90m1R9J12M64L28m53j17j30p01p7k38
1734i49j02M55o1N46Q81n22J96Q7n50o7l1qO27m73J04L39m74K99o27l21M07J04
1756a40L04K29n7k23O51o42l19J17o92J76N88r6L71k4j58J6l36l17J79l12Q9Q19
$$ y = [338, -461, -1277, -346, -384, -606, 261, 126, 798, 763, -377, -404, -228, -1613, -1038, -760, -929, -30, -331, -289, 112, -570, -1152, -659, -893, 30, 234, 407, 1655, 1690, 1232, 1398, 1008, 608, 444, 214, 120, 797, 304, 701, 896, 187, 160, -466, -813, -150, -1145, -1120, -546, -1062, -1014, -704, -1324, -1082, -1180, -1195, 308, 154, -374, 241, -114, -563, -164, -738, 110, 613, 127, 1146, 1757, 1245, 1427, 521, -68, 141, -578, -16, 687, 750, 1236, 1469, 1127, 989, -126, -1368, -1580, -1919, -1839, -1281, -826, -339, 171, -169, 404, 683, -138, 43, -8, -299, 294, 228, 456, 574, 18, 31, 162, 374, 658, 557, 69, 584, 233, -45, 195, -195, -236, -137, -25, 439, 767, 314, 197, 67, -634, -711, -949, -1051, -596, -657, -111, 770, 248, 444, 531, -19, -86, -117, -125, 502, 29, 133, 472, -2, 297, -330, -651, -244, -140, 164, 393, 336, 113, 764, 122, -197, -80, -772, -596, -8, -104, 267, 243, 85, 101, -235, -552, -373, -685, -596, 223]
1778B23j28N36O51n69M77q32n24K70n49j73J27l11K65O10k71N45K75m85M80k25
1798C92j81Ml99l81J33L7m0M99j68M69j10k75J89j57r56L30l11j8R46L2N65P72
1820A372n42p2J72r47n9p48j71M78M06L82M68j42m98N33n54j23k63m46J74K31
1840c49qN63k16J75K09k43O9J42m39k08j9j14J43N8m08M70J27L39N47l33j10r3
1862C02n91L48J61o97O78j68J13J91K37L5j88o32p9R7p93O07j97j12K74K49K41
1883G6N38l95M7L36l04k9k33m89J4r6j29J54J23J81M31J4J82K83n78P60l61q62
1905c37N70j73k83N43n61K67K49m41J2L11n67M5p7j79M62J38k41M11j13O0N51
1926F47n60N5l10n92K20qk7J39L81K27M79J83L7j6l09j28l6p92M8j89K9K59J77
$$ y = [223, 95, 631, 1282, 713, 1190, 358, -166, 104, -445, -618, -491, -802, -537, 73, -198, 347, 622, 137, 617, 392, 211, 215, -184, -565, -432, -395, -435, 64, -104, 365, 255, -20, 169, 12, -944, -614, -925, -943, 3, 35, 600, 1372, 830, 758, 930, -17, -76, -824, -995, -517, -111, 271, 739, 597, 99, 632, 78, -45, -308, -754, -580, -349, -357, 206, -10, 165, 374, 131, 200, 342, -97, -305, -324, -438, -295, -237, -645, -175, -48, 291, 838, 505, 395, 302, -289, 59, 220, -477, 201, 33, 146, 337, 574, 609, 421, -211, -290, -193, -986, -379, -576, -688, -414, -165, 76, 614, 219, 266, 602, 298, 269, 36, -453, -439, -535, -664, -510, -387, -206, 225, 239, 421, 704, 126, 886, 525, -337, 233, 60, -223, 320, -241, 26, 275, -166, -154, 157, -410, -365, -442, -621, -159, -21, -262, 149, 36, 96, 647, 87, 142, -168, -760, -540, -548, -575, -436, -55, 172, 651, 834, 871, 855, 546, 418, 382, -410, -362, -551, -522, -263, -86]
1949h6L02j84j42R1L67n42J34R4l84L42k7j1K97k11L08o9m13J11nl24J40p3k66
1972e51J49M48j00L72JL44n8j93l28K63p85M1J48o00K34J25K11K58k32O13k38
1993A22O4l4J71q3K52k12j20J74l52j61K09rM70l92k76n3J32k97K23J48m44M20
2015d8K2q1N29l87p9J75l43l44N44l16L05P4J0M39L2k74j56p5J9j86j08J43K70
2038A65j65K68o7l25M67k86j14J00l67N15k4L5k35q7m1k71k4R1K01l2j08J90L8
2061g6p5J20k58P6K41J3M00j85l83K99l65K38R7j68N0J59P7K21k02k48Oq8j63
2084b14J00j19L23K29l76J94R2m42l77N58m70j86L48K62K29j31O2J78m16K31J97
2105B72m05K0m3J70J55p4j21J1Q7j01J38N1K70n8l54L44j52p92K21j26j17L62
$$ y = [-86, 216, 32, -110, -19, 348, -194, -60, 34, -350, -8, -35, -46, 251, 40, 348, 279, -134, -23, -28, -352, -212, -285, -551, -402, 46, -54, 318, 319, 663, 605, 412, 84, 347, -438, -397, -249, -849, -615, -490, -279, -21, -253, 360, 122, 186, 152, 323, 240, 492, 280, 160, 334, -18, -179, 30, 21, 491, 99, -177, -230, -98, -395, -172, -24, -468, -48, -26, -107, 422, 35, -44, 131, -212, -556, -12, -328, -23, 51, 61, 500, 532, 258, 102, 27, 46, -140, -248, -105, 165, 0, 268, 201, -124, 343, 57, -57, 43, -324, 191, 167, 202, -33, -120, -161, -432, -456, -365, -164, -196, -304, -114, -76, -151, -31, -289, -213, 28, 41, 441, 256, -127, 172, -193, 45, 142, -26, 24, 183, 260, 481, 279, 31, 37, -51, -214, -114, -233, 90, 319, -57, 137, 229, -213, -590, -32, -502, -688, -340, -78, 151, 20, 82, 260, -156, 75, 272, -133, -113, -156, 14, 169, 95, -26, -15, 72, -29, 109, 160, 430, 372, 18, 362, 210, -582, -361, -487, -604, -242]
2127b42j97L67k8J16J42j75j65N18l86k1J42R9k63L9K0k69J4j12L81K34J30j61
2149A83o4K69J82n12K14L1l91L02k8j81J7J64l10j60j2n2K54q0M25K08j47K42
2171E54j0l12m25p5j70J77q9j7K93k27L73k2j17L58j80K2m3P0k15lM9m9l12K67
2195a03q7L90k30K48k49J26J04j75k38J63L5P1k38L18J03J1j92k54J72k09L28
2216I4j73o2J30j07N7K66k98M1L9J31J10k22J61m5l5mJ1j41j61lJ42N3L8R6J66
2241B84l59KJ61n3j45J11K9J23k01K06k04r3j37L56j13l86L36J27L9J9r6J6r3
2264g1l5J89l29L12kj84J54J73m64J7K00p1m1K81Or4n1q5J85j68J4m2m5L83k46
2289a4J54r6M6k54K43j30J76j20j54J80k09K10p5JQ6k61K53o0K03k3j66m3p9p9
$$ y = [-242, -439, -72, -100, 16, 158, -17, -182, 336, -50, -71, 71, 170, -93, -54, -34, -303, -289, -401, -20, 214, 344, 183, 119, 388, 570, 58, 272, 303, -88, 214, 186, 5, 22, 186, -124, -284, -296, -348, -94, -174, 251, 459, 312, 554, 544, 232, -193, -268, -438, -261, -350, -367, -74, -301, 72, 50, -67, 291, 111, 133, 90, 160, -55, -58, -9, -58, -370, -103, -190, 200, -30, 218, -31, 95, 199, 24, -214, -51, -16, 55, -183, 135, 238, 249, 57, -197, -25, -234, 94, -79, -141, -11, -118, -61, 205, -93, -52, -13, 118, 228, 6, 167, 122, 87, 83, 94, -47, -208, -211, -69, -16, 22, 118, 284, -75, -73, 88, 35, -110, 1, 30, 153, -48, 158, -46, -139, -276, 80, -33, -419, -83, 44, 83, 102, 6, 22, -71, -106, 83, -246, 66, 64, -120, 34, 207, -257, -240, -40, -111, -152, 129, 135, 41, -10, -95, 90, -78, -64, -106, -151, 232, -14, 140, 44, 90, -164, 79, -51, 125, 5, -149, 31, -178, 32, -43, -42, 44, -217, 36, -24, 179, 156, -10, -53, -132, -211]
2313b11N6j13J79M36l77K76j79J04P9l96J49j11jL03j41r2J36k01J56l1J11l84
2335b52R2o4K22n9k3r4P8L22j94j76L53l4j78j37K75o5l35J66j26K58k54L02L7
2358A14K20Q0k01Kj66l6n5l00J53r6J54J58L7k20K40j46j14n0L21J22p5J99o53
2381c12J27M8N6o3K73k39K33O1j29K53M0l72J62k94j9j2L87P6j25j66J41k09j66
2404b49oj57J96K15O2m5J41j46j8J86k96j84k7r6O20k28M16k37k18R0K06l18M8
2427d5Q5j32J97j65j13Q8J17k89K75q0L45k6J14q6k99q4j83J44j06L64r7j1J65
2450A78j14K62l88j41L53l5j28J61n2M0J28lk08N9J19n19J80o4n6N45j91m41J38
2473a77J98q0R7j09j80K49O4j95j55M03j66N7J06n1L6Q7K16nm11K47m93p9J03
$$ y = [-211, -155, -268, -89, 347, -30, 246, 67, 171, 250, -146, 3, -108, -109, 194, 53, -39, 97, -104, 52, 21, 132, -252, -160, -224, -2, -61, -84, -178, -100, 222, 28, -148, 205, 171, -7, -144, 131, 66, -269, -103, -229, 29, -225, 77, 114, 334, 414, 213, 215, 49, 13, -42, -342, -189, -285, -131, 27, 64, -156, 84, -62, -176, -226, 95, 217, 142, 341, -312, -185, -137, -81, -144, 129, -110, 123, 184, 55, 308, 348, -24, 138, -156, -175, -187, 200, 276, 151, -15, 126, -83, -249, -255, -412, -216, -1, 61, 16, 157, 11, -7, 179, -117, -301, -328, -424, 196, -32, 384, 147, -71, 19, 225, -93, -45, 40, -92, 105, -60, -173, -85, 32, -257, 18, -62, 283, 257, 371, 285, -14, -98, -281, -137, -243, 121, 24, 13, 178, 64, 326, -62, -203, 150, 115, -13, 148, 96, 136, 264, 261, 53, 112, 231, -288, -108, -172, -228, 317, 126, -315, -177, 21, -59, 38, -71, -251, -2, 62, -133, -288, 115, -51, 6, 112, 61, 97, 184, 400, 395, -16, 231, -262, -341, -238]
2496b38K62J6JJ30M41k96l27J1j0j60k75K27m6l14L93j16J25o7nK74J12j23J85
2519B00J56k70L16n12L51k81k37J64M26m98M58j41j0J09N6k01L4j06R8P4J58j73
2541A71j06r5m50L39m10K26k8Q9L04L50k91M41j71j00j82k98O5o6J41k02j13L7
2563c49L55P6J07Q9j16L16nk93J77q9n97N74l68j33K66j38L34n1k52K37O4m19
2585b15P4K1j26M41l48j3J99J07k22k45J24o8K05j40J07rk21N84n6J67k03p3n7
2608C3L03j63j15L39l62J10L4k56J28K46l28K50k36p1j48j42K81k34P2J25k96
2629d30K82J27o2R1M1N8n2l6j44K94j65M7K85j25o7K43l90j08K50j07N6p7k41
2652b30Q1o6J01J25L5K2J68l22j64K43l02R0j40k92O54j44P9K50p0M7Q4k90J36
$$ y = [-238, 24, 40, 41, 171, 612, 316, -11, 0, -10, -170, -445, -218, -264, -578, -185, -301, -176, -243, -248, 26, 138, 15, 200, 356, 86, 402, -110, 241, -40, -277, -113, 313, -185, 273, 132, 122, 231, 287, 86, 120, 14, 112, 186, 344, 171, 65, -30, -480, -141, -551, -325, -353, -264, 40, 390, 99, 540, 369, 269, 87, -211, -146, -212, -71, -273, -386, -349, 6, 82, 189, 278, 162, 478, 473, 180, 357, 268, -329, 245, -123, -256, 10, -128, 206, 155, -97, 140, 204, -215, -141, -120, -246, 195, -153, -166, 33, 140, -82, -327, -203, -271, -66, -206, -99, -108, -329, 255, 199, 366, 163, 90, 33, 336, 173, 58, 397, 35, 145, 179, -77, 51, 297, -31, 219, -17, -88, -236, -378, -97, -331, -259, -134, -430, -148, -21, -83, 8, 49, 107, 55, 19, -125, 169, 4, 51, 336, 211, 144, 387, -3, -111, 139, 32, 88, 11, -230, -149, -215, -114, 11, 46, 68, 236, -86, -250, -7, -309, -219, -359, -651, 3, -141, -62, 188, 118, 165, 249, -41, 95]
2675I5k50j64K38N7l2K49n6r2K77L2%O9l86J13k79j99J23R9k22L44J1L0J46j16
2699H7Q8K6m05m7L58l10Q0L29j45K63r2m56J47p7o6J1M2R5J76J2RJ25l3k26L67
2724C58k42R5k54q3l3J15p2J62j97J88k7m2J91m55J81j09O8l51J92o2J4L21j9
2747f1L65J01j1M05n11o2k90K40l79p7K9q5K94j22K42lN8J52r2l3qp6k37j91k24
2772e76J38K31n8P8K82q5K03J04j13j6l01L46j84j19L12jj04L2J72l79L27m02
2794a13J86k0m0m6L47j49n5M6l73J94j14K06j77p5J94J31k09j52K04M1k3J70j72
2817AJ46k53pK78k70L4J28o72R19l58J70K87k65k65K14J79n23O6l58L49j4j50
2839c64K86J22K49M9p7J7Pm8n9J72k83j31N7o8J40r0q0J71J11r1K57m50K87p8
$$ y = [95, -155, -319, -81, -24, -56, 193, 137, 45, 322, 354, 354, 423, 37, 150, -129, -328, -205, -106, -328, 16, 27, 57, 203, 87, 175, 201, -204, -251, 107, -203, -123, 206, 61, 324, 232, -224, -77, -154, -220, -209, -167, -72, 104, 116, 125, 250, 217, -9, 358, 116, 211, -43, -126, -159, -44, -116, 46, -151, 37, 10, -32, 159, -296, -115, -224, -156, -507, -315, -377, -363, -42, -61, 304, 405, 394, 799, 288, 226, -64, 176, -203, -280, -251, -336, -42, -164, 78, 75, 133, 285, 193, 160, 152, 76, -161, -352, -576, -438, -207, -265, -187, 95, 10, 213, 317, 204, 188, -113, 233, 49, -70, 242, 241, 137, 169, 341, -38, 289, -113, 73, 53, 13, -33, 314, 165, 110, 156, -217, -23, -137, 69, -108, -183, 11, 142, -67, -219, -15, 26, 3, 173, 1, 147, -106, -113, 165, -105, -71, 57, -615, 304, -54, 116, 403, 138, -127, 87, 266, -257, -191, -549, -200, -214, -364, -78, 44, 293, 342, 265, 282, 289, 241, 182, 354, 71, -60, -3, -71, 69, -21, -101, 70, 181, 90, 347, -103, 184, 106]
2863A06Rl36J81l01K09q9k28K78m6k60L17J25%n8J97qJ44m74L71J65l69L53o79
2886c93L91M77l29J80k27P1J04k33r4Qj39k24K90K5j59J52J57m05K19r8j11N69
2908B31l02J27j96j1J30j53J27j77R3J47n3q0O53o2m89R9P4p0K33k47Q7J15k03
2931G3J98l93j36k3n1n4N91m49j8K82o2J07L1k05R5K25m02L24j88J8nO8p7K0m03
2956d34L92m9m2J12J42l6j66Q3J05J94j78l48M07L0k49L28j85j31K62j18j71r2
2978a44j27K75L6l37L05n6j77J46m76K03L97m61L54m7r4K00o3j19K35R2RJ50k78
3001B3M10k13k85M03m34K09l30L17Q1Q2j43J21M00p78K26j66qn8k57K59k37nm5
3024d28K55M5j8J29k49M00k08N2L05j02j11J97j80j64K27j8K24k40L95j34q2k71
$$ y = [106, 115, -221, -40, -341, -132, -221, -449, -171, -217, -477, -160, -35, -35, -93, 104, 96, 240, -234, 137, 302, -67, 286, -393, -2, 475, 146, 326, 99, 170, 274, 41, -53, -45, -184, -408, -118, -93, -252, -100, 57, -348, -129, -227, -338, 231, -71, 56, -140, -151, -21, -174, -47, -224, -131, 16, -37, -117, 536, 474, -15, 84, 158, 88, 321, 74, 161, 276, 73, 271, -122, -258, -281, -332, -386, 205, -244, -262, 20, -42, 65, 96, -109, -14, 211, -191, 133, -55, -37, -42, 26, -51, -31, -434, -42, -91, -133, -21, 121, 85, -81, 2, 107, 301, 123, -225, 182, 212, -37, 291, 106, -25, 237, 119, -52, -144, -271, 4, 40, -297, 8, -48, -225, -79, -555, -352, 45, -416, -62, -109, -203, -3, -66, -185, 50, 142, 151, 301, 23, 433, 220, -65, 338, -96, 113, -217, 100, 181, 263, 120, 241, 641, -137, 89, -77, -85, -143, -400, -141, -378, -383, -428, -173, -128, -146, -17, -266, 134, -74, -22, 283, 181, 70, 267, 87, -77, 150, 132, 356, 116, 511, 377, 295, 24]
3046B4N6o8k11J26r4o5M36l81K54q8R6P4o2k66L77l60j86P0R5J45ll29L83L9j68
3071a06j60J40o2K84l88J85J41k89J05Q7k05N99l65J56K27p2k76R2qJ97k35K03
3093B50k31J54j57k1j4l8p0k81n9L00J7j11K34k9o6J2o1J93N1l89K74J42l68N00
3117B32k25K0L28m45O17j10j14K49j84l76L35k11k34j15J57j06L15l54Q8m1q0
3138b54r9J70j81M1J19k80L65r7J40J17j38K94p2K92j03J04n0J10k34j29J30j31
3160A14j78L70k40Jr3j17J53J95m16k5j94J96K48m10K85M1l06J94k24J42K25R7
3182E8k86O15l98L37m0r0j32K09k3j8k74M00Q9m26J31k1l29K38m8l46M06Nl15
3205b58L64n8l68N23m48L02M4k79K81q8k07K86j17q4K42l4r9kN7j71L08n53K68
$$ y = [24, 80, 12, -199, -73, -167, -232, 204, -177, 77, -11, 85, 159, 97, -169, 208, -152, -338, -268, -173, -28, -31, -360, 23, 62, -106, -266, -126, -188, 96, -292, -107, 34, -255, -150, -63, -268, 331, -34, 122, 349, 277, 1, 93, 85, 282, 47, 250, 19, 173, 16, -5, -19, -57, -127, -408, -467, -167, -150, -261, -27, -56, -122, -110, -171, 22, 73, -316, -42, 100, -268, 232, 7, 27, 355, -90, 527, 417, 303, 552, 368, -8, 327, 116, -118, -233, -76, -182, 133, -221, -133, -174, -254, -353, -183, -364, -323, -204, -484, -119, -216, -76, 41, -97, 197, 125, 417, 314, 418, 368, 478, 244, 115, 245, 114, -64, 306, 66, 67, -26, -143, 10, 205, -211, -236, -430, -234, 14, -396, -111, -70, -376, -182, -406, -264, -39, 58, -228, 387, -11, 326, 286, 196, 64, 273, 250, 232, -42, 358, 447, 21, 152, 131, -198, 40, -8, -354, 52, 57, -258, 106, 48, -320, 203, -245, 57, 101, -178, 103, 15, -192, 94, -23, -107, 135, 101, 2, 0, 57, -114, 194, -359, -91]
3228i1K49n05M04K03l19K56Q5j55J84l07LK04k97K37k33j31J56n3l1L49k94L7
3250d9M18l05J15M9m89L03j43O6N6p2J09j47J77J07j93l9k2K5l07L78k2k2j68
3273a75K15q5M19k28q1o8k22L94O5l40p8J80J76q9j6J85J1k39j68L47n34m3K29
3296a45k67J81J23J6R5J01L8q1p5j58L30j73K91k13l09K29R0q7L6K4o7lmJ34k69
3321a63L8K11o3l63J64R6m9K31K57l24L82n08o9L22l95N0J23o6J02r7J30M0J7
3344F6j13J28k34O7K62N8M6k11k1Q5n1k2L41n70j20O04m75n5M42n24L09J7l93
3367c64M20J83j32Q3p6M1L2j79M1K66o28K94j11lK19l93K70L08n38K14K60n18
3389c11J65J74LJ8q2J13n1L03l17M23l24k43K78l87M66m1k27K76q5k93K04J71
$$ y = [-91, 158, -347, 57, 260, -59, 197, 282, 127, 311, 4, 7, 211, -86, 151, -82, -213, -57, -110, -141, 208, -86, -49, 369, 64, 179, 228, -261, 42, -101, -35, 21, -51, 58, -89, 88, 195, 2, -37, -59, -34, -341, 37, 15, -7, -175, 40, -45, 374, 146, 65, -3, -225, 169, 234, -106, -184, -4, 172, 83, 67, 252, 263, 24, -144, 203, -331, -374, -145, -412, -231, -108, -92, 3, 104, 142, 61, -14, -172, 158, -15, 276, 63, -246, -17, 73, -14, 22, 46, -21, -24, -28, 106, -163, -125, 86, 23, -340, -176, -80, -129, 102, 359, 35, 417, -91, -160, 162, -233, -183, -60, -126, -24, -121, 9, 49, 66, -47, 81, -153, -86, 176, 234, 280, 69, 48, 133, 82, 60, 401, -169, -289, 315, -160, -215, 227, -297, 12, 29, -364, 56, 239, 107, 190, 114, 155, 187, 8, 49, 315, -313, -19, -130, -133, 86, -307, -37, 271, -267, -53, 207, -311, -146, 28, 31, 49, -33, 80, 29, 332, 15, 438, 114, -129, 149, -238, 228, 187, -40, 236, 151, -142, 62, 233]
3411B33j07K9m92L31J66N5l03J8m59L46K63m56L33j72m3L46l93K09J00l49N66
3432B21J5k69m0J61j69M80m08k17O06m50L14j00j48j26%m1L77k40q4M08m02K6
3454h6p8j14K85k36m8J64k0j66L31n02J16J49N0p2L18J4K09k10o4J13J8k08L19
3477B82Q4l01L49o3q4j42r4K53J67l48j40L2j52L39m53jQ3o4j86J33rj37J18M1
3501b93L01N7j70K81j15l9J42J0PJ46j45J98j27l08M35k08K8M1K6k01lK01l60
3524i6K19l33Q5L1k22R4j7k85L02J13q8M71k31j7K23l37J34J80m46J71l2j15M77
3547B81l22j35N39l68P3J71j50N7m6J0L55j96j40Jm62K23K7K5k29J19%J65n1N8
3571EK20r5k77O17l50O2l2l36J20J64l41L01j13J0n0j18q3L98l98J01K54l27N12
$$ y = [233, 126, 155, -337, -6, 160, 215, -88, -70, -529, -183, 80, -376, -43, -215, -258, 88, -305, -96, 4, -345, 221, 236, -33, -73, 88, -81, 399, -9, -226, 380, -70, 244, 144, -4, -130, -130, -171, 206, -34, -118, 290, -112, -86, -164, -278, 7, -229, -277, -113, -133, -299, 32, -470, -354, -205, -155, -227, 91, 105, 314, 104, 40, 153, 171, -37, 282, 366, 65, 414, 351, 267, 125, 31, 284, 451, 103, -37, -5, -157, 182, -271, -272, -189, -253, -439, -306, -315, -452, -334, -293, 8, 65, -105, 176, 61, 22, 164, 174, 181, 327, 182, 380, 253, -55, 380, 172, 200, 241, 267, 66, 63, 264, -96, 123, -210, -125, -94, -316, -222, -239, -524, -222, -109, -197, 274, 43, 26, 249, -88, 46, 226, -220, -49, -81, -196, 281, -41, -176, 363, -5, 68, 239, 89, 146, 100, 110, 465, 269, 129, 130, -332, -109, -82, -57, -286, -167, -167, -2, -53, 5, 225, 130, -147, 470, 120, 182, 150, -186, -66, 98, -243, 58, -55, -45, -95, -213, -296, 102, -296, -195, 59, -268, 244]
3594B44l8j93J18k63o2L80j79J23j38L02r2n2k17M67N7l72J52l12J90k49M6k07
3616b95N71n32J81q6k79L41j19Q8LJ36j89O2k89J54q4L4K76K86r9n5J45QJ45r5
3640C08qrJ22m2P8m47J84n3j91K90n72J48p1L5j4J66l04J73K3K61N5n4m61K92
3664i1J02k84N96n09J33J91k50N00k15k35L35k41j15L62n32L39K85k74j23K55
3684B29l1l55M40m91K53m7l03L64p2k31M54m91J42N6J61n4j36M57l05k5J50J3
3706A78k34L2J3l6J75m13K4L39l15K6L09J05m13N39l81J32K8k90P3J99J52m19
3728a77K29l0k3M5K99l10j43P0K05j23j24J46l28J81J83l17R0O5p7J79l32Q2L85
3751A75l00j82M48n57M09Q0M2Jk73O6J50l48n5L04l91K26K83k44K01J76k97J49
$$ y = [244, 206, 13, 131, -132, -194, 186, 7, 130, -8, 294, 202, 150, -67, 400, 457, 85, 237, -75, 115, -134, -88, -295, 276, -256, -75, -161, -440, -99, -218, -130, -127, 9, -180, -118, -407, -253, -337, -303, -27, 259, 160, 105, 250, 258, 403, 308, 300, 291, 413, 371, 449, 2, 186, 133, -58, 232, -340, -192, -263, -228, -242, -76, -380, -207, -184, 77, 132, 78, -383, -91, 11, -273, 323, -186, -53, 138, -112, 388, 173, -62, 273, 32, -83, 279, -253, 86, 371, 97, -26, 229, 198, -157, 283, -208, 45, -2, -305, 59, -13, -244, 210, -281, -139, -83, 78, 24, -112, 345, 40, 15, 165, 178, -56, -24, -11, -47, 128, -285, -261, 78, -237, -211, 98, 203, -210, 329, -52, 80, 108, -182, -109, 90, 242, -177, 52, 22, -1, 44, 343, 33, -110, -40, 165, 42, -82, 64, -264, -83, 100, -217, -127, -62, -139, 40, -292, -210, 175, -125, -307, 141, -416, -7, 73, 115, 116, -157, -91, 59, -289, -344, -40, -431, -205, 78, -166, 35, 211, -86, 63]
3773F3j93J05K55q8J02k0l95M20J6k39J12k71j79K85m0l23J27m4L12j52l9P3K58
3796A45j03K63l97K10k3m33N40m84j7M35j09k4K09p0j58n2L14K9l5j85k08L70
3818B17k59j1L76o5j56k27j27K95l42M7K58j08J32J61n43J86Lk80L11K14l02m
3840b24M71k67L45l87p7K55k96K56k21J12K71j21j62P7j81R5J85K%K9l13N95l83
3863F1J9L42l08l4J69k41J03K67n12M0m10M19p9r5K7J99j48J96j04J12R8j48k19
3886b46L22k0l62K92O0k79mNnM67k34M5Q4J02k63L32l36J33K50l55L10m56K89
3909A31K27k25%m3PJ53j83k49L53j89qK03o2l73K98m35J83k6k73M69nj13J60J45
3933A45j90L53l22J54K15m30J70Kk17M7q7m0L56P2r1K86k07K33k25m27L21J14
$$ y = [63, -130, -25, 230, 142, 244, 224, -171, 249, 265, 26, 138, -133, -312, -27, -67, -390, -263, -307, 5, -147, -186, -113, 145, 42, 305, -92, 118, 95, -338, 202, -282, -299, 136, 27, 3, 212, 142, -16, -68, 246, 275, 240, 55, -153, 217, -42, -53, 323, 258, 102, -125, -252, 43, -299, -252, 6, -102, 30, 191, -352, -166, -163, -443, -132, 82, -220, -224, 247, -20, 325, -62, -139, 116, -180, 76, -145, -33, 238, 117, -45, 32, -149, -54, 131, 133, 133, 162, -151, 444, 61, 80, 422, 114, 80, 249, 8, 111, 378, -134, -94, -504, -85, -164, -259, -232, -33, -181, 15, -89, 23, 121, -27, -246, 76, 56, -306, -14, 46, -233, -237, -232, -237, 230, -4, 41, 125, 227, -36, 296, -40, 93, 343, -12, 298, -158, 131, 358, 133, 133, 90, 97, 250, 67, -182, 171, -18, -26, 177, 115, -258, 40, -395, -212, -238, -511, -42, -47, -160, 0, 145, -45, 308, -14, 140, 355, -75, 95, 97, -120, -73, -160, -200, 156, 228, 137, 423, 216, 449, 224, -203, 118, 232]
3955B32p04K56P1j53K66J56j24j02J1P9J50q6j63j0o0J34Mj82Q3J75oj74j74J27
3979a94J74O1J78P1j48K97p8l23RJ1q5J23k00Oj43k95M10L36j11J44m7k48N43
4002D91k69p5j07k43J20j59k35J52J18p0O3o5o1N46k86J56M8r2L67Jj56k94K03
4025A53r1Lk62K24M1j22M8K22k20l7K85k63j33J92k4PL9J0k31L25k63j39m6J21
4049a61k15J17L35j31j45K36k60J45J80j93N2K06m85M50j90L2M29l78K6K9K6l68
4071b63K35n1j34N16n76o3K57l73M23J50K05k56j57R7L76j20k32R4k28L25K5m94
4093b44J16J66R7k4m07K75k2k27L15r3l71K73N7J8J03J14m6j73J30J46O4l38O4
4116gk16J09K00J10l38M6L87k45K16J97n56O9J21j02M5m17M81j83r6L4r9J40J6
$$ y = [232, -472, -216, -145, -298, -32, 124, 0, -102, -91, -12, 138, 52, -111, -121, -181, -47, -43, -225, -142, 33, 27, -147, -321, -194, -20, 41, 219, 290, 142, 439, 361, 38, 47, 58, -27, 96, -104, -98, -241, -536, -126, 210, 99, 243, 196, -52, 491, 222, 147, 40, -203, -83, -242, -477, -325, -207, -277, -214, -279, -340, 206, -80, 76, 124, 32, 399, 400, 244, -50, 153, 62, 65, -197, 27, 68, -54, -6, 216, -4, -41, 244, -19, -152, 40, 16, 23, 62, 72, -159, 166, -97, -236, -282, -161, -376, -259, 76, -55, -200, 36, -224, -79, 101, -92, -40, 166, -319, 131, -59, -27, 402, 24, 50, 79, 105, -263, -28, -79, -213, 303, -273, -336, -79, -452, -29, 121, 326, 70, -87, 10, 386, 266, 34, 128, -100, 225, 250, -244, -128, 38, 135, 111, -296, -21, -43, -270, 45, -48, -419, -146, -89, -71, 32, 146, 100, -73, 57, 203, 267, -71, -7, -223, -114, 86, 196, -142, -96, 291, 46, 262, 459, -97, -28, 93, -9, 36, -381, 100, -83, -179, -145, -244, -104, -88]
4139h8j48K51j51L2K31N4l80J12J36j49J35j70J99O1q7l9O7p4J73j84n4J38k43
4162a78J8M10l90L9L8Q9j05J74j9m1m46J94N58l18PL71l75nR6n1J05k75M6L01
4186B43l15m5qJ45Qj83J18j31L65jk09J04j47L17j31j93J20o1j4J18m14M15N1
4209A52n5j49Q6l1K17j27q0P2K7o5J49l55K29k7Q3q2j07J9L3K5M0J25j30Ok73
4234b18J81k40K03Q9J58k75O3J64l38O5L23k22j6K16l57K69J12k83O5M5o4J0j50
4257b00K00L19k92Kk30N5J71j38JJ19J66r9J16pj52L78m06ro9j25J43K98m19K39
4281F1J35l85M33k47m45L30j01P6K09m0J36k73K72j92N8j01K37l13l4q9N27k54
4303@J05l30J44L16k67M29m06K1J08n9k08k02K25k12J64M4l1K25J72j87l36n5
$$ y = [-88, -236, 15, -136, -104, 127, 181, -199, -87, 49, -100, 35, -135, 64, 125, 38, -1, 66, -8, 165, -19, -73, 65, -178, -160, 250, -140, -101, -63, 26, -79, 95, 76, 35, -411, -217, 341, 23, 30, 401, 26, 21, 117, 66, 171, -104, -58, 243, -72, -117, -125, 20, 28, -155, -37, -168, 197, 196, -13, 91, -56, 261, 130, -63, 57, -4, -18, 100, -314, 101, 152, 97, -52, 34, 3, 220, 93, 13, 85, 112, 47, 196, -159, 70, 43, 126, 44, -63, -44, -11, 14, 54, 179, 49, 55, -218, -37, -277, -74, 15, 173, -102, -39, 125, -213, -148, 175, -47, -63, 153, -204, 65, 177, -106, -41, 4, -60, -50, -200, 0, 319, 27, 29, -201, -146, 25, -113, -112, 7, 173, 74, 190, 183, 31, 409, 3, -6, -75, -200, -57, 241, -178, 61, 196, -189, 244, -3, -448, -118, -219, -143, 66, 26, 162, -111, 161, -31, 27, -74, 163, -150, -184, -273, 254, 0, 105, -225, -81, 235, -32, 397, -9, 12, 120, 61, -147, -349, -124, -336, -172, -128, -159, 66, 238, 51, -285, -340]
4325c40L53k28j4L96K8m7J19k30K19K2m03J72p4l56L56K40m07K98k64L99l60j7
4347a38K96NJ57k64L7k54J46k5K7q5j09J35N2r3L75j23k1j40N6j88K74k42J15
4370gj82J57L65j92j3j26M3j66J16J00J24k60K57K8n5k32K6K18k46J89j87j16
4392a59R5p5r7L42k77K78J66l90L30M1j72M0m6k45j73J19J49M3j59L73l8k11L10
4415B44l73jQ4q6k9J64j70n8K99lJ91o7R5k50j84L64j8j02l3J50k31j21k31L48
4439a8K5j88N21j99j78Q5rO9JN6l10k0J39j50J86l1k41K78l16J97K27j49j28K70
4463A17k88J58Ol3K98p2r6J18k12M8k5Mn8n4L76ml64P3K62k67j10L67l97K52l13
4488b14K11Q9j76j97J83J04p5p2MJ77n7j0k8R0l9k01J41N2k08L47j33j47L61j95
$$ y = [-340, 13, -215, -229, 167, 195, 148, 267, 37, 256, 278, -125, 47, -27, -383, -27, 213, -194, 104, -160, 239, -121, -138, 158, 163, 320, 56, 93, -161, -15, -40, -13, -98, -207, -72, -20, -113, 262, 139, 118, -22, 34, -154, 120, -122, -7, -189, -32, 333, 141, 128, 2, 45, -121, -5, 95, 219, -41, 216, 244, 189, -43, -17, 201, -45, 144, -43, -159, -64, -139, -236, 106, -171, 107, 273, -117, 213, 254, 82, 122, 76, -169, -342, -223, -74, -31, -190, 183, 145, -66, 244, -129, -130, -46, -132, -161, 3, -167, -225, 74, 71, 262, 195, 290, 40, -144, 220, 202, 100, 67, 217, -14, -135, -366, -18, 7, -181, 340, 141, -37, 48, 39, 108, 109, 165, -145, -165, -26, -176, 10, -21, -262, 16, -300, -103, 124, -25, -153, 117, -171, -13, -7, -40, 258, 186, 90, 208, -4, 44, 19, 23, -35, -89, 287, 283, -81, -8, 254, -13, -123, 244, -153, 99, -214, -3, 86, -90, -287, -104, 0, -75, -147, -143, 34, -23, -33, -61, 29, -10, -211, -70, -18, -226, 121, -12, -159, 202, 7]
4512GL45j98K07l70k6j49pK4K06j39J60l47N16k51Q2J92k8j58j60j1m2rK05o4
4536a5q8j17L9J03K37k10l04L24k74L40k69J98QJ8j65K87j59P9M7LJ60l04K01
4559A39j53L9J85k01l7J01J66J12m70K96r9J7P9k90M00J1j67J25j29J92m16J08
4581Hk55J56J14kk55K00J76j73j33L53m0j58R5J42l17J38K9j03j06J0J26J3j95
4604a77L80j43J11K82l49n5p3q5J54k51m5L35p7o2k3p5K63j21pL3N3j65j91L07
4628A9j91L24j22r0L5J4L8N7L5l63L21R6n81K91o1L54j39J33j74m2J90Ml02k33
4652c87N03j27oK68j30l10L05q3J09q0J04K44m19K04k17j36r3K94m30K99r5Q0
4674a03KJ56N7k90R1q6L48l76L64k37N8r0q5K73k00J17J47k19K56l6J05j64R5
$$ y = [7, 352, 154, 361, -9, -35, -184, -191, -167, 39, -100, 60, -287, 229, -22, 60, 252, 224, 66, -94, -105, -147, -156, 49, -15, -103, -220, -181, -78, 159, -51, -355, -31, -305, 35, -234, -36, -28, -10, -175, 112, -47, 32, 79, 82, 242, -62, 139, -14, 25, 210, 9, -28, 73, 239, 351, -119, 177, 78, 95, 174, -116, 284, 295, 128, 253, 124, 316, -100, 8, -247, -91, 23, 21, -234, -34, 142, -31, -164, 189, 149, -9, 86, 228, -89, 49, 78, -25, -131, -121, 5, 18, -177, 203, 60, 171, 453, 104, 49, -24, -109, 45, -206, -251, 84, 7, -55, -78, -153, 110, -11, -18, 15, 68, -97, -288, 19, -172, 152, 30, -60, -25, -11, 27, 84, 119, -244, 77, 173, -408, -117, -178, 176, 37, 170, -4, -46, 144, 148, -154, -387, 116, -11, -17, 251, 121, -189, 116, 33, 142, 62, 166, 410, -9, 195, -22, -158, -251, 43, -387, -88, -183, -103, -101, 55, 112, -178, -87, -173, 175, -201, 163, -74, -16, -106, -191, 82, -118, -1, 146, -73, 183, 147, 252, 88, 183]
4697A83j9j93L12m12m1PK79k11J5k0J83p5K06j62J0n4J8Q5q5N2k18J97J44N2j67
4722H6M4l56J48J68M6j18Q2j04j85J22J19M0R5k93K89j23O3Lj64J31j81L6L8j9
4746c3r6M08j43n3j63K25p2KP7J11k72K8j27p0J23j08j18L8L98m41M6K44j76J05
4770f7k7P9K29j18j2OK6K93m30j06J14j69j79K00O4J82J10j73J72l30K15j54O1
4793a4k51K08O0j09r5K51q4P8M3M6n63L75O2J61J3l24K94m93L34n3J99K07p06
4816c61N36j20j8K2k72J26J37k69O3J45q5J57j2j22jj54K01j71K56L9K44p9l51
4839h9K43l80K33j38j64M65j60j91J88l38J47K30L9k3j7J59l81J05J9J30k7j52
4861a02m9J8j34J38J20j94J67j1N3L65l19k40K52r5J01k34o4K55k16L2J21l21
$$ y = [183, 164, -29, 283, -129, -170, -163, 116, -95, -80, -100, 83, 8, 214, 52, 62, 8, 26, 111, 26, 78, -140, 57, 201, 253, 86, 130, -226, -78, 90, 136, 18, 100, -4, -189, -67, 52, 92, 187, -106, 183, 60, 123, 126, -38, 93, -88, -52, -14, -33, -129, 279, 136, 83, -80, 145, 73, 75, 152, 263, -9, 19, -108, -178, -55, -163, -281, -243, 155, -286, -240, 4, -172, -67, -94, -15, 214, 96, 84, 90, 116, 409, -21, -127, -13, -182, -361, -161, -97, 85, 195, 22, 194, -136, 79, -75, -14, -265, -57, 3, -106, -201, 50, -34, 44, 87, 133, -430, -55, 7, 168, 181, -143, 151, -342, -8, -61, 138, 345, -361, 175, 55, 37, 59, -213, -87, 50, -219, -156, -11, -96, 61, 49, -73, -74, -228, -27, -198, 58, 97, 341, 262, -89, 154, -226, 7, -131, -295, 170, 10, -181, 7, -331, -184, 46, 85, 62, 45, 204, -177, -72, -53, 77, 50, -102, -151, -133, -267, -129, -9, -203, -36, -47, 6, 371, 52, -188, 64, -31, 70, -164, -228, 27, -189, -157, -36, -357]
4883c57M35p2r7J00N6j26r4K1L10p7l9j12J87M9k51K27J32l24N7r1j6J92nM8k53
4908a00K53p8Q1o3j80K83m1O3k07o9J62k7J7j86J55m40M79m7P7p4k00P1o8J52
4932A3K6J38j25j42j19n6L10J5j63J48j51j44J63K04l58L53k66K63j40j47J55
4953b3K73k15k23K1L13j74Q4m2lm9j1K04j01j24P1J31k7k84j41L24J54l7r2P7
4977A06k72R7Q2K50j50l71K78j49J1J79j15k93K50Q2J51k72J82m7Q7k83J80Lp6
5000i0k0M13j85k74P9L34k15J27R4m01K17j03J83j74j18J8J07K6l0J31j23j17
5022a21l3L57j77j46n8L73j06k05J81j23M4J86k35K83l32M0K29k60K46q4p4J38
5044A23j02k56L16j71RK53J0m14J78O7r9j0j21J69J87j52K1k3O6j60RJ39P7Q7
$$ y = [-357, 78, 6, -91, 9, 65, -61, -155, -134, 176, 99, 60, -52, 135, 184, -67, 160, 292, -32, 25, -66, -82, 110, 105, 153, -100, 153, 75, 156, 93, -87, 196, 155, 218, 11, -58, 104, 77, 94, -92, 63, -377, 102, 55, 132, 58, -142, -71, -139, 13, 39, 177, 52, -90, -209, -265, 45, 60, -103, 45, -106, -250, -87, 117, -241, 112, -154, 109, -31, -178, -23, 250, 35, -188, -167, 146, -28, 56, 14, 11, -38, -49, 155, 54, -70, 1, 132, 105, -179, -320, 4, 158, 121, 29, 106, -166, -69, 13, 263, 113, -258, 20, -129, -118, 61, -54, -347, -97, -15, 136, -136, 46, -1, 86, -197, -17, -14, -90, -110, 303, 118, -156, -77, 257, 42, 169, 263, -138, 79, -24, 159, -15, -133, -115, -8, 18, -12, 119, -4, -121, -154, 203, 26, -120, -178, 195, 89, -116, 65, -58, -14, 172, -63, 220, -112, -72, 157, -103, 143, 59, -15, 123, 21, -235, 81, -90, -81, 172, 182, -232, -54, 13, -86, -96, -217, -48, 139, -13, 8, -15, 51, -109, -100, 39, 116, 203]
5068B03j1k63K8q0K42J87m03J40R8m8m8o9p7J53m3m8L07k00j92K15k59J14J52
5091I8q2ON2j11K83j35k87M31r2j35m34Q4K19j50j6P3K61j66J89o0j56K03j42
5114f7N3m2j0K18j90O2j77J64m6j0L6j06K39o7j69L33j78j90Q8K20K24m48k20
5137b83J55L37l64J85j97J00J58j22K02R3p2k84J26n7l1k8o3K57J09k42L43l15
5159GrJ80m04L11N0k19o0O8j85K68Mj27j8o2L23j78K05o0m15L94J00l66N8N6Q7
5184HK08k66j43p4K34q6J71p3K74m52K26o2J28q3N8kk61J83L0j59K46j50J16O7
5208A38p8J10l05O3K24l07n6J65R8j21J67J21k12J63q5j04j16K96k82l2O6Q5R
5231Gk50J86M29n34J42M9J37l45L72K01l00N9p7q5j78P1k95L57j54R1J84o6L2
$$ y = [203, 192, -71, -43, -123, 119, 306, -97, 43, 141, 93, 45, -24, -101, 52, 9, -39, 268, 68, -124, 91, -168, -54, 98, 16, 22, 74, -37, 246, 111, -176, 255, 163, 28, -406, -322, -103, -253, -269, -196, 65, -101, 88, 28, -128, 75, -67, -14, -56, -66, 152, -38, 24, -153, 11, -35, -45, -9, -115, 124, 57, -112, 221, 43, -147, -59, 161, 385, -63, -283, -128, 209, -155, 30, -167, -67, 91, -31, 171, 264, 192, -92, 34, -23, -54, -82, -145, 112, 221, -21, 322, 7, -2, 178, -226, 85, 135, -84, -144, -76, -261, 7, 11, -116, -134, -196, 127, -51, 154, 94, -321, 73, 173, -193, -135, -79, 8, 216, -50, -193, -267, -33, -119, 52, -21, 253, -199, 27, -35, 93, 10, 68, 66, -195, -12, 18, -141, 105, -45, 71, 138, 60, 170, -135, -72, 152, -155, -211, -46, 52, -69, 98, 219, 7, 170, 85, -19, -135, 161, -121, -153, -87, -2, 7, -243, -57, 372, -162, -20, 29, 166, -179, 193, 394, 94, 153, 76, -9, -187, -116, -411, -54, -208, -117, 67, 1, 33]
5254C3J96o7l80J05J03o1J70l35Q9l4L4L81k44j8K83l9n5p4j98P4K56j58j08r2
5278a39J10P0N7R0k01k4M8NJ97k26K09k81j51L10j5K73n75K08R0m5p1j52K48n1
5302a6J00p6M1j72K28N3l15K77q2l34n5L76j72K2k6K6K51l57K78O4l50J33O1J05
5326F0j09q9K36r5L8j18m7P5L2J28P3p2P6k53r8L5KK42k14K98r6l35N0L45j41
5351B3M1q3p4k08K62p4Q9m2j21M22l30qM96n04L69p9l68p5M16k38M19l28k56L81
5375A30r5k89K29K9k24O8J1M8K6K27j21j42O9L8K7J69k49lJ08j46j32J49R5k22
5399b00L60O4l69J28j89M35J19l75R8q6l1Q4P5O5j92J03J12m81J45nP1R0j7j43
5423a39J56k83L24p3J6j38K92j57O2k7QJ44P6j36j31j46J35j81K41j60M20l31
$$ y = [33, 229, 162, -218, -113, -10, -71, 99, -236, -147, -181, -147, 234, -10, -28, 255, 216, 161, 87, -111, -37, 219, 61, -47, -139, -29, 41, 98, 188, -13, -37, 11, 16, 213, -13, 196, -85, -236, 74, 59, 332, -243, -35, 55, 10, -61, -213, 35, -16, 84, 8, 49, -123, 105, 158, -157, 120, 38, -296, -351, 25, -147, -125, -151, -125, 126, -231, 47, 111, -239, -106, -45, 60, -49, -138, 98, 3, 41, -77, -124, -49, -17, 111, 184, 112, 188, -65, -163, -128, -126, 116, -98, 200, 104, -231, -181, 164, 23, 64, -19, -93, -301, -39, -113, -24, -66, -187, 235, -95, -103, 393, -111, 258, 179, -189, -264, 152, -86, 333, 5, -251, 130, 35, -254, -25, 4, -220, -152, -141, -93, -67, 160, 39, -103, -34, 4, 31, 200, -49, -52, 56, -90, -222, -73, 22, -200, 160, 224, -145, -17, -206, 229, 348, -27, 71, -15, -46, 38, 113, 178, -14, 89, 201, -280, -135, -140, -69, 21, 4, -139, 17, -266, 58, -15, 1, -137, 155, -2, 60, 33, 41, 185, 261, 125, -6, -152, -17, -198, 43, -117, 303, -28]
5445b8j89J21k09K75J2K8O4k40L38k30K16j39k38L45k2j37J72j5k09J24J4n8o2
5468f7j87L52J2o8M5j98JK30q9L27m54L2J82q7k5r6L79l57oj6M6J23M5k64J87
5493D7k21j17K75k6O6r7n7L03k20J24j8q9P7j73K07J15j95No1K14k44J52K60m84
5517a57P1K23mpk3L3Pk98J01pK26l59J6J41o5j0K25J99k83J67j71m1nJ51j62K07
5543A75m70J91R1l57M31k66o7K80J29r0NQO8Mn3k39K45k48j11L93o7j34L3K1%
5568b8R0K46j82PJ06l83O3N3J3j77L52j75K57k95P4Ml65J78K75k74K35j63J94
5591A05k30K7J97J6j29J33j2P0l33J03K29l29J44q6J42j32l0K73j0j75K7o6Q4
5614A8j84J48Q3k39J75Q3k93oL21j32p5o7L17j98j93J54j36J61j55J83L03k78
$$ y = [-28, -217, -96, -305, -30, -18, 10, 74, -166, 172, -58, 158, 19, -219, 126, 104, -33, 139, 124, -85, 39, 53, -5, -67, -254, 98, 110, 42, 87, -111, -110, 120, 31, 358, -96, -64, 118, 31, 6, -90, 289, -68, -74, -90, -44, 79, 124, -140, 47, -174, -291, -16, -42, 24, -73, -130, 173, -47, 77, 59, -30, 47, -126, 81, 196, 1, 6, -55, 159, -85, 67, 327, -157, -86, 137, 133, 126, 103, 136, 143, -155, -54, -61, 165, -194, -178, -37, -102, -112, 113, 312, 29, 196, 25, -16, -21, 130, -32, 175, -295, -104, -13, -370, 61, -205, -272, 8, 137, 47, 52, 60, 128, 132, 79, -160, 85, -163, -274, 119, 52, -82, -49, -28, -28, 62, 308, 126, 133, 239, -144, -81, -28, -15, -192, 160, -15, 242, -53, 21, 25, -340, -162, 113, -161, 74, -89, 105, -125, -98, 99, 115, -14, 119, 107, 177, -156, -53, 176, -153, -9, -95, 47, -85, -115, 158, 148, -27, 0, -66, 18, -166, -18, 65, -174, 1, 84, -209, -215, 106, -26, -101, -168, 149, -49, -242, -88, -224, -63, -218, -35, 268, -10]
5636a0kO3j10J71k80K80k22l0l7P5j34M40j32J09k39Q1l3l7k25J23L35k92K72
5659A66J89k79N2j9k58Q9r7P4nK5K83l89l5M14r1j99L17j64K5j00K5N3k51O83
5683E08m25k21J15j1r1K17Kr4R1q9j12P3K52j29p0l6jK83l48n5J76k9j76K33J0
5708G3k82K18J93k21j6j84J58m0J63k03J37j21Q6n3n6L31J08m79J66j17Q2j19
5730a76J85k1J1J79l71K50J4m4r6M1N8l8k05J37l0O1P4K2j08k36K36L6q7J31j76
5755a53J94m31K71J73j74P1j91J29ML95j37k04J94l45J67p3J86j6j09j62J48k7
5777i0J54j13k8K84l10O4O0J48J04k70j32J04p4O3J75l20K85k6J62j19l11L99
5799B09j64J09k31R7J14l6k92K28J04j29R3j92J08oK54m35q2M02Q6m18J25J16
$$ y = [-10, -12, 51, -59, 112, -168, 112, -110, -140, -177, -102, -236, 204, 72, 181, -58, 23, -10, -47, -272, -149, 186, -106, 166, 355, 76, 128, 109, -149, -60, -157, -83, -88, -63, 220, -169, -204, 210, 119, -80, 237, 73, 98, -2, 23, 76, -175, 508, 83, -138, -23, -34, -125, 92, 94, 0, 91, 2, -110, -37, 215, 86, 16, -20, -21, 262, -86, -141, 35, 6, -170, 63, 73, -209, 9, 202, -19, -35, -219, -61, -101, 62, -141, -4, -125, -39, -92, -148, 183, 291, -188, -22, -139, -57, -176, 9, -12, -1, 178, -193, 57, 71, 27, -69, -28, 30, -8, -213, -76, -106, -45, 29, 51, -57, -293, -57, -21, -108, 23, -153, 41, -390, -119, 54, -120, -49, -240, -111, -107, 288, 151, -53, 141, -204, -37, -110, 76, 60, -49, -211, -63, -90, 64, -49, -77, 207, -103, -39, 21, 169, 273, 3, -129, -25, -99, -36, 139, -181, 104, 78, 240, 121, -190, 209, 45, 154, -77, 20, 134, 98, -194, 34, 138, 9, 102, -90, 18, 12, 266, -169, -251, 151, 237, -181, -56, 60]
5821F0Q4j94L10j79L8K9r9k08J39N5j8j32J66J95l40j05K71j23m05M66j18p4L59
5844A77k39J15j68Q1j3k99J24L80l3k70J60q8L13P1j78m3J31j50J00m05J77%j53
5867b10L38n8k1L4k10j04J35j27K22L7k2k40K15K3m0O7k05K39L0k23M81k02r9
5890F0j62K0J05k43L26l5J9J2k45kK42j7k15j61M02J0O6j33M3j98l4J01j04L23
5914A80l22J05k8P5P1J25j73j81K13K8Q1j42N9k01K62j91p7Q3J2J73j24j17J05
5937A6n3j03R7J24p5O4j14j03J16J07j1r7J22j58j60L31k71j4J70J85m86L13j25
5960a25r4K13Q7L5k80j87N33k48n3Q2p1j85M69n85P47k80J4j49K56j70L7J48l2
5983A62P8j06j1k20P4J16j51l6K23l65J49K88j33n9k48K87o2p0J05mK76m30P3
$$ y = [60, 144, -50, 260, 81, 119, 148, 49, -159, -20, 35, 17, -115, 51, 246, -94, -199, 72, -51, -456, 10, -108, -182, 177, -62, 53, -115, -34, -47, -346, -222, 158, 125, -145, 15, -73, 240, 311, 133, 90, 221, 71, 171, -234, -57, -57, -210, 128, 70, 49, 83, -127, -231, -96, -223, -1, 36, 14, -226, -11, 12, -28, 39, -166, 73, 103, -120, 361, 159, 60, -102, -82, 23, -220, 106, 71, 90, 102, -143, -145, 97, 80, -135, -296, 106, 116, 182, 49, 92, -106, -140, -39, -143, 180, -142, -37, -65, 10, 81, 206, 33, -148, 65, 93, 174, 32, 91, -110, 152, -39, -116, -33, -21, 152, 28, -89, 16, -37, -140, -43, 81, 6, 70, -44, -147, -31, 76, 65, -32, 90, -68, -228, 103, -168, -182, -12, 173, -313, 0, -125, -219, -6, 81, 116, -164, -351, 182, -66, -119, -37, -108, -293, 176, -409, 338, 58, 72, -77, 179, 9, 46, 194, 162, 240, 134, 123, -97, -23, 93, -58, -94, 129, -236, -87, 201, 68, 9, -239, 48, -14, -84, 21, 17, 293, -137, -64]
6006f4j41K03k21K31M2K8n8q8l50M75j41P1R8J21P4l78L91r4l1Q1m98J01K25l02
6030b25L12j94J51j10J31k98J55kj44K79k6K2o3L7n9J92k25j4J18q1J87K12m64
6053a09J05k22K28l05L60j34J50k37J87j30j56L70k34J28K0K4J00k69j12JL31
6074I6j01j79J04j28J62O6jk16J09M3J0q9K70r5j41L24m97J43J74k48K94j1P5
6097A64k16K4J6O1k29L10k74r0L02K78n21Q2J65m8pk27J08K64l19J78l1K13J52
6120C55k61m0L52l98Mj48L9K4k1J52Q0l0k50J75p3J49k18J62r2o4JJ45j40J56
6144E9N9k35J57P4j34K2k64L39Lj20L22o5k45P9k5n4P7M5j21l05L02k15J1M16
6168A82l4K35j51j15K76r5l82J92j08P9R3j81j15L59m58M46j67k12J29J80k93
$$ y = [-64, -205, -2, -223, 8, 50, 78, 20, -68, -418, 57, -84, -13, 85, 206, 280, -98, 293, 199, 168, 249, -249, -148, 77, -225, 87, -107, 44, -66, 65, -233, -78, -80, -224, 55, 29, 51, -12, 25, -34, 158, -67, -81, 37, -44, 143, 355, -109, -4, -226, 2, -303, 57, -77, 73, -164, 23, -107, -263, 107, -127, 1, 21, 45, 145, -124, -236, -235, 96, -5, -184, -80, -208, -46, 20, 19, -197, -88, -45, -35, -124, 146, 51, -90, 234, -263, -120, 54, -194, 100, 89, 164, -52, -28, -12, 49, -180, 130, -144, -234, 68, 346, -175, -93, 72, 24, 17, -210, -102, 162, -157, 21, -10, 203, 355, 94, 54, 406, 8, 12, -136, -97, -73, -94, 58, 138, 108, -142, 33, -40, 109, -109, 53, -39, -103, -102, 43, -97, 59, 118, -117, 40, 114, -20, 2, -262, 77, 80, -40, 282, 217, -28, 51, 26, -28, 49, 94, -27, -332, -30, -245, -234, 182, 148, 383, 232, 117, 393, 298, -84, 108, 0, 79, 172, -9, -124, 235, -223, 223, 56, -156, -27, 153, -140]
6189a40M36l82O4J7p3O0l2K24Km36L36j57J09n3j49J53N9j47Q6K42l24L98n49
6212b56K49L9J5Rj68O7J45J93n93qL55m9q3J3J38k65K67j68K4L85l18qJ02k81
6236a96L20m2k73KJ75j07R2mJ7J02j43j00K84k25j9J33m3j2j03J08j52O1J72j72
6260a25L05l12K44l29O5L01l31L73j74j80K06j96M19q6k6p7j09l38K25M68m23
6281a00K85l90J31K92k49J19J36p1j16k7j70J44o5k15L34j59n4L36j29j15J02
6302A9m4J43j35j80J59m1K65k43j91L25k78m9K29J14k30J47J28o4l61K96j15L20
6324B14j21k73R8J09K63l56j8L48j86l19K79j42K3K40j29J25p0l00M94m50L44
6345A73o0j79J45k15K18J6j83M8Q4J38j36M2o3O2K02n12J45mJ69p0Kn9L0M9q8
$$ y = [-140, 296, -86, -22, -5, -78, -18, -50, 174, 176, -260, 76, -81, 28, -25, -174, -21, 38, -109, -23, 219, -105, 293, -256, -7, 32, 47, 56, -112, -45, 100, 293, -300, -308, 47, -2, -85, -72, 66, -199, 68, -100, -76, 309, -9, -17, 85, -196, 124, 82, -191, -189, -14, -121, -29, -33, -16, 86, -57, -157, 127, -98, -117, 16, -27, -39, -142, -34, -186, -125, 47, -125, 180, -132, 112, -217, -152, 149, -182, 191, 17, -163, 43, -153, 266, 180, 154, 77, -32, -370, -145, 323, -100, 185, -205, -74, 218, -31, 88, 224, 153, 37, 10, -160, -16, -81, -296, 38, -121, -175, 161, 32, -83, 19, -25, 118, -17, -197, -38, -79, 186, -57, -248, 77, -201, -250, -21, 93, -137, 10, 138, 74, -287, 9, -106, 214, 93, -180, -82, 27, 290, -66, -84, 264, 78, -241, 38, -104, -81, 159, 30, 155, 85, -215, 279, -171, 173, 113, -66, 79, -136, 82, 98, -85, -37, 47, 185, 49, 91, 28, 90, 292, -220, -75, -79, 90, 20, 22, -37, -7, 42, -46]
6370d6o7K17J6j73J40k9k13J97m3J84k35j20J85k81J05K33k06R6M08l41k68L49
6392A08j54j30m6K10K03m92P75m80k40J64Qnm6J68j56J39P2J9M7k20m8K86k25
6415d3O9k19K09l5rN6k09R0L06k00J8k3l7P1o2k17K40J9k49J35NM12l32p7r6p4
6441b52J84J73nK35p19M58k6J64l38J50J47j44m25L75j07%J77j11n6J59p4P2l8
6464aj34J33r4K44l5l17L46o2p4p4J90k44%K47k80J75M6j02O3J58j95M24o20J54
6488e2K4p8K73j27j9J45j38J06k74L6J55J84m09n6L1J76Q0M7O9j88J82k80L61
6511B48p5k08j38K03J59j84k18P5L93l10L27j93K31j85j09j42O7o7J51k2o0L2
6533b5o3J23l12J12L36k11j6lJ76j30J7j87K15R4R6rj46Lk63L43j36N7m6j14K50
$$ y = [-46, -113, 104, 120, -53, 87, 58, -155, 42, -1, 183, -52, -172, 13, -268, -163, 70, -136, -40, 368, 27, -241, 108, -46, -176, -222, -12, 191, -301, 474, -6, -246, -82, -74, -79, -125, 43, -113, 26, 98, 117, 164, -56, -104, 182, -43, 26, -193, 16, -19, -28, 28, -181, -91, 215, 15, 33, 10, -27, 44, -18, -235, 5, 24, -225, -90, -85, 327, -5, -82, -178, -252, -68, 105, 100, 335, -384, 74, 48, 212, -126, 24, 171, 27, -398, -23, -130, -130, 47, -64, -120, 39, -35, 37, -1, -135, -2, -96, 148, 113, -204, 142, 80, 6, -68, 122, -122, -122, 125, -155, 20, 66, -36, 27, 185, -10, 414, -206, -52, -28, -106, 167, 40, 21, 166, 28, 134, -140, -104, 51, 235, -174, -230, -199, -23, 57, 104, 173, -15, 167, -113, 248, 173, -35, -173, 30, 189, 5, -213, -138, 255, -55, 272, 79, 310, 125, 16, -126, -59, -126, 25, 3, -57, -25, -88, 35, -277, -165, 171, -40, -56, -59, 117, -13, 4, -183, 32, 126, 222, 213, 67, 70, -193, 150, 14, 71, 25, -89, 161]
6558A61j86N9j70M06l02K4R2j68J68j18j21L97k56J82m70L89k23R1L20J32l15
6579I2j04J71j46P0M1r1J01k79m6n1N3L18j6J2O2l30N8J88L4j97j08R8j49J59
6603f0L81k68q2J37O2Lk85J02K7j76M3P5L6r0K60l48K23K16k14M9m81L37L0n5
6627g8L0J69K0j17j89J03J07j76N4J93j46N6L1j32kK57l85J84J92j70J47L5k7
6650A56j31J89j39j12p5OJ92Jj22K17l19p7P1j20L34j71Q4l7j10K1L21p5k58K39
6674H5r7k6k26K72K92k04l02J94J43k24J75k17K90k33m4j53K75J33O0k22j91J55
6696f5k53J58K22M1j01J6j05k7Q9J96oL08m47j20J40j73L37k59O1p1J49m34K23
6719a21r5J4L34j04j70J23l23L88j23J13K36j90K18m54K55J17p1l77M04J00l50
$$ y = [161, -25, 34, -136, 270, -32, -8, 84, -84, 84, -34, -155, 242, -14, 168, -302, 87, -136, -45, 275, 407, 92, -12, 159, 13, 83, 124, 33, 134, -145, -191, -242, -189, 129, 113, 125, 187, -143, -85, 103, 137, -60, -168, -70, -219, -60, 321, 53, -29, 108, 170, 173, -112, -10, 17, -159, -116, -41, -5, -95, 165, -183, 40, 256, 42, 91, -390, -53, -23, -78, -48, 121, 141, 24, -165, -62, 45, -131, -77, 116, -30, 26, 57, -75, -77, 180, -205, -21, 171, 1, 148, 183, 156, 25, 214, 75, -37, -112, -106, 86, 87, -35, 182, -137, -214, -143, -263, 71, -100, -16, -53, -163, -142, 179, 104, -154, 85, -12, -38, -264, 8, 300, 96, -206, -12, 131, -93, 82, -135, 155, -78, -122, -275, 0, 133, 193, -29, -220, -65, -318, -160, 62, 103, 2, 18, -87, -114, -25, 171, 165, 473, 26, -94, 46, -127, 210, -49, 12, -59, 90, -344, -121, -216, -202, 132, 28, -142, -19, -342, 46, -77, 36, 272, 82, 300, -154, 101, 218, 147, -230, 174, 274, -76]
6740g6l27L81L27k18j59J28k7J26J6n05K82m8J36J05K7M7k18J20l11M6K56jj02
6763Ek21N01l32k2N1q1K79o53P00k53K79m02N0J16m6L3K93l82m5j23J41M8j34
6786a98K06J6J87l66j8n7J03P2j9j30K79m57L63R8m2m50L09j9J0J42j66o4J47
6809e4j7J1J06j7J35r8R3r3k18k5j10J89L79l07K33k10m0n2L12m45K06j54L1K35
6833I0j15K89k92J21O2j2m76K57j55K00k9j70K79P0k19J1J99r7N4J6j23J26K1
6856A07P7n3j52J55k19K21R0o6k35J53j94L1l37N33l74J97J79j13M1j15l2j8J70
6879D6j03N1p2p6L24o3P4k61J04m1J35p6j92O2L20k70m1oQ1r7J86M7j80J77j71
6904d2J72l73K35Q5rK0k61K66J08m24K22K44j65j32l2Q2k15M06q7k34K1L48j20
$$ y = [-76, -403, -22, 305, 87, -72, 56, 29, 155, 171, -334, -52, -100, 36, 141, 168, 215, -3, 117, -194, -148, 108, 107, 5, -216, 285, -47, -69, -18, -99, 180, -473, 227, -26, 253, -149, -99, 17, -29, 4, 297, -85, -130, -253, -112, -64, -198, 8, 24, 211, -155, -173, -230, -127, -55, -74, -204, 75, -382, -19, 79, 37, -413, -104, -123, -113, 29, -137, -201, -54, -71, -60, 46, 29, 164, 66, 159, 66, -152, -177, -287, -98, 281, -26, 207, -3, -43, -95, 217, -228, -22, -176, -145, 90, -25, 264, -28, 93, 155, 143, -333, -76, -231, -31, -60, -230, 49, 119, -100, -89, 110, 13, 67, 83, -40, 86, 107, 184, 131, -21, 134, -85, 136, 226, 160, -75, 78, -116, -85, -422, 111, -263, -66, 113, 0, 41, -74, -106, -124, 46, -57, -6, -78, -154, 170, 107, 181, -80, 24, -17, 118, 42, -150, -88, 232, -38, -79, -85, -4, -101, 85, 132, -48, 129, -42, 130, -243, -8, 77, 68, 88, -173, 93, 201, -223, -1, 243, 78, -54, -86, -4, -219, 187, 100, -134, -113, 235, 115]
6927A15k40L05q6n6q7oL15j73N6m13J56j32n0L27n9k3J24j8Kk05n1L81k17j6L41
6952B90j99k0j86M25n20M37l11n2K25k11k28K88J70r9l00L88O1k56pJ87O3j63
6974a8n3j0J68j67J98k5j99R9K68k55L1j62j8J7K36P0l92J69M23m05l52K83k0
6997a14K39l40O6j24R5K42k64L9N47j85k39Jj85M42j53J16o7k6j63Q6qN4j05N1
7021Eq4j01J36L81n12j16K65K06k71K17n0q8J49O9p8m0k17L45k72j7J20j06J02
7044D3R7k80P6P9j3l1j06j53J88R1L2OJ01j17P8K7k70Q7M8J6o0J65k41K04j24
7069e7J89r9j48J25K38n08K56J06Ok98K05l6J77J1k7k6k00J87o1j47J53J06j46
7092Fo0J5J03n7M9k38j36J51L84o89L24L55j84N5K54m51L53k22j2M0j64K12O4
$$ y = [115, -125, 180, 94, 38, -49, -55, 260, 87, 143, -270, -114, -246, -296, 31, -28, -51, 73, 55, 57, -148, -199, 182, -35, -51, 290, 91, 71, -115, 310, -210, 227, -84, -136, 89, -122, -350, -62, 108, 9, -291, 97, 158, -98, -105, 82, 145, -18, -71, -81, 87, -80, 118, 93, -106, -7, 261, 6, 37, -125, -143, -126, 110, 180, -212, -43, 380, -25, -377, -94, -114, 125, -215, -149, -273, -178, 64, -200, -161, 386, 201, -38, -37, -222, 220, 67, 183, 116, 90, -73, 13, 5, 59, -46, 5, -79, -180, -44, 337, -175, -291, -26, 180, -91, 126, 76, -12, 137, 206, 128, 88, -129, 216, -56, -73, 47, -59, 43, 140, -140, -64, 15, 2, -29, -135, -288, -100, -9, 23, 29, 130, 13, 91, 118, -152, -65, -17, -1, -61, 104, -137, 67, -57, 132, 33, -115, 10, 248, -260, -4, 102, 108, -190, 15, -21, 156, 167, 140, 114, -86, 101, 40, -107, 46, 152, 6, -54, -39, 64, 7, 56, -182, -318, -167, 217, -472, -148, 207, 23, 78, 332, -119, 234, 12, 0, 40, -124, 88, 152]
7115A52K1k10j54R0qO0P8j75K01J33j64k81J59j90M08l6m7j74K93j98L9jP4J12
7139A82M0j17k84J42J23R0m82K80N5L1j25Q1j1Q6J13J76k88j53j24l3J25n8J19
7162c2n9M4M9m7qL6k7J66J4k06N3n0K2J15r6J72j34J96p9j71N1J8j44J18r3Q9
7188cj28N6J40q3j62rJ2L20l56K67M0j91O1j72K18r2L0m2J84L72m62M6J93l76
7212a37L4j94N81k38rj5l70N30k71L37j57j87o4J92k57J57J82n8j63J02O7J57
7234B19k71l2j07K13J49j15k8j72m4J01L03k96j1J69m6k48K3L10k26R4o0O4J9
7257HJ6J43j00N1J67l58J17J8n6R9%l2O0j47K87l13O3L5M3k26N2%j77K08n1K61
7283A68l28O8J73O6k06O7J72n9j40K57l73K18k82M60k70K11l48o9J85l7LO5l34
$$ y = [152, 173, -37, -191, -101, -109, -49, 29, -146, 55, 188, 24, -257, -98, -288, 120, 84, 37, -137, 156, -42, -3, -4, 70, 182, 222, 105, -179, -37, 86, 176, -306, -26, 29, 60, -65, 16, 5, 91, 204, 380, 92, -61, -185, -218, -93, -151, -32, -91, -47, 2, -45, -53, -17, -44, 122, 136, -70, -17, -67, -45, 70, -26, 146, 12, 208, 129, -42, 9, 27, -117, 1, -92, -3, -131, -75, 65, -18, -180, -189, -177, 143, -213, 54, 94, -97, -36, -208, 10, -82, -52, -94, 90, 462, 0, 46, 239, -137, -103, -297, 284, 46, 37, 22, -348, 182, -89, 248, 91, -96, -160, 32, -225, -68, 114, 56, -107, -5, 62, 219, -52, -84, -191, 22, 171, 56, 28, -144, -188, -87, 216, -80, -91, 78, 32, -216, -193, 117, -109, -15, -75, -11, 8, 24, 167, 67, 118, 285, -73, 44, 62, 6, 105, 105, 73, 133, -14, 273, -40, 23, 58, 101, -125, -73, -73, -250, -42, -93, 168, -160, -92, 81, 147, -59, 8, 180, 121, -19, 238, -135, 83, -199, 261, -9, 202, -146, -215, -30, -67, -64, 1, -333]
7306c33L72PJN2J77l71r6J26J89O0k14n3J68k20NnJ70K4q9J10l43K96k02L85k33
7331a7m4J27k59J69K66n57N33m61M98j57n24J89K58L1r9n1J01o9k20J92N5J88
7353A49J22l72J31J22N2l97J22P4k74K33J91k06j38K12MK35k63K8J62j42j32L29
7375B42j21k19J08m6K43k56O7M8M0j11J30m05P2J32K0o5M9L9J07j88J49%Lj70
7399a32J02P%L7j5J64k75J01J37j66On0O9J82J1k63L47j55K1n00L22J40j11J26
7423A05k77M61j09j74p0J93jn8q9J51k42j2L16l45P5kJ41l7j38j49K78J67k27
7446d3L18nk77l58K54J1L14k11J03J4j39j7J73j06q1J28m7l6j82J27r1M40j05
7469A84R9m22K51K2r2k52J55J20K18l46o5K67j89J42n8K7M7k00J85q4J7J2J45
$$ y = [-333, 39, 46, 47, 99, 276, -95, -191, -65, 124, 184, -30, -83, 85, -135, -130, -135, 35, 59, -30, 80, -263, 33, -169, 216, -17, -61, 66, -193, -24, 242, -315, 218, -243, 255, 98, -426, -237, 21, 52, -47, -98, 3, -66, -286, -94, -39, 149, 271, -101, 30, 152, 204, -193, -71, 3, -271, -38, 153, -53, -191, 21, 25, 260, -3, 25, 187, 45, -87, 242, 121, -98, 10, -36, 207, -49, 18, 66, 106, -5, 125, -280, -208, -76, -56, -121, -72, -33, 74, -114, 35, 35, 38, -132, -30, -23, -23, 14, -1, 163, -112, -11, 126, -40, -34, -84, -15, 167, 178, -85, 262, 107, 128, -372, -50, 90, -21, 105, -172, 289, 180, 6, -64, 129, 128, 70, -19, 132, -110, -122, 194, -151, -76, -78, 63, 26, -112, -261, 17, 184, -43, 275, 270, -7, -365, -111, -100, 214, 3, 106, 120, -19, -36, 137, 31, -50, 78, 31, -5, -187, -60, -151, 289, 184, 283, -139, 112, 134, 42, -210, -55, 65, 283, -63, -128, 139, -50, 92, 34, 61, 108, -92, 93, 9, 26, 38, 183]
7492A83m3l00L98k39Q7jJ60m22O8j5J37j89K51J32j68L70l95L5j13J66j52J20
7514G0j30m3M36k59J7M6m01J79K49l43J39P2J22R1k36K33m63M48k63j70J82K7
7536CK75l38L19l20M5j92kJ83L1k89P8K37m4j73L5k53L30r2J22O7j76M3M32o18
7560b97K47k92M23J13j54o5M1K7j97R6j3K13l35J26nL93m21J82J11k94j5j2J21
7583gj0j77L25k51j51M17qP9n53M91j2l53J89n0O7q8q5L86l26O7K4J26k35K30
7607I5j58N2j59O2K25k64j60K96L6k66Q5L8L4O0Q5l1K14j24O7n01J03L21j29j6
7631c5j22j56L48P0k42K46q2K09r5N4o7j74k78K91M8l5L0j84L99k0j19j70R0P
7655A3l8M8j38J75J63J61l41J71m46P9J87j39M0k31J55M6J4M7J44l0Q6j26O6k06
$$ y = [183, 140, -160, 238, -1, 86, 85, 245, -177, -109, -124, 13, -176, 75, 207, 39, 409, 14, 49, -64, 102, -50, 70, -60, -103, 333, 74, 91, 137, -264, -85, 164, -179, -40, 32, 154, 245, 9, 242, -221, 227, -36, -206, -24, 3, 278, -60, 259, -61, -16, -208, -210, -27, 4, -285, -207, 30, -14, -187, -152, -405, -75, -167, -45, 22, -154, -111, 321, -297, -50, -342, 81, 194, 40, -25, 16, 43, -154, -58, -71, 142, -193, -67, -72, 321, -100, 82, 193, -101, -116, -128, -7, -17, -194, 131, -120, -271, 146, 138, 217, -336, 155, 143, -210, -21, -71, -4, -92, -177, 209, -117, -50, -26, 100, -135, 95, -63, -11, -170, -108, 117, -147, -307, -11, 25, -241, -156, -118, -84, -24, 61, 30, 244, 120, 187, -314, -211, 110, -19, -35, -157, -313, 35, 105, -137, 109, 27, 236, 141, 195, 128, -46, -324, -33, 15, -20, 10, -174, 225, 205, 86, -84, 6, 13, -25, 23, -115, 60, 223, 384, 43, 214, -232, -153, 34, -105, -65, -296, -141, -95, -81, -34, 110, 80, 166, 40, 106, -100]
7679a00R5j0OP7j65J80J55k97M3J04k42K53J64l66K64l18J24o3R5MN1k4l1q8m2
7704a31N3l3R5L40j88Pk5l03K0R8J74k0r4L38n21R7J49J1P1j46j52J66J08j81
7728f7J57o1j33J18Om9K54l11K0p2J49R8j16l8P1Lj11L5L82k18j75P2M6j25J97
7753A32l78Q6J03K34q3k65N1K95J98k82k36K04p8J48k58J26P6n8k50L68j93j42
7775b02p2K21L05k64O4K61l65M9j66M87l64M5k75L43k87J08J64L3r1M2j97L33
7797A72l00L28k35r2J3J76j5J75k14j14K10K8p0k9m1j00J61l3k01R6k10J89J89
7820H3lr8J1k14m0P6N8r3K46j8K8J05k19J37m5L15l63M2J61k27N8j51L22R9m65
7845a95j7J96L8J60k22J48j45k0j36J47K09k80K36j52r0K32J12Lm16L92k65J37
$$ y = [-100, -5, -15, -9, 68, -97, 83, 238, -59, -16, 88, -154, 99, 263, -103, 161, -157, -33, -96, -1, 3, 54, 30, -1, -89, -131, -78, -111, -16, 324, 136, 143, 118, -185, -165, -67, 107, 87, -7, 331, -190, -93, 56, 67, 138, -8, -160, 6, 114, -67, 90, 29, -104, 14, 20, -29, 225, -86, -66, -138, 11, 109, -7, -45, 26, 29, -82, -47, 335, 117, -58, 14, 60, -65, 132, -246, -160, -57, 177, 94, -171, -120, 175, 373, 91, -145, 59, -19, 129, -129, -3, 73, 15, -235, 133, -60, -202, -274, -53, 252, -12, 52, 313, -52, -3, -169, 318, -46, -1, -276, 67, -220, -112, 52, 85, -6, 36, -161, 172, -128, 200, -35, -127, -114, 62, 47, 222, 8, -106, 104, 132, 62, 33, -8, -108, 53, 20, -181, -85, -295, -106, 83, 80, -18, -7, -221, -261, -185, -127, -220, 26, 8, 36, 141, -78, 59, 14, 329, -34, 8, 169, -58, 0, -151, 171, 270, -195, -212, -16, 22, 182, -40, 108, -37, -57, -193, -46, 163, -117, 119, -33, -123, 109, 221, 224, -192, 200, -65, 72]
7867G2k52j5L28j90K7J8k00J13p8L14o1M8l8j6j02o9nj3J8j77j3K12K47l65L73
7892A76k15N0L87m40L3N6Q4J1j19M3J2J21j79k83J83K32N2k72J17L29j5k27q2
7915E4l69J86L42j02l03M6K9R8L5p8J76J70n09n2N14j36j74KM62m55J71l51K69
7938B5n8NJ69o0K8n4p4k1K21l24J2J13N4p0N3k27O19l34r3R1j81N0J97j34l01
7963b94M94k61R3Oo3j73l6P3M28m06K50k93N13m91K75J44k93j7k83L15J23K71
7985C75l88p8J87j00J31j45K5Q3J85k82j50K09J39k62J90k71L0L4j1K38k50j38
8007b49K68L6j86L6J96n1N8L8oj56k2Pp3j03n5M27m65R3K77l66N75l68L30l07
8031f6o2L91j96J7k10J70J34j74K68m34N0J71l65K79k7J03j11K9N5K41n89M09
$$ y = [72, -180, -195, 133, -57, -30, -12, -212, -99, -177, 137, 76, 124, 86, 70, -32, -101, -106, -119, -101, -278, -291, -79, 168, -197, 176, -39, 11, 398, -42, -9, 47, 131, 142, 23, 66, 78, 199, 20, -263, -80, 152, 204, -68, 49, 378, 363, 136, 54, -315, -129, 213, 111, -192, -146, -117, -19, 16, -62, 114, 284, -225, -277, 237, 101, -73, -71, 391, -64, 107, -244, 25, -33, -28, 141, 81, 109, 55, -19, -40, 181, -143, -131, -18, 36, -34, 19, -208, 411, 77, -16, 75, -106, -56, 141, 7, -294, 200, -61, 32, 38, -25, -198, -234, -161, 267, -139, 111, -182, 331, -160, 115, 259, -34, -51, -334, -19, 104, 375, -13, -91, 96, -4, 127, -18, 7, 90, 275, -7, -157, 52, 191, -71, 119, -152, -122, -88, -99, 139, -111, -249, 19, 55, -131, -95, 101, 50, 108, 146, 140, -16, -38, -31, -104, -207, -262, 165, -300, -207, 70, -296, 279, -89, 241, -66, -128, 263, 67, 84, -126, 44, 178, 4, 272, -162, -112, 59, -306, -27, -54, 49, -62, -33, 22, 263, -326, 83]
8053H3q%r6k0k11K04j73J06K10k84K50K1J71k69J46k18J67O2j63M3j96O0J00m9
8077f4J90l00p5Q9J11J83k08j14K03j31J4J13j1%j45O4M3L1J98j33l2N5m2O4k79
8102a76J76n7J30k9j57R6M3J00k14J05j99P2M2K35N8m12J99o6j5J49m5r3K51l82
8126a89L16j33k0p5p2K20M4k95L20k30K34K5p1J68j39R1k78J89J75k23J9l56L69
8149H9M3j34J9l8k0J50k7o3J23j27r4k9o2j27L13j40K71j33j59L18k07m1J53j61
8173h3n2K58k92L52k50J80k03K05L2j98K0o8J52j54J7m2J00j75
$$ y = [83, 75, 75, -21, -41, -252, -48, -221, -115, 95, -189, 61, 82, 253, -16, 130, -88, 79, 141, -22, 21, -175, -115, -15, -64, 126, -174, -249, -160, -49, 134, -74, -188, 15, -116, -102, 11, 0, 0, -145, -81, -38, -7, 191, 58, 26, 81, 39, 103, -176, 0, -57, 73, 44, -113, -17, 26, 126, -88, 17, -182, -110, -68, 167, 225, -187, 12, -54, -69, 80, 35, -58, 193, -189, 127, -6, -26, -101, -173, 47, 91, -204, 116, -114, 120, 145, 74, 242, 103, 194, -84, 105, 280, 57, 76, -280, 89, 132, -2, 17, -21, -41, 109, 82, 19, 142, 15, -79, -108, -170, -297, 16, -124, 147, 14, -145, 173, -34, -75, 78, -83, -135, 123, -169, 183, -67, 113, -90, 115, 147, -51, -31, -99, 53, -101, -84, -126, -26, -201]
8191b01
$$ Imaginary data points
##PAGE= N=2
##DATA TABLE= (X++(I..I)), XYDATA
0@%%%%%%QqQj6J6j7K5l3M1n6P2q8J04j28J53j78K15k55K98l52M11m75N49o32P22
31C84q25R38j063J206j358J525j711J914k139K384k649K943l261L608l990M406
47B312m860N357n902O499p161P892q705R615j0635J1793j3119J4654j6451J8593
61I882k1201K4455k8653L4298m2347N4857p7169J29318m86853l71316M61895J09545
73b03289J43532L6491J82244P3478J836l5962m4727j81877o1162O8140J70172
84A48876O0471r9439p4868P7422K8094L9321O1950P791q2069j06854r854J10041
96A60882m4761j82272r8701J0680O1518P1715K3420m131j18093j78910j9002Q4603
108b33052J1059l8186k35J43012K13398J18346P9323L1171j40041j74906n3193
$$ y = [0, 0, 0, 0, 0, 0, 0, 8, 0, 8, -8, 8, -9, 16, -17, 24, -32, 40, -48, 56, -72, 81, -97, 118, -137, 161, -191, 220, -255, 294, -338, 384, -441, 497, -566, 640, -718, 807, -904, 1010, -1129, 1255, -1394, 1549, -1712, 1896, -2094, 2312, -2548, 2809, -3093, 3406, -3755, 4137, -4568, 5047, -5588, 6205, -6914, 7740, -8711, 9882, -11319, 13136, -15517, 18781, -23566, 31291, -45878, 83440, -403413, -774729, -312834, -203289, -59757, -23266, 158978, 232456, 234292, 198330, 153603, -28274, -89436, -21296, 148876, 209347, 109908, 35040, 112462, 140556, 179877, 241827, 249618, 167549, 60695, 50841, 160882, 116121, -66151, -164852, -154172, -92654, -20939, 2481, -1650, -119743, -298653, -317655, -233052, -221993, -260179, -260414, -117402, 95996, 214342, 293665, 324836, 184795, 9889, -43304]
119d3304M3839L1819p7924n9340Q1508P8398L1289L3078k3839p9099q5803m766
131g4144J40046Q8504p9806q0089k1756n458q903k9553K104m862n4372O0278J71845
144A03834P3880o2617j19762o8280J1973r723R153P2166J1075k4189M4166Q3181
156A24857M5323r2612j69040n7466J0081k391M4160N7879J9092j5668m413R5330
168E5132Q9795n5728p1011O469L0933L2095l106k3957m1042j11160n9440Q1360
180f9660Q2899J5939j3752J0250O7443J9598m9080k5011o7487j19197l8132O5071
192a21119J09108N0110l7534Q528M4516k1138k3539q818l4575l4184j2679P1238
204a0086J20446M695p0616k9224j3660j0581j4713q167K7481j2770k6418P0076
$$ y = [-43304, 535, 32354, -45570, -104910, -23402, 54996, 86285, 119363, 95524, 16425, -69378, -74144, 65902, 154406, 74600, -5489, -27245, -32703, -41606, -71159, -69055, -73917, -128289, -68011, 103834, 177714, 115097, -4665, -72945, -60972, -70695, -61542, 10624, 21699, -2490, 41676, 124857, 170180, 77568, -91472, -148938, -138857, -141248, -97088, -39209, -20117, -35785, -40198, 55132, 144927, 89199, 18188, 24657, 55590, 87685, 84579, 60622, 19580, -91580, -151020, -69660, 13239, 29178, 15426, 25676, 93119, 112717, 63637, 38626, -28861, -148058, -186190, -121119, -12011, 38099, 565, 9093, 53609, 32471, 8932, 114, -34461, -68645, -81324, -10086, 110360, 115055, 44439, 15215, 1555, -9026, -23739, -31906, -4425, -17195, -43613, 26463]
216B6463P1272k3864o9049n7947N053K6461n011L5000L6714m1210l5458J3920
228a7656L0332K523o4586l3464N4284L5676J9069L9032M321l5273n5560j8914
240d0216N4475R436n4099p07L2647J7300K024j9711q734k7966n6811K4429Q2960
253A5027L6365J095p448J1916J5602m3224m0073n46l9221m0804K3718O1641N2693
266D6741j1999l2642J9641K043l1694L493J1490n487j5152o255M2983K4000n2936
279e774l5289P560O765Q028N890K4391K4225l1810j6539L4313r75l4184k1814
292c5213J2047M0336R160l653K8742j0264n6279l0476l417J0265n747j5584M3139
305a6944N6494Q527J3925J8741r985l5533m9186o708J7628l1907k4473K5315J6659
$$ y = [26463, 97735, 73871, 4822, -53125, -48072, -21611, -26622, 8378, 45092, 3882, -31576, -17656, 12676, 15199, -49387, -82851, -28567, 7109, 26178, 65210, 69531, 34258, -21302, -40216, 14259, 23695, -30404, -31111, 1536, 18836, 20860, 1149, -7585, -35551, -92362, -67933, 15027, 51392, 52487, 45039, 56955, 72557, 29333, -10740, -11286, -50507, -91311, -67593, -5952, 46741, 34742, 2100, 21741, 23784, -7910, -4417, 7073, 1586, -13566, -19821, 23162, 47162, -5774, -41063, -33503, -26738, -18710, -12820, 11571, 35796, 3986, -12553, 21760, 20785, -13399, -35213, -23166, 17170, 26330, 22677, 51419, 41155, -15124, -45600, -49017, -38752, -44499, -60083, -16944, 39550, 48077, 62002, 80743, 70758, 35225, -13961, -20669, -3041, -34948, -59421, -34106, -17447]
318a7447K315k611Q798K8209j0245j8613L0655J5906k2021k1589j3114P732p478
331a9503k6547K3496L7266l347M319J9582J4947p487m1572j3715J2107k6010j6499
344d2963K4621K2763J0569p755m84K3163j4781l2465R682R313r593j1186l644
357b2760K3389L705l2273M075J8456j0008o87J6486K6620J4873k3116q85K3983
370D1858j7377k5843l825P65M989q727Q36K9595o553l2775q95P882M1j1350j2925
385c4304K0324J3435j2411J9305K5620r826k1514j5574J0224J2597k3367q446
397b3937J7347l138r33J6121J8519J2264k0421j6312K1992K468k4197j1780n909
410a7916l43l106J506L3510J5732k1825M40J8448N350j0631k6893j0607o46j8617
$$ y = [-17447, -15132, -17743, -8945, 19264, 9019, -9594, 21061, 36967, 14946, -6643, -19757, -12025, -19503, -46050, -22554, 14712, 11365, 15684, 35266, 50213, 42726, 1154, -12561, -454, -26464, -42963, -18342, 4421, 14990, 7235, 6751, 29914, 15133, -17332, -7650, 1663, -7930, -19116, -22760, 629, 4334, -27939, -23864, -5408, -15416, -16103, 383, 27003, 41876, 18760, 17875, 41858, 24481, -1362, -5187, -4422, 567, -8160, -7324, 22271, 15718, -17057, -17952, -10070, -10029, -21379, -34304, -13980, -545, -12956, 6349, 31969, 22143, 629, -14945, -4721, 7876, -15491, -23937, -6590, -9728, -10661, 5460, 23979, 36243, 15822, -490, 21502, 23970, -227, -12007, -17916, -18259, -21365, -19859, 13651, 29383, 7558, 7998, 26446, 31796, 21165, -5728, -16335, -16981, -35598]
424c5598N473K8917L253j2016q121J2366K7182p912k0168M814n665j1435P043
437a1867J2248Q358j8288k4442J8462K0942o906l58N615P995J0467O053K4401
450E2680J6329k8623k4353N43j769j0462k7294j8597M786o025O854L6219J4214
463A4502j2599j4371j164J8621k906k6477m307j517o252J5818K3064J6757l478
476A5691k4754M157K2826l612q235r61o6R053O421J8525K4871j6983k8701M48
490A8680L160n150j9901k6674p611r796q139K3784J7443p562o263N301K7930K3618
504B8820j1500q082j274j4015k42J3654R791k146k3677o299K4709M427j1570o650
518d054j0303k189M728J2079K5365j119k4446n64J1271M263n893j9737p193J426
$$ y = [-35598, -30125, -1208, 2045, -9971, -18092, -5726, 21456, 13544, -6624, -1810, -7475, -18910, -11867, 381, 8739, -9549, -33991, -15529, 5413, -1493, -1851, 3764, 11759, 22226, 28279, 52680, 69009, 40386, 16033, 16576, 14807, 4345, -22949, -41546, -36760, -42785, -35931, 288, 14502, 1903, -12468, -13632, 4989, 2083, -24394, -28701, -30218, -36470, -20652, 2412, 19169, 15691, -9063, -4906, 17920, 14308, 6073, 5112, 5046, 14099, 20520, 39045, 63916, 46933, 18232, 18680, 21840, 16690, -3211, -29885, -37496, -47292, -55431, -31647, -14204, -21766, -28029, -22728, 5202, 28820, 17320, 9238, 7964, -6051, -6293, 7361, 17152, 15006, -8671, -14970, 9739, 14166, 2596, -4054, -14357, -16546, -11818, 261, 25626, 24507, 61, -503, 10768, 15031, 9138, -10599, -17792, -16366]
532a6366n568J6455K0910r053j7766p152J5119K4919O14l124R415l607k065Q467
546C1198j607j7791l6648l1422P398J1268p37O931O854R282J2849J0178J7924
559B5677J273k9689j3712R544Q170L605q338m657O691j20J3642K5990J471j3516
573B6031p944L180J4986n638k1821r903j1069r537R483J2113L401j4501k3229
586c4448L235J1230q615o611j959J693J3167J6856K5560J8400j4626j5055L498
599A2325K222j738j0190j1385M834K589N214K1726N390j5198j2555j544J3390
612A5080O904j3243m976m740j3622k76M793k875r658j6981N169K6627J1215M321
626G738L442m995j328j137K789R151j1496j7435P542J2515N544k291j1350l045
$$ y = [-16366, -21934, -5479, 15431, 6378, -11388, -18540, -3421, 21498, 22112, 18988, 28403, 24796, 22731, 31198, 29591, 11800, -24848, -56270, -48872, -37604, -38341, -31410, -24556, -15274, -2425, 7753, 25677, 26950, -2739, -16451, -6907, 1263, 4868, -3470, -8127, -1436, -1556, 12086, 38076, 39547, 26031, 18087, 21267, 36253, 30615, 8794, -1109, -12178, -21715, -12232, -119, 3282, -11219, -34448, -31213, -19983, -28598, -35209, -37168, -35475, -22308, -5452, 20108, 38508, 23882, 8827, 12325, 14547, 12809, 2619, -8766, -3932, -1343, 3871, 25597, 30987, 15789, 3234, 1690, 15080, 21984, 8741, 3765, -975, -14597, -14873, -10080, -12955, -22613, -39594, -34425, -7798, 3417, 7738, 11180, 6185, 4857, 3720, 6509, 15660, 4164, -13271, -5729, 6786, 12330, 10039, -1311, -4356]
640d356k219m831J4108J1113r509p538p12P807Q642j1103j0202O70o820K122J3160
655C32O690j693j4482q726J3721O293l017M903L046L672P405N153P745p998k6303
670c259r802K723O81J090l558K007Q207o16P013J0904q951j2466n011M574J1249
685D785l038q593J747o180o542P763N733J317m062l648J3697J2497l622l166n556
700C132p723k130Q08R718R668p704m55J1185M116k243q346r033j346n970m36J2195
716E436Q49q649k712O14O612j275r889M77L1m819M839N615P1n337j1140L299J2226
733c752K81K507N913L01J397j67J774L486j1062r750O415N714M195K525k178K709
749A0308k436p115M437R91q990l209K311P666N790o541j619Q75q874j974M587
$$ y = [-4356, -6575, -11406, 2702, 13815, 4306, -3232, -3944, 3863, 12505, 1402, -8800, -8130, -14950, -12828, 332, 7022, 5329, -9153, -17879, -4158, 2135, -882, 4021, 7067, 10739, 18144, 23297, 31042, 23044, -3259, -13061, -10338, -9657, -8567, -12125, -10118, -1911, -2527, 4486, 15390, 6439, -6027, -11038, -6464, 4785, 1747, -6846, -5099, -11279, -17821, -10058, -4325, -3008, -7070, -10718, 2979, 15476, 11854, 8688, 3132, -4591, -6721, -5913, 3805, 13473, 5769, 5314, 16499, 20615, 18372, 10026, 993, -353, -6323, -6759, 5436, 6285, -2364, -5076, -4462, 2150, 875, -9014, -8537, -8506, -13325, -8486, -2871, -2800, -8137, -19277, -15978, -3752, -3471, -964, 4949, 5250, 6647, 6480, 8254, 11740, 678, -9072, -2657, 3057, 7252, 9777, 7599, 10308, 7872, 757, 5194, 6185, -2805, -6014, -3703, 3963, 9753, 3212, 1593, 2468, -6406, -8380, -3793]
764c793L64j32o042l96J0052r13m729K091j643N96L963L109R893n39j0536K96
780A641k8n718l709m636K594N190n12Q959J0589l251l456j413j103J320o605m289
796d427M308k416j453O050J739k11m194n058O497J985n966J117n46l256n68j437
812g836N151L973n282L754Q171Q9j73k253l074N19o589k291P075J17j857K954
828B448K201K852l796p176R18k623o193L513M178J878Q18k561L677L822o722j093
844c859J422j983J667N33M234O462l806j916N356r88k275n13m22K986k875m631
860f08L803j310n935q43m80J098Q59l312L744L482m459N46J901r25q8l270J494
877d303O277k820j126M149m8n90l97L74N463q11l361M421M09l723j287k430P26
$$ y = [-3793, -3429, -3561, -9603, -9999, 53, -860, -5589, -3498, -5141, -4545, -582, 2527, 12420, 11881, 1345, 1641, 1613, -4105, -7814, -12450, -9856, -4666, -5178, 3781, 14370, 11119, 7663, 6250, 5147, 6467, -138, -4427, -119, -2535, -3988, 2062, 3801, 3590, -604, -5662, 835, 2820, -3146, -2029, -2575, -5831, -6399, -7836, -2685, 1288, -3994, -240, 7931, 8020, 7847, 5594, 2520, 3039, -3550, -5841, 1234, 1351, -506, 2448, 4649, 7501, 3705, -3471, -2553, -5176, -11369, -7856, -3678, -1800, -982, -3543, 134, 3956, -2766, -3859, -2437, -4420, -2753, -2220, 2014, 8476, 4670, 2754, 8110, 7122, 4847, 4334, 3912, 6898, 4023, -608, 3195, 1885, -4050, -4893, -5373, -4275, -3416, -6728, -2984, 498, -3961, -3415, -1514, -2439, -2527, -5797, -4303, 1974, -846, -1972, 2177, 2129, 1539, 1142, 1516, 6979, 6168, 2807, 7228, 7637, 3914, 2627, 197, 923]
894I23r84n534K925L468l450K87L17r86k10m859k5N885j950NN096J417J232j500
912B057j694L393k196m457L808J401p38J522j381L504P99n941J190J432l473j03
928h77O90K098K729l880m84M588l655j981J167k211r4k837k618M519o67l732K728
945d517O22M98R33j615L539J260m773K150L107n47R44k36K360M519l115l52K782
962G559l613k301Q8j44K599j949k149M624J87k478Q86j975k020k557m539K420
978e362J840m302J170J818l25J679j671J763K463l859M51M237l94R85J40M80M286
995E399q40j399M062o76k385J115r29J622j713n504J960O56l507N18L71n92j72
1012b014k783J618L323l571l87K141n01J239n3K87L144k035k421L572k17q63o57
$$ y = [923, -61, -5595, -2670, 798, -2652, -2365, -2048, -3034, -3244, -8103, -8128, -2243, -4193, -4188, 908, 2325, 3557, 2057, 363, 3756, 1560, -2897, 911, 2312, 1574, 3096, 1715, 5219, 6018, 77, 1267, 2699, -774, -877, -187, 1911, 4640, 760, 276, 4864, 1209, -772, 395, -1816, -1910, -4747, -7365, -2846, -3513, -7245, -4517, -3895, -3397, -2464, -4079, -540, 720, -4053, -1903, 1204, 657, 1601, 1365, 3725, 8244, 5129, 4777, 7559, 3946, 1645, 1733, 1589, 4188, 2239, 90, 4714, 4901, 2423, 3309, 1334, -686, -3243, -7782, -5362, -3522, -7824, -6654, -4836, -5161, -3482, -5153, -3390, -927, -4786, -4335, -98, -492, 493, 633, 1113, 5399, 4559, 3160, 7222, 6546, 4161, 5276, 4347, 5969, 4256, -1248, 712, 1368, -2139, -1621, -1250, -1842, -2014, -4797, -3179, 144, -3427, -3814, -1673, -2174, -935, -988, -701, 2443, 408, -2013, 1559, 1342, 479, -178]
1029a78j001J864L33l327L015J081k682J215O47J193R26l755M33K337l211J3P42
1046c55r13O42j505O04M927j160j805K284r73n32j91k342K380j054l941K705J454
1063B25j731J147j375O84J784l056O05K366k780N17P17N97J978j696r00L318o74
1080A726j412J932q41r3r74j640L179N30l076J437O63j337P35j320N19J151m116
1097b937K82K198j577M8J03j45K500j324j061L977j389j175J648q1J371q46k337
1114g45K617N90k312J250k48j164N1k317J421J419l217J09J130o04O81K3K23K686
1132A593j992m82L001o54l31K10r01J521l30k348K526j22k208J126l43K71K38
1149G75k510J266J684k335L19J024r13M49j432M99K656k241j052J589q22LJ84
$$ y = [-178, -1179, 685, 1018, -2309, 706, 1787, -895, 320, 967, 2160, 3086, -669, -236, 2101, -1110, -1097, -355, -1268, -626, -2131, -1527, 3400, 2240, 435, 2719, 1746, 1214, 1023, -1319, 1061, 7, -3934, -1229, 225, -1506, -359, -1734, -1050, 734, -2322, -1717, 649, -2131, -1614, -897, -300, 1678, -18, -918, 2400, 1726, 314, 2246, 1405, 1312, 338, -1302, 1877, 2407, -669, 768, 1431, 94, 829, -491, 28, 1179, -2937, -2655, -457, -2034, -1986, -1883, -2028, 472, -852, -1913, 2064, 675, -500, 1148, 1067, 2438, 1592, -745, 1872, 2462, 150, 1400, 1152, -12, 39, -2278, -857, 562, -2655, -2546, -1416, -2020, -1339, -1316, -1093, 1593, -399, -881, 2120, 1466, 1135, 1345, 444, 1965, 1635, -713, 1813, 1691, -517, 609, 266, 537, 775, -1735, -469, 1215, -1120, -801, 223, -690, -241, -1673, -1174, 1482, -759, -1811, -222, -1044, -1041, -857]
1166h57n79J949p94j921K468Q05j040P85n51J170Q44k515J391J115k142K34qm26
1184g2P44k049k45K089j519l62J686j060P40j66m77K612k43k061J947n09r36P70
1202H89j187Q90K37k910J270J195j745J88N4n3Q82j250k20K655j474j10J240l79
1220A72Q84m81j181K466n83j837J598n68j59M05j486J955O54k499O63R26j117
1237a88L04j87R1J192j596m00K236j117l92M52r37Q14r39j299K041o14j423J344
1255f18l31K37J85q37J534L53k023J319O33o92N34n94M36J633k007j6J697q35
1273F08j90N87o95J704p15j156J597k29j252M12m90o2l16j631J436Q96j693P68
1291d21J15o27L10j322J48J397j951M92J719l41M90J50l08J832r19j392J852j068
$$ y = [-857, -1436, 513, -281, -2202, 266, 1071, 31, 816, 265, 1435, 2279, -236, 1155, 2270, 128, 362, 354, -72, 672, -1377, -1622, 467, -1052, -1414, 272, -788, -48, -214, -691, 1921, 1678, -383, 1564, 1055, 119, 889, -298, 592, 829, -2081, -811, 384, -1361, -1173, -1119, -1172, -290, -1540, -1760, 895, -579, -689, 551, 172, 1056, 575, -606, 1860, 1277, -560, 1038, 470, 311, 716, -770, 1185, 1839, -660, 3, 929, -188, 116, -71, 20, 1212, -384, -784, 1452, 335, -57, 395, -542, 272, -667, -1966, 75, -539, -1962, -618, -949, -712, -527, -1364, 170, 523, -1500, -181, 452, -240, 294, -300, 136, 1769, -238, -254, 1443, 608, 418, 1005, 310, 2014, 1299, 143, 1740, 1511, 259, 671, 181, 119, -197, -1828, -392, 504, -1189, -421, -306, -933, -623, -1945, -1797, -400, -2351, -1859, -140, -481, 9, 159, -149, 1683, 764, -628, 1224, 156]
1309A56n76J093k20J130R7j110J203O22j469J82p41m78K53k266P47J791j490j63
1327a239J471o95O40n53o69J277j172p94J411m2M47P05m40J632l0j785M00m32
1345A32j743K46o19N45R84j417J036J907j046N79K98o70J065j201k73J771j044
1362E50o49R28k09N6N9j128Q72M11j444Q98K66n40O73r71O77K40j334J74P92j118
1382g97J06M2q27Q04j116l83J344o39K51R87j84P76N28r67J419O31j066Q48k30
1401A527n65L44j221O02N69j412M52P33m10l2m22p92M88j659j125J244o01K81
1419a999J146n7J603J22j226J179r7j413M47m47K45P10j67J189Q97j204L90M63
1437A781j058M33q54j54P21p97k07Q55l08L46r7m39j58p36j459Q90m89q10N07
$$ y = [156, -420, 673, 453, 1583, 1680, 570, 1773, 2395, 926, 1108, 367, -111, 142, -2124, -1377, 414, -1076, -1239, 232, -463, 177, -376, -1045, 232, -940, -1734, -323, -365, 82, 787, 347, 1979, 1949, 164, 564, 132, -1611, -1365, -1984, -1439, -455, -1872, -836, 1071, 25, 604, 902, 232, 1297, 96, -177, 1594, 550, -99, 829, 620, 676, 735, -393, 479, 890, -554, 344, 610, 70, 743, -228, 449, 689, -645, -471, 321, -797, -691, -649, -1476, -672, -1788, -2171, -827, -1466, -1215, -228, -412, 364, 892, -75, 1344, 1975, 909, 1757, 1527, 962, 1306, 85, 687, 1256, -156, 296, 1029, 619, 587, 165, -627, -139, -1798, -2923, -1679, -2280, -1999, -853, -910, 693, 815, -411, 768, 671, -742, -295, -742, -497, 213, 46, 1235, 2132, 928, 1318, 1781, 723, 1156, 302, 148, 869, 72, -135, 720, 412, 758, 661, 222, 64, -672, -2131, -1241, -1730, -2540, -2033]
1456b033k01N91Q24m43J314J131j306N62P1j227P86j040K93J840m19K84R63j14
1474A876K89k02j184P85n99j340R47J46l58O06p71j84M57j442K54K80p68L55j10
1493i63k49P34j038k35R80q21M2O45J31P88Qn07R76j99r19Q38N4O1R67k47P61
1514A807K02j454J69K34j226P20m43n7J032o70N2P39q16o26M47r19M29k28n86
1533a194Q69k70n80P70l34j3O63m73Q78R43j104L31Q4j197J79m97r8R88n04J36
1553d23J045r6j92J6n28K43R3m13J056k7k92P00l40j67l96p57J58J32n92Q00n0
1574c0J42N70o11O4L29n17l49J048k12K57o5l97L83j042r98K22O0M51O69N3L14
1595C41K74j063QL33r82K39K80L48Q17kM39L22j100j04l2m75j51j16j32R96j99
$$ y = [-2033, -2234, -1643, -819, -1262, 52, 1183, -123, 439, 510, -717, 69, -971, -678, 1162, 743, 1027, 1990, 1876, 2165, 1963, 779, 1564, 965, -375, 572, 718, 360, 966, 195, 11, 468, -974, -720, -440, -1208, -853, -963, -1212, -478, -1516, -1751, -771, -1592, -1550, -905, -774, 14, 22, -485, 491, 292, -627, 211, 265, 326, 1293, 1046, 1807, 2009, 555, 724, 958, -268, 452, 9, -48, 984, 314, 366, 1105, 289, -337, 110, -809, -380, -608, -1194, -325, -595, -1175, -405, -739, -752, -89, -562, 316, 1259, 155, 486, 570, -627, -448, -945, -1043, -55, -559, -423, 622, 526, 334, 350, -178, 65, 158, -255, 801, 774, 482, 1182, 842, 675, 279, -478, -320, -188, -780, 20, -30, 112, 682, 71, 135, 464, -53, -402, 646, 434, 691, 626, 229, 612, -430, -1428, -1206, -1146, -695, -26, 27, 341, 615, -448, -440, -107, -1089, -850, -570, -222, 595, 593, 1032, 1354, 254, 150, 118, -357, -508, -624, -756, 240, 41]
1616D1l55N49k27l02O05j88P58K01p37M11k25l76k09o9o78M04lN49M99n92j58
1637a02o2p71M30l99k5R34M19j03P51l47o16k05r33L20Q1k58R95L77k54Q05n85
1658D52k55J10j098L95L96j93R64M0k1k8m69p61O65o72k32O17j66O86J76n23l1
1679E2n65l86R6L44j54M28j01K40Q94p86L48J82l59J53P4J1M6m60m51N78p95K20
1701c91Q34m56P18J60m54N55l47q46o46k37r6N52K13M12M02m91L65m29o18k22
1721a022j3O4R93j90M79R92m36l05l0p05Mj31n21N19L39M76L76k49j57M29l98
1742E14rK27n97j73K06l04L5m76l91k44m8O34M07N8L29J34m50M27J11o57M87l95
1764a75n7M70k82R2K01o30J02L94j02N71k79J7M19l79l58L26m92l05K14j58P68
$$ y = [41, -314, 235, 8, -294, 311, 123, 881, 1082, 345, 756, 531, 155, -54, -123, -801, -397, -400, 149, 648, 56, -102, -164, -935, -505, -904, -929, 5, 424, 321, 1072, 725, 109, -96, -1029, -709, -628, -886, 109, 486, 232, 1037, 452, 197, 307, -791, -396, 0, -193, 771, 811, 790, 762, 293, -468, 197, -475, -707, -90, -256, 430, 606, 83, 52, -513, -899, -803, -459, -613, -185, -286, -46, 848, 62, 410, 592, 233, 386, 460, 471, 517, 57, -394, 184, -611, -391, 443, -13, 705, 865, 411, 966, 619, -227, -873, -1110, -1206, -654, -441, -29, 373, -118, 247, -182, -800, -1022, -1035, -971, 22, -168, 311, 1303, 867, 562, 532, -173, -169, -300, -821, -302, 37, 513, 889, 640, 483, 912, 514, 505, 732, 135, -38, 168, -136, -101, -577, -968, -1212, -1260, -626, -219, -161, 168, 302, -148, 279, 390, -267, 220, -175, -232, 238, -44, 48, 249, -381, -279, 115, 13, 584, 305, 322, 741, 362, 4, 330, -162, -467, -253, -411, 357]
1785C57R1j67M65p02o02nR0l43K69k04M61R42k51M75l1p15k51Kk92L34j88P2O09
1808D16k0O4O8n39p3j16n10M34l41k13M98j70M79N21j89J72O0l53K92k49m50n3
1830b72m32K21K07J59L43O13n00J75L1j55p9o15n72K71N8l19N55K84j64K00J0
1851A9K52O6n19L65k33J93Pl50q6J95m0k54N47r7J35j54p0M32j89j83L20l47r3
1874h4L52l53K86J48l18j30L94q81L49l2r9k21J37L46M45k32l4L24Qj08l4k42
1896B1o3l63j31M94k21j62N58J09J10j6j82J08j45p1l1m17P5J27K9J61L04m9K86
1919E31k01j65j5l94K8n9l53j20K44J50K79K55j16m2J53m24N62j80l76N3k65L97
1941e8J61J47k24L20j60r2o5q3P2k47L18K02k50N4J17q4L42n85m3K28l52j15K01
$$ y = [357, 448, 281, 746, 44, -558, -563, -473, -816, -547, -751, -290, 652, 401, 876, 845, 130, -121, -119, -411, -77, -265, -193, 416, 396, 460, 528, -11, -84, -200, -710, -276, -617, -830, -332, -502, -23, 498, 309, 481, 541, 188, 480, 231, -219, -272, -704, -483, -276, -117, 226, 839, 339, 514, 545, 390, 311, -304, -876, -605, -547, -866, -311, -27, -191, 9, 19, 271, 337, -182, 183, -50, 143, 150, -200, -286, -91, -131, -385, 162, 65, 200, 46, -24, 408, 219, 36, 356, 9, -84, 268, -85, 201, 349, 31, -99, 295, -586, -237, -269, -368, -589, -452, -106, 339, 107, 73, 397, 405, 297, 263, 21, -42, -405, -536, -42, -263, -425, 133, 242, 352, 336, 154, 262, 117, 46, 15, -402, -327, -200, -171, -10, 294, 245, 531, 330, 165, 150, -244, -216, -275, -628, -748, -504, -354, -75, 180, 64, 22, 175, -249, 313, 133, -243, -190, -455, -58, 103, 250, 26, 346, 186, 94, 29, -54, 18, -229, 89, 291, 41, 95, 212, 128, 470, -115, -158, 70, -282, -397, -196]
1964a96j05K93k53K01k8J00K09j87K62j0l2j1q9p9m08j61N10k09L8K64k1K06P7
1987C71n46n6M15o80L60K0p5M29o68L23K58m57LK17n2M7J29k05N52k7o6J78m02
2010F8J63k27k40M72Mj77r0J00l23j18J36L3M08N6l53M28m11oJ53m43L06N9k08
2033b10L01K69j17j30q8r6J30m35J34J30k41K7K59J49K30k41L5J7L3L15q4J29
2055E16k08l79P5k16j76j3K56m44R2O21j29M39k88j86M8k19L5J93m0l0K97j08
2077A36m44K88n87K49j96M52K5K32P1M38m90K89j13l33J70j17K7j24q4R5J98k88
2099a06N8J05o6K75k74M2n8j6j17J15j77j38j67K98J49N30m23J84K45k22n35l5
2121c33m1K6K28J08J43r1K33K2N1j76J28j68k28J86N3l2J39j41p3l30J4J30j52
$$ y = [-196, -301, -8, -261, -60, -88, 12, 221, 34, 296, 286, 254, 243, 154, 75, -333, -494, 16, -193, -155, 109, 88, 294, 371, -175, -231, 184, -496, -136, -116, -191, 238, -430, -107, 151, -306, -303, -86, -138, -91, 38, -167, 385, 358, 292, 470, 68, 231, 4, -236, 236, 240, 63, -27, 73, -250, -368, -232, -199, 209, 265, -88, 340, -71, -77, 76, -367, -61, -2, -210, 91, 360, 243, 113, 25, -71, 59, -376, -242, -112, -353, -326, -67, 82, 312, 71, 106, 123, 156, 471, 387, 516, 308, -71, 4, -212, -388, -401, -145, -589, -497, 124, -5, 434, 146, -40, 8, -211, -176, 17, -23, -53, 244, 136, -308, -20, -607, -358, -554, -102, -77, 155, 226, 664, 174, 463, 350, 17, 187, 70, 97, -27, -111, -16, 182, -106, -48, 57, -9, 266, -8, 34, -24, -40, -157, -42, -219, -357, -524, -226, -77, 453, 30, 214, 459, 237, -298, -333, -374, -348, -120, -12, 131, 40, 273, 295, 346, 170, 298, 130, -98, 88, 141, 109, 248, 107, 34, -296, -282, -152, -304]
2144c04J02N23l95K85jk00r4J66m08R8Q6J75R0m65L16j33M9j7O6n8J88K31J9l14
2168EK10p3k71j69J26p7Q7L44j37J09j26J2L19l43m8p0J66N8k5Q2k53P8l1k05
2192b32qj79jM66l22L54Q9k54j76R5L7j6j75K18M1J30Q2N9k19J30k50J89NK26
2216B89k10k02K41J5l35K03J3r9j08K36J05j74J65j85K4p1k72J43K01n6Q4P9K44
2239C30o2qm21q5K25P6l43K57j64K74l17J64j09j18K29n8J39J72m4k35k2L10k94
2262a04j8J06k55M74r8j00J4J70r2l37m4M41J33m5o8k14R6Lp7R5M2M3l0j73K38
2287B00j48k63M17k62r6R6qM2N4J66J33k62k48J58R7k61K14j36N8K77J3k9l80
2310a68L07l16M9K43r5J91l52J70J86k8r5k62L15J08j03n6R8j05j66K07k09O4
$$ y = [-304, -202, 321, -74, 211, 210, 10, -84, 82, -326, -228, -142, 33, 123, -342, -26, -159, -110, -127, -61, -119, 69, 300, 319, 5, 215, 142, -129, -298, -172, -249, -162, 182, 45, 154, 28, 40, 359, 16, -32, -102, 64, 122, 97, 179, -74, 4, -27, -232, -240, -419, -420, 46, -276, 78, 167, -87, -263, -168, -131, -147, -322, -104, -63, 67, 149, 208, -11, 119, -131, 58, 63, 289, 79, -123, 118, 133, -202, 1, 14, -85, -193, 43, 148, -26, 139, -46, -22, -93, -365, -222, -21, -77, 7, 86, 330, 268, 260, -161, -246, -21, 55, -288, -31, -195, 79, -238, -74, -183, -301, -72, -130, 9, 181, 137, -98, -120, 190, -104, -122, -16, -271, 203, 105, 5, 19, 189, 97, -240, -284, 157, 290, 245, 177, -37, 59, 62, -15, 80, 122, 165, 135, -38, 200, 52, -211, 206, -56, -152, -56, -64, -22, 32, 198, 331, 69, -179, -21, 76, -185, 29, -107, -49, 228, 241, 212, -168, 139, -177, -128, 115, 20, 211, -141, 29, 215, 187, 92, -170, 145, 253, 150, 94, 192, 87, -79, 128, -81, -17]
2332a7K48k73R0M1m3N9k36q1J39M69j87k24N4M0j36j3K56l25Mn1k09K24J55J57
2356A41J84k94K32k14k06L8J05l18K11K52p7j58J9L86k72m2K2J38r8k2o9L51j30
2379A79j59n6k19k7J34L57j56M3j25L7Q9q1l24J22L05j08Q7p7O9j82M2m6m7J63
2403B0q3J07M4M18k72l04L13k27j78J7k63M64r7o6L03k60L32j28j63l67k6P0K28
2426a18J28J57p7j67m6M10m27K13j93L51k93N15l97p6J04k23k1O4k44K67L38k66
2448aJ62k95J78M6j23O4P0O5q4o5m5P7k84J10J70k9j34K01k62M36l3j8p7l23J83
2473a1l32n1n5K20j47K3M0M11j67J74RK01j25N9N1k40j72j21j4J56o8j96K05L79
2497B29k38N11k83q1q3N2l12ML19r8l5M09l01k7j24N0j10K7n0rR2l1J34n6j62
$$ y = [-17, 231, -42, 48, 89, 46, 105, -131, -212, -73, 396, 209, -15, 39, 79, -57, -70, 186, -139, -135, -186, -395, -171, -16, 141, 325, 31, 263, 49, -157, -119, -14, -332, -121, 131, 54, -104, -85, 301, 29, -13, 9, 147, 49, 27, -42, 309, 179, 20, -36, -255, -282, -148, 209, 53, 96, -29, 8, 97, 16, -308, -186, 119, 11, 98, 21, 90, -92, -50, -96, -143, 20, -63, 44, 88, 506, 234, -70, 243, 16, -162, -145, -408, 56, -41, -107, 196, -64, 268, 140, -23, -390, -416, -346, -118, 10, 167, 90, -77, -123, 287, -140, 73, -120, 231, -62, 453, 56, -20, 84, -139, -160, -96, -340, -73, 265, -1, 161, -134, 44, 90, -33, 31, 101, 166, 82, 17, -28, 49, -235, -125, 45, 16, -118, 83, -179, 257, 224, 206, 129, -194, -11, -343, -394, -449, -229, -376, -353, -313, 98, -69, 105, 114, 315, 190, 249, 300, 60, -112, -233, -247, -91, -159, -355, -150, 229, -9, 502, 219, 138, 55, 107, -205, -201, 118, 20, -15, 394, 93, 66, -58, -8, -118, -91, -141, -150, -58, -89, 45, -11, -173]
2522a73n2K96k62m3O23k08j61K37k59K59J7k75J62L05l47Qr6qk6J58l47J0oL44
2546A56k03J54J10k08N7j33J04j7k38N1J2J61Jj25L00k82J24Jq4K62l0J10j93
2569I0j5k62L12j90j75L85Nk1k6L8L74l49Q2j41l77K26j43K64M2J80K2j4j49n1
2593A07j10m56L25p5k01j46L29j4l5J50K0K71q6k83L67k56J03K30p3j42K50k08
2615F7j23N24l73o1M02l45k31K2K19l6j25K01k92Q7J59k25k32r1N7k64K16R2j7
2638c69J87m2M68o4n5K08j51%K37n64J69O6K5k35M3Q9K27m51J62K80j13j70L73
2661C20j44j39j24J17J28pk21J75j75k86K36l71K39K00J78j34J7K46j60J58l56
2682a03L39P0o8k27k08q6R2k45J61K66l14J79K33l07L41j5l20K60n1j46J19J40
$$ y = [-173, -225, 71, -191, -234, 389, 181, 20, 257, -2, 257, 274, -1, 161, 466, 119, 127, 31, 23, -3, 155, -192, -182, -188, 156, -47, 107, 217, 9, 66, -67, 37, 20, -218, -167, -155, 6, 7, -118, 182, -100, 24, 25, -59, 203, 173, 283, 90, 75, -187, 125, -65, -240, 145, 150, 129, 103, 141, 515, 166, 248, 107, -270, -44, -187, 77, 119, 299, 321, 307, 158, 107, -3, -459, -134, -209, -410, -556, -227, -241, -276, -126, -106, 165, 79, -204, 163, -93, 10, 240, 167, 25, 275, 67, -56, 468, 95, 34, 436, 91, -140, -118, 101, 65, -60, 141, -151, -64, 95, -130, -362, -453, -396, -660, -444, -352, -369, -182, -224, 244, 180, 125, 333, 182, 182, 419, -145, 24, 90, 115, -120, -77, 12, 239, -212, -50, 230, 117, -53, 320, 176, 37, -87, 30, 158, 151, -70, 105, -70, -356, -120, -491, -252, -52, 126, -8, 9, 255, 95, 253, -103, 236, 306, 238, 11, -197, -283, -191, -436, -275, -9, -323, -144, 89, -218, 123, 108, -212, 48, -3, -149, -30, 110]
2704A10l67K89j87M82l04m0K34Q9j97j31J49l41Q2Q7j61Lo2k9m5J01J71J07N2
2727I2nk53j3N56l43k0K43k41r3R4j18o7K39l49K02j04M39J97j02L3o4k50P1o3
2751H1j67j07P1j82K23r0j58N04j31K1J13l00K64m2k92kk07N01k98k01K71K0j60
2774b68K41M23k20p4n3J57k21qk42N29m43J33L3j70N2O7L8J46j08K4J03j50j81
2797a92K06j90N5m6k07J00J40J17K60q1j67L56m70K23q8l91J97O5o5N09l25k7
2819b1K15j33j65K35j38J45K22k37O5K08m31O7k74J87K6j14J38R3j60mK92l50
2841a34NK94n33N56j09J13r6k55j48K8r4L11J01k72L56q6PK78k44q6j52L51l04
2864a13JKJ74J64k54N02k65k0r0Q4l08J33p8j96K93m26j2M07k3L19k60P9j06L83
$$ y = [110, -257, 32, -155, 327, 23, -17, 217, 306, 109, -22, 127, -214, -132, -45, -206, -203, -265, -294, -339, -238, -67, 40, 92, 87, -166, -179, 377, 34, 14, 257, 16, -77, 17, -101, -168, 71, -278, -76, -180, 259, 456, 354, 387, 323, 73, 144, 81, -86, -193, -122, -304, -81, -171, -329, 175, 44, 65, 178, -122, 142, 100, -192, -194, -401, 100, -198, -399, -128, -108, -268, -27, 396, 176, 102, 49, 206, -15, -23, -265, 264, -179, -46, -13, -183, -131, -64, -26, 120, 12, 36, 139, -11, -192, 14, -176, -121, -167, -374, -274, -134, -17, 243, 162, -5, 351, -119, 104, 16, -375, -178, -113, -178, 331, 6, -21, 194, 61, -104, 131, -7, 138, 360, 123, 188, 396, -35, 32, -242, -55, -29, -143, -5, 88, -72, -76, 216, -134, -129, 165, -368, 188, 79, 192, 96, -159, -307, -279, -373, -62, 39, -233, 123, 37, 44, 322, 78, -8, -160, 191, -113, -112, -110, 64, 228, -26, 476, 211, 191, 101, 185, -123, 10, -68, -264, 29, -397, -409, -2, -25, 294, 34, 113, 7, 390]
2888C90P1L3l29k0j64k16J67JN5K41Mk11J41k14j18L50l94QJ71p1J21p5K39p0
2912A10N3m28J60j38K27OM68l18k8o2M1P9m30K73J45j40L41k27j21K97j66o6L59
2935D35m70L94k64j20J9j80j03L7k2j72P47m58K53j31k77O72k76J3k58O8q3N36
2957C60j39m48M00m98J8L42k66j8K42k86M20m4K47K4l09J27M2n63L46J43m1J1
2979A10O3l81M09k71M6K8k20N3N05m98L21k50m01L93J47n6l54L33j05R5j62K53
3001E8k8k7PM7M1j92ON14k66O1O9j65k42p3K71l85L03K82k56O8q7j52J06Q8l57
3026c09J17k30R9L7R6o4m6l8L58K05j23Q5n8N39l22p54L52L20m92M05m54n7K55
3049g9K72j59K41p5Jj76l46K58l8j59J92j70j38K85O6j50K30J95j27J23j23J01
$$ y = [390, 461, 494, 165, 145, -19, -235, -68, -67, -12, 229, 233, 22, 163, -51, -169, 181, -213, -205, -34, -105, 16, -59, 180, 110, 163, -265, -105, -243, -16, -10, 458, 140, 112, 50, 91, 170, -260, 13, 158, 18, 359, 132, 11, 308, 142, 76, 435, -35, 359, 95, -25, -6, -186, -289, -252, -274, -446, 301, -157, 96, -35, -312, 360, 84, 97, -161, -93, -176, 360, 221, -227, 173, -325, -307, 35, -231, -249, -7, -293, 127, 83, 330, 354, 45, 172, 214, -349, -3, 140, 99, 110, 173, -208, 201, -70, -24, 4, -216, -163, 342, -156, 165, -85, -486, -93, 54, -2, -356, -23, -128, -33, -195, 58, 30, 3, 10, 57, 98, -94, -88, 426, 160, 221, 290, 125, -117, -190, 81, -304, -1, 281, 25, 93, 6, -146, -40, 48, -309, -192, -422, -323, -286, -190, -254, -300, -338, 20, 225, 102, 187, 129, 668, 346, -408, -56, 264, -228, 177, -277, -334, -79, 193, 34, 275, 200, 201, 25, -321, -63, -101, -260, -68, -238, -376, -91, -25, -175, 55, 250, 123, 246, 123, 224]
3071B24L72k42k15k61o5K11k56L1J98j69r6L20k73J19q2Q1PR2J15o3J0l17M39
3094A80K03o05K45L41j93kj32J45O9k89K31Ok25R8k79N5K68j75l80j1K33J68k1
3117g0j62J09l2j79K24M3j00J00l0p1R9L3M79k88J65J76K53m83P4j6j42K1l50
$$ y = [224, 596, 354, 139, -122, -187, 24, -232, -201, -3, -172, -268, 52, -221, -102, -184, -103, -96, -4, 111, 48, 58, -259, 180, 383, -222, 23, 364, 171, 169, 37, 182, 251, -38, 193, 199, -26, 72, -207, -152, 116, -59, -439, -450, -217, -49, -70, -232, -123, -155, -334, -110, -67, -167, -67, -97, -168, -69, -36, 443, 155, 320, 496, 749, 266, 340, 324, 182, 203, -147]
$$ [...]
8191A00
##END NTUPLES=NMR FID
##END=
