##TITLE=1H_110-2025-Bay
 200.13MHz, CDCl3,
 8 sc
 
 8.9.2025
##JCAMPDX= 6.0         $$ Bruker NMR JCAMP-DX V2.0
##DATA TYPE= NMR FID
##DATA CLASS= NTUPLES
##ORIGIN= UXNMR, Bruker Analytische Messtechnik GmbH
##OWNER= pz
$$ XWIN-NMR		Version 3.5
$$ Mon Sep  8 15:35:50 2025 Russian Standard Time (UT+4h)  she@DPX200
##.OBSERVE FREQUENCY= 200.1313
##.OBSERVE NUCLEUS= ^1H
##.DELAY= (6, 6)
##.ACQUISITION MODE= SIMULTANEOUS
##.ACQUISITION SCHEME= undefined
##.AVERAGES= 8
##.DIGITISER RES= 18
##SPECTROMETER/DATA SYSTEM= spect
##.PULSE SEQUENCE= zg30
##.SOLVENT NAME= CDCl3
##.SHIFT REFERENCE= (INTERNAL, CDCl3, 0, 14.3821)
##AUDIT TRAIL= $$ (NUMBER, WHEN, WHO, WHERE, WHAT)
$$ ##TITLE= Audit trail, XWIN-NMR		Version 3.5
$$ ##JCAMPDX= 5.01
$$ ##ORIGIN= Bruker BioSpin GmbH
$$ ##OWNER= she
$$ F:/spectra/data/she/nmr/H-C/1/audita.txt
$$ ##AUDIT TRAIL=  $$ (NUMBER, WHEN, WHO, WHERE, WHAT)
(   1,<2025-09-08 15:34:28.56 +0400>,<she>,<DPX200>,
      <created by zg, POWCHK disabled, PULCHK disabled
       configuration hash MD5:
       00 E9 B6 7A A2 85 ED C7 34 08 36 98 17 FE 4E 26
       data hash MD5: 16K
       7D 90 1C EB BE D7 F6 FD E4 C5 D2 AC C8 0D 72 2E>)
$$ ##END=
$$ 
$$ hash MD5
$$ 46 84 AE 3B BB 16 55 25 3D A2 26 78 ED 29 82 AB
##$RELAX= 
##$RELAX= 
##$RELAX= 
##$RELAX= 
##$RELAX= 
##$RELAX= 
$$ Bruker specific parameters
$$ --------------------------
##$DU= <F:/spectra>
##$EXPNO= 1
##$NAME= <H-C>
##$PROCNO= 1
##$TYPE= <nmr>
##$USER= <she>
##$AMP= (0..31)
100 100 100 100 100 100 100 100 100 100 100 100 100 100 100 100 100 100 
100 100 100 100 100 100 100 100 100 100 100 100 100 100 
##$AQSEQ= 0
##$AQ_mod= 1
##$AUNM= <au_zg>
##$AUTOPOS= <>
##$BF1= 200.13
##$BF2= 200.13
##$BF3= 200.13
##$BF4= 200.13
##$BF5= 200.13
##$BF6= 200.13
##$BF7= 200.13
##$BF8= 200.13
##$BYTORDA= 1
##$CFDGTYP= 0
##$CFRGTYP= 5
##$CHEMSTR= <none>
##$CNST= (0..31)
1 1 145 1 1 1 1 1 1 1 1 1 1 1 1 1 1 1 1 1 1 1 1 1 1 1 1 1 1 1 1 1 
##$CPDPRG= <>
##$CPDPRG1= <>
##$CPDPRG2= <>
##$CPDPRG3= <>
##$CPDPRG4= <mlev>
##$CPDPRG5= <mlev>
##$CPDPRG6= <mlev>
##$CPDPRG7= <mlev>
##$CPDPRG8= <mlev>
##$CPDPRGB= <>
##$CPDPRGT= <>
##$D= (0..31)
0 0.7 0 0 0 0 0 0 0 0 0 0.03 0 0 0 0 0 0 0 0 0 0 0 0 0 0 0 0 0 0 0 0 
##$DATE= 1757331268
##$DBL= (0..7)
120 120 120 120 120 120 120 120 
##$DBP= (0..7)
150 150 150 150 150 150 150 150 
##$DBP07= 0
##$DBPNAM0= <>
##$DBPNAM1= <>
##$DBPNAM2= <>
##$DBPNAM3= <>
##$DBPNAM4= <>
##$DBPNAM5= <>
##$DBPNAM6= <>
##$DBPNAM7= <>
##$DBPOAL= (0..7)
0.5 0.5 0.5 0.5 0.5 0.5 0.5 0.5 
##$DBPOFFS= (0..7)
0 0 0 0 0 0 0 0 
##$DE= 6
##$DECBNUC= <off>
##$DECIM= 32
##$DECNUC= <off>
##$DECSTAT= 4
##$DIGMOD= 1
##$DIGTYP= 9
##$DL= (0..7)
0 120 120 120 120 120 120 120 
##$DP= (0..7)
150 150 150 150 150 150 150 150 
##$DP07= 0
##$DPNAME0= <>
##$DPNAME1= <>
##$DPNAME2= <>
##$DPNAME3= <>
##$DPNAME4= <>
##$DPNAME5= <>
##$DPNAME6= <>
##$DPNAME7= <>
##$DPOAL= (0..7)
0.5 0.5 0.5 0.5 0.5 0.5 0.5 0.5 
##$DPOFFS= (0..7)
0 0 0 0 0 0 0 0 
##$DQDMODE= 0
##$DR= 18
##$DS= 0
##$DSLIST= <SSSSSSSSSSSSSSS>
$$ [...]
##$SUBNAM0= <"">
##$SUBNAM1= <"">
##$SUBNAM2= <"">
##$SUBNAM3= <"">
##$SUBNAM4= <"">
##$SUBNAM5= <"">
##$SUBNAM6= <"">
##$SUBNAM7= <"">
##$SUBNAM8= <"">
##$SUBNAM9= <"">
##$SW= 18.0517328524113
##$SWIBOX= (0..15)
0 0 2 0 0 0 0 0 0 0 0 0 0 0 0 0 
##$SW_h= 3612.71676300578
##$TD= 16384
##$TD0= 1
##$TE= 0
##$TE2= 300
##$TE3= 300
##$TEG= 300
##$TL= (0..7)
0 120 120 120 120 120 120 120 
##$TP= (0..7)
150 150 150 150 150 150 150 150 
##$TP07= 0
##$TPNAME0= <>
##$TPNAME1= <>
##$TPNAME2= <>
##$TPNAME3= <>
##$TPNAME4= <>
##$TPNAME5= <>
##$TPNAME6= <>
##$TPNAME7= <>
##$TPOAL= (0..7)
0.5 0.5 0.5 0.5 0.5 0.5 0.5 0.5 
##$TPOFFS= (0..7)
0 0 0 0 0 0 0 0 
##$TUNHIN= 0
##$TUNHOUT= 0
##$TUNXOUT= 0
##$USERA1= <user>
##$USERA2= <user>
##$USERA3= <user>
##$USERA4= <user>
##$USERA5= <user>
##$V9= 5
##$VALIST= <valist>
##$VCLIST= <CCCCCCCCCCCCCCC>
##$VD= 0
##$VDLIST= <DDDDDDDDDDDDDDD>
##$VPLIST= <PPPPPPPPPPPPPPP>
##$VTLIST= <TTTTTTTTTTTTTTT>
##$WBST= 1024
##$WBSW= 4
##$XGAIN= (0..3)
0 0 0 0 
##$XL= 0
##$YL= 0
##$YMAX_a= 529203
##$YMIN_a= -1064147
##$ZGOPTNS= <>
##$ZL1= 120
##$ZL2= 120
##$ZL3= 120
##$ZL4= 120
##$ABSF1= 10
##$ABSF2= 0
##$ABSG= 5
##$ABSL= 3
##$ALPHA= 0
##$AQORDER= 0
##$ASSFAC= 0
##$ASSFACI= 0
##$ASSFACX= 0
##$ASSWID= 0
##$AUNMP= <proc_1d>
##$AZFE= 0.1
##$AZFW= 0.1
##$BCFW= 1
##$BC_mod= 2
##$BYTORDP= 1
##$COROFFS= 0
##$CY= -3
##$DATMOD= 1
##$DC= 2
##$DFILT= <>
##$DTYPP= 0
##$F1P= 0
##$F2P= 0
##$FCOR= 0.5
##$FTSIZE= 0
##$FT_mod= 4
##$GAMMA= 1
##$GB= 0.15
##$INTBC= 1
##$INTSCL= 1
##$ISEN= 128
##$LB= 0.25
##$LEV0= 0
##$LPBIN= 0
##$MAXI= 10000
##$MC2= 0
##$MEAN= 0
##$ME_mod= 0
##$MI= 1.114404
##$NCOEF= 0
##$NC_proc= 0
##$NLEV= 6
##$NOISF1= 3.799351
##$NOISF2= 2.8
##$NSP= 1
##$NTH_PI= 0
##$NZP= 0
##$OFFSET= 14.38212
##$PC= 1
##$PHC0= -1559.043
##$PHC1= 7.39228
##$PH_mod= 1
##$PKNL= yes
##$PPARMOD= 0
##$PSCAL= 0
##$PSIGN= 0
##$REVERSE= no
##$SF= 200.129724274929
##$SI= 16384
##$SIGF1= 3
##$SIGF2= 2
##$SINO= 400
##$SIOLD= 16384
##$SREGLST= <1H.CDCl3>
##$SSB= 0
##$STSI= 0
##$STSR= 0
##$SW_p= 3205.1282051282
##$SYMM= 0
##$S_DEV= 0
##$TDeff= 0
##$TDoff= 0
##$TI= <>
##$TILT= no
##$TM1= 0
##$TM2= 0
##$TOPLEV= 0
##$USERP1= <user>
##$USERP2= <user>
##$USERP3= <user>
##$USERP4= <user>
##$USERP5= <user>
##$WDW= 1
##$XDIM= 8192
##$YMAX_p= 0
##$YMIN_p= 0
$$ End of Bruker specific parameters
$$ ---------------------------------
##NTUPLES= NMR FID
##VAR_NAME=  TIME,          FID/REAL,        FID/IMAG
##SYMBOL=    X,             R,               I
##VAR_TYPE=  INDEPENDENT,   DEPENDENT,       DEPENDENT
##VAR_FORM=  AFFN,          ASDF,            ASDF
##VAR_DIM=   8192,          8192,            8192
##UNITS=     SECONDS,       ARBITRARY UNITS, ARBITRARY UNITS
##FACTOR=    0.0002768,     1,               1
##FIRST=     0,             0,               0
##LAST=      2.2672688,     0,               0
##MIN=       0,             -1064147,        0
##MAX=       2.2672688,     529203,          0
$$ Real data points
##PAGE= N=1
##DATA TABLE= (X++(R..R)), XYDATA
$$ [...]
2062A14N16k027j540M89R41O78O40Q86J794K27j93J340M52j247j607j036j47l52
$$ 114 630 -1397 -2937 -2448 -1507 -829 -189 697 2491 2718 2525 3865 4317 3070 1463 427 280 -72
2080g2j661M57J043K39O23R44J038k74k374j506O7j050j352J18Q35J364O95P23
$$ -72 -1733 -1276 -233 6 629 1573 2611 2337 -37 -1543 -1476 -2526 -3878 -3760 -2925 -1561 -866 -143
2098a43K015j93j879o27p7j78m73r32Q78Q69j88Q72J730O3j28m7R16J305r55j275
$$ -143 1872 1679 -200 -827 -904 -1082 -1555 -2487 -1609 -740 -928 -56 1674 1737 1609 1562 2478 3783 2828 1553
2118A553m0p43j023p00O63N50m86m8J578J105q34j036j095m23l56j238P93P99
$$ 1553 1513 770 -253 -953 -290 260 -226 -274 1304 2409 1575 539 -556 -979 -1335 -2573 -1780 -981
2136i81n34K98O04J396k57j364o91P44o74k09J042L64n00n36M63J498O32o99O17
$$ -981 -1515 -1217 -613 783 526 -838 -1529 -785 -1459 -1668 -626 -262 -762 -1298 -835 663 1295 596 1213
2155A213Q28J85l10o82l88n74j845M90J635O63O41j47P69K79j399j463l64j667
$$ 1213 2041 2226 1916 1234 846 272 -1573 -1083 552 1215 1856 1709 2478 2757 1358 -105 -469 -2136
2173b136o17M20J532J583l30l39P20j1j207q47q83k86p16m0J821J561n96K03M23
$$ -2136 -2753 -2333 -801 782 452 113 833 822 -385 -1232 -2115 -2401 -3117 -3157 -1336 225 -371 -168 255
2192B55J165L35m30J09K47j210q46N36k13m49o72O50J872P11k65L76l49j002o91
$$ 255 1420 1755 1325 1434 1681 471 -375 161 -52 -501 -1173 -523 1349 2060 1795 2171 1822 820 129
2211A29l93K24k95j049P74J318j44k48j234p00n80q40J011J659M53N24P40N98
$$ 129 -264 -40 -335 -1384 -610 708 564 316 -918 -1618 -2198 -3038 -2027 -368 85 609 1349 1947
2229A947N87j616j603m22q83o70J233J147J010j92J18J253L67j611o40n20l14
$$ 1947 2534 918 -685 -1107 -1990 -2660 -1427 -280 730 538 656 1909 2276 665 25 -495 -809
2246h09N0p1R58L26q72M03J422R64j48p22p46n57j156j068L46j66m73R02J613
$$ -809 -759 -830 128 454 -418 -15 1407 2371 2223 1501 755 198 -958 -2026 -1680 -1846 -2319 -1417 196
2265A96K000N91p02m33q87k065j171q60j24M35Q63K231K549M39m30m23r54j056
$$ 196 2196 2787 2085 1652 765 -1300 -2471 -3331 -3455 -3020 -2157 74 2623 3062 2632 2209 1255 199
2283A99j428r50N93l36N40J916J581R23q0m02K44n49j545n28r18j725o69m35J418
$$ 199 -1229 -2179 -1586 -1922 -1382 534 2115 3038 2958 2556 2800 2251 706 178 -740 -2465 -3134 -3569 -2151
2302b151J213q1Q26J696O91n50p40j368j134j900m88J381O77J007J536J575J346
$$ -2151 -938 -1019 -193 1503 2194 1644 904 -464 -1598 -3498 -3986 -2605 -1928 -921 615 2190 3536
2319C536L4j061r07j349j389k58M93N34O08J90J059J005k39q26m95q28r83j107
$$ 3536 3570 2509 1602 253 -1136 -1394 -901 -367 241 431 1490 2495 2256 1430 935 107 -876 -1983
2337a983l17L43r90m12J097J308J189Q38P25O37j03j076p05j033j889q47P8J552
$$ -1983 -2300 -1957 -2947 -3359 -2262 -954 235 1073 1798 2435 2332 1256 551 -482 -2371 -3218 -3140 -1588
2355a588J404J019J240J103k68k07p59j096j152j497m42R54M12L19R67nN07j39
$$ -1588 -184 835 2075 3178 2910 2703 1944 848 -304 -1801 -2243 -1289 -877 -558 409 404 911 772
2373G72j89L67o55j157n52L4K2j98MJ124R91N31J274O32l70p56j254p94q84j435
$$ 772 583 950 295 -862 -1414 -1380 -1358 -1556 -1552 -428 563 1094 2368 3000 2630 1874 620 -174 -1058 -2493
2393b493n87O98O88J151J178O52O54r27o62O7n47q36k22M3N38J44K43L69O47m92
$$ -2493 -3080 -2382 -1694 -543 635 1287 1941 1014 352 419 -128 -964 -1186 -1143 -605 -461 -218 151 798 306
2413C06j5K60M59J0n17P4K43n85l45K68p7J7J41o7Q74l07j260m05l55m47p1J84
$$ 306 291 551 1010 1020 503 577 820 235 -110 158 81 98 239 172 1046 739 -521 -926 -1281 -1728 -1799 -1615
2435a615P53P29j87Q51R24m55n52p74m30N77j034K86N51m5K77L80M01P87j27K1
$$ -1615 -862 -133 -320 531 1455 1000 448 -326 -756 -179 -1213 -927 -376 -421 -144 236 637 1424 1297 1318
2455A318O07K28q17l39q67o21p04o29M98O99j67J187P21N63k35j201l88m59j502
$$ 1318 1925 2153 1336 997 130 -491 -1195 -1824 -1326 -627 -794 393 1114 1677 1442 241 -147 -606 -2108
2474b108k10L23RO06M88P58J231j89j85L70o38o28j35k81l2K39m86Q07N84J13
$$ -2108 -2318 -1995 -1986 -1380 -892 -134 1097 908 723 1093 455 -173 -308 -589 -621 -382 -868 -61 523 636
2494F36Q94L79N4K71j041j70k33j105p92j0M09N85k3M42O16J17j019J48o90n42
$$ 636 1530 1909 1963 2234 1193 1023 790 -315 -1107 -1117 -708 -123 -146 296 912 1029 10 158 -532 -1074
2514a074m91n68M12N12Q2L41O19J89oj27M84L30m98J2L89m65k66j02K33K61j35
$$ -1074 -1565 -2133 -1721 -1209 -1127 -786 -167 22 16 -111 373 703 205 217 606 141 -125 -227 6 267 132
2535A32J00R06K58J12n1k49k8m73r66rP09o35L42l6L91k22o31j51k64n29k47J45
$$ 132 232 1138 1396 1508 1457 1208 1180 707 -259 -268 441 -194 148 112 503 281 -350 -501 -765 -1294 -1541 -1396
2557a396J19K5j0N25O01N20k72K79J1l84m25m58k37j22p63N39J226L93Q84J070
$$ -1396 -1277 -1252 -1262 -737 -136 384 112 391 402 18 -407 -865 -1102 -1224 -1987 -1448 -222 171 1055 2125
2577B125P67L2l14o96m75j195r36n44k09O34K40M14J157L67o7j43j06o32j026
$$ 2125 2892 2924 2610 1914 1439 244 -692 -1236 -1445 -811 -571 -157 1000 1367 1300 1157 1051 419 -607
2596f07r28j20j50k90K86N60J49M74K02M09m7k74k07O5n9k57L01L44R35J62K80
$$ -607 -1535 -1655 -1805 -2095 -1809 -1249 -1100 -626 -424 -15 -62 -336 -543 -478 -537 -794 -493 -149 786 948 1228
2617A228R61k28m11m01n36m26o06q2J00L31jP14K77L67P8m65j27l25o59o61l39
$$ 1228 2189 1961 1550 1149 613 187 -419 -501 -401 -70 -71 643 920 1287 1365 900 773 448 -211 -872 -1211
2638a211k61j43n5LO59L17OQ75P9R0j02j24j94m03l57RJ89N6M49L06M05P17N5
$$ -1211 -1472 -1615 -1670 -1667 -1008 -691 -685 190 269 359 257 133 -61 -464 -821 -812 -623 -567 -118 188 593 1310 1365
2661A365J94J18n52j39o71l59K7k61J46N03j61K85O50j00J95l44j030m76n54p13
$$ 1365 1559 1677 1125 986 315 -44 -17 -278 -132 371 210 495 1145 1045 1240 896 -134 -610 -1164 -1877
2681a877K5mK51L71L24N66J003m77j68K0q08q8m88j73P09L41O47J025M81N44K27
$$ -1877 -1852 -1856 -1605 -1234 -910 -344 659 182 14 34 -774 -862 -1350 -1523 -814 -473 174 1199 1680 2224 2451
2702B451k19l02n52j023n19m78o8J84L53J096M23k4j33Lq18j013o93j021j53j03
$$ 2451 2232 1930 1378 355 -164 -642 -710 -526 -173 923 1346 1322 1189 1192 374 -639 -1332 -2353 -2506 -2609
2722b609O36M64O76P09P43K93j32k89o50k64k58m76K65L75P31N24P64Q09M06j76
$$ -2609 -1973 -1509 -833 -124 619 912 780 491 -159 -423 -681 -1157 -892 -517 214 738 1502 2311 2717 2541
2742B541l36o51r94n17p26o57L68l05M37R92K23J79R9o6m81r21o80k57m83k51
$$ 2541 2205 1554 560 43 -683 -1340 -972 -1277 -840 152 375 554 653 587 106 -815 -1495 -1752 -2235 -2486
2762b486M68M72P69P79M96P36L87k24r9n04k09M1o57j72N43Q4j57N20Q5P58m83
$$ -2486 -2018 -1546 -777 2 498 1234 1621 1397 1298 794 585 626 -31 -203 340 424 267 787 872 1630 1147
2783A147j67M7j060n86k30j92k18L18K7L95N09r2N8j92j25k16n47o9M45k47N13
$$ 1147 980 1027 -33 -619 -849 -1041 -1259 -941 -914 -519 -10 -102 -44 -236 -361 -577 -1124 -1193 -748 -995 -482
2804d82Q96K22L38K96m08K79l38m01q9m16k33J35j5K39M64l75N29J31n23J75j99
$$ -482 414 636 974 1270 862 1141 803 402 313 -103 -336 -201 -216 23 487 112 641 772 249 424 225
2825B25o32k97m83j11L21k24N25N88M55M18q3q9M5k04p09lp7l43J71J18M19M27
$$ 225 -407 -704 -1187 -1298 -977 -1201 -676 -88 367 785 702 613 658 454 -255 -258 -335 -678 -507 -389 30 457
2847D57k23L34K2k96J22j99m26N8o77j19J78k49J86O57K94L57J25p1M68l54m31
$$ 457 234 568 590 294 416 217 -209 -151 -828 -947 -769 -1018 -832 -175 119 476 601 530 998 644 213
2868B13k13k78k13m7K0M38K86J06N40K89m13K6n31K4j77m02L6m27l5L03N4R8L54
$$ 213 0 -278 -491 -538 -518 -80 206 312 852 1141 728 754 223 247 70 -332 -296 -723 -758 -455 -401 -303 51
2891E1q2j79M39P6n39m78j98J7k73K37O03M98m8M50L13k00Q4o62j43L3k91K07
$$ 51 -31 -210 229 305 -234 -712 -910 -893 -1166 -929 -326 172 124 574 887 687 771 109 -34 -1 -292 -85
2913h5M3K45N44r4R0L18J64o47j68l89l01L56o42L39r4j19N94j06J19J78k02o31
$$ -85 -42 203 747 653 743 1061 1225 578 410 21 -280 76 -566 -227 -321 -440 154 48 167 345 143 -488
2935d88k71k40j28k61n58Q14J45O35L20M91r3M87l02k00j80m11k07K66k0M91L98
$$ -488 -759 -999 -1127 -1388 -1946 -1132 -987 -352 -32 459 366 853 551 351 171 -240 -447 -181 -201 290 688
2956F88J23M88N7R4L56n49l11m79m23k47k79j29M07p9P7M70l22R6P5n23k69l55
$$ 688 811 1299 1356 1450 1806 1257 946 467 44 -203 -482 -611 -204 -283 -206 264 -58 38 113 -410 -679 -1034
2978a034m74N0j6N9O48J81M66L56lJ08J39n02j29J79k30L07Q0J24O90Q3M80K74
$$ -1034 -1508 -1458 -1474 -1415 -767 -586 -120 236 233 341 480 -22 -151 28 -202 105 185 309 999 1082 1562 1836
3000A836k05p01J13m77l78n12l83J61jK76N49O8K58J40l55m29k90o64n42Q9j02
$$ 1836 1631 930 1043 566 188 -324 -707 -546 -547 -271 278 346 604 744 389 -40 -330 -994 -1536 -1447 -1549
3021a549K91J75N45N33J80J39L42n17k20M4m34J9K55KK35K49L42J74K03M0J58
$$ -1549 -1258 -1083 -538 -5 175 314 656 139 -81 -37 -471 -452 -197 -195 40 289 631 805 1008 1048 1206
3042A206n32k74k31n32L74k94R4L03j11J55M12k81J97k04p12j8l27k75N1K54o1
$$ 1206 674 400 169 -363 11 -283 -189 114 3 158 570 289 486 282 -430 -448 -775 -1050 -999 -745 -806
3063h06M44K08K71J98k26j13k29M4j83k62M7L20K47J42K76Q4J54L41m20M7K9n32
$$ -806 -362 -154 117 315 89 -24 -253 -209 -392 -654 -607 -287 -40 102 378 462 616 957 537 584 613 81
3085H1j25J45k63J50N7R9M0J46K73M4l26j3l24k94j42k84K0J19J14J61K03J41
$$ 81 -44 101 -162 -12 45 144 184 330 603 647 321 308 -16 -310 -452 -736 -716 -597 -483 -322 -119 22
3107B2K66k7o24J99j0k88n9J61m22L90J15L78K16PK68K6k80K92K7m29K5l38R5
$$ 22 288 261 -363 -164 -174 -462 -521 -360 -782 -392 -277 101 317 324 592 618 338 630 657 228 253 -85 10
3130A0P8P6Q0L40k11J36M3m50J84k87n57Q2k72k74K61J8L7N52o7K68J91k08j95
$$ 10 88 164 244 584 373 509 552 102 286 -1 -558 -476 -748 -1022 -761 -743 -706 -154 -221 47 238 30 -165
3153a65JJ37L70n84J15K51n2L02J78OJ74k24o3M9nk51k97K5N1J10p9%J55k03J15
$$ -165 -164 -27 343 -241 -126 125 73 375 553 559 733 509 446 495 490 239 -58 -33 18 128 49 49 204 1 116
3178A16O4l73j30m90j1J94j68K52J94K64L22k2J19K03j10n31J15p3N4NM0K08K01
$$ 116 180 -193 -323 -813 -824 -630 -798 -546 -352 -88 234 212 331 534 424 -107 8 -65 -11 -6 34 242 443
3201D43m9J42K06j37j26l90k15M6j63m63L65j61L98N1L48M2K7j96J3l17k77j19
$$ 443 394 536 742 605 479 89 -126 -80 -243 -706 -341 -502 -104 -53 295 337 364 168 181 -136 -413 -532
3223e32j59Q1K06m0N15K43J05J08r7q9J97n41k05M8n31M72M0R1M15O1j47L53J4
$$ -532 -691 -610 -404 -444 71 314 419 527 430 341 538 -3 -208 -160 -691 -219 -179 -88 327 388 241 594 608
3246F08l94J52m65j46r8k7n6L62J20K62R7p3P1j63l35n5l11l26J39l84J55O19
$$ 608 214 366 -99 -245 -343 -370 -426 -64 56 318 415 342 413 250 -85 -140 -451 -777 -638 -1022 -867 -248
3268b48P6K73J33l7J5j87ok16k44R1M5p9O09K89P7L4K30j86k81o7l38n6k93j65
$$ -248 -172 101 234 197 212 25 19 -197 -441 -350 -305 -384 225 514 591 625 855 669 388 321 -17 -73 -366 -531
3292e31L50r0J35J66J1M02j77l14J34k57l01O7k74L24J92j07K17L21J50M4o9k76
$$ -531 -181 -271 -136 30 41 443 266 -48 86 -171 -472 -405 -679 -355 -163 -270 -53 268 418 462 393 117
3314A17R3j65m27M00k05q0O5J80J39R6QJ76j91k88K3l11l6J16j71Q44l52J28m
$$ 117 210 45 -382 18 -187 -267 -202 -22 117 213 221 397 206 -82 -59 -370 -406 -290 -461 383 31 159 155
3337A55J93o1K17p5l26J87j79m35K41k01M94j66RL0r2j90K05j48l65l2j90J06
$$ 155 348 287 504 429 103 290 111 -324 -83 -284 210 44 53 83 -9 -199 6 -142 -507 -539 -729 -623
3359f23j6Q6J25J98j45L18n2K51K8O2J16j18J12R6o1O4J91j13P0K63l34J23l13
$$ -623 -639 -553 -428 -230 -375 -57 -109 142 170 232 348 230 342 438 377 441 632 519 589 852 518 641 328
3382C28J53l51j89j0j16Q2k05K24j19q7N8j52k25L78m62r0L15N3M3j11K66L31
$$ 328 481 130 -59 -69 -185 -103 -308 -84 -203 -290 -232 -384 -609 -231 -693 -783 -468 -415 -372 -483 -217 114
3404A14k93K95K48p5M7p3j56LK02l11K38l27J27K84K71r4l4j10O8K7j31O2j86
$$ 114 -179 116 364 289 336 263 107 110 312 1 239 -88 39 323 594 500 466 356 424 451 320 382 196
3427A96k60ql01K17J01J99m04K66k33K77j03N8l18J65r1j29J39k27J39j38K66
$$ 196 -64 -72 -373 -156 -55 144 -260 6 -227 50 -53 5 -313 -148 -239 -368 -229 -456 -317 -455 -189
3448a89j0l7j60K76j66J10J6K17J33m9j0K91K65N2k3j38K31k31k26L1j65n8j87
$$ -189 -199 -236 -396 -120 -286 -176 -160 57 190 141 131 422 687 739 716 578 809 578 352 383 218 160 -27
3471b7P6L16k74J54l2pk29k19j54k45l7k02k22K56k4N1L31K23J66J1J3M42j72
$$ -27 49 365 91 245 213 206 -23 -242 -396 -641 -678 -880 -1102 -846 -870 -819 -488 -265 -99 -88 -75 367 195
3494A95k95P5J34J0Q9Q1K72J79O9J6M01n70k01p6l68J84k35m5k3j02K85M6k79
$$ 195 -100 -25 109 119 208 289 561 740 809 825 1226 656 455 379 11 195 -40 -85 -108 -210 75 121 -158
3517a58r8J75o65K61j82n95L43K28K29K44K6L60K03k25Q3j74n7R7m15K69K9j24
$$ -158 -256 -81 -746 -485 -667 -1262 -919 -691 -462 -218 -192 168 371 146 229 55 -2 95 -320 -51 -22 -146
3539a46N00K94o7K4m8o2P5o8n40jj98j26M4P8O4R8J11J51o0O0l96K0j70Q1j13
$$ -146 354 648 581 605 557 495 570 502 -38 -39 -237 -363 -319 -241 -177 -79 32 183 123 183 -213 -193 -363 -282 -395
3564c95l1L67L8k67L83J00K5j09n36M76k87P4Q4j41J56Q1j96N61k87K2K3k8j38
$$ -395 -426 -59 -21 -288 95 195 220 111 -425 51 -236 -162 -78 -219 -63 18 -178 383 96 118 141 113 -25
3587b5k98k37O8J02K08n7L17J48L80J33j48j1k31p1l90j56J50J20j91J65J28k06
$$ -25 -323 -560 -492 -390 -182 -239 78 226 606 739 591 580 349 278 -112 -268 -118 2 -189 -24 104 -102
3609a02M11o0K2m25J42j14j04k08j05L58k39J95L09R7o8j14R2Q5l61m7K46J75
$$ -102 309 249 271 -154 -12 -126 -230 -438 -543 -185 -424 -229 80 177 109 -5 87 172 -189 -236 10 185
3631A85j93k5J03K90O5r5J13k97m9R9j17j38L01m59J3K75l01L70J44K8q6l28Q1
$$ 185 -8 -33 70 360 425 330 443 146 97 196 79 -59 242 -217 -204 71 -230 140 284 312 226 -102 -21
3654b1R9l00M3q0j29J98M3j09K82K85m39K24n0L9P3l47Q2k3L1O7J1J1l4j24K43
$$ -21 78 -222 -179 -259 -388 -190 -147 -256 26 311 -128 96 46 85 158 -189 -107 -130 -99 -32 -21 -10 -44 -168 75
3679G5J22k12j1m7m5j7MN3K57n6j56L59r4o4j11Q1P3j53Jm2P6P6j19l8r3N58m37
$$ 75 197 -15 -26 -73 -118 -135 -131 -78 179 123 -33 326 232 168 57 138 211 58 59 17 93 169 50 12 -81 477 40
3706D0j70J82Q5J2J20k04JM0o2M3j79n1J80J9M2Q1k18J90k2M8r6Rl8o2qJ97k28
$$ 40 -130 52 137 149 269 65 66 106 44 87 -92 -143 37 56 98 179 -39 151 129 177 81 90 52 -10 -18 179 -49
3733d9Q0k04J22j55J61Q2k43K47k11l72J25M18k11K54m12N16J32k95J15l7j63
$$ -49 31 -173 -51 -206 -45 37 -206 41 -170 -542 -417 1 -210 44 -368 148 280 -15 100 63 -100
3754a00p5J58J30q4p7L19M5R3o0l23j5J32k78J3j65P6q2J36j5N8l0j6L1p4j93
$$ -100 -175 -17 113 29 -48 271 316 409 349 26 11 143 -135 -122 -287 -211 -293 -157 -172 -114 -144 -160 -129 -203 -396
3779c96Q1L08j18q4K58j08K75q1J64J91j14p9K65n06J72j61j90J72r9J15O6q8
$$ -396 -315 -7 -125 -209 49 -59 216 135 299 490 376 297 562 56 228 67 -123 49 -50 65 131 43
3801D3l4K83j88j96J37k10j45J7j78K31p1p3p0K90r6J7J9N8N5O2m8L79o04M39
$$ 43 9 292 104 -92 45 -165 -310 -293 -471 -240 -311 -384 -454 -164 -260 -243 -224 -166 -111 -49 -97 282 -322 117
3825A17L5j40K41j14J0m4j27j40L39n27K34j76M74j42m1K65Q8Qq3j9l13L26m68
$$ 117 152 12 253 139 149 105 -22 -162 177 -350 -116 -292 182 40 -1 264 352 360 277 258 -55 271 -197
3848a97l3K40j1NM0J98k75K07j99K1J13l37K2j8j35N5j22j77J77J91n1J72K0n4
$$ -197 -230 10 -1 4 44 242 -33 174 -25 -4 109 -228 -206 -224 -359 -304 -426 -603 -426 -235 -286 -114 -94 -148
3872a48k4K89J28po8j17J18Q5J64k41M20k84j79K94k93J59k29J79j34P3n6m2o5
$$ -148 -172 117 245 238 170 53 171 256 420 179 599 315 136 430 137 296 67 246 112 185 129 87 22
3895B2m9m14J74l5m5k40J09J07k44J2J97J90J7K0Q7M26J21j34p9J37k4j87k4J46
$$ 22 -27 -441 -267 -302 -347 -587 -478 -371 -615 -603 -406 -216 -199 -179 -92 334 455 321 242 379 355 168 144 290
3919B90M0m8j73K13n2R7j64j57L67l07l21k4o5j22J94k23N1L6j42L02J07j25J39
$$ 290 330 282 109 322 270 367 203 46 413 106 -215 -239 -304 -426 -232 -455 -404 -368 -510 -208 -101 -226 -87
3942h7L8lO9O1J32j81n3L52k80K21K4j79m7K08j75k73L38p8r9j6J4L43l36j17
$$ -87 -49 -52 17 78 210 29 -24 328 48 269 293 114 67 275 100 -173 165 87 -12 -28 -14 329 -7 -124
3966a24o2O6p6J60k31q4K05l19K38K69l2J21J70Q8P9r0k38J70m39k09K67k36J07
$$ -124 -186 -120 -196 -36 -267 -351 -146 -465 -227 42 10 131 301 389 468 378 140 310 -129 -338 -71 -307 -200
3989b00L6J83K18j06k70L51o1k21k0q5j28K13J3j61K84nJ55j32K27j56m1J2J51
$$ -200 -164 19 237 131 -139 212 151 -70 -90 -175 -303 -90 -77 -238 46 41 196 64 291 135 94 106 257
4012B57j09k14J72J67o3j32p4K80p9k40k31nJ32k56N9J26Q6PM8J53P1P3m05K05
$$ 257 148 -66 106 273 210 78 4 284 205 -35 -266 -271 -139 -395 -336 -210 -124 -117 -69 84 155 228 -177 28
4036B8J68k94K7l1r6K07j53NN80m34J85K39l47P6n5j35K52j89j94J99k10k3J72
$$ 28 196 -98 -71 -102 -198 9 -144 -139 441 7 192 431 84 160 105 -30 222 33 -161 38 -172 -195 -23
4059b3j69J5M00l31O8J85n7lo2q4L02N9l53M60l32m8L4RJ24J1m4n5J35k09r3J8
$$ -23 -192 -177 223 -108 -40 145 88 85 23 -61 241 300 -53 407 75 27 61 70 194 205 161 106 241 32 -61 -43
4085d3J7K7j99K10L8j28q6L10j96q8K35l95K25k72K62Q0O3n1M14l30J18N8k09
$$ -43 -26 1 -198 12 50 -78 -164 146 -50 -138 97 -298 -73 -345 -83 -3 60 9 423 93 211 269 60
4108F0j14j2o3o6j0O8J96j38J86L18j54q6J18l61J00j84j00K28j17k89N26j45
$$ 60 -54 -66 -129 -195 -205 -137 59 -79 107 425 271 185 303 -58 42 -142 -242 -14 -131 -420 106 -39
4130c9L41j64k7L9K4k51k01J05k17K84k96K93L09J8r9K35j43q2j26j14j94N4j43
$$ -39 302 138 111 150 174 -77 -278 -173 -390 -106 -402 -109 200 218 119 354 211 129 3 -111 -305 -251 -394
4153c94J96P4L16q2J89K43p9l62j18O0o1j97J24j26L97j76K21J48O2j56k26k51
$$ -394 -198 -124 192 110 299 542 463 101 -17 43 -18 -215 -91 -217 180 4 225 373 435 279 53 -198
4175a98P6k20k70K49J41J41K46J10kj5l6N9n1n33R8J1j56J06J76N9J49K41k9n3
$$ -198 -122 -342 -612 -363 -222 -81 165 275 273 258 222 281 230 -303 -205 -194 -350 -244 -68 -9 140 381 352 299
4199B99j04p8l73J99k34m3N0L30J76k87L70J49j96l03o9P8j62k25K17l8j21L35
$$ 299 195 117 -256 -57 -291 -334 -284 46 222 -65 305 454 258 -45 -114 -36 -198 -423 -206 -244 -365 -30
4221c0j49L53N3j78K00kk17%q1q5j12J30Q6P9j11M19q2j27J10j48l76K35J34k20
$$ -30 -179 174 227 49 249 247 30 30 -51 -136 -248 -118 -32 47 -64 355 273 146 256 108 -268 -33 101 -119
4245a19J17k11L10o1o2J65l2j79mj41J97k7K9J02J79j93k1M4j07m1L8j29N8j46
$$ -119 -2 -213 97 36 -26 139 107 -72 -76 -217 -20 -47 -18 84 263 70 49 93 -14 -55 -17 -146 -88 -234
4269b34N8j23K21R8k9K94p4L88m83r4Qk0l8k04K9J11jj33M83n80K93m8P1jm6o4
$$ -234 -176 -299 -78 20 -9 285 211 599 116 22 30 10 -28 -232 -203 -92 -93 -226 257 -323 -30 -78 -7 -8 -54 -118
4295a18L39O7nj33n3q0j10L5J02k03m0j22K58J99j5k7j2R2j89k04J88k82N0L8
$$ -118 221 288 283 150 97 17 -93 -58 44 -159 -199 -321 -63 136 121 94 82 174 -15 -219 -31 -313 -263 -225
4319b25j35L26L9j77L72m0L2k5q3Jn5j74J29J74m29L33J47p3L56j81l86N3r8Q8
$$ -225 -360 -34 5 -172 200 160 192 167 84 85 30 -144 -15 159 -270 63 210 137 493 312 -74 -21 -119 -31
4343c1j83j52K24j26J18L55J41k85J1j55j97r9k56K32J67o2J0O20J31M4l03M54
$$ -31 -214 -366 -142 -268 -150 205 346 61 72 -83 -280 -379 -635 -403 -236 -298 -288 332 463 507 204 658
4365F58j43k67j19j27k77R4l2k73N49J0JM00j28j03k90K7k49k28l33L59J39nM42
$$ 658 515 248 129 2 -275 -181 -213 -486 63 73 74 474 346 243 -47 -20 -269 -497 -830 -471 -332 -337 105
4388A05Q2K50j47k61j71M24k27l72J63K00J23kJ17L67k08k90l5L8l65p8k15J62
$$ 105 187 437 290 29 -142 282 55 -317 -154 46 169 167 284 651 443 153 118 156 -209 -287 -502 -340
4410c40L1j58L55K52J63n1N9J21k55m64K8l4k94j17K23J51J85K77N4J46J08j82
$$ -340 -309 -467 -112 140 303 252 311 432 177 -287 -259 -293 -587 -704 -481 -330 -145 132 186 332 440 258
4432B58J17j60m6k68j36M78j91j82L48n3L8l08kK16j35j42j8K2N7O4J27l5J92
$$ 258 375 215 169 -99 -235 243 52 -130 218 165 203 -105 -107 109 -26 -168 -186 -164 -107 -43 84 49 241
4455B41J24j55L8k03l22r9j84r1L76j30N4K87K18K18j28k95J88l10K9J09k30K18
$$ 241 365 210 248 45 -277 -376 -560 -651 -275 -405 -351 -64 154 372 244 -51 137 -173 -144 -35 -265 -47
4477d7p6N4k7j8R7J98j11mN3k8J80q2j49L13m12j07q9J42k55J49mJ11M67m85K05
$$ -47 -123 -69 -96 -114 -17 181 70 66 119 91 271 189 40 353 -59 -166 -255 -113 -368 -219 -223 -112 355 -130 75
4502G5j05j9j6r4J01M8k46J57L32n08J94L0J05P0J95l73M76m08m7n1J6M7R5j45
$$ 75 -30 -49 -65 -159 -58 -10 -256 -99 233 -275 -81 -51 54 124 319 -54 422 14 -33 -84 -68 -21 74 -71
4526g1J19M52j65q7j99J5J29m16j57L85l69J07N1J51K71R3J08mk63j65K38j17
$$ -71 48 500 335 248 49 64 193 -223 -380 5 -364 -257 -206 -55 216 309 417 413 150 -15 223 106
4548A06r6K44j72n5O5j41M6J05k72J26k18l7J53j66l3K48J04QJ38l1J32j99k33
$$ 106 10 254 82 27 92 -49 -3 102 -170 -44 -262 -299 -146 -312 -345 -97 7 15 153 122 254 55 -178
4571a78N6P9l05n7K26K6L20L5L83L8m0p0o0j86k83j50k23K90j49P1L03j05J61
$$ -178 -122 -43 -348 -405 -179 -153 167 202 585 623 583 513 453 267 -16 -166 -389 -99 -248 -177 126 21 182
4594A82K2j57p4P1k89k17n3j37L06j15J17K80O6q5M42j14j68q6R2k41k79L33k1
$$ 182 204 47 -27 44 -245 -462 -515 -652 -346 -461 -344 -64 2 -83 359 245 77 -9 83 -158 -437 -104 -125
4617a25M5J74L01j3J97j88k07o4J33n95N38m27J26N4L2m4L50k49k78L88j66J48
$$ -125 -80 94 395 382 579 391 184 120 253 -342 196 -231 -105 -51 -19 -63 287 38 -240 148 -18 130
4639A30k21j82K69l92M2L91N7M1J60%m4j93k24k6N9k5N0j91M59j76r4M81J1k26
$$ 130 -91 -273 -4 -396 -354 37 94 135 295 295 251 58 -166 -192 -133 -158 -108 -299 160 -16 -110 371 382 156
4663A56J6l7j91O5j34r3K99k36J75J62j96po6J01J09j54r2J88j75RP5j09J35K13
$$ 156 172 135 -56 9 -125 -218 81 -155 20 182 -14 -21 -87 14 123 -31 -123 65 -110 -101 -26 -135 0 213
4687B13n25J80J39k41K2o9K20j75J99l29M13L7n6R5QN6r4N7J4M6j86J65j50j00
$$ 213 -312 -132 7 -234 -212 -281 -61 -236 -37 -366 47 84 28 123 131 187 93 150 164 210 24 189 39 -61
4711f1Kk2O6J01k85J37L36m63K30Q4k57K71l06o8L15l92K55j15N0L12j50k64L10
$$ -61 -59 -81 -15 86 -199 -62 274 -189 41 125 -132 139 -167 -235 80 -312 -57 -172 -122 190 40 -224 86
4734H6j34o6K12m20N33l44J29N6K6j24L39k7n3M4p5r8M1k72k03P7M2J32l05L97
$$ 86 -48 -114 98 -322 211 -133 -4 52 78 -46 293 266 213 257 182 84 125 -147 -350 -273 -231 -99 -404 -7
4758gL28l18K85l24L3j62o5j06P2L13k99J65J31J17J19q6J22J35n36%Q9j53R2
$$ -7 321 3 288 -36 -3 -165 -230 -336 -264 49 -250 -85 46 163 282 196 318 453 -83 -83 6 -147 -55
4781e5k32J46K42%J11R0N5r5l11R4j46l06N7J3L64k38K59k5N5Jm5J6M4m24N3P1
$$ -55 -287 -141 101 101 212 302 357 262 -49 45 -101 -407 -350 -337 27 -211 48 23 78 79 34 50 94 -330 -277 -206
4807b06L5K41p2J80j63P0L4J11O6k59J47k20l6K31k27K34j69Q3j75j25K83j25
$$ -206 -171 70 -2 178 15 85 119 230 296 37 184 -36 -72 159 -68 166 -3 80 -95 -220 63 -62
4829f2k66K6J13K72k89O2K27j59J69K24j14j46j7k48j36K43j95k15K36L39k78
$$ -62 -328 -302 -189 83 -206 -144 83 -76 93 317 203 57 40 -208 -344 -101 -296 -511 -275 64 -214
4850b14L44M54k25J45m28mP8k80k60K04j14N7J54R0K11k43K29lm2o3p7q2Q9k49
$$ -214 130 584 359 504 76 72 150 -130 -390 -186 -300 -243 -89 1 212 -31 198 195 153 90 13 -69 20 -229
4874b29r3L01J7j12J30M8J71Qj38j98L40l33M1q0l6jK91j43J99j52j02OJ09J63
$$ -229 -322 -21 -4 -116 14 62 233 241 103 -95 245 -88 -47 -127 -163 -164 127 -16 183 31 -71 -65 44 207
4898B07j67l5L9OJ4r4r6j5p6r7L71nj61J31Q6q4j26JJ6n5K08k95P2J56q4K1J7
$$ 207 40 5 44 50 64 -30 -126 -141 -217 -314 57 52 -109 22 108 24 -102 -101 -85 -140 68 -227 -155 1 -83 -62 -45
4925d5J94J55j77J22lj28R5o3OO9l51J86j78n1J02o7M6j87L3K09L7j92n8K01k3
$$ -45 149 304 127 249 246 118 213 150 156 225 -126 60 -118 -169 -67 -134 -88 -275 -242 -33 4 -188 -246 -45 -68
4950f8J86k92O0L8k00J78K80n8j55R6M6O1K65j32N9K16k89p2L6MJ22m67J04Q4
$$ -68 118 -174 -114 -76 -276 -98 182 124 -31 65 111 172 437 305 364 580 291 219 255 259 381 -86 18 102
4974A02m34K33J10q2o6O6l12K03k83k95K01K66j56m0L49J01J67j95L15qJ43k6
$$ 102 -332 -99 11 -71 -137 -71 -383 -180 -463 -758 -557 -291 -447 -487 -138 -37 130 -65 250 242 385 359
4996C59j15J67Ol09J55q6K51j4J9k29J59k93Pj27m4j83j24J69q3m1L7J11l9j17
$$ 359 244 411 417 108 263 177 428 414 433 204 363 70 77 -50 -94 -277 -401 -232 -315 -356 -319 -208 -247 -364
5020c64J19j34L2J52k02%M05J6j5J99J5K01j39J02J63J21m22%k84P4K54m26L15
$$ -364 -245 -379 -347 -195 -397 -397 8 24 9 208 223 424 285 387 550 671 249 249 -35 39 293 -133 182
5043A82j7j73K90k08l05J22k99K58J33l55j23K06j04J39N3K20RK19l28k7J99j60
$$ 182 165 -8 282 74 -231 -109 -408 -150 -17 -372 -495 -289 -393 -254 -201 19 28 247 -81 -108 91 -69
5065f9O9M0j28R9O8M5Q0k1l6k62K21j18j14N0o4J13l4K77k49K58l18Q6K96j71
$$ -69 0 40 -88 11 79 124 204 183 147 -115 106 -12 -126 -76 -140 -27 -61 216 -33 225 -93 -7 289 118
5089A18k08J21m3l92K92J16N3J25j09j01K55j00l12r1O9Q8j13N3K35j49J07r0
$$ 118 -90 31 -12 -404 -112 4 57 182 73 -28 227 127 -185 -276 -207 -119 -232 -179 56 -93 14 -76
5111g6J05j60J85l12K97k41J03l2J02J08n4J0K25j21r0L84k23j9O1j34R6l03j22
$$ -76 29 -131 54 -258 39 -202 -99 -131 -29 79 25 35 260 139 49 433 210 191 252 118 214 -89 -211
5134b11J2J14J11j90J12j12K4m4J12J4J87k49k66j00L23j32R8M3j7K39K8KP7j72
$$ -211 -199 -85 26 -164 -52 -164 -140 -184 -72 -58 129 -120 -386 -486 -163 -295 -197 -154 -171 68 96 98 175 3
5158CN5j68J99k57R7J05l98L72k9Q4J75j65k5O0k26J66J17k77Q9m0P2j97mJ56
$$ 3 58 -110 89 -168 -71 34 -364 8 -21 63 238 73 48 108 -118 48 165 -112 -23 -63 9 -188 -192 -36
5182c6mJ67l9n8l0m2L53m19nm6J55J18q9k09Q5K44J48m1l01L49l21j11J51l65
$$ -36 -40 127 88 30 0 -42 311 -108 -113 -159 -4 114 25 -184 -99 145 293 252 -49 300 -21 -132 19 -346
5206c46l7K42J75nJ50p5J2k38n5l6J86L4l02M3K00L28k26P3r0K92n26K67k8p0
$$ -346 -383 -141 34 29 179 104 116 -122 -177 -213 -27 7 -295 -252 -52 276 50 123 33 325 -201 66 38 -32
5230c2j01RP9j6M6L4j28K11K65n46J41o3J3p4m9J03l3J24k23M93r9O8j00km3k39
$$ -32 -133 -124 -45 -61 -15 19 -109 102 367 -179 -38 -101 -88 -162 -211 -108 -141 -17 -240 253 154 222 122 120 77 -162
5256a62j54K67Oj16J50P8K10N0j55j54L52n10L47j11l70L16l10J68J85j41N4K36
$$ -162 -316 -49 -43 -159 -9 69 279 329 174 20 372 -138 209 98 -272 44 -266 -98 87 -54 0 236
5278B36no8j34K5M9j10k87m2J84K03k82J58L3N5P2k25K70j53j63J67k22K32j00
$$ 236 231 163 29 54 103 -7 -294 -336 -152 51 -231 -73 -40 15 87 -138 132 -21 -184 -17 -239 -7 -107
5301a07K06J20K4K1j31J91k70R5j54kj36j5L99j75R6k08Q3J99k5j31m7j1l83J59
$$ -107 99 219 243 264 133 324 54 149 -5 -7 -143 -158 241 66 162 -46 37 236 211 80 33 22 -361 -202
5325b02l3K91oo2j00L36j67J86P8l91N8p8J15l4o8p5qK81q9o6R7j83K70j32p1
$$ -202 -235 56 50 -12 -112 224 57 243 321 -70 -12 -90 25 -9 -77 -152 -160 121 32 -34 63 -120 150 18 -53
5350e3L68m13J59k91J38K03j68J29K9k58J37N3r5J44j39J9K19k64j1j32K22R7
$$ -53 315 -98 61 -230 -92 111 -57 72 101 -157 -20 33 -62 82 -57 -38 181 -83 -94 -226 -4 93
5372I3j86N6L00m5n10L86r2J99j19r5O9J12o7j84J44j42K29j32k43L27k94M7O4
$$ 93 -93 -37 263 218 -292 94 2 201 82 -13 56 168 101 -83 61 -81 148 16 -227 100 -194 -147 -83
5395h3p1m9L3j37K58j35RJ50P4l4J30k00O6K5j53K14R3k12J66K25j1R3j65k05
$$ -83 -154 -203 -170 -307 -49 -184 -175 -25 49 15 145 -55 11 36 -117 97 190 -22 144 369 358 451 286 81
5419H1Q4N5l31O8o5Mj19J65m0J98l21L33k48L2P4j81K2m5j76L7K92J42m0J50L0
$$ 81 165 220 -111 -43 -108 -104 -223 -58 -98 100 -221 112 -136 -104 -30 -211 -189 -234 -410 -373 -81 61 21 171 201
5444B01J89k36o7J2k09R9j43p0K85l08J35M19j02K05k31m0o5j51j56J43K7j85
$$ 201 390 154 87 99 -110 -11 -154 -224 61 -247 -112 307 205 410 179 139 74 -77 -233 -90 -63 -248
5466b48n8L24n3K40k4j68J34l12K5O4J20r5j49K9P7L82l60L51k52R9l9k80k5l
$$ -248 -306 18 -35 205 181 13 147 -165 -140 -76 44 -51 -200 -171 -94 288 -72 279 27 126 87 -193 -218 -221
5490b21J18k25L70L6j58J42nK34k5m18K71l08j0k23K03L61n1j81L57J17m1l8j03
$$ -221 -103 -328 42 78 -80 62 57 291 266 -152 119 -189 -199 -422 -219 142 91 -90 267 384 343 305 202
5513B02k20l4J30l53n8m4N0K84J02%N8k39K16n6l16K04l21L8Q3j6K30J48J31J43
$$ 202 -18 -52 78 -275 -333 -377 -327 -43 59 59 117 -122 94 38 -278 -74 -395 -357 -274 -290 -60 88 219 362
5537C62l8j94L22l59p0j62k7K63p8m2K91J66l9q9J6k00o8j12j24j33O5Q1j95K45
$$ 362 324 130 452 93 23 -139 -166 97 19 -23 268 434 395 306 322 122 54 -58 -182 -315 -250 -169 -364 -119
5561a19R2K09j82R2M0k98J18j19q5%J40q4J01N4L19k67L02l1j66Oq1j62M4J44
$$ -119 -27 182 0 92 132 -166 -48 -167 -252 -252 -112 -196 -95 -41 278 11 313 282 116 122 41 -121 -77 67
5585F7M5N6l17K71J06m5J96k97J4J63l30k08K25L5n5j7K16l0J55j38p5J36j60
$$ 67 112 168 -149 122 228 183 379 82 96 259 -71 -279 -54 -19 -74 -91 125 95 250 112 37 173 13
5608A3k70Q6R5j6m7k8K83j45J4L14k32j75J93k05K47Ll20j44L76J01P2j08k8Q9
$$ 13 -257 -171 -76 -92 -139 -167 116 -29 -15 299 67 -108 85 -120 127 130 -190 -334 42 143 215 107 79 168
5632A68n0j82N7j03N4k9O2R7j2j54R9Q7q8J56l94J90P2k45N43l77j27J2K55j25
$$ 168 118 -64 -7 -110 -56 -85 -23 74 62 -92 7 94 6 162 -232 -42 30 -215 328 -49 -176 -164 91 -34
5656c4J23L5j29J02k66J02K24j66K46k1p6j18q3K55j26k58L57k7l59M79J1m96
$$ -34 89 124 -5 97 -169 -67 157 -9 237 216 140 22 -61 194 68 -190 167 140 -219 260 271 -225
5678b25L37k03J33j98j48K88j07N6J46J84j67k0k9l5K6M1k66n1K07M2j23j25K88
$$ -225 112 -91 42 -156 -304 -16 -123 -67 79 263 96 76 47 12 38 79 -187 -238 -31 11 -112 -237 51
5701E1m8J58k8L4j93J04j5j13j51p5J63L6J05q7K12O0r8k78J52j89q9K6J9lJ06
$$ 51 3 161 133 167 -26 78 63 -50 -201 -276 -113 -77 28 -59 153 213 115 -163 -11 -200 -289 -263 -244 -247 -141
5726a41K73j29K2K40k04K17k02r3Q5k64J60L4j43J53J75k27K05j60K19q5j30l8
$$ -141 132 3 25 265 61 278 76 -17 68 -196 -36 -2 -145 8 183 -44 161 1 220 135 5 -33
5748c3j30M1j95J10J86K46p3J5J94k43N7K78l09j96r7j43J65J33p5lJ80j46L60
$$ -33 -163 -122 -317 -207 -21 225 152 167 361 118 175 453 144 -52 -149 -292 -127 6 -69 -72 108 -38 322
5771C22Qj01k58l5J6j36l1J34q1J82L14j14J68j91j35L3j57j69j61O4q0J06M84
$$ 322 330 229 -29 -64 -48 -184 -215 -81 -162 20 334 220 388 197 62 95 -62 -231 -392 -328 -408 -302 182
5794A82j72M8K19j27J12k92rr5j03R2P5N5l6K87k68J14J22r2M2l45J21n7N8l9
$$ 182 10 58 277 150 262 -30 -39 -134 -237 -145 -70 -15 -51 236 -32 82 204 112 154 -191 -70 -127 -69 -108
5818a08j28Q4P8K67P6j65J14j86J79m32m4K66l70J29L0J09K99R4m2k8j79N4Jn1
$$ -108 -236 -152 -74 193 269 104 218 32 211 -221 -265 1 -369 -240 -210 -101 198 292 250 222 43 97 98 47
5842D7J86m41MP7K18j15L12K8k52j21P4r5j49Kj30P9L58l39L89K8P4P1l67K38
$$ 47 233 -208 -204 -127 91 -24 288 316 64 -57 17 -78 -227 -225 -355 -276 82 -257 132 160 234 305 -62 176
5866A76j15j50m6m4j51J81l8K47J90N7RjJ02k30k33m5j38q1L7K4K10P9L0j52K83
$$ 176 61 -89 -135 -179 -330 -149 -187 60 250 307 316 315 417 187 -46 -91 -229 -310 -273 -249 -39 40 70 -82 201
5891B01J02l94J45k17k4M8o0J45j25p3M60M3K7k71J21k59J74j87J70Q9j59j02
$$ 201 303 -91 54 -163 -187 -139 -199 -54 -179 -252 208 251 278 7 128 -131 43 -144 26 115 -44 -146
5913a46K91n4K78k9j55l14Q0j11r4p7K74j47l69O67q9o7R1K05q5r5j11q2J69k15
$$ -146 145 91 369 340 185 -129 -49 -160 -254 -331 -57 -204 -573 94 5 -62 29 234 149 54 -57 -139 30 -185
5937a85p4J35j17J23L59j53m6K6j61J91M7N6l48J00J50M6k4J80j22j22K8k91K37
$$ -185 -259 -124 -241 -118 241 88 42 68 -93 98 145 201 -147 -47 103 149 125 305 183 61 89 -202 35
5960C5l01n9L23l5j1n7N1R7K8j91J10J18j9k14K20J1k24Q9j48K99k79J94L2l7
$$ 35 -266 -325 -2 -37 -48 -105 -54 43 71 -120 -10 108 89 -125 95 106 -118 -29 -177 122 -157 37 69 32
5984C2M6J86k12k4J83k71K00j25j61J16K9k12J86o4M5J53j45J87r0j97K72k60
$$ 32 78 264 52 28 211 -60 140 15 -146 -30 -1 -213 -27 -91 -46 107 -38 149 59 -138 134 -126
6006a26Q1m5J36K46m24J08J66N7j19k44L32n0k21Q4K2J00j72J29nm7N7j41J80
$$ -126 -45 -90 46 292 -132 -24 142 199 80 -164 168 118 -103 -19 3 103 -69 60 55 8 65 -76 104
6029A04k37j91n7L38n6L8j72L12p9j61J89PQ4j77k6J59J69k28J54o8J00pJ7j82
$$ 104 -133 -324 -381 -43 -99 -61 -233 79 0 -161 28 35 119 -58 -84 75 244 16 170 102 202 195 212 30
6053C0J13M8k04O4K28k39j74K16q4j04Ok2k6pJ16J20P2n9j38J15j35J04j25K2
$$ 30 143 191 -13 51 279 40 -134 82 -2 -106 -100 -122 -148 -155 -39 81 153 94 -44 71 -64 40 -85 -63
6077f3K19m44K55L31p6J3j31J02r5q9q3J22j22j38K06o0nN2J22o3L9o1j1R5j16
$$ -63 156 -288 -33 298 222 235 104 206 111 22 -61 61 -61 -199 7 -53 -58 -6 116 53 92 31 20 115 -1
6102ak97P1R3J01n1J80J44r6Q9p0Kj98q5l6O1J45j92J31J23K1J88k93J66n8j58
$$ -1 -298 -227 -134 -33 -84 96 240 144 233 163 165 -33 -118 -154 -93 52 -140 -9 114 135 323 30 196 138 -20
6127b0p1k74L26m85L20J64n0J52K4J17m4p7j51K3O0j7k51L06J5L9J30m2O5O4k86
$$ -20 -91 -365 -39 -524 -204 -40 -90 62 86 203 159 82 -69 -46 14 -3 -254 52 67 106 236 194 259 323 37
6152C7J0j29j34J7l8j09K85j67N0L25k2j97J70j10n9N3l28K30l4N0K39K2R0j37
$$ 37 47 -82 -216 -199 -237 -346 -61 -228 -178 147 125 -72 98 -12 -71 -18 -346 -116 -150 -100 139 161 251 114
6176A14J12M5R4m08j48K15n9J27j25O6L6J93k17M8k1q9L8l13K82k29o9J44J56
$$ 114 226 271 365 -43 -191 24 -35 92 -33 33 69 262 45 93 72 -17 21 -292 -10 -239 -308 -164 -8
6199hm4O9J63J73j07j27m3N3m34K76j95R0K95P6m37N84k16Rr9j23k7k8k30J08
$$ -8 -52 17 180 353 246 119 76 129 -305 -29 -224 -134 161 237 -200 384 168 177 78 -45 -72 -100 -330 -222
6223b22m3M7OJ34K40k69O3n9K83l78l4k46L43l7L39k95L00k27J55K54j14j80r
$$ -222 -265 -218 -212 -78 162 -107 -44 -103 180 -198 -232 -478 -135 -172 167 -128 172 -55 100 354 240 60 51
6246E1j1J24r4q4L9J72j06J22k74K55K77m45q6j52J30L7j73L11r6j23Q5m6J30
$$ 51 40 164 70 -14 25 197 91 213 -61 194 471 26 -60 -212 -82 -45 -218 93 -3 -126 -41 -87 43
6269D3j7J5M1q4j90Q6P8J2J98j68l3oJ24p3p2J88k54LJ05JK8k96J53N9N8o7J72
$$ 43 26 41 82 -2 -192 -106 -28 -16 182 14 -19 -25 99 26 -46 142 -112 -109 -4 -3 25 -271 -118 -59 -1 -68 104
6296A04q7K7j47J88k05J07j25L6p7J68o2o5L56j73O5m0J3N2k20oj1J01k78K87
$$ 104 17 44 -103 85 -120 -13 -138 -102 -179 -11 -73 -138 218 45 110 70 83 135 -85 -91 -102 -1 -279 8
6320HNn0J17r2PK4Rk53L98k61J21n5N2o3K64k35N4L4k06QK65j28j15J78j70J40
$$ 8 13 -37 80 -12 -5 19 28 -225 173 -88 33 -22 30 -33 231 -4 50 84 -122 -114 151 23 -92 86 -84 56
6346E6N0N6M0j47J23k11j86L21j83n1M3O6j3K4k9J33j9q9N4rl10M60j45Q5O7l10
$$ 56 106 162 202 55 178 -33 -219 102 -81 -132 -89 -23 -36 -12 -41 92 73 -16 38 29 -281 179 34 119 186 -124
6372a24J90j04J7m8J9O6K5k70J02L06n6R7j46Q7J14j10j14k25J7K01k32pM08j51
$$ -124 66 -38 -21 -69 -50 16 41 -229 -127 179 123 220 74 161 275 165 51 -174 -157 44 -188 -195 213 62
6396F2j51K66j2j7mj86K0k30K81j80R0J25j59L06K34k78o4l0j58j19o1J3K15m
$$ 62 -89 177 165 148 144 -42 -22 -252 29 -151 -61 64 -95 211 445 167 103 73 -85 -204 -265 -252 -37 -41
6420d1K43l9R5r7Q5l53K8j42k0J04K72k52J24K64p2r4L07k24j6k38J08k01J20
$$ -41 202 163 258 161 246 -107 -79 -221 -241 -137 135 -117 7 271 199 105 412 188 172 -66 42 -159 -39
6443c9J49k33J27J51j43J97R5q9l35j61J71j49j07LK44lL25j4j55P8l0o3k10J94
$$ -39 110 -123 4 155 12 209 304 215 -120 -281 -110 -259 -366 -363 -119 -122 203 189 34 112 82 19 -191 3
6467Ck17M8J11L60j84k1J72j76J30l1l44K08j26k58K62p6k5J28K58o4j15j37n7
$$ 3 -214 -166 -55 305 121 100 272 96 226 195 -149 59 -67 -325 -63 -139 -164 -36 222 158 43 -94 -151
6490a51K09O3l12j36J96k04L41N4n5K6P1R9j1K41m41k4J61m4l7k76k8K87J4J74
$$ -151 58 121 -191 -327 -131 -335 6 60 5 31 102 201 190 431 -10 -34 127 83 46 -230 -258 29 43 217
6514B17K8k13r4J85q3K1j64J2J29j21R2k92K60R1l62L47J9j87L04r6j00J28j16
$$ 217 245 32 -62 123 40 61 -103 -91 38 -83 9 -283 -23 68 -294 53 72 -115 189 93 -7 121 5
6537Ek8j34K20o1J8j23R0j37N0j0N0N5j42M5K16k17J86l2%j15Q4J87j89l3o9P
$$ 5 -23 -157 63 2 20 -103 -13 -150 -100 -110 -60 -5 -147 -102 114 -103 83 51 51 -64 20 207 18 -15 -84 -77
6563g7P7j35j81K70j05K38m6m9Po4O3R0m19L64k15N1P4k5K3K38ll81J98J03jJ18
$$ -77 0 -135 -316 -46 -151 87 41 -8 -1 -65 -2 88 -331 33 -182 -131 -57 -82 -59 179 176 -205 -7 96 95 213
6589B13j62J96k15J74j39m2J47n3l1q0Q4j78M9j16J57J49l51M5R2j57q7J90k15
$$ 213 51 247 32 206 67 25 172 119 88 8 92 -86 -37 -153 4 153 -198 -153 -61 -218 -305 -115 -330
6612c30L02j86J37P0j17N0q8J42j2l9J43j0j99K66O2K1R4l45J25P7J17l11q2J72
$$ -330 -28 -214 -77 -7 -124 -74 -162 -20 -32 -71 72 62 -137 129 191 212 306 -39 86 163 280 -31 -113 59
6636E9j59K92j46l04L78k39n9J15j56j9j5P3j04J11K4J18K39k12K2O7j35P4o9
$$ 59 -100 192 46 -258 120 -119 -178 -63 -219 -238 -253 -180 -284 -173 -149 -31 208 -4 18 85 -50 24 -45
6659d5j34J06N9K58l04J04N8n9j07J09rl9O5j30N8o3j08N2J94p2Q9n4n4K55j98
$$ -45 -179 -73 -14 244 -60 44 102 43 -64 45 36 -3 62 -68 -10 -73 -181 -129 65 -7 82 28 -26 229 31
6684C1k1R5k51N4QQP6N5O3j43K9O7j69J96Mj03P8k70Ln2J75K13j84K61q9m1L9
$$ 31 10 105 -146 -92 -84 -76 0 55 118 -25 4 71 -98 98 102 -1 77 -193 -190 -242 -67 146 -38 223 134 93 132
6711A32l12N9J46n6l9J68n3j13J76j63K12J82l64o0o6J95Q6n01J81o8j3J87K33
$$ 132 -180 -121 25 -31 -70 98 45 -68 108 -55 157 339 -25 -85 -151 44 130 -371 -190 -258 -271 -84 149
6734A49Qn3j15J63l4j70n3q4J34K0R4l6J13j8j4k4j91J18n0l3j91L91l11K69K17
$$ 149 157 104 -11 152 118 -52 -105 -189 -55 -35 59 23 136 118 104 80 -111 7 -43 -76 -267 124 -187 82 299
6759B99j45j94J79k6J4r6k03J00L0J4m27K64K27K38j56J74k22j73Q2j7j14K38
$$ 299 154 -40 139 113 127 31 -172 -72 -42 -28 -455 -191 36 274 118 292 70 -103 -21 -38 -152 86
6781H6m08M04J80k58j00K73J29j67j49k0j35J91M1R3k32K79k70o2J14Q8k7J74
$$ 86 -322 82 262 4 -96 177 306 139 -10 -30 -165 26 67 160 -72 207 -63 -125 -11 77 50 224
6803B24j43M0j27L2n8K12J28k71q2N9j02L6R9NK07m74N74j59k84J63Q4k69Q0p5
$$ 224 81 121 -6 26 -32 180 308 37 -45 14 -88 -52 47 52 259 -215 359 200 -84 79 163 -106 -26 -101
6827a01j24J67j76M31j10PM1k17L4K84m81K50j90l3K14K4K74n1n6r6j76O5j11
$$ -101 -225 -58 -234 197 87 94 135 -82 -48 236 -245 5 -185 -218 -4 20 294 243 187 91 -85 -20 -131
6850a31R3Rj64M13k84J96Q7j13j0R3p3j69j27r5J20m7J97j47L04o5L9R3J9j74
$$ -131 -38 -29 -193 220 -64 132 219 106 96 189 116 -53 -180 -275 -155 -202 -5 -152 152 87 126 219 238 64
6874F4k9ro8j4K16l38L38l36J0K28J11o3L3j61j40K04k72J27J14r4O1O0k1J08
$$ 64 35 26 -42 -56 160 -178 160 -176 -166 62 173 110 143 -18 -158 46 -226 -99 15 -79 -18 42 21 129
6898A29l41Q8J9L41k70j41N1J80k01nR7n1j22K90k45O7J65j20k7j0p8J45Q9k3
$$ 129 -212 -124 -105 236 -34 -175 -124 56 -145 -150 -53 -104 -226 64 -181 -114 51 -69 -96 -106 -184 -39 50 27
6922B7m3j82K55J59j92j34J19j01J56p6j46L7M6R5Q4J5r5K6L1M3Qm1j01R0j60
$$ 27 -16 -198 57 216 24 -110 9 -92 64 -12 -158 -121 -75 20 104 119 24 50 81 124 132 91 -10 80 -80
6947h0R2j03R5L6l9N4R7k26L1N8l62J04J60k4O5j48L43k54J55p0K68j29p8J02
$$ -80 12 -91 4 40 1 55 152 -74 -43 15 -347 -243 -83 -107 -42 -190 153 -101 54 -16 252 123 45 147
6971A47j86R7k27n4L84j42l6K9J39Ln4j52O1K9k19J89k53P9N3J09m1n6K21j90
$$ 147 -39 58 -169 -223 161 19 -17 12 151 154 100 -52 9 38 -181 8 -245 -166 -113 -4 -45 -101 120 -70
6995g0p0n5K26n3J27j65j06K34j7n4J14jj5J15o6M9L0j28j99J57j76k6Q8r8J79
$$ -70 -140 -195 31 -22 105 -60 -166 68 51 -3 111 110 95 210 144 193 223 95 -104 53 -123 -149 -61 -159 20
7020B0q7n3R7o9O6J7j42J06j65J77q6P8j08K68J5j48K34k10j04J83j44Q2K75o42
$$ 20 -67 -120 -23 -92 -26 -9 -151 -45 -210 -33 -119 -41 -149 119 134 -14 220 10 -94 89 -55 27 302 -340
7044c40L46J63p4P4j07QJ71k81J06l1k3p4l0j26K08J20j07o7J71j92j5k8R4l4
$$ -340 6 169 95 169 62 70 241 -40 66 35 12 -62 -92 -218 -10 110 3 -64 107 -85 -100 -128 -34 -68
7068f8q8k6R3N8o1J36j66J49k7J35J21j44k17J24M4j23J56N4q0k3Nk49J19L36
$$ -68 -156 -182 -89 -31 -92 44 -122 27 0 135 256 112 -105 19 63 -60 96 150 70 47 52 -197 -78 258
7092B58j19k41q0N3L3R5K27k45J20l40K65L4M6j9J18k53K57k57r6J62k23Q8J36
$$ 258 139 -102 -182 -129 -96 -1 226 -19 101 -239 26 60 106 87 205 -48 209 -48 -144 18 -205 -117 19
7115A9j07j0J15k3R8o0j65l1J4l5K73l90O3J28K16j4N5J15k14l6j65R2j44L40
$$ 19 -88 -98 17 -6 92 32 -133 -164 -150 -185 88 -302 -239 -111 105 91 146 261 47 11 -154 -62 -206 134
7139A34Lk34J31O4j16K70rk43q2K65l39l5J36k26L15j45K49m2OR0J06k29j15M7
$$ 134 137 -97 34 98 -18 252 243 0 -82 183 -156 -191 -55 -281 34 -111 138 96 102 192 298 69 -46 1
7163Ak27J65q8O3J19o1Q1M2r1K94j88l85K01j40mJ52j19L5K08l9Q8M2j57k13K07
$$ 1 -226 -61 -149 -86 33 -28 53 95 4 298 110 -275 -74 -214 -218 -66 -185 -150 58 19 107 149 -8 -221 -14
7188a4O8j4J02n7K23k54qJ98j53o9J31k45J75l5j90QP0q0J45n8r6R9p7M7M0Q3
$$ -14 54 40 142 85 308 54 46 244 91 22 153 -92 83 48 -142 -134 -64 -144 1 -57 -153 -54 -131 -84 -44 39
7214C9j43j7K0J24r5j0J64r1M8n8R3J72j45j92J36m0P9j61N1k9K22l08J64P3k0
$$ 39 -104 -121 -101 23 -72 -82 82 -9 39 -19 74 246 101 -91 45 5 84 -77 -26 -55 167 -141 23 96 76
7239G6l09K62J0j54K32k83J67p5p3J53j31J8K10M1j67L05k81j0j22Q6Q7P0O0n7
$$ 76 -233 29 39 -115 117 -166 1 -74 -147 6 -125 -107 103 144 -23 282 1 -9 -131 -45 42 112 172 115
7263A15J85k47K32j84q8O8J33k25J4q3J13j75J27k9o8R1J56j00j76K09j28L8l6
$$ 115 300 53 285 101 13 81 214 -11 3 -80 33 -142 -15 -44 -112 -21 135 35 -141 68 -60 -22 -58
7286e8jJ28j8k29J78Q5k54K49M8l8j18Kj99R2O9JJ88P1K8K5k86nJ26j92K00l44
$$ -58 -59 69 51 -178 0 85 -169 80 128 90 -28 -26 -225 -133 -64 -63 125 196 224 249 -37 -42 84 -108 92 -252
7312b52M2N3J09M1j65J90R0J3j72K9R6Q0k58K7J38o1K6o2J57k85K38p2J3L0J7
$$ -252 -210 -157 -48 -7 -172 18 108 121 -51 -22 74 154 -104 -77 61 0 26 -36 121 -164 74 2 15 45 62
7337F2j28l3j97L30p8J11J20l17K63k57J54K85k21j30J6oK28j89r3m7P1J74n8
$$ 62 -66 -99 -296 34 -44 67 187 -130 133 -124 30 315 94 -36 -20 -26 202 13 -80 -127 -56 118 60
7360F0nn4o4K03q5P4k81J02j25oJ98J04j54q5J32J6J43k34J19N5k62j31K10J42
$$ 60 55 1 -63 140 55 129 -152 -50 -175 -181 17 121 -33 -118 14 30 173 -61 58 113 -149 -280 -70 72
7384G2j07R3P0N0k09K4j5K67j6l07P7k02K71k90J21J59qQ2M0j22l2J94k60J38
$$ 72 -35 58 128 178 -31 -7 -22 245 229 -78 -1 -203 68 -222 -101 58 50 132 172 50 18 212 -48 90
7408I0k82Q8K19l32J54q7J11J00R0J9m2j60L3j00J35j44J5N0J07P6k98J46j73
$$ 90 -192 -104 115 -217 -63 -150 -39 61 151 170 128 -32 1 -99 36 -108 -93 -43 64 140 -158 -12 -185
7431a85K59N5j37j68R7OK1Q1j42L98j24k87L09o7o1j46j80J41k9P2o0L81j44m4
$$ -185 74 129 -8 -176 -79 -73 -52 29 -113 285 161 -126 183 116 55 -91 -271 -130 -159 -87 -147 234 90 46
7455D6p8O9j5j04J50kl03K92R2k21J74r5p9P5m1q3R2j20l8J67p1L4N8q9K20j68
$$ 46 -32 37 22 -82 68 66 -237 55 147 -74 100 5 -74 1 -40 -123 -31 -151 -189 -22 -93 -59 -1 -90 130 -38
7481c8K84k0l17J93J66l57J23p9j62K04J20j82R9J1P4p3R6L2j91J82l29J07m7
$$ -38 246 226 -91 102 268 -89 34 -45 -207 -3 117 -65 34 45 119 46 142 174 -17 165 -164 -57 -104
7504a04J75j9j1j11K37j25n4M9N5M0k08n4K56k21J72ol14K50O9nj44Q5j01M9K23
$$ -104 71 52 41 -70 167 42 -12 37 92 132 -76 -130 126 -95 77 71 -243 7 76 71 -73 12 -89 -40 183
7529A83M8k84J36j98J73j24M1L0j70K20l3k46K35K01k61K83j45L4rk94J22J18
$$ 183 231 -53 83 -115 58 -66 -25 5 -165 55 22 -224 11 212 -49 234 89 123 114 -180 -58 60
7551F0M6J0k47M7M0%M4M0pJ22l2k55J24j5n4J63l21K21o2j09K44M6j07n0L3j05
$$ 60 106 116 -131 -84 -44 -44 0 40 33 155 123 -132 -8 -23 -77 86 -235 -14 -76 -185 59 105 -2 -52 -19 -124
7577a24K46k7k32K34k35K95o8j05Q7o7j61J74M8j33J01j59K69k17K6K6L1m9J80
$$ -124 122 95 -137 97 -138 157 89 -16 71 4 -157 17 65 -68 33 -126 143 -74 -48 -22 9 -40 140
7600A40j68r5J35l39L40QP7q1J83j22J16k15J7K26l49J47n9p5K00J51l7j34j56
$$ 140 -28 -123 12 -327 13 21 98 17 200 78 194 -21 -4 222 -127 20 -39 -114 86 237 200 66 -90
7623i0K58k20oj81J14n9k1J96P5r8O7j61K19J1j15K2on8m4J66q7K68K5j32Qk3
$$ -90 168 -52 -58 -239 -125 -184 -205 -9 66 -32 35 -126 93 104 -11 11 5 -53 -97 69 -18 250 275 143 151 128
7649A28j98R6j07j3K2q2J42j22N9J3n2J16n0o9j45o7K29m8J37J3l9K05k15L6J15
$$ 128 -70 26 -81 -94 -72 -154 -12 -134 -75 -62 -114 2 -48 -117 -262 -329 -100 -148 -11 2 -37 168 -47 -11 104
7674A04j03J11m1n8n5J8J23Q5L8k5L0J0k55K27j2j94j98l2m9J52J4j47P2J17J5
$$ 104 1 112 71 13 -42 -24 99 184 222 197 227 237 -18 209 197 3 -195 -227 -276 -124 -110 -257 -185 -68 -53
7699e3j32RK37j71k6O5K2J16J5J1J4j8q1M0L9k69m7L52k6k44M9j9l1P6K40k20
$$ -53 -185 -176 61 -110 -136 -71 -49 67 82 93 107 89 8 48 87 -182 -229 123 97 -147 -98 -117 -148 -72 168 -52
7725e2PJ56j98J01r8J43k0k48L72l23m1K24j2Q5O5j29J42j41j57L6J55o5L3l0
$$ -52 -45 111 -87 14 -84 59 39 -209 163 -160 -201 23 11 96 161 32 174 33 -124 -88 67 2 35 5
7749En0P6k17J88o0K04k63J57r5J4J54k85P2OK60k02J26M7N5n3K9j42j65Q5J19
$$ 5 -45 31 -186 2 -58 146 -117 40 -55 -41 113 -172 -100 -94 166 -36 90 137 192 139 168 26 -139 -54 65
7774F5qo4K61k95J23l8K30k00lk8j36j7J07j63L48k14k2MJ81j75J06j50P6M2o0
$$ 65 57 -7 254 -41 82 44 274 74 71 43 -93 -110 -3 -166 182 -32 -54 -50 131 -44 62 -88 -12 30 -30
7799c0R6J00k78R1q5Q2J82r9k03K21k33L05o9o1K81l28Q9j01J60L12n69J05j2
$$ -30 66 166 -112 -21 -106 -24 158 59 -144 77 -156 149 80 19 300 -28 61 -40 120 432 -137 -32 -44
7822d4j76K78j37M9Q7J71j95o2R4J67k48J49J3o4k39K28l16L37j85j22K34N2n2
$$ -44 -220 58 -79 -30 57 228 33 -29 65 232 -16 133 146 82 -157 71 -245 92 -93 -215 19 71 19
7845A9k1J34j75J19p2J46j92q7L34r7k37J11J41j49j0J95j74kn8j49J41K87l8
$$ 19 -2 132 -43 76 4 150 -42 -129 205 108 -129 -18 123 -26 -36 159 -15 -17 -75 -224 -83 204 166
7868A66J9k52L60m39M3K6J76l07J52k6J66m1rJ06q9J7n1J06r1O6K8j37J62q7o
$$ 166 185 -67 293 -146 -103 -77 99 -208 -56 -82 84 43 34 140 51 68 17 123 32 98 126 -11 151 64 58
7893E8m2n9J13k19J48K54l71J86J6n9j09J38k28J89K3j45J37m0J48j08j33Q8k29
$$ 58 16 -43 70 -149 -1 253 -118 68 84 25 -84 54 -174 15 38 -107 30 -10 138 30 -103 -15 -244
7916b44J31J94L0m6j87K67j85m9RR7o7J76l6N3j37l3j12J57R7L2j49jk21K56j75
$$ -244 -113 81 111 65 -122 145 -40 -89 -80 17 -50 126 90 143 6 -27 -139 18 115 147 -2 -3 -224 32 -143
7941a43K41k02L3q4J99J51k88M2N2J9Q6j64kj28J51L7L7L8J37o0j85n5J96j04
$$ -143 98 -104 -71 -155 44 195 -93 -51 1 20 106 -58 -60 -188 -37 0 37 75 212 152 -33 -88 108 4
7965DlJ11k01L81l36km9J36R4k48k9M0j6R5K1q2K09j06k49K65j2Q2k07l8N3O5
$$ 4 1 112 -89 292 -44 -46 -95 41 135 -113 -142 -102 -118 -23 -2 -84 125 19 -230 35 23 105 -102 -140 -87 -22
7991b2l2K32j33j75J16j76J56K32n1L1O3k53p9j4j00K74j75J81m8n8J30j22k38
$$ -22 -54 178 45 -130 -14 -190 -34 198 147 178 241 -12 -91 -105 -205 69 -106 75 27 -31 99 -23 -261
8014b61K67k8o6Q4j31J4K88q0j4k5J69k26O6L7j27j77J41p7R9j2j9J11m4P1N6
$$ -261 6 -22 -88 -4 -135 -121 167 87 73 48 217 -9 57 94 -33 -210 -69 -146 -47 -59 -78 33 -11 60 116
8039A16l6j20K2R1J56k98L3R9o0L7J38k42K05j68l2J61N1j73j16nK01p1j65L08
$$ 116 80 -40 -18 73 229 -69 -36 63 3 40 178 -64 141 -27 -59 102 153 -20 -136 -141 60 -11 -176 132
8063A32j21k52N6K72q8J69j11mj45P7j1K4pJ8j22K2J19J64j12K3j30r4p3R1J76
$$ 132 11 -241 -185 87 -1 168 57 53 -92 -15 -26 -2 -9 9 -113 -91 28 192 80 103 -27 -121 -194 -103 73
8088G3j1n2J54j42m3P9M1k43J36m9k9j46J15K43j65LM5J65k03q6J90lj61m6M3
$$ 73 62 10 164 22 -21 58 99 -144 -8 -57 -86 -232 -117 126 -39 -36 9 174 -29 -115 75 72 -89 -135 -92
8113i2P2j9K4k13K44m0J8J70K9k50J31J27j85k16J50J2K06j50m1M2j19K22k61
$$ -92 -20 -39 -15 -228 16 -24 -6 164 193 -57 74 201 16 -200 -50 -38 168 18 -23 19 -100 122 -139
8136a39K3J25j52J88l7k0J04MJ0L6j1l63N53k88k83J13n0J21K11j90r5J89N7O5
$$ -139 -116 9 -143 45 8 -12 92 96 106 142 131 -232 321 33 -250 -137 -187 -66 145 -45 -140 49 106 171
8160A71j62q0Rj43p8J99j81K42p9J8L09j34j03j05N0N6j08L8K75k18Q2K5j05J07
$$ 171 9 -71 -62 -205 -283 -84 -265 -23 -102 -84 225 91 -12 -117 -67 -11 -119 -81 194 -24 58 83 -22 85
8184H5K1n5k55Q4J04K70k67
$$ 85 106 51 -204 -120 -16 254 -13
8191a3
$$ Imaginary data points
##PAGE= N=2
##DATA TABLE= (X++(I..I)), XYDATA
0@%%%%%%QqQj6J6k4L2m0M8n6P2q8J11j39J63j97K37k78L25l80M43n13N92o78P77
$$ 0 0 0 0 0 0 0 8 0 8 -8 8 -16 16 -24 24 -32 40 -48 63 -76 87 -110 127 -151 174 -206 237 -276 316 -362 415
31D15q87J007j142J292j456J635j832K047k286K550k833L145l484L852m258M702
$$ 415 -472 535 -607 685 -771 864 -968 1079 -1207 1343 -1490 1655 -1829 2023 -2235 2467
47B467n184N712o295O934p639Q421r290J0262j1355J2596j4020J5671j7612J9933
$$ 2467 -2717 2995 -3300 3634 -4005 4416 -4874 5388 -5967 6629 -7391 8280 -9332 10601
61A0601k2767K6316l0914L7144m6099O0151q5549J45956n65472n93514P12388
$$ 10601 -12166 14150 -16764 20380 -25719 34432 -51117 94839 -470633 -1064147 -351759
72c51759J78686J4466L0082L03989J96221O3372o8548j59463l72239k30890J61292
$$ -351759 -173073 -158607 -128525 175464 371685 435057 366509 207046 -165193 -396083 -234791
83b34791M64882J62637k59615j50426K61523K34401L5927m6919j07349k90159
$$ -234791 230091 392728 133113 -17313 244210 478611 514538 467619 360270 70111
93G0111k99510N3394L40926L6742l11280j50275K18628L02672J04823j00968j74507
$$ 70111 -229399 -176005 164921 201663 -109617 -259892 -41264 261408 366231 265263 90756
104I0756l02960l43938o6544K09562R4372j94088j31129L38622N32674K21342
$$ 90756 -212204 -556142 -622686 -413124 -318752 -512840 -643969 -305347 227327 448669
114D48669p627l6656j85121k66695n3801J76421M7242k75059k28649J66066L34202
$$ 448669 441042 404386 219265 -47430 -101231 75190 122432 -152627 -381276 -215210 118992
125A18992J52238o9152j19494o6536p8056J016K17078J32850k30609k83652O0543
$$ 118992 271230 202078 82584 16048 -62008 -60992 156086 288936 58327 -225325 -164782
136a64782K97311J19900j44603j06688j2599o5337J2309J70025O5207k29382l03541
$$ -164782 132529 252429 107826 1138 -11461 -76798 -64489 105536 170743 -58639 -362180
147c62180J0953K98080J77105m7167n0484K8711L8448J6588O3596O0586j96523
$$ -362180 -351227 -53147 123958 76791 26307 55018 93466 110054 173650 234236 37713
158C7713l55539n3869K60869J49007j08276j22047L1668N1643J5026J29011J44474
$$ 37713 -317826 -371695 -110826 38181 -70095 -192142 -160474 -108831 -93805 35206 179680
169A79680p5866j73473K3718K52874J79710j38960k46670p7684j305k4228M3542
$$ 179680 103814 -69659 -45941 206933 386643 247683 1013 -76671 -77976 -102204 -58662
180e8662J06848N39j54305k6557K62008J89128j43722k24183o1236L6318R406
$$ -58662 48186 48725 -105580 -132137 129871 318999 175277 -48906 -110142 -73824 -64418
191f4418K0846R2115j483j65235n6097J73015J57860o9821k04183n8981J13419
$$ -64418 -43572 48543 47060 -118175 -174272 -1257 156603 86782 -117401 -176382 -62963
202f2963M6409j9564M8900N391j28044p5698J62320K34319j5999j75044j0931
$$ -62963 -16554 -36118 12782 18173 -109871 -185569 -23249 211070 195071 20027 9096
213I096J04144J4249n6254m5553n2002j22726r9519J21583K25894L4375j30406
$$ 9096 113240 127489 71235 25682 -26320 -149046 -248565 -126982 98912 133287 2881
224B881m7019J05203P9366o6808n8745J1327p8978j02241Q2166J74431J4682j63519
$$ 2881 -44138 61065 140431 73623 14878 26205 -52773 -155014 -72848 101583 116265 -47254
236d7254q6508J05572Q1171m1089j6237K2683l0578o0949J9664J18878K3333j60459
$$ -47254 -133762 -28190 52981 11892 -4345 18338 -12240 -73189 -53525 65353 88686 -71773
248g1773r7927J09031J35277J2510l3818L0993R087j02326m2556R0613o79j52615
$$ -71773 -169700 -60669 74608 87118 53300 84293 93380 -8946 -51502 39111 38432 -114183
260a14183r1189R2799J47750K9575k7443M4236K6320o1772l4267N1333L0457j06965
$$ -114183 -205372 -112573 35177 64752 37309 81545 107865 46093 11826 63159 93616 -13349
272a3349j37656L9390J21723j3752p3701K2008O5039l220k2948P9186Q1878q8735
$$ -13349 -151005 -111615 10108 -3644 -77345 -55337 9702 6482 -16466 62720 144598 55863
284E5863j28333J8508P4662j5027p7620n960Q0753K8300j8278N9565P0102n8095
$$ 55863 -72470 -53962 20700 5673 -71947 -77907 2846 31146 12868 72433 142535 84440
296H4440j36961m5775P2555Q455r6825k300J06880M2197j7958M0082Q2346j5016
$$ 84440 -52521 -98296 -25741 -17286 -114111 -116411 -9531 32666 14708 54790 137136 122120
308A22120j19801l9920O5684m671q7916l4999N1283M2358l3455r947Q5574L7386
$$ 122120 2319 -37601 28083 23412 -64504 -99503 -48220 -5862 -39317 -49264 36310 73696
320G3696o7652k2391P2393L5718q2565q0797L9178L2323o8034k1665Q2286N5374
$$ 73696 6044 -16347 56046 91764 9199 -71598 -32420 -97 -68131 -89796 -7510 47864
332D7864k9414k4156O1030N0161o8432p7882J5850J8991m8026m7442M6400Q8994
$$ 47864 18450 -5706 55324 105485 37053 -40829 -24979 -5988 -54014 -101456 -55056 33938
344C3938n492m0126N9326O9219l5697o1485J3882L4640o1829r9055J2431N4149
$$ 33938 28446 -11680 47646 116865 81168 19683 33565 68205 6376 -92679 -80248 -26099
356b6099l1395m3937L6342P6095K4498k3952L3179O7372l3223r2396k0987L3992
$$ -26099 -57494 -101431 -65089 11006 35504 11552 44731 112103 78880 -13516 -34503 -511
368e11j7385p8819j2474Q4692L4648k4438M0780O7608j8874q1329k5084N1575
$$ -511 -17896 -96715 -109189 -24497 10151 -14287 26493 94101 75227 -6102 -31186 20389
380B0389k187q2431k1439O0042L8740j191J8541N9104J1651q0104l9558N3720
$$ 20389 18202 -64229 -85668 -25626 13114 11923 30464 89568 101219 21115 -18443 35277
392C5277R034q2178o0181L3929N3293r299P080P6913K5271n9185k0982M7956J6734
$$ 35277 44311 -37867 -98048 -64119 -10826 -20125 -13045 63868 89139 29954 8972 56928 73662
405G3662q1009r2333O422M0372j2204m775M5291L3944k6367k8271N6999O0964
$$ 73662 -7347 -99680 -93258 -52886 -65090 -69865 -24574 9370 -16997 -45268 11731 72695
417G2695o1482r1189R837N8636J5190q818L5746M5755k6803k9900N7024N1878
$$ 72695 11213 -79976 -70139 -11503 3687 -5131 30615 76370 49567 19667 76691 128569
429A28569m9103r1962k8127M4632J4577l4809O101L0052j7912k5636L7538O7190
$$ 128569 79466 -12496 -40623 4009 18586 -16223 -10122 19930 2018 -23618 13920 81110
441H1110j6792r9598l0554N7136J2606m4709k2626L676j9425l5700K7966P5217
$$ 81110 64318 -35280 -65834 -8698 3908 -40801 -63427 -59751 -79176 -114876 -86910 -11693
453a1693j78o4509k715P9947P4758M494k0398J5174n655m7290n28M2405j6907
$$ -11693 -11871 -76380 -79095 852 75610 80104 59706 74880 69225 21935 21407 63812 46905
466D6905q7627m8220O3434P6534o282j8644K0596L106k4119k99L1762n699q6606
$$ 46905 -40722 -88942 -25508 51026 44744 26100 46696 49802 25683 25384 57146 51447 -35159
479c5159o2710M5645O4124l722l5670n292K0202q817j2278L6873P416p8319n6676
$$ -35159 -97869 -52224 11900 8178 -27492 -32784 -12582 -21399 -33677 3196 10612 -67707 -124383
492a24383M6948Q6977K3641l0158J0255L6691k750n496J9747j4031p9216q3707
$$ -124383 -77435 9542 33183 3025 13280 49971 47221 41725 61472 47441 -31775 -115482
504a15482R508Q1314K6926k9395J0717N1756L6036J0797J8487J2662o2149r1009
$$ -115482 -105974 -24660 2266 -27129 -16412 35344 71380 82177 100664 113326 51177 -39832
516c9832K663O3412P432n1233k8755L0129L2829m96J3603J4649m7159o6161R13
$$ -39832 -37169 26243 33675 -17558 -46313 -16184 16645 16149 29752 44401 -2758 -68919 -68006
529f8006O2759L2269n1722m6447L1082L9872N038P439R911k9363o5687j8615O1536
$$ -68006 -5247 27022 -24700 -71147 -40065 -193 4845 12284 22195 -7168 -72855 -91470 -29934
542b9934L2456m8722l4856L4180N9777L7334J8088K5000l713n1204j8412M4111
$$ -29934 2522 -46200 -81056 -46876 12901 50235 68323 93323 89610 38406 19994 64105
554F4105K2188n2787p0271K14N1183J3008j2895P113j0764m0731j1623M8444M6510
$$ 64105 86293 33506 -36765 -36551 14632 27640 14745 21858 11094 -29637 -41260 7184 53694
567E3694l3767o6034K570M3438J0914j8816j9049j7558l1667j8855M6268N8759
$$ 53694 19927 -46107 -43537 -99 10815 -8001 -27050 -44608 -76275 -95130 -48862 9897
579I897j5558m9268N327N8427L8126j4689j1606O609k0430j7170L7369M3006j8432
$$ 9897 -5661 -54929 -49602 8825 46951 32262 20656 27265 6835 -10335 27034 70040 51608
592E1608o0658j7425M8949L1410k1289j9595n375j3237j2022J7693M0933o147
$$ 51608 -9050 -26475 22474 53884 32595 13000 7625 -5612 -17634 59 40992 34845
604C4845o1956j7341N3065M0212j4883l3887j4158j3034l0306J664L6310m800
$$ 34845 -27111 -44452 8613 48825 33942 55 -14103 -27137 -57443 -55779 -19469 -24269
616b4269m5715q482N7125O4667M817k8249j722J27j8477j174J9773j077m3696
$$ -24269 -69984 -78466 -21341 43326 48143 19894 18172 18299 -178 -1352 18421 17344 -26352
629b6352l1517M2760N8200p052l3479m870J0328K78P09K2125R048m4269l5814
$$ -26352 -57869 -15109 43091 36039 2560 -2310 8018 8296 9005 31130 40178 -4091 -39905
642c9905L0471M5660j63l7190j7618J8335N893p730J4611M419l8484l8539J4814
$$ -39905 -9434 36226 36063 -1127 -18745 -410 5483 -2247 12364 16783 -21701 -60240 -45426
655d5426N1335J3460l3492n678K9593J2850j869N634J271k8808m3425M438M5631
$$ -45426 5909 19369 -14123 -19801 9792 22642 20773 26407 27678 -1130 -44555 -40117 5514
668E514O329l5218j6592K0134K4849P52K31J5709j1154l1756R477M2301J2810
$$ 5514 11843 -23375 -39967 -19833 5016 5768 5999 21708 10554 -21202 -11725 30576 43386
681D3386l6561l3799J4505K2843n120J909J4753o144k1906j062L1857J6055l8850
$$ 43386 6825 -26974 -12469 10374 5254 7163 21916 15772 -6134 -7196 24661 40716 1866
694A866l7326J2241K4334L112l387R957P263k0765j2921K6960J1601l7498l7490
$$ 1866 -35460 -23219 1115 4227 840 10797 18060 -2705 -15626 11334 22935 -14563 -52053
707e2053N226L0173Q687r439J1551J3567j1399j622K7820K2019j8503l9206j332
$$ -52053 -46827 -16654 -7967 -17406 -5855 7712 -3687 -5309 22511 44530 26027 -13179 -14511
720a4511K7762q30k0736k711O592n281p256K1718L4161q979l5409oK2834J262
$$ -14511 13251 12421 -8315 -11026 -4434 -9715 -16971 4747 38908 29929 -5480 -5486 17348 18610
734A8610k1832j3771Q963K99j1588J5603K7156o664k9689q641K3079J3599k1980
$$ 18610 -3222 -16993 -8030 -7731 -19319 -3716 23440 16776 -12913 -21554 1525 15124 -6856
747f856j3071J5050M078p501Q534K1538J014l0216j4486K6436J5653j7934j3617
$$ -6856 -19927 -4877 -799 -8300 234 21772 22786 -7430 -21916 4520 20173 2239 -11378
760a1378N181N831j0483n324J8791P300k3965q647K4373K1971p323j9112M766
$$ -11378 -6197 -366 -10849 -16173 2618 9918 -14047 -22694 1679 23650 16327 -2785 1981
773A981J1622j4013j0189J5223O668j5750j2012J7482K5759r871k3686L362R775
$$ 1981 13603 -410 -10599 4624 11292 -4458 -16470 1012 26771 16900 -6786 -3424 6351
786F351p489r956N745J1204j1407k0390J4342K5178m884j7453P88J5700K379j4118
$$ 6351 -1138 -11094 -5349 5855 -5552 -25942 -11600 13578 8694 -8759 -7971 7729 10108 -4010
800d010L932J4115j4045k0661O527K0882L949j5927J49K3193L789j6009j072O729
$$ -4010 -78 14037 -8 -20669 -14142 6740 10689 -5238 -5089 18104 21893 5884 4812 11541
814A1541q341k1189m546K1244P090j8679q47K0461P097j1577p927Q421N38k1578
$$ 11541 3200 -17989 -22535 -1291 5799 -12880 -13727 6734 13831 2254 -5673 2748 3286 -18292
828a8292m142K1440P593j2534n713J4970J4291j0448r364J3873M035j6704q649
$$ -18292 -22434 -994 6599 -5935 -11648 3322 17613 7165 -2199 11674 15709 -995 -9644
841i644J1619J1131j2254j4477J3924J5004j0305q844Q666Q429j0647j5268P689
$$ -9644 1975 13106 852 -13625 299 15303 4998 -3846 4820 13249 2602 -12666 -4977
854d977J2806j2620j2094J1843J5289k366j2108L347J2329j0638j7685O689J2176
$$ -4977 7829 -4791 -16885 -5042 10247 7881 -4227 -880 11449 811 -16874 -10185 1991
867A991m894j1854N273J9677L76j5776K866J1242q046j5596j145J3954K734j3716
$$ 1991 -2903 -14757 -9484 10193 10569 -5207 -2341 8901 855 -14741 -15886 -1932 802 -12914
881a2914L722J9066L47j1149O96J2761K928j4965k891J6890K316j2718M60J2798
$$ -12914 -9192 9874 10221 -928 -232 12529 15457 492 -2399 14491 16807 4089 4549 17347
895A7347L683j3873r035J2104J419j9859p044R348K587j0703p313J3751J0085
$$ 17347 21030 7157 -1878 10226 11645 -8214 -15258 -5910 -3323 -14026 -21339 -7588 2497
908B497j1396m451J2320L390j3427j1107P133J1022r569o857J5000J1946m650
$$ 2497 -8899 -13350 -1030 2360 -11067 -22174 -15041 -4019 -13588 -20445 -5445 6501 1851
921A851k961J1001J2235r349j4652R041J1756p197o940O895J1087m160j3369M779
$$ 1851 -1110 9891 22126 12777 -1875 7166 18922 11725 4785 11680 22767 18607 5238 10017
935A0017R615j2821j6208J556P991l086j3250J965J5054k556j0463N911J0471
$$ 10017 19632 6811 -9397 -7841 150 -2936 -16186 -14221 833 -1723 -12186 -6275 4196
948D196m333j4126j671J4045o10j5093R80J1902J635n446K464J4390L263j4620
$$ 4196 -137 -14263 -15934 -1889 -2499 -17592 -16612 -4710 -3075 -8521 -6057 8333 11596 -3024
962c024j314J4471J507j0632m312Q930N712r643k566J3608J441j3062l977R395
$$ -3024 -4338 10133 11640 1008 -3304 5626 11338 1695 -871 12737 14178 1116 -2861 6534
976F534O508j0474q482J1385O776q954l382P244L234j0542j0012Q464Q309j2503
$$ 6534 13042 2568 -5914 5471 12247 3293 -89 7155 10389 -153 -10165 -1701 6608 -5895
990e895j0286N662O243m600p075O133Q899q764q442J1682J0989m359q306L669
$$ -5895 -16181 -10519 -4276 -8876 -15951 -9818 -919 -9683 -18125 -6443 4546 187 -8119 -4450
1004d450J1197l272q777O973Q075o180p161N045J2506j001j2169L728J2625k716
$$ -4450 6747 3475 -5302 1671 9746 3566 -3595 1450 13956 12955 786 4514 17139 14423
1018A4423q447J126N846l148j2636N76J1353m844j3779o09Q384J840q859l511
$$ 14423 5976 7102 12948 9800 -2836 -2260 9093 4249 -9530 -10139 -1755 85 -8774 -12285
1032a2285R350j613j1553J826J1282K725q423m240J2028P220r595j850R666P22
$$ -12285 -2935 -4548 -16101 -14275 -2993 -268 -8691 -12931 -903 6317 -3278 -5128 4538 5260
1046E260q235k933R464O799j0544m674J1631N531n810n034M521N407p774p353
$$ 5260 -2975 -5908 3556 10355 -189 -4863 6768 12299 6489 1455 5976 11383 3609 -3744
1060c744Q816M923j0264o771O132R021l755r811N506O542p855o110O136N653n621
$$ -3744 5072 9995 -269 -7040 -908 8113 4358 -5453 53 6595 -1260 -7370 -1234 4419 -1202
1075a202j0409L611J0776m091p680M031N332k201p161J978R889l496j0072M757
$$ -1202 -11611 -8000 2776 -1315 -8995 -4964 368 -1833 -8994 -7016 2873 -623 -10695 -5938
1089e938J0252p51o569L53R828Q39q849L090Q579l508q316J70Q343K799r831k519
$$ -5938 4314 3563 -3006 -2653 7175 8014 -835 2255 10834 7326 -990 -820 7523 10322 491 -2028
1105b028Q709Q6p034m62N942Q83j0263m473R759K180j0328k381O235K411o043
$$ -2028 6681 6767 -267 -729 5213 6096 -4167 -8640 1119 3299 -7029 -9410 -3175 -764 -6807
1120f807m054Q644L939q900k058Q399M135m955m662O554P921n937m015P370M033
$$ -6807 -10861 -2217 1722 -7178 -9236 -837 3298 -1657 -6319 235 8156 2219 -1796 5574 9607
1135I607n743n036N471P277o851q949N867M810n409m693K953N100m665q713M879
$$ 9607 3864 -1172 4299 11576 4725 -4224 1643 6453 1044 -3649 -696 4404 -261 -8974 -4095
1150d095P490m822o543K133O728q89p445K530R691l265o839L417P440n53p666
$$ -4095 3395 -1427 -7970 -5837 891 2 -7443 -4913 4778 1513 -5326 -1909 5531 4978 -2688
1165b688M82R135j076q228J821N844p34n905j033P837O33r388o65O930L71o300
$$ -2688 -2206 6929 5853 -2375 -554 5290 4556 -1349 -2382 5455 6088 -3300 -3965 2965 3336 -2964
1181b964l189N708K517q983j893Q721J581o117j879N866M490n785l025P977K551
$$ -2964 -6153 -445 2072 -6911 -8804 -83 1498 -4619 -6498 -632 3858 -1927 -4952 3025 5576
1196E576n811j625M711M782m031n635O644M732o765m207L809L420l991o715M077
$$ 5576 -235 -1860 2851 7633 3602 -2033 4611 9343 2578 -1629 2180 5600 1609 -5106 -1029
1211a029N296o601n006N097L723k770n366J789O236m049n343M900N074j825m137
$$ -1029 4267 -2334 -7340 -2243 1480 -1290 -6656 -4867 1369 -2680 -8023 -3123 1951 126 -4011
1226d011J492P439o74o845L500O556l052n460R39O030k17p442J374O768k954n937
$$ -4011 -2519 4920 4246 -2599 901 7457 4405 -1055 -116 5914 5697 -1745 -371 6397 3443 -2494
1242b494O34M210M22o800j739P050o79o502K32N122J579n647k595O714K174o803
$$ -2494 -1860 2350 2772 -4028 -5767 1283 604 -5898 -5666 -544 1035 -4612 -7207 -493 1681 -5122
1258e122L31P196J607m177k399O508L776o127k202N699J305m538l255L937M536
$$ -5122 -4791 2405 4012 -165 -2564 3944 7720 1593 -609 5090 6395 1857 -1398 2539 7075
1273G075m967m742M691K407n455m351K301L891m689n837N120M656l702k173L659
$$ 7075 2108 -2634 2057 4464 -991 -5342 -3041 850 -3839 -9676 -4556 100 -3602 -5775 -2116
1288b116M713k082n655K905N224l301l668L532M678j10m830K065P180j958o367
$$ -2116 2597 515 -5140 -2235 2989 -312 -3980 -448 4230 4120 -710 1355 8535 6577 210
1303B10J662L071k438n333O6O092l50n649J848M776j242l990j139L828j98p256
$$ 210 1872 4943 2505 -2828 -2762 3330 2980 -2669 -821 3955 2713 -1277 -2416 1412 1214 -6042
1319f042p23N917o5l405Q1M937L159n682j590N678l39n335m89L772K251l689j282
$$ -6042 -6765 -848 -913 -4318 -4237 700 3859 -1823 -3413 2265 1926 -3409 -3898 -126 2125 -1564 -2846
1336b846O327K465m470j227K332Q84m098m181M035L559m734j872M811L499k061
$$ -2846 3481 5946 1476 249 2581 3465 -633 -4814 -779 2780 -1954 -3826 985 4484 2423
1351B423l173L187L921n262m241M316K034k982k564J696M488k582n090L029K905
$$ 2423 -750 2437 6358 1096 -3145 1171 3205 223 -2341 -645 3843 1261 -3829 -800 2105
1366B105k867l551N89M017j224n381K888N732k289m072J390L734p85n055R87N659
$$ 2105 -762 -4313 -3724 293 -931 -6312 -3424 2308 19 -4053 -2663 1071 286 -4769 -3782 1877
1382A877j446l778K523M619J240l040p16M951j92n668N3L692L27l414j703M283
$$ 1877 431 -3347 -824 3795 5035 1995 1279 6230 6038 370 423 4115 4442 1028 -675 3608
1398C608J216n915j226M114n16m056j815L356K577l761j344M758N26l916k655
$$ 3608 4824 -1091 -2317 1797 1281 -2775 -4590 -1234 1343 -2418 -3762 996 1522 -2394 -5049
1413e049J251K176l334l566M570L170k814n95M146M375j673k936L480L028m338
$$ -5049 -3798 -1622 -4956 -8522 -3952 -782 -3596 -4191 -45 4330 2657 -279 3201 6229 1891
1428A891j960K289J845j138l455J843M235k582l169K348K078j656m281J63L791
$$ 1891 -69 2220 4065 2927 -528 1315 5550 2968 -201 2147 4225 2569 -1712 -1549 2242
1443B242j067l646K774L608j970l606N4K277k079n452N86L076j297j677J567M396
$$ 2242 1175 -2471 303 3911 1941 -1665 -1611 666 -1413 -6865 -6279 -3203 -4500 -6177 -4610 -214
1459b14J656l329j66M121q39l563j22L052J359l417r25N108Q60l740P05L390Q82
$$ -214 1442 -1887 -2053 2068 1229 -2334 -2456 596 1955 -1462 -2387 2721 3581 -159 546 3936 4818
1476D818k600j738L953J389m192r28K835L83k364k893K365K487m213l115K391
$$ 4818 2218 480 4433 5822 1630 702 3537 3920 1556 -1337 1028 3515 -698 -3813 -1422
1491a422P58k864k237K533L705k579k639L573K033l132j860Q42K611j293k919
$$ -1422 -664 -3528 -5765 -3232 473 -2106 -4745 -1172 861 -2271 -4131 -3289 -678 -1971 -4890
1506d890K617L717j440j619J211K727kl408J876M825j048k354J961K333j109m181
$$ -4890 -2273 1444 4 -1615 -404 2323 2321 -1087 789 5614 4566 2212 4173 6506 5397 1216
1522A216o11L227k000l712O75J678N4k309r88L056K4m131j35L615K17k012o28
$$ 1216 605 3832 1832 -1880 -1205 473 527 -1782 -2770 286 310 -3821 -3956 -341 -124 -2136 -2764
1539b764K495Q17l942n12L430K30k216J20K512J910k089j139L370Q53k125j70
$$ -2764 -269 548 -3394 -3906 -476 -246 -2462 -2342 170 2080 -9 -1148 2222 3075 950 780
1555G80J785K150j670k519K498J235m303k364J035J366j862j618K546K421l241
$$ 780 2565 4715 3045 526 3024 4259 -44 -2408 -1373 -7 -1869 -3487 -941 1480 -1761
1570a761j398K199J366r97j957J076L334j256k202K007J743j644k569O24L421
$$ -1761 -3159 -960 406 -591 -2548 -1472 1862 606 -1596 411 2154 510 -2059 -1435 1986
1585A986k46k468K308L245j206k376l17J713j405l369P11K987j505k466P9J645
$$ 1986 1740 -728 1580 4825 3619 1243 926 2639 1234 -2135 -1424 1563 58 -2408 -2329 -684
1601f84R8l172r00L118Q6k274J106L597J557k542j391L165O10l077J82K020L99
$$ -684 -586 -3758 -4658 -1540 -1454 -3728 -2622 975 2532 -10 -1401 1764 2374 -703 -521 1499 1898
1618A898j929p01K389J209k415r37K679J243r53j570J053J278l076k568K158M16
$$ 1898 -31 -732 1657 2866 451 -486 2193 3436 2483 913 1966 3244 168 -2400 -242 174
1634A74k372j344J672K920j363k415J309P76k319p46J767K293M27j532J946K982
$$ 174 -2198 -3542 -1870 1050 -313 -2728 -1419 -643 -2962 -3708 -1941 352 779 -753 1193 4175
1650D175j265k472k33K86j127k357R89L797o09j934J689J936q10k555j107J778
$$ 4175 2910 438 205 491 -636 -2993 -2004 1793 1184 -750 939 2875 2065 -490 -1597 181
1666A81p52j929J365J930m71j209K62K743J140k783o93J872r69j741l97J689M76
$$ 181 -571 -2500 -1135 795 324 -885 -623 2120 3260 477 -216 1656 687 -1054 -1451 238 714
1683G14k439M23M126R85j856q38k0o10k883k239J850P94j813J192L080K727r79
$$ 714 -1725 -1302 2824 3809 1953 1115 1095 485 -2398 -4637 -2787 -1993 -3806 -2614 466 3193 2214
1700B214k548O25L94l163j478J601Q97J77J95L543L380j593k182O98j20j711j674
$$ 2214 -334 291 685 -2478 -3956 -2355 -1458 -1281 -1086 2457 5837 4244 2062 2760 2640 929 -745
1717g45k51J221r55j805K527K698m20j512k84J647j007k974l8P97k132j558J576
$$ -745 -996 225 -730 -2535 -8 2690 2270 758 474 2121 1114 -1860 -1898 -1101 -3233 -4791 -3215
1734c215K705J166j310O03K805n79k046q26k43k94j217P14L967J127j965J82J124
$$ -3215 -510 656 -654 -51 2754 2175 129 -697 -940 -1234 -2451 -1737 2230 3357 1392 1574 2698
1751B698J88k561k539M14j39j908J240L191J204q63o85J263J182j886j639Q65
$$ 2698 2886 325 -2214 -1800 -1939 -3847 -2607 584 1788 925 240 1503 2685 799 -840 25
1767B5m86p59m18J727J449j284j504J916J718j244r93M06O06q25j437J653P02
$$ 25 -461 -1220 -1638 89 1538 254 -1250 666 2384 1140 147 553 1159 334 -1103 550 1252
1784A252j906r47J213J282j39j934o02J114j372j106J714J286R7j449Q99K557
$$ 1252 -654 -1601 -388 894 755 -1179 -1781 -667 -2039 -3145 -1431 -145 -48 -1497 -598 1959
1800A959n40k343J30O44k54L7R06K489Q4j754K88J313j155k045j382O12Q69r09
$$ 1959 1419 -924 -794 -150 -404 -367 539 3028 3112 1358 1646 2959 1804 -241 -1623 -1011 -142 -1051
1818a051M15K389l73j458pJ361N04k531j745J384L40j039Q6J056M62j258o06K142
$$ -1051 -636 1753 1380 -78 -85 1276 1780 -751 -2496 -1112 -772 -1811 -1725 -669 -207 -1465 -2071 71
1836G1J591j896p32O45N80k51j202J252J379j545k74J852P39j185j801l9J181
$$ 71 1662 -234 -966 -321 259 8 -1194 58 1437 -108 -382 1470 2209 1024 -777 -816 365
1853C65n39j154J624J012j17j61P98J733j179k878J44Q11q54j006L06Q48M7j646
$$ 365 -174 -1328 296 1308 1191 1030 1828 3561 2382 -496 -352 459 -395 -1401 -1095 -247 -200 -1846
1871a846O35J845r38j428K13J068L60o66j77J431k86j330K73P61O0j175p37K380
$$ -1846 -1211 634 -304 -1732 -1519 -451 -91 -757 -934 497 211 -1119 -846 -85 -25 -1200 -1937 443
1889D43N20j470K18J424J44n61j93J406P22k073k60J490J13p14r94J79N02j476
$$ 443 963 -507 -289 1135 1279 718 525 1931 2653 580 320 1810 1923 1209 215 394 896 -580
1907e80j052J090R8j486q29J089J711j87q44J643J045j381m69K33J93r64j655
$$ -580 -1632 -542 -444 -1930 -2759 -1670 41 -146 -990 653 1698 317 -152 81 274 -690 -2345
1924b345O54J388o45l60J247J110J75o43Q2J281j101j824Q30Q95j45p24k62J811
$$ -2345 -1691 -303 -948 -1308 -61 1049 1224 581 663 1944 843 -981 -151 744 599 -125 -387 1424
1942A424l39j141L12O59j191j110n70J312P58j191R31J519K38o02l84K23L21j832
$$ 1424 1085 -56 256 915 -276 -1386 -1956 -644 114 -1077 -146 1373 1611 1009 625 848 1169 -663
1960f63r59R15m0j197K97J388J144q73l66J159J57j112n0N32L80m42j054N51R44
$$ -663 -1622 -707 -747 -1944 -1647 -259 885 12 -354 805 962 -150 -200 332 712 270 -784 -233 711
1979G11j242m24P97L08n78r43M78J269q78m85J303P39j69m97M19J056q81j733
$$ 711 -531 -955 -158 150 -428 -1371 -893 376 -502 -987 316 1055 886 389 808 1864 983 -750
1997g50J51lo42k29L96J515O03q96J078Q28m78j256o7K73J68j195L6J243n26j091
$$ -750 -599 -602 -1244 -1473 -1077 438 1041 145 1223 2051 1573 317 250 523 691 -504 -468 775 249 -842
2017h42K87N04j66j170o00J216J68q29K45O17m5o09K56J729R21j394M0P45m98
$$ -842 -555 -51 -217 -1387 -1987 -771 -603 -1432 -1187 -570 -615 -1224 -968 761 1682 288 328 1073 575
2036E75p75r16L20L38o81N15K178Q03K43j97l62K76j127j985L81m15l81K33R13
$$ 575 -200 -1116 -796 -458 -1139 -624 1554 2357 2600 2403 2041 2317 1190 -795 -414 -829 -1210 -977 -64
2055f4J132m48r87P34Q48j414o82j31l23l98m97N50J090l44n47R62J132N58q81
$$ -64 1068 620 -367 367 1215 -199 -881 -1012 -1335 -1733 -2230 -1680 -590 -934 -1481 -519 613 1171 290
2074B90p67J47j048j071Q75J024N97O31J197J921P34j652j013j084j873j041o20
$$ 290 -477 -330 -1378 -2449 -1574 -550 47 678 1875 3796 4530 2878 1865 781 -1092 -2133 -2753
2091b753J480Q43O13J635K608O91j016j665j596j162k433j393N50l96n96J218
$$ -2753 -1273 -430 183 1818 4426 5117 4101 2436 840 -322 -2755 -4148 -3598 -3994 -4590 -3372
2107c372K370J794M15n20M59j39j502o54o23q97j038j62K073K380O18R26J490
$$ -3372 -1002 792 1207 687 1146 1007 -495 -1149 -1772 -2669 -3707 -3869 -1796 584 1202 2128 3618
2124C618P88o08j536r85q08j492p14K195J848M26J39K3K08j308k347j467j047
$$ 3618 4406 3798 2262 1277 469 -1023 -1737 458 2306 2732 2871 2894 3102 1794 -553 -2020 -3067
2141c067j575j57J453K328J501l73M61J139n61j210p21o66j056q93L10J757K68
$$ -3067 -4642 -4799 -3346 -1018 483 110 571 1710 1149 -61 -782 -1448 -2504 -3397 -3087 -1330 -1062
2158a062j26J382J364J257J11m38L42r29j578l76J84m78j27j05J762J755l68p13
$$ -1062 -1188 194 1558 2815 2926 2488 2830 1901 323 -53 131 -347 -474 -579 1183 2938 2570 1857
2176A857k72j721j880o78L23R23l72K69K046J311l72m86q62n84p78q80J155P49
$$ 1857 1585 -136 -2016 -2694 -2371 -1448 -1820 -1551 495 1806 1434 948 86 -498 -1276 -2156 -1001 -252
2194b52r43r9N96Q16J77j035J56N40q9O29J273K05p46j097k97J076p23n39J62
$$ -252 -1195 -1294 -698 118 295 -740 -584 -44 -133 496 1769 1974 1228 131 -166 910 187 -352 -190
2213a90J26O06j79K78M18p80j405O98J224J56j05n00M0m89j363k89M15n86m49
$$ -190 -64 542 363 641 1059 279 -1126 -428 796 952 847 347 387 -102 -1465 -1754 -1339 -1925 -2374
2232b374R13J515J439m91m60O4n82p08J78q5L81j36M35J793M58j268p96j54l25
$$ -2374 -1461 54 1493 1002 542 606 24 -684 -506 -591 -210 -346 89 1882 2340 1072 276 122 -203
2251b03L82m00O19K73r71l05Q96m37l32r22l24J328N7J37P68p40r30l14j32Q84
$$ -203 179 -221 398 671 -300 -605 291 -146 -478 -1400 -1724 -396 -339 -202 566 -174 -1104 -1418 -1550 -666
2271f66Q3j94J259J401J84J24l03m63j023q26L97Q52n68l9L55M85M05n51q07J49
$$ -666 -583 -777 482 1883 2067 2191 1888 1425 402 -424 -27 825 257 218 573 1058 1463 912 105 254
2291B54j200n86M50J83l86j140p30P35P87m7J069J036M09M27P9K08j069j763p46
$$ 254 -946 -1532 -1082 -899 -1285 -2425 -3155 -2420 -1633 -1680 -611 425 834 1261 1340 1548 479 -1284 -2030
2310b030R18N25J316N41J412P08k15l86o3j522j975m69K6Q21M12P4Q78J17n27
$$ -2030 -1112 -587 729 1270 2682 3390 3175 2789 2726 1204 -771 -1240 -1214 -393 19 93 971 1088 561
2329E61j91j67q63j136j412M22O68n56K02O60J066P78P74R30J013q23j125j49
$$ 561 370 203 -660 -1796 -3208 -2786 -2118 -2674 -2472 -1812 -746 32 806 1736 2749 1926 801 652
2347F52o56j169n69k0J267J088P11K009K72m37j232j173o89q78j771LJ225M38
$$ 652 -4 -1173 -1742 -1762 -495 593 1304 3313 3585 3148 1916 743 54 -824 -2595 -2592 -1367 -929
2365i29R44Q01N50j34j088o54K94p49n08k78K19M61J51J52J108M02J06P84N73
$$ -929 15 816 1366 1232 144 -510 -216 -965 -1473 -1751 -1532 -1071 -920 -768 340 742 848 1632 2205
2384B205O7q00j271n39o73q69k8M08P98Q87N72Q09N46r93r62m73p22k68k43L26
$$ 2205 2272 1472 201 -338 -1011 -1880 -1908 -1500 -702 185 757 1566 2112 1119 157 -316 -1038 -1306 -1549 -1223
2404a223O47J48j00R36K06k31k40l64M52L48j12M6N04n91j37L25J01k1l83J71
$$ -1223 -576 -428 -528 408 614 383 143 -221 231 579 467 513 1017 426 289 614 715 694 311 482
2424D82N69n28o73m13n96j92j80K24J240L67ON15L75l79p00p15n10k46n06N78
$$ 482 1051 523 -150 -563 -1159 -1351 -1531 -1307 -67 300 306 821 1196 817 117 -598 -1108 -1354 -1860 -1282
2444a282J167L54N0K88Q6N55r96k64L03N0n45o0L33J78m32j65O58K45p5N46J67
$$ -1282 -115 239 289 577 663 1218 222 -42 261 311 -234 -294 39 217 -215 -380 278 523 448 994 1161
2465A161K50m04o61j08o92q02k27N81L68M53K85L29N45k53j86L04p29k22r36k03
$$ 1161 1411 1007 346 238 -454 -1256 -1483 -902 -534 -81 204 533 1078 825 639 943 214 -8 -944 -1147
2485a147q3m54n41M73K03K34O77N64J212K19r3J36l25r35o81q69N05K92J08R83
$$ -1147 -1230 -1684 -2225 -1752 -1549 -1315 -638 -74 1138 1357 1264 1400 1075 140 -541 -1410 -905 -613 -505 478
2505D78J040O40n2L03n06n45j061p70J82r5k93O23K64L69o6n68R3j29r63j53n83
$$ 478 1518 2158 2106 2409 1903 1358 297 -473 -291 -386 -679 -56 208 577 511 -57 36 -93 -1056 -1209 -1792
2526a792k78J24l09Q14J102l6N70O76M07m67q03l69m90p82q4R42L59R00J127O27
$$ -1792 -2070 -1946 -2255 -1441 -339 -375 195 871 1278 811 8 -361 -851 -1633 -1717 -775 -416 484 1611 2238
2546B238Q22m82o20m78p35j044k32k09O12K10O9P40O01o51k97k23p32n70o47m02
$$ 2238 3060 2578 1958 1480 745 -299 -531 -740 -128 82 151 891 1492 841 544 321 -411 -981 -1628 -2030
2566b030L35l5R1P27L82M49L33r7M90k64j008k06m1j48m45M22P09Q11Q0P68N68
$$ -2030 -1695 -1730 -1639 -912 -530 -81 252 155 645 381 -627 -833 -874 -1022 -1467 -1045 -336 475 555 1323 1891
2587A891j98P8m46k69m8q29j50L73j77L0O0m0M70m27j73L08n5o76k50pm56m08
$$ 1891 1693 1771 1325 1056 1008 179 29 402 225 255 315 275 745 318 145 453 398 -278 -528 -535 -991 -1399
2609a399l68K31L04rO40N17L97K37k93j10j49o22m89K60p4J16P64L08Q70L05j79
$$ -1399 -1767 -1536 -1232 -1241 -601 -84 313 550 257 147 -2 -624 -1113 -853 -927 -811 -47 261 1131 1436 1257
2630A257M91k17o97k78m67q7l66k56K99Q35P4J82J77M0J48r87p39j71q19l67J22
$$ 1257 1748 1531 834 556 89 2 -364 -620 -321 514 588 770 947 987 1135 148 -591 -762 -1581 -1948 -1826
2651a826L97P27M66M13Q62m0o50O0n41n92o11k95N04M12J06R41J080K44j7q2l67
$$ -1826 -1429 -702 -236 177 1039 999 349 409 -132 -724 -1335 -1630 -1126 -714 -608 333 1413 1657 1640 1558 1191
2672A191k57q40p39k5o39k8L79M12Q42L37K97L39m97k66n27m07l32l13P6N7Q05
$$ 1191 934 94 -645 -670 -1309 -1337 -958 -546 296 633 930 1269 772 506 -21 -428 -760 -1073 -997 -940 -135
2693a35R4M20M28LK96o50k59J01p54j18r3K47R1K90M10M68J24m51k37k17o97n29
$$ -135 -41 379 807 810 1106 456 197 298 -456 -574 -667 -420 -329 -39 371 839 963 512 275 58 -639 -1168
2715a168l82l47L40j58P20J037L48O94J5J64J81q19l69p1m44n6K55J44M45M90
$$ -1168 -1550 -1897 -1557 -1715 -995 42 390 1084 1099 1263 1444 625 256 185 -259 -315 -60 84 529 1019
2735A019L08M68k3l36n10m71r28q78n12R6l8m0P65N57O46L73k11j00k5q80o54
$$ 1019 1327 1795 1772 1436 926 455 -473 -1351 -1863 -1767 -1805 -1845 -1080 -523 123 496 285 185 160 -720 -1374
2756a374k01k83L37M75Q21J119M47K15P56l85j9m10p09l05n17m27K01J87j56L32
$$ -1374 -1575 -1858 -1521 -1046 -225 894 1341 1556 2312 1927 1908 1498 789 484 -33 -460 -259 -72 -228 104
2776A04L91N2o1l06k73m1p04n23j71J48J54J77M57O74J24L15J04k22m92N7n31
$$ 104 495 547 486 180 -93 -134 -838 -1361 -1532 -1384 -1230 -1053 -596 78 202 517 621 399 -93 -36 -567
2797e67L00K23J17L75O15K25J10k13m18l1r88j97K9k16l18L41K55K48K64q1K97
$$ -567 -267 -44 73 448 1063 1288 1398 1185 767 736 -252 -449 -420 -636 -954 -613 -358 -110 154 73 370
2818C70Kq1j03n41r3m1o18L44L74R9K71M21K47M13l49Rk23p93k74q5j88K03J81
$$ 370 372 291 188 -353 -446 -487 -1105 -761 -387 -288 -17 404 651 1064 715 724 501 -292 -566 -651 -839 -636 -455
2841d55M79M49j18N72r3J8n12j96m12mk6k61K54L3jN57k4J78O28o28O0Q0m66l68
$$ -455 24 473 355 927 834 852 340 144 -268 -272 -298 -559 -305 -272 -273 284 260 438 1066 438 498 578 112 -256
2865b56m78j05K1l5J35J49l2O02l0j1K92m83J0J1O7j02K12J10J04qj3L49L99k36
$$ -256 -734 -839 -818 -853 -718 -569 -601 1 -29 -40 252 -231 -221 -210 -143 -245 -33 77 181 173 160 509 908 672
2889F72J46j25o0K65m76m21j35m06k2L52j01J04J56l48K69J08n06j64j84l03K96
$$ 672 818 693 633 898 422 1 -134 -540 -562 -210 -311 -207 -51 -399 -130 -22 -528 -692 -876 -1179 -883
2910h83L3M58N08l27J58N28j91J78n4l57j01j93J83J65J35J54J00L80K44M4J42
$$ -883 -850 -392 116 -211 -53 475 284 462 408 51 -50 -243 -60 105 240 394 494 874 1118 1162 1304
2931A304k37n39p14p7m47J08r1j76Q25M30n3L06k72l44k22n89k39k41k19j3P67
$$ 1304 1067 528 -186 -263 -710 -602 -693 -869 -44 386 333 639 367 23 -199 -788 -1027 -1268 -1487 -1500 -733
2952g33N51M90J17J32J82k62l48K47n30k15J16l13O48K42J86N29L78K2j96q9o32
$$ -733 -182 308 425 557 739 477 129 376 -154 -369 -253 -566 82 324 510 1039 1417 1439 1243 1154 522
2973E22k18m84n25R8N9J22N28K29M66j47k61k98l51p72k89k28j18L62q5M58P11
$$ 522 304 -180 -705 -607 -548 -426 102 331 797 650 389 91 -260 -1032 -1321 -1549 -1667 -1305 -1390 -932 -221
2994b21R0M50K64k73k46m14l8L04k13q9L84L2K76P86J64K71q1j95j51k91m62j44
$$ -221 -131 319 583 310 64 -350 -388 -84 -297 -386 -2 30 306 1092 1256 1527 1446 1251 1100 809 347 203
3016B03k58K0P0J32J31L46k05R8m05m93k57m15l26j56J91J09M89k62N88K35K18
$$ 203 -55 -35 35 167 298 644 439 537 132 -361 -618 -1033 -1359 -1515 -1324 -1215 -726 -988 -400 -165 53
3037E3J99k07q6Jk14M3j66J46L88L23j0O65K00o3K73l75l06k33l77k83k4k10O5
$$ 53 252 45 -41 -40 -254 -211 -377 -231 157 480 470 1135 1335 1272 1545 1170 864 631 254 -29 -53 -263 -198
3060a98L68j8K32j16l17R2k59n43K12n62J12K81k39J65M62%N20l27k1Mj15j54
$$ -198 170 152 384 268 -49 43 -216 -759 -547 -1109 -997 -716 -955 -790 -328 -328 192 -135 -156 -152 -267 -421
3082d21K65l98K38N6M10K95L69j42J41J43k85p2k62k99j00k57O7N3LO60kKJ60
$$ -421 -156 -554 -316 -260 150 445 814 672 813 956 671 599 337 38 -62 -319 -252 -199 -196 464 462 464 624
3105F24J73p74P3n04j16Q9m42K48K47j59M20J14Q2K48l78p5J9l90n2J28l36J35
$$ 624 797 23 96 -408 -524 -435 -877 -629 -382 -541 -121 -7 75 323 -55 -130 -111 -501 -553 -425 -761 -626
3127f26M4L61K06L85M2K43k34j10j3k53r5Nj92K42O7m4N87N0j11K18j04r0j98
$$ -626 -582 -221 -15 370 412 655 421 311 298 45 -50 -45 -237 5 72 28 615 665 554 772 668 578 380
3150C80k49m39K8n3J66q1jJ96O1P9L10n59K2K3l25J19j88l69L35L13N2M39R7M9
$$ 380 131 -308 -280 -333 -167 -248 -249 -53 8 87 397 -162 -140 -117 -442 -323 -511 -880 -545 -232 -180 259 356 405
3174D05K01k71R1j04l95j19m4M5M33j0J65K34k73K34j99j33k90j46k41kj31J20
$$ 405 606 335 426 322 -73 -192 -236 -191 242 232 397 631 358 592 393 260 -30 -176 -417 -419 -550 -430
3196d30L99l5J98L25l02J66L8n58n7k0l23J57P4mL49mK22K20m3j12R2o01N2j69
$$ -430 -31 -66 132 457 155 321 359 -199 -256 -276 -599 -442 -368 -372 -23 -27 195 415 372 260 352 -249 -197 -366
3220c66k11qJ71J64J04L66L44J00j28k21Nl98L3l14j98J86K76K23L44O4K19N3
$$ -366 -577 -585 -414 -250 -146 220 564 664 536 315 320 -78 -45 -359 -557 -371 -95 128 472 536 755 808
3242H08l68j57j98j04l30o8m95M58J88J19J56nJ99J30k29k92k32j01m5K47k26
$$ 808 440 283 85 -19 -349 -417 -912 -454 -266 -147 9 4 203 333 104 -188 -420 -521 -566 -319 -545
3263e45K34K58J53M67l9R9O1m61j58N7l62J34j03j38K68J34L02J23k54J73l64
$$ -545 -311 -53 100 567 528 627 688 227 69 126 -236 -102 -205 -343 -75 59 361 484 230 403 39
3284C9k38K6k14k68J01J0K97J24QM08R8k16J12l1k52k77l22P7L16J99j09M10Q5
$$ 39 -199 -173 -387 -655 -554 -544 -247 -123 -115 293 391 175 287 256 4 -273 -595 -518 -202 -3 -112 298 383
3307C83J29P9j85K66l87m13P2l49J54L95l08mN35k13N5o9j07j72k75j24K74k74
$$ 383 512 591 406 672 285 -128 -56 -405 -251 144 -164 -168 367 154 209 140 33 -139 -414 -538 -264 -538
3329e38J55L79k09K83K78m4j41J20j91k8q5j31j1n2K31J16j55J54J03P9q1n1p
$$ -538 -383 -4 -213 70 348 304 163 283 92 64 -21 -152 -163 -215 16 132 -23 131 234 313 232 181 174
3352A74k01j34k13K83K9j03L56J12J68j21p1J22l26j98Q1o2j05j11p7K10R2k19
$$ 174 -27 -161 -374 -91 -62 -165 191 303 471 350 279 401 75 -123 -42 -104 -209 -320 -397 -187 -95 -314
3374c14J76O7K3J16m24j29M04m17J15J40r1J02N16k40L61j12q0K92j52J17L2p7
$$ -314 -138 -71 -48 68 -356 -485 -81 -498 -383 -243 -334 -232 284 44 405 293 213 505 353 470 502 425
3396D25o4K08l15J17L6l75J78J35l52J07j5l34K99l54k64K83l85m4pk9M88j71
$$ 425 361 569 254 371 407 32 210 345 -7 100 85 -249 50 -304 -568 -285 -670 -714 -721 -750 -262 -433
3418d33j0K98n6Q4J03O6K66j49j39K09J73p3M87k44L5L3j90m9R7j67l49o6R7n5
$$ -433 -443 -145 -201 -117 -14 52 318 169 30 239 412 339 826 582 617 650 460 411 508 341 -8 -74 23 -32
3442c2q2j86L46J58l88K63m05l2l2l86K54l9j91K01L15NK05J21Q8L9l19Q8K34
$$ -32 -114 -300 46 204 -184 79 -326 -358 -390 -776 -522 -561 -752 -551 -236 -231 -26 95 183 222 -97 -9 225
3465B25p6k80p5J64L35J15j69J77K9K40k95q2p4j83l77L66l6N0R9l38L94J66l45
$$ 225 149 -131 -206 -42 293 408 239 416 445 685 390 308 234 51 -326 40 4 54 153 -185 209 375 30
3488C0k24K12l57o7R0k27K95j33N7L90l15K57K98n36P3k12k03p2J78J20nK23K07
$$ 30 -194 18 -339 -406 -316 -543 -248 -381 -324 66 -249 8 306 -230 -157 -369 -572 -644 -466 -346 -351 -128 79
3511G9K20M39l35M23j97l85J74n4k74k64K48K72j84k58N24j25k59Q6j72r0r5k16
$$ 79 299 738 403 826 629 244 418 364 90 -174 74 346 162 -96 428 303 44 130 -42 -132 -227 -443
3533d43Q5O9j91K66M1J9q5k25J76J44k50r3L44k12L25J10O7p0M09r8K30j71k45
$$ -443 -358 -289 -480 -214 -173 -154 -239 -464 -288 -144 -394 -487 -143 -355 -30 80 147 77 486 388 618 447 202
3556B02L4k59m4P8l84L87J69k42M56p4j6J16j70l42K6l66P8j00l9J66N0J75L88
$$ 202 236 -23 -67 11 -373 14 183 -59 397 323 307 423 253 -89 -63 -429 -351 -451 -490 -324 -274 -99 289
3579B89k14OJ41j61j23m2k27M25k1m26M86Q0K2O7j06l14K64l86O2L6j42J79J05
$$ 289 75 81 222 61 -62 -104 -331 94 73 -353 133 213 235 302 196 -118 146 -240 -178 -142 -284 -105 0
3602@j41N06kn34M72n4j47k1j63L2q2k01J63pJ75J20J37J0j34j80M2J12m03j65
$$ 0 -141 365 363 -171 301 247 100 79 -84 -52 -134 -335 -172 -179 -4 116 253 263 129 -51 -9 103 -300 -465
3626d65J85PJ56m2J84J22j12N0Pj46J3j85J8L65l55K11l0L79k20R1r7J69r5k96
$$ -465 -280 -273 -117 -159 25 147 35 85 92 -54 -41 -226 -208 157 -198 13 -17 362 142 233 136 305 210 -86
3650h6p4R5j53K62m42M09J35k50J84p2J0p8k09J26J89j50j24J12L7K8J72J65p3
$$ -86 -160 -65 -218 44 -398 11 146 -104 80 8 18 -60 -269 -143 46 -104 -228 -116 -79 -51 121 286 213
3673B13j9j8j07J52l72J62n2J00Lk4k08M30k87J66j42l1O8J0j25J98j28p9j46
$$ 213 194 176 69 221 -151 11 -41 59 62 38 -170 260 -27 139 -3 -34 34 44 -81 117 -11 -90 -236
3696b36K60r5O3j66J05K40m12K89j52oJ60kp4L83k96N8K44k33k07R9l7j24M31
$$ -236 24 -71 -8 -174 -69 171 -241 48 -104 -110 50 48 -26 357 61 119 363 130 -77 22 -15 -139 292
3719B92l03J49J24m44L72n4l21J71k81J03N6j19J74K9j08K15J07j3J04j71Pj0
$$ 292 -11 138 262 -182 190 136 -185 -14 -295 -192 -136 -255 -81 -52 -160 55 162 149 253 82 89 79
3741G9r1M4o8oM34k40P1l9j10R8p9J9j19K16n72K90K69j99j09N3Q5j54j41Rj21
$$ 79 -12 32 -36 -42 392 152 223 184 74 172 93 112 -7 209 -363 -73 196 -3 -112 -59 26 -128 -269 -260 -381
3766c81N2K52k9K22P0l03K19P0r5k7L3K12k48M5P6J38j09j35M21j15j94K37j65
$$ -381 -329 -77 -106 116 186 -117 102 172 77 50 83 295 47 92 168 306 197 62 483 368 174 411 246
3789B46j3q6l22j33L80j76l0n5j25K84j38j64J20n5j72J11L38j95N53m04K35J35
$$ 246 233 147 -175 -308 72 -104 -134 -189 -314 -30 -168 -332 -212 -267 -439 -328 10 -185 368 -36 199 334
3811C34k31K44j3N3l96J54k21M57m26K0K07k66J83m4p0K66l00j39L4rN1j37q0
$$ 334 103 347 334 387 -9 145 -76 381 -45 -25 182 -84 99 55 -15 251 -49 -188 -154 -163 -112 -249 -329
3834c29m6O8K7K07K14l53K6K73j58m9Q3K2J20J2j44l6N7J99J07l39P7j04r0J43
$$ -329 -375 -307 -280 -73 141 -212 -186 87 -71 -120 -37 -15 105 117 -27 -63 -6 193 300 -39 38 -66 -156 -13
3858a3Q5m1o1J12J08k32Q6J18j45J56j70k13K85j09j89jJ66j29Q3L13q8K98q5
$$ -13 72 31 -30 82 190 -42 44 162 17 173 3 -210 75 -34 -223 -224 -58 -187 -104 209 121 419 334
3881C34j79j9j61j70O5k90n7J91R2J31r9l09L63J66K01J2k08J72L08l24j07L32
$$ 334 155 136 -25 -195 -130 -420 -477 -286 -194 -63 -162 -471 -108 58 259 271 63 235 543 219 112 444
3903D44l50J75J08j83P5Q9r0lj82J10j93L2p0j58n7M5J93k40l08k07L81j68q3
$$ 444 94 269 377 194 269 358 268 265 83 193 0 32 -38 -196 -253 -208 -15 -255 -563 -770 -389 -557 -640
3926f40q6K08Q5L34L1lK12L3J87J15k88K34oo7J21r5k42K20ML8o1K90l7k94k60
$$ -640 -726 -518 -433 -99 -68 -71 141 174 361 476 188 422 416 349 470 375 133 353 357 395 334 624 587 293 33
3951C3L1k38n3k21l47K53j52m0J56J17l6l7L12j19J79j4o8L7L16j42K02J45m3
$$ 33 64 -174 -227 -448 -795 -542 -694 -734 -578 -461 -497 -534 -222 -341 -162 -176 -244 -207 109 -33 169 314 271
3974B71k49J18J31J42l13J50K15l65p4K61q2J19kJ81q8r3m35L4k51k2j41k65L84
$$ 271 22 140 271 413 100 250 465 100 26 287 205 324 322 503 415 322 -113 -79 -330 -352 -493 -758 -374
3997c74J29j04J74LR0m8K6J32j36j97J21J19j49J99K31o6K91l43J28J65o9j1k4
$$ -374 -245 -349 -175 -172 -82 -130 -104 28 -108 -305 -184 -65 -214 -15 216 150 441 98 226 391 322 311 287
4020B87J8j80j00q1J26Ok16P6q9K61%k56k9O6o5R8j8lK06p2J02J81l05K1k57L08
$$ 287 305 125 25 -56 70 76 -140 -64 -153 108 108 -148 -177 -111 -176 -78 -96 -99 107 35 137 318 13 34 -223 85
4046H5k92R6n5K19J46k63M91R3k79j91J4J16l0j26l3J79j22m0J31k74J81l18J00
$$ 85 -207 -111 -166 53 199 -64 427 520 241 50 64 180 150 24 -9 170 48 8 139 -135 46 -272 -172
4069a72L44l26Mj73K38K65j08m7J27rr3J17j46J30l3j14m1j8K30q7j3R6k5j16
$$ -172 172 -154 -150 -323 -85 180 72 25 152 143 50 167 21 151 118 4 -37 -55 175 88 75 171 146 30
4093C0k40L39m61M5K65K9M6r4P8K28j48l55L56k65M5r9k68M58j59J57J54J9k56
$$ 30 -210 129 -332 -287 -22 7 53 -41 37 265 117 -238 118 -147 -102 -201 -469 -11 -170 -13 141 160 -96
4116i6L21j86J16P4l43j52L48lj01O1J59j21m5M27r0k94q4p3l60L04j68mJ98J36
$$ -96 225 39 155 229 -114 -266 82 79 -22 39 198 77 32 459 369 75 -9 -82 -442 -138 -306 -310 -112 24
4140B4k20L09j8n4N3k67l4M22m14k23M12L1J37j27J76J75j30n58L08k09k49L53
$$ 24 -196 113 95 41 94 -173 -207 215 -199 -422 -10 21 158 31 207 382 252 -306 2 -207 -456 -103
4162a03j54K10P4j3K39j69kK32k28o0k01l8J8N5k18M59q8K91r0K3J16l49j24k66
$$ -103 -257 -47 27 14 253 84 82 314 86 26 -175 -213 -195 -140 -358 101 13 304 214 237 353 4 -120 -386
4186c86J79j90J16J52J7J39K24k87L66q1p7j71j96O5j91J98r0K23RJ00Q6j09N6
$$ -386 -207 -397 -281 -129 -112 27 251 -36 330 249 172 1 -195 -130 -321 -123 -213 10 19 119 205 96 152
4209A52j04j98M8k04J51j99R8K29j1K75P1%j23k45J18J9j27l20K40K28k68L27
$$ 152 48 -150 -102 -306 -155 -354 -256 -27 -38 237 308 308 185 -60 58 77 -50 -370 -130 98 -170 157
4231A57K7k2K51l30K47K2k96o9N0k93J49j26J27J47J68p8o1r5q5M8p9q3K60j42
$$ 157 184 162 413 83 330 352 56 -13 37 -256 -107 -233 -106 41 209 131 70 -25 -110 -62 -141 -224 36 -106
4255a06R4J33j14K30j51LJ57l09Q2p4q7M3m6J28P9R6j59J18J07j37mo1kJ45m43
$$ -106 -12 121 7 237 86 89 246 -63 19 -55 -142 -99 -145 -17 62 158 -1 117 224 87 83 22 20 165 -278
4280b78K87L6r9J85P0l13J76j26Q1L2j16j08K26k13R6J90j95O1k4j97J09j7j27
$$ -278 9 45 -54 131 201 -112 64 -62 19 51 -65 -173 53 -160 -64 126 -69 -8 -32 -229 -120 -137 -264
4303b64N7Q5O2K39k79K00n0l13L03n0q6R4n9j33N99j12LJ49J34l41m18L55j23
$$ -264 -207 -122 -60 179 -100 100 50 -263 40 -10 -96 -2 -61 -194 405 293 296 445 579 238 -180 175 52
4326E2rl39M82J15J33j00j18K9k03K2j87k52l4k15m0M0M00l76N22L05L5j43P0
$$ 52 43 -296 186 301 434 334 216 245 42 64 -123 -375 -409 -624 -664 -624 -224 -600 -78 227 262 119 189
4349A89j33k0j43j29M07l0j53K64J51j3J17k17K62o2o95K41N6L7l58J1n9N37k70
$$ 189 56 36 -107 -236 171 141 -12 252 403 390 507 290 552 490 -205 36 92 129 -229 -218 -277 260 -10
4372a0mJR0k29m84J6Q1l45m3N59N8L37J59N8J73J32m28J41k74j20j03K6K30o9
$$ -10 -14 -13 77 -152 -636 -620 -539 -884 -927 -368 -310 27 186 244 417 549 121 262 -12 -132 -235 -209 21 -48
4396d8L28%K34%l07M5r8m5j75k23l9m3l8K91J8K72l95L40O0q8m02Q1k01J53J4
$$ -48 280 280 514 514 207 252 154 109 -66 -289 -328 -371 -409 -118 -100 172 -223 117 177 89 -313 -232 -433 -280 -266
4421b66J78K70M0%J33l4k83Qk27k42K00j11JM53r7J11L24m2o8j64p4j7L4o01K86
$$ -266 -88 182 222 222 355 321 38 46 -181 -423 -223 -334 -333 120 23 134 458 416 348 184 110 93 127 -474 -188
4446a88p7J84J80Rk5L43m28R9N10n08k28l08P7K29L7j79K42O1J59J46o6k24J6
$$ -188 -265 -81 99 108 83 426 -2 97 607 99 -129 -437 -360 -131 -94 -273 -31 30 189 335 269 45 61
4469F1m55K72j84J10J4q1L48J60k15J86K14l79Q4Q1m2j22k92J54K16j71P2j70
$$ 61 -394 -122 -306 -196 -182 -263 85 245 30 216 430 51 135 216 174 52 -240 -86 130 -41 31 -139
4491a39P5J3l5o0K40k32MJ47l23J11J05kJ36J70k5q8J84j97K4j08J70J45n42J85
$$ -139 -64 -51 -86 -146 94 -138 -134 13 -310 -199 -94 -96 40 210 185 97 281 84 108 0 170 315 -227 -42
4515d2L12k44R1k63q1l4J14k44M85k28J54n4J54k92K70l85j5K68l57L05J72L7
$$ -42 270 26 117 -146 -227 -261 -147 -391 94 -134 20 -34 120 -172 98 -287 -302 -34 -391 -86 86 123
4537A23n1p3J81l8l00J82p9j15K04j4L4J65j94p2K39K8k92j00J7J10j28k92K04
$$ 123 72 -1 180 142 -158 24 -55 -170 34 20 54 219 25 -47 192 220 -72 -172 -155 -45 -173 -465 -261
4560b61R5p3K7K35j59L20l6lj50p7r3L2lP9K03j28M47j50J44l57o2j26q7l1Q5
$$ -261 -166 -239 -212 23 -136 184 148 145 -5 -82 -175 -143 -146 -67 136 8 455 305 449 92 30 -96 -183 -214 -129
4585a29p5k10K98j0J63K5j15K44O5o17K99j95p1L8J01O1L49j96P4K36K09j83l46
$$ -129 -204 -414 -116 -126 37 62 -53 191 256 -361 -62 -257 -328 -290 -189 -128 221 25 99 335 544 361 15
4608A5n0k49J02n9NJ33kL35K37k08K10k95Q3k9l51k52P3O3J73k22J05K35J32j65
$$ 15 -35 -284 -182 -241 -236 -103 -105 230 467 259 469 174 257 228 -123 -375 -302 -239 -66 -288 -183 52 184 19
4632A9K90j75o9J6r8j10K04k80L83N2K6o7j29J39q1l29j25J84j44n8nK21Q4K30
$$ 19 309 134 65 81 -17 -127 77 -203 180 232 258 191 62 201 120 -209 -334 -150 -294 -352 -357 -136 -52 178
4656A78J5J34n3k47o2J6m1P0k05J12J18rJ4J47r9K21j36k0O0k92OJ17k23O8k8
$$ 178 193 327 274 27 -35 -19 -60 10 -195 -83 35 26 40 187 88 309 173 153 213 -79 -73 44 -179 -111 -139
4681a39NL68m02j48M03M4k58k1R5j93L48j95j12N12j94J9l8J72j80q4%oj5J94
$$ -139 -134 234 -168 -316 87 131 -127 -148 -53 -246 102 -93 -205 307 113 132 94 266 86 2 2 -4 -19 175
4705A75j85M0J67n05L4M44k45M0k02L8N11k51l48M23k20j00J0j03J78J00k1j37
$$ 175 -10 30 197 -308 -274 170 -75 -35 -237 -199 312 61 -287 136 -84 -184 -174 -277 -99 1 -20 -157
4727a57L39l21K65m3jK46m39J72j71q1J37J30j06O4j63J23Q6J01k5q6k05p2KO8
$$ -157 182 -139 126 83 82 328 -111 61 -110 -191 -54 76 -30 34 -129 -6 80 181 156 70 -135 -207 -205 -137
4751a37J92lk00P7K76k51K08j92J12k46j14j75K90j27K08J66J23P1N8k3J68m36
$$ -137 55 52 -148 -71 205 -46 162 -30 82 -164 -278 -453 -163 -290 -82 84 207 278 336 313 481 45
4773D5J9n6n3l19K49J2j0K90j64n7O19l95k58j40K1J79n12K96J61j94J57R6K05
$$ 45 64 8 -45 -364 -115 -103 -113 177 13 -44 575 180 -78 -218 -197 -18 -530 -234 -73 -267 -110 -14 191
4796A91m5J33j58J69j54k06J62m42L24N9k88M59j41k0K31j39L2K38o57J66L10
$$ 191 146 279 121 290 136 -70 92 -350 -26 33 -255 204 63 43 274 135 167 405 -252 -86 224
4817B24j43j83L44o9O9jj68J54k51R5l15M7k12Q6J56L03L8J8J23J79j72l10p6
$$ 224 81 -102 242 173 242 241 73 227 -24 71 -244 -197 -409 -323 -167 136 174 192 315 494 322 12 -64
4840f4k64L14m26J57K48q8R1K97k08K98m31j29L75l19q1o5K16q6J85jJ08N4r7
$$ -64 -328 -14 -440 -283 -35 -123 -32 265 57 355 -76 -205 170 -149 -230 -295 -79 -165 20 19 127 181 84
4863H4J76k55J18l0k70M6p9M8m0J22R5N6j91l6M72j23l70J94P2j67j96Q8j2k6
$$ 84 260 5 123 93 -177 -131 -210 -162 -202 -80 15 71 -120 -156 316 193 -177 17 89 -78 -274 -186 -198 -224
4887b24K32l8K78j69K9K8j30O3m2j29K19m13n8K95N4K78k62k50L74j43O6K18j67
$$ -224 8 -30 248 79 108 136 6 69 27 -102 117 -296 -354 -59 -5 273 11 -239 135 -8 58 276 109
4910A09P0J35l08K84j1l44o8m1J01K4m6J67L7j52K2L13r7j78L6j97J04NJ1QN0
$$ 109 179 314 6 290 279 -65 -133 -174 -73 -49 -95 72 109 -43 -21 292 195 17 53 -144 -40 -35 -24 -16 34
4935C4j27j98K20n2Mj47K21O6p6J13j67m1N9PK05J06k08L21j68K7k0j96Q8K94
$$ 34 -93 -291 -71 -123 -119 -266 -45 21 -55 58 -109 -150 -91 -84 121 227 19 340 172 199 179 -17 71 365
4959C65l35R4J11r7j12qk35P4k5o8k39K49j93K07J49k2n4j10N4J32k8j75J06q
$$ 365 30 124 235 138 26 18 -217 -143 -168 -236 -475 -226 -419 -212 -63 -85 -139 -249 -195 -63 -91 -266 -160 -168
4983a68J28j88M49J93J03j97K2K20j66q9l25j6K54l98L04l32L71J37m32K42k12
$$ -168 -40 -228 221 414 517 320 342 562 396 307 -18 -34 220 -178 126 -206 165 302 -130 112 -100
5004a00L6j84J0q1L2k46LL97j3n2J37p0M25k37k12K77j17j3J38J78k90J6K09l3
$$ -100 -64 -248 -238 -319 -287 -533 -530 -133 -146 -198 -61 -131 294 57 -155 122 5 -8 130 308 18 34 243 210
5028B10J8j01N3j03M4l35K36j93j13n7O8M64j66J4n0J1r1J61k36J03K29m75J71
$$ 210 228 127 180 77 121 -214 22 -171 -284 -341 -273 191 25 39 -11 0 -91 70 -166 -63 166 -309 -138
5051a38P9L03k7k20M22j73k58J86j58l39L38q9K57j23l17J83J37L88m20K7p9Q7
$$ -138 -59 244 217 -3 419 246 -12 174 16 -323 15 -74 183 60 -257 -74 63 451 31 58 -21 66
5073F6j03j03m1MpL5K1M3JK47j88J79k51o8L63p5j54o9L20l7q0r8J0J11M3j88
$$ 66 -37 -140 -181 -177 -184 -149 -128 -85 -84 163 -25 154 -97 -165 198 123 -31 -100 220 183 103 5 15 126 169 -19
5099a9k7J41m4k39J60O6n8J81l42K03J44J8l51L81j51j84J43Q8j76r3oM74l35
$$ -19 -46 95 51 -188 -28 38 -20 161 -181 22 166 184 -167 214 63 -121 22 110 -66 -159 -165 309 -26
5122b6J73p4l5k46K6k04J02L47l55K56j14r1K79rJ3j74J42n8J28Rj93N6j38J00
$$ -26 147 73 38 -208 -182 -386 -284 63 -292 -36 -150 -241 38 29 42 -132 10 -48 80 89 -104 -48 -186 -86
5146h6l6J38J91j93J04k2m3J45J78l26j28l1j69L21k12J36K43l50R0k0L23l11
$$ -86 -122 16 207 14 118 96 53 198 376 50 -78 -109 -278 43 -169 -33 210 -140 -50 -70 253 -58
5168e8J61j24J91m62K31P8l34K38J30k1KM7Q8O5p5Qj66j2j96l1L3L15j82l5J84
$$ -58 103 -21 170 -292 -61 17 -317 -79 51 30 32 79 167 232 157 165 -1 -13 -209 -240 -207 108 -74 -109 75
5193G5o9J32k15J08nm2j0q8J16P4q5j56P7K93k52RJ13l2Q4k82q6K70q5j66J47
$$ 75 6 138 -77 31 26 -16 -26 -114 2 76 -9 -165 -88 205 -47 -38 75 43 127 -155 -241 29 -56 -222 -75
5218g5J38O6k43M1M1N9r9k7K49l60N7j6J70o3k9R4M3Jj6J20l11L3R1J32j92N9
$$ -75 63 129 -114 -73 -32 27 -72 -99 150 -210 -153 -169 1 -62 -91 3 46 47 31 151 -160 -127 -36 96 -96 -37
$$ [...]
8191b00
##END NTUPLES=NMR FID
##END=
