##TITLE=1H_11-2025
 200.13MHz, D2O,
 8 sc
 
 20.1.2025
##JCAMPDX= 6.0         $$ Bruker NMR JCAMP-DX V2.0
##DATA TYPE= NMR FID
##DATA CLASS= NTUPLES
##ORIGIN= UXNMR, Bruker Analytische Messtechnik GmbH
##OWNER= pz
$$ XWIN-NMR		Version 3.5
$$ Mon Jan 20 13:57:18 2025 Russian Standard Time (UT+4h)  she@DPX200
##.OBSERVE FREQUENCY= 200.1313
##.OBSERVE NUCLEUS= ^1H
##.DELAY= (6, 6)
##.ACQUISITION MODE= SIMULTANEOUS
##.ACQUISITION SCHEME= undefined
##.AVERAGES= 8
##.DIGITISER RES= 18
##SPECTROMETER/DATA SYSTEM= spect
##.PULSE SEQUENCE= zg30
##.SOLVENT NAME= D2O
##.SHIFT REFERENCE= (INTERNAL, D2O, 0, 14.3821)
##AUDIT TRAIL= $$ (NUMBER, WHEN, WHO, WHERE, WHAT)
$$ ##TITLE= Audit trail, XWIN-NMR		Version 3.5
$$ ##JCAMPDX= 5.01
$$ ##ORIGIN= Bruker BioSpin GmbH
$$ ##OWNER= she
$$ F:/spectra/data/she/nmr/H-C/1/audita.txt
$$ ##AUDIT TRAIL=  $$ (NUMBER, WHEN, WHO, WHERE, WHAT)
(   1,<2025-01-20 13:55:53.68 +0400>,<she>,<DPX200>,
      <created by zg, POWCHK disabled, PULCHK disabled
       configuration hash MD5:
       00 E9 B6 7A A2 85 ED C7 34 08 36 98 17 FE 4E 26
       data hash MD5: 16K
       7F 57 85 49 A4 A2 1F 99 AD B9 30 75 30 99 32 53>)
$$ ##END=
$$ 
$$ hash MD5
$$ C9 09 B4 26 B6 71 45 92 0F DB 6A 91 4E AC 5A 68
##$RELAX= 
##$RELAX= 
##$RELAX= 
##$RELAX= 
##$RELAX= 
##$RELAX= 
$$ Bruker specific parameters
$$ --------------------------
##$DU= <F:/spectra>
##$EXPNO= 1
##$NAME= <H-C>
##$PROCNO= 1
##$TYPE= <nmr>
##$USER= <she>
##$AMP= (0..31)
100 100 100 100 100 100 100 100 100 100 100 100 100 100 100 100 100 100 
100 100 100 100 100 100 100 100 100 100 100 100 100 100 
##$AQSEQ= 0
##$AQ_mod= 1
##$AUNM= <au_zg>
##$AUTOPOS= <>
##$BF1= 200.13
##$BF2= 200.13
##$BF3= 200.13
##$BF4= 200.13
##$BF5= 200.13
##$BF6= 200.13
##$BF7= 200.13
##$BF8= 200.13
##$BYTORDA= 1
##$CFDGTYP= 0
##$CFRGTYP= 5
##$CHEMSTR= <none>
##$CNST= (0..31)
1 1 145 1 1 1 1 1 1 1 1 1 1 1 1 1 1 1 1 1 1 1 1 1 1 1 1 1 1 1 1 1 
##$CPDPRG= <>
##$CPDPRG1= <>
##$CPDPRG2= <>
##$CPDPRG3= <>
##$CPDPRG4= <mlev>
##$CPDPRG5= <mlev>
##$CPDPRG6= <mlev>
##$CPDPRG7= <mlev>
##$CPDPRG8= <mlev>
##$CPDPRGB= <>
##$CPDPRGT= <>
##$D= (0..31)
0 0.7 0 0 0 0 0 0 0 0 0 0.03 0 0 0 0 0 0 0 0 0 0 0 0 0 0 0 0 0 0 0 0 
##$DATE= 1737366953
##$DBL= (0..7)
120 120 120 120 120 120 120 120 
##$DBP= (0..7)
150 150 150 150 150 150 150 150 
##$DBP07= 0
##$DBPNAM0= <>
##$DBPNAM1= <>
##$DBPNAM2= <>
##$DBPNAM3= <>
##$DBPNAM4= <>
##$DBPNAM5= <>
##$DBPNAM6= <>
##$DBPNAM7= <>
##$DBPOAL= (0..7)
0.5 0.5 0.5 0.5 0.5 0.5 0.5 0.5 
##$DBPOFFS= (0..7)
0 0 0 0 0 0 0 0 
##$DE= 6
##$DECBNUC= <off>
##$DECIM= 32
##$DECNUC= <off>
##$DECSTAT= 4
##$DIGMOD= 1
##$DIGTYP= 9
##$DL= (0..7)
0 120 120 120 120 120 120 120 
##$DP= (0..7)
150 150 150 150 150 150 150 150 
##$DP07= 0
##$DPNAME0= <>
##$DPNAME1= <>
##$DPNAME2= <>
##$DPNAME3= <>
##$DPNAME4= <>
##$DPNAME5= <>
##$DPNAME6= <>
##$DPNAME7= <>
##$DPOAL= (0..7)
0.5 0.5 0.5 0.5 0.5 0.5 0.5 0.5 
##$DPOFFS= (0..7)
0 0 0 0 0 0 0 0 
##$DQDMODE= 0
##$DR= 18
##$DS= 0
##$DSLIST= <SSSSSSSSSSSSSSS>
##$DSPFIRM= 0
$$ [...]
##$SUBNAM0= <"">
##$SUBNAM1= <"">
##$SUBNAM2= <"">
##$SUBNAM3= <"">
##$SUBNAM4= <"">
##$SUBNAM5= <"">
##$SUBNAM6= <"">
##$SUBNAM7= <"">
##$SUBNAM8= <"">
##$SUBNAM9= <"">
##$SW= 18.0517328524113
##$SWIBOX= (0..15)
0 0 2 0 0 0 0 0 0 0 0 0 0 0 0 0 
##$SW_h= 3612.71676300578
##$TD= 16384
##$TD0= 1
##$TE= 0
##$TE2= 300
##$TE3= 300
##$TEG= 300
##$TL= (0..7)
0 120 120 120 120 120 120 120 
##$TP= (0..7)
150 150 150 150 150 150 150 150 
##$TP07= 0
##$TPNAME0= <>
##$TPNAME1= <>
##$TPNAME2= <>
##$TPNAME3= <>
##$TPNAME4= <>
##$TPNAME5= <>
##$TPNAME6= <>
##$TPNAME7= <>
##$TPOAL= (0..7)
0.5 0.5 0.5 0.5 0.5 0.5 0.5 0.5 
##$TPOFFS= (0..7)
0 0 0 0 0 0 0 0 
##$TUNHIN= 0
##$TUNHOUT= 0
##$TUNXOUT= 0
##$USERA1= <user>
##$USERA2= <user>
##$USERA3= <user>
##$USERA4= <user>
##$USERA5= <user>
##$V9= 5
##$VALIST= <valist>
##$VCLIST= <CCCCCCCCCCCCCCC>
##$VD= 0
##$VDLIST= <DDDDDDDDDDDDDDD>
##$VPLIST= <PPPPPPPPPPPPPPP>
##$VTLIST= <TTTTTTTTTTTTTTT>
##$WBST= 1024
##$WBSW= 4
##$XGAIN= (0..3)
0 0 0 0 
##$XL= 0
##$YL= 0
##$YMAX_a= 66197
##$YMIN_a= -178644
##$ZGOPTNS= <>
##$ZL1= 120
##$ZL2= 120
##$ZL3= 120
##$ZL4= 120
##$ABSF1= 10
##$ABSF2= 0
##$ABSG= 5
##$ABSL= 3
##$ALPHA= 0
##$AQORDER= 0
##$ASSFAC= 0
##$ASSFACI= 0
##$ASSFACX= 0
##$ASSWID= 0
##$AUNMP= <proc_1d>
##$AZFE= 0.1
##$AZFW= 0.1
##$BCFW= 1
##$BC_mod= 2
##$BYTORDP= 1
##$COROFFS= 0
##$CY= -3
##$DATMOD= 1
##$DC= 2
##$DFILT= <>
##$DTYPP= 0
##$F1P= 0
##$F2P= 0
##$FCOR= 0.5
##$FTSIZE= 0
##$FT_mod= 4
##$GAMMA= 1
##$GB= 0.15
##$INTBC= 1
##$INTSCL= 1
##$ISEN= 128
##$LB= 0.25
##$LEV0= 0
##$LPBIN= 0
##$MAXI= 10000
##$MC2= 0
##$MEAN= 0
##$ME_mod= 0
##$MI= 1.114404
##$NCOEF= 0
##$NC_proc= 0
##$NLEV= 6
##$NOISF1= 3.799351
##$NOISF2= 2.8
##$NSP= 1
##$NTH_PI= 0
##$NZP= 0
##$OFFSET= 14.38212
##$PC= 1
##$PHC0= 251.8313
##$PHC1= 9.992201
##$PH_mod= 1
##$PKNL= yes
##$PPARMOD= 0
##$PSCAL= 0
##$PSIGN= 0
##$REVERSE= no
##$SF= 200.129724274929
##$SI= 16384
##$SIGF1= 3
##$SIGF2= 2
##$SINO= 400
##$SIOLD= 16384
##$SREGLST= <1H.CDCl3>
##$SSB= 0
##$STSI= 0
##$STSR= 0
##$SW_p= 3205.1282051282
##$SYMM= 0
##$S_DEV= 0
##$TDeff= 0
##$TDoff= 0
##$TI= <>
##$TILT= no
##$TM1= 0
##$TM2= 0
##$TOPLEV= 0
##$USERP1= <user>
##$USERP2= <user>
##$USERP3= <user>
##$USERP4= <user>
##$USERP5= <user>
##$WDW= 1
##$XDIM= 8192
##$YMAX_p= 0
##$YMIN_p= 0
$$ End of Bruker specific parameters
$$ ---------------------------------
##NTUPLES= NMR FID
##VAR_NAME=  TIME,          FID/REAL,        FID/IMAG
##SYMBOL=    X,             R,               I
##VAR_TYPE=  INDEPENDENT,   DEPENDENT,       DEPENDENT
##VAR_FORM=  AFFN,          ASDF,            ASDF
##VAR_DIM=   8192,          8192,            8192
##UNITS=     SECONDS,       ARBITRARY UNITS, ARBITRARY UNITS
##FACTOR=    0.0002768,     1,               1
##FIRST=     0,             0,               0
##LAST=      2.2672688,     0,               0
##MIN=       0,             -178644,         0
##MAX=       2.2672688,     66197,           0
$$ Real data points
##PAGE= N=1
##DATA TABLE= (X++(R..R)), XYDATA
$$ [...]
$$ plain form
1636 -58 -68 -67 -197 -103 17 -242 -5 381 159 316 128 104 101 -21 -191 -78 -29 -5 -108 -130 97 330 142 113
1660 113 66 120 168 -96 -36 -67 8 70 -326 -27 15 -23 -80 -108 81 32 235 -132 -371 243 16 88 -240 -111
1684 -111 369 118 -50 115 -18 254 88 -62 19 45 69 -108 37 17 237 -200 63 -119 117 245 -60
1705 -60 -318 -186 35 -27 -143 -50 166 228 98 -187 -48 117 -45 -205 -69 65 50 -119 -168 -20 71 15 132
1728 132 107 223 161 -203 -224 -127 -172 65 -141 -134 -48 203 -101 -44 127 124 150 -35 41 -11 22 42 -347 -162 358
1753 358 390 -47 -7 -106 225 22 -131 -73 -183 56 9 -75 107 8 249 -91 110 130 117 -314 -239 22 135
1776 135 -216 -161 73 187 206 -7 64 108 212 84 -211 -53 116 73 45 -241 -29 10 217 22 -90 150
1798 150 82 -153 -176 -341 84 -72 44 -230 145 1 -65 -193 -30 39 227 -93 -131 209 -102 -3 -155 -186
$$ packed form
1636e8j0Jj30R4J20k59K37L86k22J57j88k4lj22j70J13M9K4j03k2K27K33j88k9
1660A13m7N4M8k64O0l1P5O2l96K99M2l8n7k8J89m9K03l67k39O14k27P2l28J29
1684a11M80k51j68J65j33K72j66j50Q1K6K4j77J45k0K20m37K63j82K36J28l05
1705f0k58J32K21o2j16R3K16O2j30k85J39J65j62j60J36J34j5j69m9J48R1n6J17
1728A32k5J16o2l64k1R7m5K37k06PQ6K51l04N7J71lK6j85P6n2L3K0l89J85N20
1753C58L2m37M0r9L31k03j53N8j10K39m7q4J82r9K41l40K01K0j3m31P5K61J13
1776A35l51N5K34J14J9k13P1M4J04j28k95J58J69m3k8k86K12L9K07j95j12K40
1798A50o8k35k3j65M25j56J16k74L75j44o6j28J63O9J88l20l8L40l11R9j52l1
$$ plain form
1820 -186 112 284 107 5 106 97 -17 -130 -5 30 -52 14 -124 57 370 60 -2 -81 94 23 43 -266 -60
1843 -60 -80 32 -123 -214 203 311 176 -72 -19 235 107 -99 -128 29 258 34 174 13 131 242 8 -86
1865 -86 124 350 47 7 -90 18 433 -152 -170 97 86 21 -247 31 8 111 -5 -82 -190 16 -101 -196 59
1888 59 16 99 93 -263 -160 -76 227 8 -124 14 143 -82 -229 -1 -16 131 -208 -71 252 196 169 -252 -19
1911 -19 -120 172 -85 -184 40 149 -40 -21 62 191 90 -105 -268 45 107 35 -90 -125 159 29 313 -30
1933 -30 -115 457 153 -163 -195 129 -129 -13 -4 -56 157 102 -158 -204 242 59 -35 -134 103 117 150 -226 -85 95
1957 95 306 99 -187 -4 113 17 -83 78 49 80 -302 -272 -52 194 -57 34 -206 -58 112 -94 -176 -59
1979 -59 138 163 -299 -121 -80 121 74 6 135 64 257 -82 -280 65 214 0 162 29 115 113 25 87 -54 78
$$ packed form
1820a86K98J72j77j02J01rj14j13J25L5q2O6j38J81L13l10o2p9J75p1K0l09K06
1843f0k0J12j55r1M17J08j35k48N3K54j28k06k9J57K29k24J40j61J18J11k34r4
1865h6K10K26l03m0r7J08M15n85j8K67j1o5k68K78k3J03j16p7j08K06j17r5K55
1888E9m3Q3ol56J03Q4L03k19j32J38J29k25j47K28j5J47l39J37L23n6k7m21K33
1911a9j01K92k57r9K24J09j89J9Q3J29j01j95j63L13O2p2j25l5K84j30K84l43
1933c0q5N72l04l16l2L24k58J16Rn2K13n5k60m6M46j83r4r9K37J4L3l76J41J80
1957I5K11k07k86J83J17r6j00J61k9L1l82L0K20K46k51R1k40J48J70k06q2J17
1979e9J97K5m62J78M1K01m7o8J29p1J93l39j98L45J49k14J62j33Q6kq8O2j41J32
$$ plain form
2003 78 -78 104 -80 -12 164 43 -300 25 170 5 -15 -82 17 -53 136 -109 -70 -7 5 -155 -48 -20 252
2026 252 177 -233 -200 300 79 91 36 71 86 -71 -28 100 5 127 55 -238 13 102 -229 -44 -163 -142 77 -70
2050 -70 -176 -9 -8 -11 -72 -153 -10 143 86 -57 93 117 100 -206 -40 8 150 -7 -105 -75 130 110 -128 31 199
2075 199 99 45 -33 26 201 -24 9 -79 -138 152 -8 32 -111 -48 185 -120 -288 50 -163 -51 -95 -70 -73 206
2099 206 -104 -1 -93 7 71 -193 -165 181 145 -99 -155 -32 -140 149 97 174 -48 -99 120 -161 -31 193 -7
2122 -7 -62 -109 70 97 -126 -20 -1 -34 -49 -52 -205 128 -30 6 49 85 158 -102 -108 -158 51 -89 -92 -110 -82 -115 54
2149 54 95 -119 25 -21 -127 -44 31 196 32 -173 -34 118 11 303 5 66 79 -119 149 -89 -43 47 43 74
2173 74 -107 -113 26 7 -90 -82 44 -53 -133 -65 -41 19 70 -210 -4 -23 -39 -8 -200 106 -62 -155 -27 -70 132 47
$$ packed form
2003G8j56J82j84O8J76j21l43L25J45j65k0o7R9p0J89k45L9O3J2j60J07K8K72
2026B52p5m10L3N00k21J2n5L5J5j57M3J28r5J22p2k93K51Q9l31J85j19K1K19j47
2050g0j06J67Jlo1q1J43J53n7j43J50K4j7l06J66M8J42j57r8L0K05k0k38J59J68
2075A99j00n4p8N9J75k25L3q8n9K90j60M0j43O3K33l05j68L38k13J12m4K5lK79
2099B06l10J03r2J00O4k64K8L46l6k44n6J23j08K89n2P7k22n1K19k81J30K24k00
2122gn5m7J79K7k23J06J9l3j5lj53L33j58L6M3L6P3k60on0K09j40lj8K8l3J69
2149E4M1k14J44m6j06Q3P5J65j64k05J39J52j07K92k98O1J3j98K68k38M6R0mL1
2173G4j81oJ39j9r7QJ26r7q0O8K4O0N1k80K06j9j6L1j92L06j68r3J28m3K02q5
$$ plain form
2199 47 -183 106 -51 60 253 54 47 -18 -13 107 -4 43 17 -156 -150 -179 -107 56 -191 21 46 290 63 -139
2223 -139 -155 -71 -30 -175 -67 -20 142 -27 -186 -160 116 -18 199 -104 -28 106 -102 -35 -231 195 -92 119
2245 119 148 -16 -46 155 -6 -107 -30 -86 -105 -58 -31 -107 178 -149 -175 168 2 60 35 181 11 79 -33 -348
2269 -348 -167 154 -230 -193 -34 -11 116 -126 84 -125 78 -88 -145 90 139 -72 24 -182 -110 27 96 -117
2291 -117 -102 -122 -173 -110 48 -1 -23 80 -66 -193 -60 -7 -43 -29 -117 -49 -78 -22 76 24 -38 23 119 -78 54 28
2317 28 78 56 129 -90 98 121 -145 136 133 84 53 -36 40 -203 -116 197 -34 8 62 92 -172 144 49 -96 -168 -150
2343 -150 120 -189 -87 -95 -180 93 32 -44 78 218 -272 -20 -34 31 -143 25 -132 -111 135 66 -103 -172 54
2366 54 28 -68 42 154 -106 260 -80 -47 76 282 40 42 92 170 46 -129 -136 174 -65 -228 85 -75 158
$$ packed form
2199D7k30K89j57J11J93j99po5NJ20j11M7k6j73Ok9P2J63k47K12K5K44k27k02
2223a39j6Q4M1j45J08M7J62j69j59K6K76j34K17l03P6J34k08O7j96M26k87K11
2245A19K9j64l0K01j61j01P7n6j9M7K7p6K85l27k6L43j66N8k5J46j70O8j12l15
2269c48J81L21l84L7J59K3J27k42K10k09K03j66n7K35M9k11R6k06P2J37O9k13
2291a17J5k0n1O3J58m9k2J03j46j27J33N3l6J4q8O8k9N6R8n2o2O1R6j97J32k6
2317B8N0k2P3k19J88K3k66K81lm9l1q9P6k43Q7L13k31M2N4L0k64L16r5j45p2J8
2343a50K70l09J02qq5K73o1p6J22J40m90K52j4O5j74J68j57K1K46o9j69o9K26
2366E4k6r6J10J12k60L66l40L3J23K06k42KN0P8j24j75pL10k39j63L13j60K33
$$ plain form
2389 158 20 -257 -138 -186 -45 -127 -45 104 61 -24 123 43 -185 207 -99 -228 120 300 -152 20 -130 142
2411 142 265 60 -129 -144 -64 102 -53 191 -137 134 124 199 191 -77 255 17 -100 -45 8 14 -68 44 -28 0
2435 0 15 203 46 59 -28 41 -302 -88 163 -90 -188 138 -56 14 -311 -190 -22 102 2 -154 -147 31 -146
2458 -146 -65 102 78 175 113 -45 88 114 155 161 -65 -4 -26 -109 -63 -72 -40 -158 -90 242 54 -45 42 46 -39 134 174
2485 174 67 -11 -86 -5 163 153 77 -139 219 -51 -106 -149 -204 -219 -8 -67 -74 151 2 150 -50 15 -24 202 33
2510 33 -164 378 -10 -45 -63 -183 -17 124 -88 -91 99 -60 153 26 251 49 30 -115 -12 -46 165 -120
2532 -120 -1 32 -82 -6 -109 150 -132 237 186 56 128 -245 -282 -6 12 -52 181 -73 -87 -111 -120 -129 164 -11
2556 -11 38 7 -167 -2 205 22 16 -45 -57 146 155 7 -8 3 -2 86 -96 13 112 -184 -92 -106 -173 -12 457 -109
$$ packed form
2389A58j38k77J19m8J41q2Q2J49m3q5J47q0k28L92l06j29L48J80m52J72j50K72
2411A42J23k05j89j5Q0J66j55K44l28K71j0P5qk68L32k38j17N5N3Oq2J12p2K8
2435@J5J88j57J3q7O9l43K14K51k53r8L26j94P0l25J21J68J24j00j56PJ78j77
2458a46Q1J67k4R7o2j58J33K6M1Ok26O1k2q3M6rL2j18O8L32j88r9Q7Mq5J73M0
2485A74j07p8p5Q1J68j0p6k16L58k70n5m3n5j5K11n9pK25j49J48k00O5l9K26j69
2510C3j97N42l88l5j8j20J66J41k12lJ90j59K13j27K25k02j9j45J03l4K11k85
2532a20J19L3j14P6j03K59k82L69n1j30P2l73l7K76J8o4K33k54j4k4rrK93j75
2556a1M9l1j74J65K07j83oo1j2K03Rj48j5J1nQ8j82J09R9k96R2j4o7J61M69n66
$$ plain form
2582 -109 -99 54 -99 139 2 -151 67 104 30 -8 -136 47 -62 66 24 -122 -201 117 -52 31 103 -28 -119
2605 -119 202 -17 -156 -169 42 -32 162 152 -83 -19 1 -41 129 88 -28 -74 -41 78 -8 63 -81 23 11 -37
2629 -37 190 106 140 -211 67 22 16 53 -144 -22 134 20 11 -88 -141 142 249 11 57 -142 -146 -19 4 -7 101
2654 101 -86 48 -5 95 16 -59 29 -23 214 102 -56 115 -198 59 38 9 43 -58 149 -119 -118 -145 -66 38
2678 38 50 14 -115 -25 -63 49 48 -208 -129 -41 142 -118 -118 25 -27 63 39 -34 -87 60 -68 -50 -211 51 103 39
2704 39 -127 66 154 -125 -17 25 -68 -68 -78 193 -69 -39 -120 211 -228 107 33 -60 24 65 163 175 -11 52 50 80
2730 80 108 4 -156 -18 -121 -19 -21 -15 -12 39 130 74 8 61 -18 -75 -160 47 -113 9 -17 15 -135 68 -20 143
2756 143 -26 36 151 -97 -17 10 -93 16 -7 -20 -59 11 6 16 9 -10 36 -113 139 -53 -119 71 87 -114 -76 135
$$ packed form
2582a09J0J53j53K38j37j53K18L7p4l8j28J83j09J28m2j46p9L18j69Q3P2j31r1
2605a19L21k19j39j3K11p4J94j0k35O4K0m2J70m1j16m6L3J19q6P1j44J04j2m8
2629c7K27q4L4l51K78m5oL7j97J22J56j14rr9n3K83J07k38M6j99mJ27K3j1J08
2654A01j87J34n3J00p9p5Q8n2K37j12j58J71l13K57k1k9L4j01K07k68Jk7P9J04
2678C8J2l6j29R0l8J12jk56P9Q8J83k60%J43n2R0k4p3n3J47j28J8j61K62N2o4
2704C9j66J93Q8k79J08M2r3%j0K71k62L0q1L31m39L35p4r3Q4M1R8J2j86O3kL0
2730H0K8j04j60J38j03J02kOLN1R1n6o6N3p9n7q5K07j60J22k6L2j50K03q8J63
2756A43j69O2J15k48Q0K7j03J09k3j3l9P0nJ0pj9M6j49K52j92o6J90J6k01L8K11
$$ plain form
2782 135 -22 182 110 -118 98 -249 84 26 -47 179 -31 -59 15 -120 17 -74 -194 108 174 87 -93 143 -142
2805 -142 58 24 -11 -144 -238 18 44 -20 29 232 55 -68 -171 -163 -46 -74 24 70 -4 -38 -89 57 79 12 -135
2830 -135 6 -53 68 -1 -131 39 80 -2 -45 60 86 -72 -6 -118 116 -231 93 -127 103 1 -44 160 2
2853 2 53 39 -7 -72 57 -94 115 179 -76 48 112 187 158 -73 -174 14 91 1 -59 -13 34 51 38 -10 -35 50 -92
2880 -92 85 -99 6 -124 19 112 -141 3 -66 -29 -17 109 135 -34 -105 42 204 117 37 -165 46 -16 11 45
2904 45 95 -180 132 -67 54 -69 86 -242 -132 -52 -54 -57 48 -163 -13 191 59 58 -49 36 93 48 -108 103
2928 103 -176 -230 50 124 -11 -78 231 -66 32 -165 -107 98 -102 -54 34 89 -5 -16 85 -112 168 46 -53 -94
2952 -94 55 161 30 169 11 94 147 123 165 -31 97 -33 338 -56 -188 39 -95 34 -75 47 124 -120
$$ packed form
2782A35j57K04p2k28K16l47L33n8p3K26k10k8P4j35J37r1j20L02O6q7j80K36k85
2805a42K00l4l5j33r4K56K6o4M9K03j77j23j03QJ17k8R8M6p4l4n1J46K2o7j47
2830a35J41n9J21o9j30J70M1q2m3J05K6j58O6j12K34l47L24k20K30j02m5K04j58
2853BN1j4m6o5J29j51K09O4k55J24O4P5k9k31j01J88P7r0o0M6M7J7j3m8k5Q5j42
2880i2J77j84J05j30J43R3k53J44o9L7J2J26K6j69p1J47J62q7q0k02K11o2K7L4
2904D5N0k75L12j99J21j23J55l28J10Q0klJ05k11J50K04j32jj07Q5N7m5j56K11
2928A03k79n4K80P4j35o7L09k97R8j97N8K05k00M8Q8N5r4j1J01j97K80j22r9m1
2952i4J49J06j31J39j58Q3N3k4M2j96J28j30L71l94j32K27j34J29j09J22P7k44
$$ plain form
2974 -120 -150 85 15 -25 -2 -80 -62 -94 -46 -184 8 -96 -29 -139 -175 39 0 230 -99 57 -46 75 253 48
2998 48 20 69 -193 181 67 73 -2 19 70 -145 30 58 25 -102 -41 50 -66 24 -98 46 89 -67 74 62 -59
3023 -59 -88 -75 -64 121 -101 34 -86 32 -148 53 51 -13 5 20 -25 -62 194 65 163 -35 -53 -233 -5 124
3047 124 -37 -13 128 -8 -73 -109 3 2 -150 -160 135 -92 -52 -34 244 69 -196 -46 151 -54 50 -49 -54 43
3071 43 -85 -193 23 178 -17 217 -102 86 120 -17 31 197 -176 219 -153 -47 16 19 -4 -139 168 74 94
3094 94 -41 114 24 -53 -93 55 -27 -101 -26 139 29 -47 -149 -14 170 -12 -22 -11 -124 -12 -176 83 66 -8
3118 -8 -29 -24 55 -50 176 -48 -6 -47 -36 102 -142 -35 -24 -108 256 -32 -118 91 65 -158 109 -86 19 88 -78
3143 -78 -139 2 -20 -126 46 -81 105 111 70 24 -83 152 88 -305 -102 213 -87 43 -18 14 -60 -21 180 83
$$ packed form
2974a20l0K35p0m0K3p8J8l2M8j38J92j04O7j10l6K14l9K30l29J56j03J21J78k05
2998D8k8M9k62L74j14Op5K1N1k15J75K8l3j27O1R1j16R0j22J44M3j56J41j2j21
3023e9k9J3J1J85k22J35j20J18j80K01ko4J8J5m5l7K56j29R8j98j8j80K28J29
3047A24j61K4J41j36o5l6J12jj52j0K95k27M0J8K78j75k65J50J97k05J04r9nR7
3071D3j28j08K16J55j95K34l19J88L4j37M8J66l73L95l72J06O3Lk3j35L07r4K0
3094I4j35J55r0p7m0J48q2p4P5J65j10p6j02J35J84j82j0J1j13J12j64K59j7p4
3118hk1NP9j05K26k24M2m1J1J38k44J07J1q4L64k88q6K09k6k23K67j95J05O9j66
3143g8o1J41k2j06J72j27J86Om1m6j07K35o4l93K03L15l00J30o1L2p4L9K01r7
$$ plain form
3167 83 203 34 80 116 -253 -130 -99 -201 122 -121 -39 -138 -61 27 136 -143 138 -37 38 -36 119 13 -80 43
3191 43 -203 -230 -279 38 33 -1 -12 -72 112 -79 169 118 38 84 -85 186 75 60 261 105 95 -71 -109 238 -55
3216 -55 -33 34 302 -38 -36 -69 -132 -113 -13 -71 98 -128 -22 -187 135 141 13 7 -90 -107 -58 -8 108 123 -179 47
3242 47 83 -39 -18 -2 49 -119 38 -191 -22 -40 32 90 111 384 -96 -40 -164 -2 -13 173 18 59 -97 40
3266 40 -11 -204 -28 165 137 4 70 47 -54 -52 13 16 -172 -99 42 -107 -124 22 -13 10 -91 80 -31 -5 -22
3291 -22 171 -185 11 82 86 -104 -46 -151 -130 -45 -92 -36 50 77 169 335 -13 5 -286 84 -98 -116 -145 -37 -166
3316 -166 -110 221 186 -114 113 89 -36 -156 65 236 2 72 75 113 -83 -100 68 -236 -33 24 -56 5 -32 -94
3340 -94 64 -10 2 91 182 20 86 -88 -23 -60 -102 -206 99 -27 93 -130 -46 41 132 -115 -35 152 -156 142
$$ packed form
3167H3J20j69M6L6l69J23L1j02L23k43Q2r9P7Q8J09k79K81j75P5p4J55j06r3J23
3191D3k46k7m9L17nl4j1o0J84j91K48n1q0M6j69K71j11j5K01j56j0j66l8L47k93
3216e5K2O7K68l40Kl3o3J9J00n8J69k26J06j65L22Oj28or7j7M9N0J16J5l02K26
3242D7L6j22K1J6N1j68J57k29J69j8P2N8K1K73m80N6j24J62j1J86j55M1j56J37
3266D0n1j93J76J93k8j33O6k3j01KO5Lj88P3J41j49j7J46l5K3j01J71j11K6j7
3291b2J93l56J96P1Mj90N8j05K1Q5m7N6Q6K7R2J66l48J8k91L70j82j8k9J08j29
3316a66N6L31l5l00K27k4j25j20K21J71k34P0LL8j96j7J68l04K03N7q0O1l7o2
3340i4J58p4J2Q9R1j62O6j74O5l7m2j04L05j26J20k23Q4Q7R1k47Q0J87l08K98
$$ plain form
3364 142 -81 59 -100 11 -60 -29 8 20 63 208 122 236 77 49 -130 63 164 34 24 -31 64 -50 91
3387 91 14 -138 -139 -40 -40 -104 -42 222 -154 -133 11 89 49 131 -15 156 -23 4 188 70 -123 15 -27 -35 -38 82
3413 82 -98 202 54 40 50 -159 -102 -120 21 20 -52 25 5 2 -18 -173 53 40 111 -170 58 -37 -105 -92 66 -26
3439 -26 13 133 55 -103 84 -10 94 -79 -190 217 -30 -81 88 83 -89 87 237 11 -69 58 96 -117 -87
3462 -87 32 27 49 -16 43 -85 5 -102 -10 120 158 23 -176 -31 -39 38 -106 -243 9 -198 -118 -82 12 53 11 170
3488 170 -133 9 122 48 2 55 126 -44 17 65 34 73 -65 91 -288 80 109 -84 -217 -17 27 -75 116
3511 116 122 8 -156 203 -23 -52 61 -237 220 -16 156 -18 30 136 102 49 96 105 -10 227 -295 96 124
3534 124 48 154 -4 -27 259 -59 -42 11 235 -100 -139 -96 -36 157 -41 9 91 136 30 29 82 -33 -39 -13 -156
$$ packed form
3364A42k23J40j59J11p1L1L7J2M3J45q6J14j59k8j79J93J01j30j0n5R5j14J41
3387I1p7j52jR9%o4O2K64l76K1J44P8m0Q2j46J71j79K7J84j18j93J38m2qlJ20
3413H2j80L00j48j4J0k09N7j8J41jp2P7k0lk0j55K26j3P1k81K28r5o8J3J58r2
3439b6L9J20p8j58J87r4J04j73j11M07k47n1J69nj72J76J50k26q0J27L8k13L0
3462h7J19nK2o5N9j28R0j07R2J30L8j35j99J45qP7j44j37K52k07Q0L6R4M1m2J59
3488A70l03J42J13p4m6N3P1j70O1M8l1L9j38J56l79L68K9j93j33K00M4j02J91
3511A16Oj14j64L59k26k9J13k98M57k36J72j74M8J06l4n3M7Rj15K37n22L91K8
3534A24p6J06j58k3K86l18J7N3K24l35l9M3O0J93j98N0Q2M5j06jN3j15oK6j43
$$ plain form
3559 -156 119 138 64 -11 -129 -6 -28 -103 -72 -126 49 -155 -73 -55 -104 30 -40 82 68 -39 184 -137 -99 118
3583 118 -70 -119 -52 -89 46 152 3 48 -126 179 186 -107 84 110 38 -126 128 24 -69 98 -169 -97 -50 -80
3607 -80 -41 -66 -114 -44 -274 -134 -54 146 -57 103 58 -110 20 49 -173 -35 45 133 89 -92 77 38 -43 25 -148
3632 -148 251 -123 21 -106 -152 -84 26 11 -148 -24 -13 168 -318 -8 -150 120 90 -50 -124 -119 45 -174 -17
3655 -17 -152 -59 217 -25 36 31 -90 3 18 -128 236 -22 -89 151 -23 -202 -13 -50 213 -52 45 -79 30
3678 30 -137 -60 -28 -85 -19 79 -96 38 105 125 -35 8 36 -125 -106 125 -160 -145 -157 -83 -76 -33 231 30 -90 2
3704 2 -8 -22 -154 82 -142 165 77 -103 36 58 140 176 192 120 110 20 -100 115 -67 -37 65 -124 -54 133 -4
3729 -4 65 66 -10 -7 -251 -117 -179 92 15 119 237 -74 -8 -207 -72 -107 82 118 -82 285 -32 -125 122 -115 76
$$ packed form
3559a56K75J9p4p5j18J23k2p5L1n4J75k04Q2J8m9J34p0J22j4j07K23l21L8K17
3583A18j88m9O7l7J35J06j49M5j74L05Pk93J91K6p2j64K54j04r3J67k67P2M7l0
3607h0L9k5m8P0k30J40Q0K00k03J60m5j68J30K9k22J38Q0Q8m4j81J69l9q1O8j73
3632a48L99l74J44j27m6O8J10j5j59J24J1J81m86L10j42K70l0j40p4NJ64k19J57
3655a7j35R3K76k42O1nj21R3J5j46L64k58o7K40j74j79J89l7K63k65R7j24J09
3678C0j67P7L2n7O6R8j75J34O7K0j60M3K8j61J9K31k85J5j2P4PM3K64k01j20R2
3704Bj0j4j32K36k24L07q8j80J39K2Q2L6J6p2j0r0j20K15j82L0J02j89P0J87j37
3729dO9Jp6Lk44J34o2K71p7J04J18l11O6j99J35l5J89L6k00L67l17r3K47k37J91
$$ plain form
3754 76 181 -206 170 9 219 189 -20 -279 20 -87 83 38 30 -116 -51 -78 67 12 70 -30 -70 -6 84 -124
3778 -124 186 -82 133 45 -139 -55 190 -21 28 279 -19 -21 -42 256 -185 33 183 99 -230 -104 200 -41
3800 -41 -90 -43 -64 -130 -57 57 -33 -121 -57 -54 -39 128 -194 31 91 -192 -122 62 -380 33 -26 -95 -95 -37 85 -153
3826 -153 -28 -11 -79 76 -117 -147 127 -224 14 -108 63 61 -14 -29 -93 11 35 168 27 49 -16 -80 -22 90
3850 90 48 30 -91 -10 -99 58 129 -58 -8 31 -139 -113 73 -70 142 40 -6 -106 -51 -4 34 -94 42 -122
3874 -122 145 122 73 32 25 70 -4 158 11 -88 -47 142 6 150 -4 -34 130 -168 39 14 -197 -106 -43 -66 -24
3899 -24 -30 -211 86 -288 -53 -58 266 -145 -94 44 6 -47 95 -87 -20 92 101 13 203 6 3 -188 117 36 105
3924 105 130 98 -7 118 -11 156 139 63 -30 -85 14 43 34 180 70 -182 29 44 52 -48 118 -20 -96 98 8
$$ packed form
3754G6J05l87L76j61K10l0k09k59K99j07J70m5qj46O5k7J45n5N8j00m0O4R0k08
3778a24L10k68K15q8j84Q4K45k11M9K51k98kk1K98m41K18J50q4l29J26L04k41
3800d1m9M7k1o6P3J14r0q8O4LJ5J67l22K25O0k83P0J84m42M13n9o9%N8J22k38
3826a53J25J7o8J55j93l0K74l51K38j22J71kp5j5o4J04K4J33j41K2o5o4N8J12
3850I0m2j8j21Q1q9J57P1j87N0L9j70K6J86j43K12j02m6j00N5M7L8j28J36j64
3874a22K67k3m9m1pM5p4J62j47r9M1J89j36J44j54l0J64k98K07k5k11R1O3k3M2
3899b4oj81K97l74K35nL24m11N1J38l8n3J42j82O7J12Rq8J90j97lj91L05q1O9
3924A05K5l2j05J25j29J67j7p6r3n5R9K9rJ46j10k52K11J5Qj00J66j38p6J94r0
$$ plain form
3949 8 -27 80 90 -157 143 41 40 34 37 34 343 190 121 -83 44 263 25 -185 -304 76 -158 136 117 44 102
3974 102 -90 -234 267 107 -142 57 -132 -205 0 -118 -126 4 76 11 170 -167 65 146 -260 1 69 57 48
3997 48 -155 -88 164 -227 58 -104 -22 135 -221 -24 -30 18 186 -224 93 -42 195 218 -62 140 160 -77 -13
4020 -13 -182 -10 227 -128 -22 26 -226 73 102 -38 -20 24 -27 -11 -135 -84 3 29 -65 -118 -120 -18 -172 84 -18
4045 -18 -6 25 98 -69 -9 47 144 -95 -91 -140 -167 -260 -7 229 -35 -85 -70 129 -16 36 -185 66 -301 96 -194
4070 -194 15 -156 166 96 149 -77 14 107 152 -75 41 -133 -75 47 55 96 -20 29 84 16 101 75 -26 198 -54
4095 -54 123 122 -117 -90 79 57 -98 -178 21 237 -6 61 -40 36 6 -14 -101 -135 -243 -24 125 15 -72 -76 146
4120 146 17 43 -160 2 -38 -101 11 -40 249 -19 52 -92 -93 95 54 -72 -68 54 80 -177 -63 -99 121 17
$$ packed form
3949Hl5J07J0k47L00j02joLlL09j53o9k04J27K19k38k10j19L80k34K94j9p3N8
3974A02j92j44N01j60k49J99j89p3K05j18qJ30P2o5J59l37K32Q1m06K61O8j2r
3997D8k03O7K52l91K85j62Q2J57l56J97oM8J68m10L17j35K37K3k80K02K0k37O4
4020a3j69J72K37l55J06M8k52K99K9j40J8M4n1J6j24N1Q7K6r4n3kJ02j54K56j02
4045a8J2L1P3j67O0N6R7k39Mm9k7r3K53K36k64n0J5J99j45N2k21K51l67L97k90
4070a94K09j71L22p0N3k26R1R3M5k27J16j74N8J22QM1j16M9N5o8Q5k6j01K24k52
4095e4J77jk39K7J69k2j55q0J99K16k43O7j01P6l0k0q7l4j08K19J49j10q7mK22
4120A46j29K6k03J62m0o3J12n1K89k68P1j44jJ88m1j26MJ22K6k57J14l6K20j04
$$ plain form
4144 17 117 -8 -113 -233 -11 -133 -81 -100 124 0 -19 -2 70 24 -132 -70 -42 128 171 -29 70 142 0 128
4168 128 -65 63 81 -32 239 49 60 44 54 -97 120 -114 -188 104 92 -66 36 -49 164 -41 134 -58
4190 -58 22 -124 -166 -194 -46 -33 -123 -65 -87 -152 -132 -81 -60 -110 -19 -247 -138 14 14 233 25 -66 -58 -110 -10 4 36
4217 36 -38 -88 -42 117 142 -9 50 12 -88 67 -146 75 -76 -95 68 -139 -33 -126 -92 97 -123 226 -57
4240 -57 25 -17 -18 -41 56 -39 -92 -135 -58 50 23 -112 -65 23 -31 53 -16 -65 -31 -8 -9 -149 -192 -238 -131 47 24 -12 132
4269 132 -16 65 11 -123 -103 -112 -101 -160 130 87 285 89 -48 134 -20 -183 84 119 149 11 9 35 96 5 9 -61
4295 -61 320 23 -28 17 -79 -13 -43 -96 38 200 5 194 -146 -48 -103 35 -32 6 55 23 -105 9 -40 75 -53
4320 -53 72 8 -185 26 -45 -16 -158 107 -42 -93 62 211 -39 -127 205 -9 73 164 -103 328 106 -31 18
$$ packed form
4144A7J00j25j05j20K22j22N2j9K24j24j9J7P2m6j56O2K8J70M3k00R9P2j42J28
4168A28j93J28J8j13K71j90J1j6J0j51K17k34p4K92j2j58J02q5K13k05J75j92
4190e8Q0j46m2k8J48J3r0N8k2o5K0N1K1n0R1k28J09J52%K19k08r1Qn2J00J4L2
4217C6p4n0M6J59K5j51N9l8j00J55k13K21j51j9J63k07J06r3L4J89k20L49k83
4240e7Q2m2jk3R7r5n3m3P7J08k7j35M7Q8n4Q4o9m9L4K3jj40m3m6J07J78k3l6J44
4269A32j48Q1n4j34K0rJ1n9K90m3J98j96j37J82j54j63K67L5L0j38kK6O1r1Mp0
4295f1L81k97n1M5r6O6l0n3J34J62j95J89l40R8n5J38o7L8M9l2j28J14m9J15j28
4320e3J25o4j93K11p1K9j42K65j49n1J55J49k50q8L32k14Q2R1k67M31k22j37M9
$$ plain form
4343 18 -222 -65 -24 -100 28 8 102 -55 36 24 -130 -66 76 -111 92 -109 -51 -57 11 -88 -160 -35 -116 113 148
4368 148 8 19 271 -196 -104 -272 -94 78 62 -5 226 63 -25 43 -44 7 -144 -9 26 -4 -52 -39 70 -8
4392 -8 46 138 151 -147 -70 54 1 -90 150 116 -110 -179 -74 57 13 -13 142 -109 44 -110 -39 -186 240 -83
4416 -83 152 -34 -15 15 80 187 -41 -315 -159 19 -104 62 -51 -36 97 -67 -109 -78 167 26 -47 -88 -100
4439 -100 -135 112 -4 69 -54 -134 64 6 -24 -119 -145 -59 -94 -351 -182 54 -11 -79 159 -6 -148 41 -110 26
4463 26 -23 44 99 157 -15 28 -42 -92 250 2 -151 5 206 92 -65 -330 -187 126 -7 -110 -142 -53 57
4486 57 81 -8 128 156 113 -25 -31 -119 -179 -148 76 -106 -110 -70 92 136 48 43 91 -99 8 4 -163 217 -144 -125 -35
4513 -35 -105 144 -14 -50 78 -168 -146 31 -73 -176 -143 105 224 71 34 -10 -85 154 78 -17 -116 -35 -14 37 70
$$ packed form
4343A8k40J57M1p6J28k0R4j57R1j2j54O4J42j87K03k01N8oO8r9p2J25q1K29L5
4368A48j40J1K52m67R2j68J78J72j6o7K31j63q8O8q7N1j51J35L5l0m8J3J09p8
4392hN4R2J3k98P7J24n3r1K40l4k26o9J05J31m4k6J55k51J53j54P1j47M26l23
4416h3K35j86J9L0O5J07k28k74J56J78j23J66j13J5J33j64m2L1K45j41p3m1j2
4439a00l5K47j16P3j23q0J98n8l0r5k6Q6l5k57J69K36o5o8K38j65j42J89j51J36
4463B6m9O7N5N8j72M3p0n0L42k48j53J56K01j14j57k65J43L13j33j03l2Q9J10
4486E7K4q9J36K8m3j38oq8o0L1K24j82mM0J62M4q8nM8j90J07mj67L80l61J9R0
4513c5p0K49j58l6J28k46K2J77j04j03L3K48J19j53l7m4p5K39p6r5r9Q1K1N1L3
$$ plain form
4538 70 -101 -17 16 78 -20 125 124 -92 -58 -218 -56 -88 27 -97 -41 -122 40 93 -35 -296 -155 -14 157 -167
4562 -167 10 -25 73 -184 -415 -84 5 -90 93 28 -172 134 -51 23 -65 44 118 -104 302 -30 -33 91 -128
4585 -128 21 115 315 7 -27 -158 -77 78 -59 41 -220 -62 -157 -14 -57 -28 -70 -134 -73 -86 -32 -148 162 -73
4609 -73 -125 -99 -77 90 -289 -8 -17 -83 -190 -27 73 33 39 -11 -59 73 15 216 184 -34 -44 285 -60 132 -39
4634 -39 -165 -121 5 36 167 208 -60 -131 21 83 56 -142 -12 -18 -31 23 -106 -145 -114 -214 -13 -4 -55 -242 -187 16
4660 16 -94 -17 66 226 -1 -107 13 130 -9 59 166 -130 -144 158 -79 -3 -78 -123 8 185 -77 4 174
4683 174 156 2 -173 -140 -78 -56 -196 53 20 -10 -46 -23 76 202 -126 45 -19 -173 -300 -86 -132 207 -53 -274
4707 -274 239 -41 -33 26 -75 233 46 133 -202 -33 58 67 -1 89 149 200 -131 -2 57 211 197 -56 63 -154
$$ packed form
4538G0j71Q4L3O2r8J45jk16L4j60J62l2J15j24N6q1J62N3j28k61J41J41J71l24
4562a67J77l5R8k57k31L31Q9r5J83o5k00L06j85P4q8J09P4k22M06l32lJ24k19
4585a28J49R4K00l08l4j31Q1J55j37J00k61J58r5J43m3K9m2o4O1j3N4j16L10k35
4609g3n2K6K2J67l79K81ro6j07J63J00m0On0m8J32n8K01l2k18j0L29l45J92j71
4634c9j26M4J26L1J31M1k68p1J52O2k7j98J30oj3N4j29l9L1j00K01Rn1j87N5K03
4660A6j10P7Q3J60k27j06J20J17j39O8J07k96j4L02k37P6p5m5J31J77k62Q1J70
4683A74j8j54j75L3O2K2j40K49l3l0l6K3R9J26l28J71o4j54j27K14m6L39k60k21
4707b74N13k80QN9j01L08j87Q7l35J69R1Ro8R0O0N1l31J29N9J54j4k53J19k17
$$ plain form
4731 -154 51 126 163 -47 29 11 106 -71 -37 -20 -189 37 9 109 -101 -2 -74 -141 151 66 -28 -2 -66 -102 32
4756 32 35 19 -139 169 -2 78 281 -84 227 -155 -4 86 -435 -135 -53 -46 186 -5 56 109 173 194 28 69 55
4781 55 -113 -96 65 25 -29 -77 121 -160 -31 2 -169 -122 127 112 -37 -69 -7 26 53 -162 -115 161 236 -137 57
4806 57 -25 124 -81 81 266 39 -49 19 87 -22 -209 -74 -301 43 159 -100 131 -102 -46 -193 79 -132
4828 -132 -48 -78 41 -10 18 141 -19 13 118 97 128 -54 142 -88 190 31 191 -127 206 -108 198 18
4850 18 -143 52 -238 173 -62 -156 -97 275 22 40 -200 -91 179 120 -209 -136 -50 47 5 142 -23 85 53
4873 53 -8 -56 77 99 92 -113 122 149 -267 88 -73 -21 62 -129 -10 42 -140 -30 215 -36 82 -95 34
4896 34 -13 51 -113 38 -109 -67 62 -1 -36 2 -165 41 -203 -30 -127 -166 164 -105 27 -32 21 114 210 107
$$ packed form
4731a54K05P5L7k10P6j8R5j77L4J7j69K26k8J00k10R9p2o7K92q5r4K6o4l6J34
4756C2Lj6j58L08j71Q0K03l65L11l82J51R0n21L00Q2PK32j91O1N3O4K1j66M1j4
4781E5j68J7J61m0n4m8J98k81J29L3j71M7K49j5j49l2O2L3K7k15M7K76P5l73J94
4806E7q2J49k05J62J85k27q8O8O8j09j87J35k27L44J16k59K31k33N6j47K72k11
4828a32Q4l0J19n1K8J23j60L2J05k1L1j82J96k30K78j59J60l18L33l14L06j80
4850A8j61J95k90M11k35r4N9L72k53J8k40J09K70n9l29P3Q6R7m2J37j65J08l2
4873E3o1m8J33K2pk05K35K7m16L55j61N2Q3j91J19N2j82J10K45k51J18j77J29
4896C4m7O4j64J51j47M2J29o3l5L8j67K06k44J73r7l9L30k69J32n9N3R3R6j03
$$ plain form
4920 107 6 13 127 53 8 293 28 228 54 7 90 -30 12 26 205 -23 69 -35 69 288 110 65 -37
4943 -37 260 164 11 144 -92 2 -105 -17 72 128 -8 34 -32 39 28 -171 188 -58 24 165 21 46 8 -92
4967 -92 132 149 200 91 70 46 -46 -123 207 -64 -68 26 183 71 137 184 149 57 67 105 11 15 63 170 172 -55 -18 -100
4995 -100 10 -52 -190 -144 43 -101 -48 -94 -75 -264 43 -43 138 47 -206 112 133 -184 -58 13 159 72 68 -35
5019 -35 196 -33 99 92 129 26 -207 133 143 145 -55 -254 -138 -86 -45 -56 -73 -50 -36 13 -288 238 268 100 -222
5044 -222 135 -81 193 130 113 -12 -19 119 -55 105 -11 67 41 129 16 31 -5 -47 31 -52 -9 -192 0 -84 8
5069 8 99 216 24 50 34 -125 -32 -38 145 73 -79 -52 -100 -47 11 -66 -127 -3 61 16 -24 205 -80 -96 -208 133
5095 133 80 52 32 19 -132 65 -5 -77 -167 181 -87 -126 196 -16 -24 -121 -6 -3 -73 273 117 -143 7 34 -20
$$ packed form
4920A07j01PJ14p4m5K85k65K00j74m7Q3j20M2J4J79k28R2j04J04K19j78m5j02
4943c7K97r6j53J33k36R4j07Q8Q9N6j36M2o6P1j1j99L59k46Q2J41j44K5l8j00
4967i2K24J7N1j09k1k4r2p7L30k71mR4J57j12O6M7l5r2J0L8r4MM8J07Kk27L7q2
4995a00J10o2j38M6J87j44N3m6J9j89L07q6J81r1k53L18K1l17J26P1J46q7mj03
5019c5K31k29J32pL7j03k33L40J0Kk00j99J16N2M1j1j7K3J4M9l01N26L0j68l22
5044b22L57k16K74o3j7j25pJ38j74J60j16P8k6Q8j13J5l6m2P8q3M3j83J92q4R2
5069HR1J17j92K6j6j59R3oJ83p2j52K7m8N3N8p7o1J24O4m5m0K29k85j6j12L41
5095A33n3k8k0j3j51J97p0p2r0L48k68l9L22k12qr7J15Lp0L46j56k60J50K7n4
$$ plain form
5120 -20 94 100 72 -159 20 60 99 -46 58 -70 9 -27 30 84 69 64 -30 77 42 91 -149 183 -137 114 -107
5145 -107 -170 214 -85 -47 96 -167 -5 266 12 -184 132 -40 -156 47 -94 108 -65 -130 35 25 -43 27
5167 27 1 172 -4 117 214 -49 -9 -144 102 86 -182 116 -89 -28 38 -30 -170 -32 -204 -123 -241 -40 -48 81
5191 81 -77 -117 -116 5 -20 -21 -263 -42 -18 80 128 -48 -139 -42 19 88 96 -37 -46 -93 56 116 -164 -106 62 -225 -77
5218 -77 60 -47 56 -147 -69 41 92 10 -87 -80 -39 99 -161 158 122 -116 -118 -109 -130 48 48 -171 16 -14 78 69 76
5245 76 -16 242 33 -30 186 -27 172 23 19 7 80 219 -100 20 28 26 52 -65 -97 -5 132 69 61 10 146 254
5271 254 -3 80 -177 -127 63 61 9 116 238 215 -2 -55 -37 -102 1 -22 -6 18 -71 -106 -10 -57 -77 -74 177 2
5297 2 178 -27 -69 47 -222 121 -10 -27 14 1 -133 -8 79 26 88 -218 65 163 -172 -43 21 123 23 112
$$ packed form
5120b0J14Ok8k31J79M0L9j45J04j28P9l6N7N4j5nr4J07l5M9k40L32l20K51k21
5145a07o3L84k99L8J43k63J62K71k54j96L16j72j16K03j41K02j73o5J65j0o8P0
5167B7k6J71j76J21R7k63M0j35K46j6k68K98k05O1O6o8j40J38j72Q1j18K01qJ29
5191H1j58m0JJ21k5jk42K21K4R8M8j76r1R7O1O9Qj33rm7J49O0k80N8J68k87J48
5218g7J37j07J03k03P8J10N1q2r7PM1J38k60L19l6k38kRk1J78%k19J87l0R2rP
5245G6r2K58k09o3K16k13J99j49mj2P3J39l19J20QkK6j17l2R2J37o3qn1J36J08
5271B54k57Q3k57N0J90kn2J07J22k3k17n3J8o5J03k3J6K4q9l5R6m7k0LK51j75
5297BJ76k05m2J16k69L43j31j7M1j3j34J25Q7n3O2l06K83R8l35J29O4J02j00Q9
$$ plain form
5321 112 -110 -29 148 -46 112 -22 7 -99 -94 -33 195 -51 106 -57 162 58 -169 47 -47 97 74 19 -26
5344 -26 -191 -132 223 24 -48 -58 -122 50 148 20 38 -92 20 -59 199 133 18 -46 3 -79 -106 160 -108 -223
5368 -223 80 73 -97 5 70 -27 -95 -90 -104 -66 69 -17 -116 54 -76 34 45 -30 -185 -36 169 -97 127 65 80
5393 80 -91 -115 -40 22 73 6 249 -47 62 -100 19 120 -57 51 -14 17 -88 33 -2 -54 -78 -78 64 -5 91
5418 91 -103 -187 173 186 223 261 194 -18 62 231 26 57 -46 -13 41 145 14 86 129 -24 -54 -75 159 24 -50
5443 -50 34 28 69 -21 49 80 -34 50 170 -147 -108 120 -161 -115 104 114 66 -112 -88 94 -26 114 -50 98 -136
5468 -136 -251 -213 77 38 87 16 -117 21 -117 4 -3 57 123 100 151 -41 -150 -255 54 156 56 72 -221 -44
5492 -44 -20 -184 18 -119 28 -9 -242 -211 -1 -150 12 -12 9 -220 129 -74 73 -213 25 -17 22 -4 218
$$ packed form
5321A12k22Q1J77j94J58j34K9j06NO1K28k46J57j63K19j04k27K16r4J44k3n5m5
5344b6j65N9L55j99p2j0o4J72R8j28J8j30J12p9K58o6j15o4M9q2k7K66k68j15
5368b23L03pj70J02O5r7o8Nj4L8J35q6r9J70j30J10J1p5j55J49K05k66K24o2J5
5393H0j71k4P5O2N1o7K43k96J09j62J19J01j77J08o5L1j05J21l5n2k4%J42o9R6
5418I1j94q4L60J3L7L8o7k12Q0J69k05L1j03L3N4J04j31P2M3j53l0k1K34j35p4
5443e0Q4oM1r0P0L1j14Q4J20l17L9K28k81M6K19J0m8j78K4J82j20J40j64J48k34
5468a36j15L8K90l9M9p1j33J38j38J21pO0O6k3N1j92j09j05L09J02j00J6k93J77
5492d4K4j64K02j37J47l7k33L1K10j49J62k4K1k29L49k03J47k86K38m2L9k6K22
$$ plain form
5515 218 94 -118 135 48 -140 78 59 83 12 -230 -68 32 108 -105 30 133 -3 19 114 158 27 98 -187
5538 -187 -83 -4 -170 -153 -105 -132 310 -96 -74 -36 73 157 -176 58 -21 94 -224 146 -10 -39 14 77 -69 -219
5562 -219 132 18 -135 -41 35 -58 -358 -85 -17 -118 -63 -132 169 -3 1 -60 -276 -64 67 170 45 -165 -234
5585 -234 33 89 -126 -184 -157 22 133 35 295 189 62 -64 -184 9 -32 -28 39 -83 -67 159 4 -133 50
5608 50 -25 18 187 -200 67 -266 142 -134 52 -122 -67 -47 30 -107 -182 -86 -83 40 55 -17 174 -6 159 41
5632 41 77 272 3 119 -79 101 280 -12 51 -11 -127 -160 1 85 152 -63 132 -140 -230 -4 -34 -93 4 7
5656 7 36 -50 -41 9 14 255 -31 -8 -15 -221 -130 8 -102 -127 242 200 -74 -85 210 164 -208 104 73 126 162 111 172
5683 172 136 -53 160 38 -66 -15 -153 -19 -119 -116 95 65 125 12 -1 81 145 61 -262 137 196 55 -120 -111
$$ packed form
5515B18j24k12K53q7j88K18j9K4p1k42J62J00P6k13J35J03j36K2R5M4j31P1k85
5538a87J04P9j66J7M8k7M42m06K2L8J09Q4l33K34p9J15l18L70j56k9N3O3j46j50
5562b19L51j14j53R4P6r3l00K73O8j01N5o9L01j72Mo1k16K12J31J03j25k10o9
5585b34K67N6k15n8K7J79J11r8K60j06j27j26j20J93m1MO7j22J6K26j55j37J83
5608E0p5M3J69l87K67l33M08k76J86j74N5K0P7j37p5R6LJ23J5p2J91j80J65j18
5632D1L6J95k69J16j98J80J79k92O3o2j16l3J61Q4O7k15J95k72r0K26l0n9R7L
5656GK9q6RN0NK41k86K3pk06R1J38j10k5L69m2k74j1K95m6l72L12l1N3L6n1O1
5683A72l6j89K13j22j04N1j38J34j00LK11l0O0j13j3Q2O4q4l23L99N9j41j75R
$$ plain form
5707 -111 -161 -71 70 25 -93 35 -66 -12 -9 -34 -90 148 -103 -164 35 12 -216 -13 152 -128 -65 18 40 -114
5731 -114 50 95 -160 -44 117 229 33 -60 -289 -248 -143 230 11 263 -80 -10 -110 49 7 71 -44 -141
5753 -141 -142 -10 5 83 -60 -165 89 -22 79 -418 195 -9 53 -123 18 -140 -4 -33 81 -34 -43 93 -120
5776 -120 1 -234 33 -68 -52 -16 -117 -58 -40 -2 -44 45 38 -185 33 -166 49 -63 -251 93 129 200 10 -13
5800 -13 43 78 -122 9 -81 103 -15 -156 -42 181 117 -131 -81 -93 178 -29 -23 -123 -129 -13 -88 166 124 98 -57
5825 -57 3 -7 -51 223 18 15 -108 -48 74 58 -110 18 21 -15 -41 83 -146 12 63 112 -139 106 25 32 -261 167
5851 167 209 98 188 -36 -119 239 -29 -18 -30 -156 123 151 -99 81 111 -112 69 37 -63 -79 110 95 60 82
5875 82 -6 62 152 -73 -38 -32 174 112 57 -57 235 -129 -67 238 -53 -4 58 -69 -132 64 31 -48 161 -211 35
$$ packed form
5707a11n0R0J41m5j18J28j01N4Lk5n6K38k51o1J99k3k28K03J65k80O3Q3K2j54
5731a14J64M5k55J16J61J12j96r3k29M1J05L73k19K52l43P0j00J59m2O4j15r7
5753a41jJ32J5P8j43j05K54j11J01m97O13k04O2j76J41j58J36k9J14j15rJ36k13
5776a20J21k35K67j01J6L6j01N9J8L8m2Q9pk23K18j99K15j12j88L44L6P1j90k3
5800a3N6L5k00J31r0J84j18j41J14K23o4k48N0j2K71k07Oj00oJ16p5K54m2k6j55
5825e7O0j0m4K74k05lj23O0J22j6j68J28Ll6k6J24k29J58N1M9k51K45q1Pk93M28
5851A67M2j11R0k24q3L58k68J1j2j26K79K8k50J80L0k23J81l2j00j6J89j5l5K2
5875H2q8O8R0k25L5OK06o2n5j14K92l64O2L05k91M9O2j27o3J96l3p9K09l72K46
$$ plain form
5900 35 -49 -201 -14 73 14 92 -4 88 -174 -66 34 -76 36 275 65 16 8 -31 25 159 -134 -41 -134 -113 -70
5925 -70 66 110 -90 76 211 71 24 140 104 311 -166 -180 91 23 34 -7 166 166 -73 -49 215 -99 132 55
5949 55 44 34 172 -3 -89 101 43 -89 -203 222 108 -107 5 104 -111 207 8 -85 -49 -107 27 -94 -132
5972 -132 37 31 -23 -67 34 53 120 -47 100 7 -63 -151 171 -26 232 90 -190 4 -130 69 69 -17 29 6 -85
5997 -85 -55 -153 -117 55 22 -4 209 -27 189 -96 -24 238 -1 -207 -150 27 -94 -84 -57 -27 -23 0 -93 8 -23
6022 -23 -67 16 -53 -108 156 20 -51 134 -69 8 -87 16 -94 -5 82 -298 -90 -224 -92 -13 -198 54 104 -75
6046 -75 -33 164 35 15 251 34 95 174 -120 102 -53 46 106 -178 -78 -11 291 91 156 -19 41 -36 -22 -42
6070 -42 -1 153 -81 -83 53 -28 156 -201 57 -117 46 -12 177 80 -138 -20 77 132 -126 -43 59 -120 -27 -92
$$ packed form
5900C5q4j52J87Q7n9P8r6R2k62J08J00j10J12K39k10m9ql9N6J34k93R3r3K1M3
5925g0J36M4k00J66J35j40m7J16l6K07m77j4K71o8J1m1J73%k39K4K64l14K31p7
5949E5j1j0J38j75q6J90n8j32j14M25j14k15J12R9k15L18j99r3L6n8J34j21l8
5972a32J69on4m4J01J9O7j67J47r3p0q8L22j97K58j42k80J94j34J99%q6M6k3r1
5997h5L0r8L6J72l3k6K13k36K16k85P2K62k39k06N7J77j21J0K7L0MK3r3J01l1
6022b3m4Q3o9n5K64j36p1J85k03P7r5J03j10Q9Q7l80K08j34J32P9j85K52N0j79
6046g5M2J97j29k0K36k17O1P9k94K22j55R9O0k84J00O7L02k00O5j75O0p7J4k0
6070d2M1J54k34kJ36q1J84l57K58j74J63n8J89r7k18J18R7N5k58Q3J02j79R3o5
$$ plain form
6094 -92 -146 52 -156 -110 175 165 21 245 -57 100 -76 -196 58 152 -5 -33 -40 -120 76 -105 -66 3 168 52
6118 52 74 164 -128 49 -112 -214 66 66 -248 44 -271 -172 -65 29 -73 -149 -131 -181 -9 88 138 -132 -122 -76 -8
6143 -8 -32 1 -153 -119 92 147 141 -9 64 47 -42 151 -12 125 -88 59 -130 -16 25 94 -28 30 148 127 -185
6168 -185 13 -32 -180 39 154 112 -23 103 31 70 -82 56 -47 -28 5 176 8 197 11 208 131 13
6190 13 33 -64 -49 -26 -98 32 -57 -131 -167 -72 8 84 -144 26 -107 79 -81 35 166 -18 45 -6 -6 -142 41
6215 41 -48 -102 -67 118 -139 -28 187 -45 186 68 86 -37 124 128 -56 24 130 20 -166 -58 40 196 -2
6238 -2 -119 -82 -18 -265 62 83 122 80 -214 -53 -59 123 44 9 100 10 -13 166 117 -106 -242 7 -58 -189 47
6263 47 -91 -383 67 -34 89 -214 -35 152 -45 -4 125 -110 16 4 -120 -21 -103 -113 141 22 -56 51
$$ packed form
6094i2n4J98k08M6K85j0j44K24l02J57j76j20K54R4j57k8pq0J96j81L9O9J65j16
6118E2K2R0k92J77j61j02K80%l14K92l15R9J07R4j02p6J8n0J72R7N0k70J0M6O8
6143hk4L3j54L4K11N5oj50P3j7q9J93j63J37k13J47j89J14M1O9j22N8J18k1l12
6168a85J98m5j48K19J15m2j35J26p2L9j52J38j03J9L3J71j68J89j86J97p7j18
6190A3K0r7J5K3p2J30q9p4l6R5Q0P6k28J70j33J86j60J16J31j84O3n1%j36J83
6215D1q9n4L5J85k57J11K15k32K31j18J8j23J61Mj84Q0J06j10j86J08R8J56j98
6238bj17L7O4k47L27K1L9m2k94J61oJ82p9l5R1r0k3J79m9k23j36K49o5j31K36
6263D7j38k92M50j01J23l03J79J87j97M1J29k35J26j2j24R9q2j0K54j19p8J07
$$ plain form
6285 51 -233 79 50 150 -131 -8 218 70 -97 134 -226 72 125 -111 -258 -22 -41 35 168 -193 -252 2
6307 2 49 136 24 2 -79 51 -27 -21 -29 23 164 62 -17 -39 -219 117 72 73 113 29 20 10 42 20 241 -108 -36 -131 25
6336 25 -5 43 10 -59 24 -14 17 64 -35 30 61 -32 19 118 22 83 83 -22 236 -24 -28 12 -190 -97 66 -100 -2 131
6364 131 80 93 121 -23 -32 -168 155 2 -23 -131 210 133 173 79 49 -125 -5 23 17 111 9 9 81 9 -51 -21 121
6391 121 82 -48 229 -75 74 1 -244 -55 -82 -200 -44 -175 51 -30 -221 -23 -79 -71 -110 140 -38 21 -173
6414 -173 -9 -309 -155 84 9 93 68 -126 121 66 -104 -61 6 -73 -48 -98 -164 -175 -6 59 -43 -175 -82 41
6438 41 -51 149 40 -26 80 69 -63 -50 -55 105 71 -7 130 261 -128 27 -194 26 -32 3 -140 28 17 149
6462 149 168 -94 19 76 -98 102 -6 58 -44 -17 -80 -121 9 -122 16 21 -85 -47 115 -89 -72 31 -36 249
$$ packed form
6285E1k84L12k9J00k81J23K26j48j67K31l60K98N3k36j47K36j9P6J33l61n9K54
6307BM7Q7j12k2q1J30p8OqN2J41j02p9k2j80L36m5JM0q4rj0L2k2K21l49P2r5J56
6336B5l0M8l3o9Q3l8L1M7r9O5L1r3N1R9r6O1%j05K58k60mM0k02R3J63j66R8J33
6364A31n1J3K8j44rj36L23j53k5j08L41p7M0r4l0j74J20K8oR4j02%P2p2o0L0J42
6391A21l9j30K77l04J49p3k45J89k7j18J56j31K26q1j91J98n6Ql9K50j78N9j94
6414a73J64l00J54K39p5Q4k5j94K47n5j70M3O7p9K5n0o6j1J69O5j02j32R3J23
6438D1r2K00j09o6J06j1j32J3nJ60l4p8J37J31l89J55k21K20n8L5j43J68j1J32
6462A49J9k62J13N7j74K00j08O4j02K7o3m1J30j31J38Nj06L8J62k04J7J03o7K85
$$ plain form
6486 249 28 235 64 -107 74 -61 17 -28 -71 65 15 39 50 -36 -3 -63 73 1 39 135 237 -83 -126 -146 -103
6511 -103 -101 166 -142 212 -63 -93 56 -229 173 3 -65 155 16 62 52 -84 -165 176 175 -80 6 98 157 41
6535 41 -18 -15 133 90 173 -72 -73 -39 -63 15 70 38 -54 182 199 -134 39 -125 131 -140 90 40 -36 139 -15 -88
6561 -88 -155 61 66 36 40 7 14 121 -125 70 22 -34 -185 27 19 63 -57 -79 -25 -208 22 17 56 -45 55 -364 44
6588 44 -162 -78 138 -129 24 62 122 -57 -14 -58 126 -206 -42 -84 -43 351 -58 31 90 -2 -7 52 212 59 -30
6613 -30 -207 97 34 153 50 -75 155 58 -157 -102 80 -42 37 -41 50 3 50 -14 144 -32 163 -30 0 135
6637 135 -5 173 367 -35 -16 93 -130 59 -50 169 32 -24 147 63 131 -122 134 -4 -81 15 37 -176
6659 -176 95 -71 76 394 -210 -124 -196 84 -42 -69 -50 18 187 -198 -14 43 -133 121 223 -305 -258 89
$$ packed form
6486B49k21K07j71j71J81j35P8m5m3J36n0K4J1q6L3o0J36p2L8R6J02l20m3k0M3
6511a03KK67l08L54k75l0J49k85M02j70o8K20j39M6j0j36q1L41jk55Q6R2N9j16
6535D1n9LJ48m3Q3k45jL4k4P8N5l2r2K36J7l33J73j64K56k71K30n0p6J75j54p3
6561h8o7K16Nl0Ml3PJ07k46J95m8n6j51K12qM4j20k2N4j83K30nL9j01J00m19M08
6588D4k06Q4K16k67J53L8O0j79M3m4J84l32J64m2M1L94m09Q9N9r2nN9J60j53q9
6613c0j77L04o3J19j03j25K30r7k15N5J82j22P9p8R1m7M7o4J58j76J95j93L0J35
6637A35j40J78J94m02J9J09k23J89j09K19j37n6J71q4O8k53K56j38p7R6K2k13
6659a76K71j66J47L18o04Q6p2K80j26k7J9O8J69l85J84N7j76K54J02n28M7L47
$$ plain form
6681 89 -90 169 -105 19 -23 141 128 85 -9 -119 69 -105 -126 -58 134 131 -108 -46 -236 72 -64 -121 -21 83
6705 83 42 -112 53 -19 1 -25 93 24 -76 -140 -13 -109 7 125 95 395 174 -194 -67 -16 128 73 36 185
6729 185 220 82 285 144 -27 -148 25 -36 278 -105 -13 -310 -88 46 179 22 143 -97 -7 -146 79
6750 79 171 -215 40 -76 36 126 27 -46 164 -175 -94 111 -55 58 -184 107 111 -6 -66 106 60 24 82 13
6774 13 -165 -67 -46 17 -48 82 -25 -149 46 87 100 233 210 3 96 77 11 -35 23 -145 120 -105 94 90 73
6799 73 -56 65 25 -187 28 -308 56 -40 102 -158 235 214 40 129 -39 -124 91 58 -2 21 159 -228 179
6822 179 96 261 -130 -4 -142 -332 294 -9 85 0 50 -55 157 194 -48 -91 -57 -232 -116 90 60 71 277
6845 277 -163 -186 -97 267 -21 -130 -96 270 162 -1 -105 137 -97 129 -27 165 136 46 48 -57 -86 -150 35
$$ packed form
6681H9j79K59k74J24m2J64j3m3r4j10J88j74k1O8J92lk39O2j90L08j36n7J00J04
6705H3m1j54J65p2K0k6J18o9j00o4J27r6J16J18l0L00k21l68J27N1J44n5l7J49
6729A85L5j38K03j41j71j21J73o1L14l83R2k97K22J34J33j57J21k40R0j39K25
6750G9R2l86K55j16J12R0r9p3K10l39Q1K05j66J13k42K91Mj17o0J72m6l6N8o9
6774A3j78R8K1O3o5J30j07j24J95M1J3J33k3k07R3j9o6m6N8j68K65k25J99mj7
6799G3j29J21m0k12K15l36L64r6J42k60L93k1j74Q9j68q5K15l3o0K3J38l87M07
6822A79q3J65l91J26j38j90O26l03R4q5N0j05K12L7k42m3L4j75J16K06l0J1K06
6845B77m40k3Q9L64k88j09L4L66j08j63j04K42k34K26j56J92k9r0Kj05k9o4J85
$$ plain form
6868 35 198 -58 -16 -57 62 114 -213 -49 21 -12 -16 157 162 -95 27 165 -11 165 227 -152 -183 112 34 -101
6892 -101 35 126 156 -79 98 94 151 168 -11 15 217 -53 158 89 107 69 183 233 -33 5 126 -231 -56 -92
6916 -92 -89 -45 92 58 -16 -95 10 100 -3 46 -205 24 131 -122 -62 -57 198 -44 -190 -191 47 -94 56 -40 110
6941 110 78 97 124 128 183 72 -10 -60 2 89 87 -40 10 91 71 19 -151 13 -141 -310 9 96 97 33 -4 -89 84
6968 84 61 140 5 -113 31 109 -54 32 34 23 179 147 -77 -134 -152 14 -19 -121 -68 31 -191 2 -51 143 3
6993 3 -194 -317 -38 -113 -16 24 -192 -134 118 -274 -47 186 228 77 14 -9 -152 -71 -213 122 -103 32 184
7016 184 -1 43 80 -135 36 35 72 67 31 23 117 -76 -2 44 71 255 96 0 101 19 -46 44 -97 126 -98 -6
7042 -6 20 -184 95 -66 -125 -48 -224 -8 117 -125 20 68 30 -121 -87 48 41 169 92 -107 -27 -15 -36 -210 195
$$ packed form
6868C5J63k56M2m1J19N2l27J64P0l3mJ73Nk57J22J38j76J76O2l79l1K95p8j35
6892a01J36R1L0k35J77mN7J7j79K6K02k70K11o9J8l8J14N0k66L8J21l57J75l6
6916i2LM4J37l4p4p9J05R0j03M9k51K29J07k53O0NK55k42j46jK38j41J50r6J50
6941A10l2J9K7MN5j11q2n0O2Q7kj27N0Q1k0n2j70J64j54j69L19Q7Jo4l7q5J73
6968H4k3P9j35j18J44P8j63Q6Kj1J56l2k24n7j8J66l3j02N3R9k22J93n3J94j40
6993Cj97j23K79p5R7M0k16N8K52l92K27K33M2j51o3k3j43Q1j42L35k25J35J52
7016A84j85M4L7k15J71jL7nl6qR4j93P4M6K7J84j59r6J01q2o5R0j41K23k24R2
7042fK6k04K79j61n9P7j76K16J25k42J45M8l8j51L4J35pJ28p7j99Q0J2k1j74M05
$$ plain form
7067 195 203 -77 129 69 -158 -69 177 -4 43 57 64 211 -62 93 -164 -19 -20 139 78 -138 53 -23 132 -19
7091 -19 198 -29 287 -29 -71 58 70 -48 98 16 47 98 -91 39 116 -68 65 -89 149 -74 -14 61 234
7114 234 -43 -80 180 -52 100 -15 10 -101 -66 40 109 -118 32 100 103 251 -92 -194 -40 -116 -49 -95 78
7137 78 168 -58 -179 -75 -57 -78 8 80 -124 -54 286 96 -126 122 180 -51 4 -56 128 234 -98 -113 41 75
7161 75 -119 -1 -111 -183 33 -36 7 -99 0 -50 31 110 -22 -94 85 0 -100 -187 -131 16 -46 -70 43 46 -277
7186 -277 -185 25 -16 161 76 -263 -199 71 -86 -95 58 67 -175 21 -32 -142 -41 46 -139 -70 -65 34 153 18 -100
7211 -100 6 -74 135 -59 -9 -69 119 -102 -151 -90 -8 -34 171 105 -144 311 73 -64 9 104 129 -33 48 50 40
7236 40 -163 -80 84 122 32 -109 88 90 121 12 63 93 -28 -40 -141 96 -123 53 101 -39 -70 -90 -37 -94 -4
$$ packed form
7067A95Qk80K06o0k27Q9K46j81M7J4PJ47k73J55k57J45jJ59o1k16J91p6J55j51
7091a9K17k27L16l16m2J29J2j18J46q2L1N1j89J30P7j84J33j54K38k23O0P5J73
7114B34k77l7K60k32J52j15K5j11L5J06O9k27J50O8LJ48l43j02J54p6O7m6J73
7137G8R0k26j21J04J8k1Q6P2k04P0L40j90k22K48N8k31N5o0J84J06l32j5J54L4
7161G5j94J18j10p2K16o9M3j06R9n0Q1P9j32p2J79q5j00q7N6J47o2k4J13Ll23
7186b77R2K10m1J77q5l39O4K70j57rJ53Rk42J96n3j10J01Q7j85O9NR9J19j35j18
7211a00J06q0K09j94N0o0J88k21m9O1Q2k6K05o6k49M55k38j37P3R5K5j62Q1Kj0
7236D0k03Q3J64L8r0j41J97KL1j09N1L0j21j2j01K37k19J76M8j40l1k0N3n7R0
$$ plain form
7261 -4 -222 42 57 55 144 -74 -129 45 -31 241 3 167 227 91 49 116 203 158 -1 96 3 82 -171 -129 -80 103
7287 103 184 -49 -93 62 24 -1 6 161 164 137 -5 -19 -44 39 -304 59 58 72 -92 -57 113 61 19 -128 114 -121
7313 -121 -258 36 59 41 84 -105 -16 -3 -45 56 43 91 62 153 45 -132 -146 10 27 -10 -23 74 30 -148 -1
7338 -1 -54 -23 22 -28 77 5 -107 -136 -91 -242 46 -162 -35 -45 -34 31 122 46 -68 8 -82 -106 -139 100 55 -15 -59
7365 -59 -117 -54 -45 82 69 12 -131 34 -228 -27 22 200 -191 -88 -1 -169 32 50 -253 61 -227 156 -97
7388 -97 -246 139 -81 -363 -4 -128 53 182 68 -8 -16 -46 -113 165 205 151 110 20 112 -36 25 144 -259 13
7412 13 -149 -165 -83 143 -192 34 -5 11 180 -1 -53 -37 -177 -160 49 -216 -275 -231 -20 62 -35 29 135 75 -28
7437 -28 -102 54 254 -119 -9 -82 107 176 141 82 -12 -143 -99 -154 39 -127 63 -182 217 -93 6 -184 153
$$ packed form
7261dk18K64J5kQ9k18n5J74p6K72k38J64O0j36m2O7Q7m5j59R7r3P9k53M2M9J83
7287A03Q1k33m4J55l8k5PJ55Lk7j42j4k5Q3l43L63jJ4j64L5J70n2m2j47K42k35
7313a21j37K94K3j8M3j89Q9J3m2J01j3M8k9R1j08j77j4J56J7l7j3R7m4j78J47
7338an3L1M5n0J05p2j12k9M5j51K88k08J27j0J1O5R1p6j14P6r0k4l3K39m5p0m4
7365e9n8O3RJ27j3n7j43J65k62K01M9J78l91J03Q7j68K01J8l03L14k88L83k53
7388i7j49L85k20k82L59j24J81J29j14p6ql0o7K78M0n4m1r0R2j48O1J19m03K72
7412A3j62j6Q2K26l35K26l9J6J69j81n2J6j40J7K09k65n9M4K11Q2r7O4J06o0j03
7437b8p4J56K00l73J10p3J89O9l5n9r4j31M4n5J93j66J90k45L99l10R9j90L37
$$ plain form
7460 153 90 2 62 93 -52 -19 -36 81 72 -119 -143 7 170 -52 42 -99 -134 -64 -6 -58 53 -9 -47 63 56 -207
7486 -207 -20 26 -55 146 24 -75 -75 -93 24 -103 28 131 107 56 -49 -70 -33 -51 38 -153 -222 7 60 41 -100
7511 -100 87 -87 48 -4 -31 24 -192 -66 186 27 126 43 230 132 240 100 -12 -119 -105 -58 189 -101 -179
7534 -179 57 129 43 -6 124 96 -96 -112 -85 20 2 -46 -10 -93 -134 -100 -54 237 -44 -76 -66 91 106 -45 -8 -179
7560 -179 -73 8 -24 -130 -65 110 -66 -8 -7 83 -61 118 160 60 147 19 101 -209 192 72 -59 18 101 72
7584 72 61 -86 59 -85 -270 -82 -127 121 121 -61 -139 21 -239 -290 155 -99 -53 77 40 30 -225 102 -48
7607 -48 180 205 -120 44 -203 -116 24 -179 72 -276 262 -163 -62 -275 51 -108 -222 -157 -116 37 -12 -116
7629 -116 -77 21 101 3 97 21 146 40 -83 -26 -5 3 -55 -20 -97 -69 -223 -28 4 16 -163 -17 67 341 210 86
$$ packed form
7460A53o3q8O0L1j45L3j7J17rj91k4J50J63k22R4j41l5P0N8n2J11o2l8J10pk63
7486b07J87M6q1K01j22r9%j8J17j27J31J03k4n1j05k1L7j8Q9j91o9K29N3j9j41
7511a00J87j74J35n2k7N5k16J26K52j59R9q3J87r8J08j40j12j07J4M7K47k90p8
7534a79K36P2q6m9J30k8j92j6K7J05j8m8L6q3m1L4M6K91k81l2J0J57J5j51L7j71
7560a79J06Q1l2j06O5J75j76N8JR0j44J79M2j00Q7j28Q2l10M01j20j31P7Q3k9
7584G2j1j47J45j44j85J88m5K48%j82p8J60k60n1M45k54M6J30l7j0k55L27j50
7607d8K28K5l25J64k47Q7J40k03K51l48N38m25J01k13L26j59j14O5M1J53m9j04
7629a16L9R8Q0r8R4p6J25j06j23N7K1Qn8L5p7K8j54J95L2J2j79J46Q4K74j31j24
$$ plain form
7655 86 84 7 89 -76 32 -195 -139 -66 -121 159 -116 -198 172 130 15 311 -156 101 187 -25 -126 -125 13 -10 73
7680 73 -85 -20 -106 -26 -73 -24 116 190 110 152 58 -119 -61 -66 12 -54 -29 -185 26 96 50 169 -135 21 92 -106
7706 -106 43 -145 19 -37 -302 -76 -119 15 -50 -133 88 -82 15 49 -156 -80 51 11 12 179 -386 -69 99
7729 99 6 269 102 142 141 -73 133 1 84 -93 -148 -33 57 142 76 261 -48 -16 -42 -5 233 -12 1 -3 -144
7754 -144 8 -19 42 -113 20 278 -90 -231 -91 -5 264 -61 132 -32 25 170 -20 153 140 -27 67 39
7776 39 109 -69 -53 19 -104 -21 -9 -13 190 70 2 216 139 179 -21 54 151 -228 13 107 56 82 152 -135 75 52
7802 52 -140 -96 -159 27 23 70 98 -383 9 -49 75 121 90 71 -14 -137 -72 -30 -69 160 85 -61 -113 21 23 -19 -2
7829 -2 -37 46 -21 -237 54 133 -22 -49 -39 -134 81 11 -107 -11 67 3 -96 -132 181 22 -3 14 64 77 68 119 -12
$$ packed form
7655H6kp7Q2j65J08k27N6P3n5K80k75q2L70m2j15K96m67K57Q6k12j01JJ38k3Q3
7680G3j58O5q6Q0m7M9J40P4q0M2r4j77N8nP8o6K5j56K11P0m6J19l04J56P1j98
7706a06J49j88J64n6k65K26m3J34o5q3K21j70R7L4k05P6J31m0JJ67n65L17J68
7729I9r3K63j67M0jk14K06j32Q3j77n5J15R0Q5o6J85l09L2k6L7K38k45J3mj41
7754a44J52k7O1j55J33K58l68j41J40Q6K69l25J93j64N7J45j90J73j3j67R4k8
7776C9P0j78J6P2j23Q3J2mK03j20o8K14p7M0k00P5R7l79K41R4n1K6P0k87K10k3
7802E2j92M4o3J86mM7K8m81L92n8J24M6l1j9q5j23O5M2l9K29p5j46n2J34Km2J7
7829bl5Q3o7k16K91P9j55k7J0r5K15p0j18R6P8o4r9l6L13j59k5J7N0J3rN1j31
$$ plain form
7856 -12 221 -56 75 190 -45 -41 86 26 136 -232 -137 106 91 0 71 -48 -120 -37 -121 158 -113 210 25 -74
7880 -74 -3 -35 -23 144 -2 -44 -51 -67 17 -205 31 -57 -88 -23 -27 -122 -26 144 -37 11 11 -21 124 -182 106 229 -75
7907 -75 62 -6 47 -35 52 -43 -78 -75 -97 -214 -63 -74 -33 157 317 76 -19 -96 162 -67 -181 -146 -25 85 13
7932 13 129 -270 169 76 91 -24 125 138 88 35 -132 -177 105 -122 -20 -12 -151 61 -224 15 188 -32 137
7955 137 0 128 65 -58 9 37 163 5 -117 69 208 13 94 26 37 -14 30 73 -57 29 64 -56 -140 61
7979 61 49 -35 225 100 -68 -188 -14 -93 -2 -16 28 -6 -132 7 81 71 94 17 4 5 15 159 77 -53 -1 -40
8005 -40 19 146 26 145 -161 60 130 66 -51 115 -35 77 -102 17 7 34 -121 -15 114 154 84 180 -173
8028 -173 -20 46 55 70 86 90 -125 7 86 192 66 66 185 -47 126 -23 -111 92 37 -66 96 -29 51 -72
$$ packed form
7856a2K33k77J31J15k35MJ27o0J10l68R5K43j5r1P1j19p2Q3q4K79k71L23j85r9
7880g4P1l2J2J67j46m2pj6Q4k22K36q8l1O5mr5R6J70j81M8%l2J45l06K88J23l04
7907g5J37o8N3q2Q7r5l5Lk2j17J51j1M1J90J60k41r5p7K58k29j14L5J21J10p2
7932A3J16l99M39r3J5j15J49J3n0n3j67m5K82k27J02Qj39K12k85K39J73k20J69
7955A37j37J28o3j23O7K8J26j58j22J86J39j95Q1o8J1n1M4M3j30Q6L5j20q4K01
7979F1j2q4K60j25j68j20J74p9R1j4M4l4j26J39P4j0K3p7j3JJ0J44q2j30N2l9
8005d0N9J27j20J19l06K21P0o4j17J66j50J12j79J19j0K7j55J06J29M0p0R6l53
8028a73J53O6RJ5J6Mk15J32P9J06j26%J19k32J73j49q8K03n5j03J62j25Q0j23
$$ plain form
8052 -72 53 161 151 -123 -66 274 17 105 -105 -10 1 74 59 -124 39 192 -57 -128 -53 90 33 -57 150 64
8076 64 56 89 138 221 -2 -96 66 10 88 -150 -158 -140 81 -151 -67 -17 -17 -145 -45 -174 -40 17 146 105 -168 195
8102 195 -53 158 -89 219 129 174 -74 -8 -67 67 5 -133 278 59 120 67 167 -133 -75 103 -60 56 -134
8125 -134 -183 -70 -21 66 55 83 118 158 -38 48 -26 182 -77 1 145 -24 -122 191 15 -147 -54 -89 56 35 -144
8150 -144 83 68 -138 -25 -82 -19 -190 14 -125 26 -78 -80 -88 -264 -2 -147 -15 -64 -155 75 -55 -42 -42 -17
8174 -17 215 195 -163 -94 197 -42 -237 80 169 65 119 112 -163 101 62 -77 -111
$$ packed form
8052g2J25J08j0k74N7L40k57Q8k10R5J1P3j5j83J63J53k49p1P5J43n7r0K07q6
8076F4qL3M9Q3k23r4J62n6P8k38qJ8K21k32Q4N0%j28J00j29J34N7J29m1k73L63
8102A95k48K11k47L08r0M5k48O6n9J34o2j38M11k19O1n3J00l00N8J78j63J16j90
8125a34m9J13M9Q7j1K8L5M0j96Q6p4K08k59P8J44j69r8L13j76j62R3l5J45k1j79
8150a44K27j5k06J13n7O3j71K04j39J51j04kqj76K62j45J32m9r1K30j30J3%K5
8174a7K32k0l58O9K91k39j95L17Q9j04N4pk75K64l9j39l4
8191a11
$$ Imaginary data points
##PAGE= N=2
##DATA TABLE= (X++(I..I)), XYDATA
$$ plain form
0 0 0 0 0 0 0 0 0 0 0 0 0 0 0 -8 8 -8 8 -8 16 -16 16 -24 24 -32 38 -40 48 -56 64 -74 88 -97 112 -128 144
35 144 -160 182 -202 226 -253 282 -313 347 -384 425 -469 520 -571 630 -694 764 -842 929 -1026
54 -1026 1131 -1255 1391 -1551 1735 -1953 2217 -2539 2945 -3479 4212 -5287 7019 -10308 18815
69 18815 -95142 -178644 -81913 -48638 -4004 15698 50320 53719 50440 38631 47339 37776 6363
82 6363 -40188 -45242 -10093 36597 57230 65377 66197 61396 34670 4539 -9241 -5760 -18609 -52379
96 -52379 -82094 -72287 -33375 914 14252 22925 28859 22785 1277 -13967 -5972 9445 2032
109 2032 -25350 -41321 -25128 4935 21399 26088 32625 36115 23458 581 -7907 4576 13573
122 13573 -2712 -31087 -40849 -24793 -5503 1424 8478 21267 25398 11587 -6037 -6082 8160
$$ packed form
0@%%%%%%%%%%%%%qJ6j6J6j6K4l2L2m0M8n6P0p8Q8j04J20j38J62j85K09k40K72
35A44l04L42l84M28m79N35n95O60p31Q09q94R89j091J201j324J458j606J771j955
54a026K157k386K646k942L286l688M170m756N484o424P691r499J2306j7327K9123
69A8815j13957q3502R6731L3275M4634J9702L4622L399l279j1809Q708r563l1413
82F363m6551n054L5149M6690K0633Q147Q20m801k6726l0131j3780L481j2849l3770
96e2379k9715R807L8912L4289J3338Q673N934o074k1508j5244P995J5417p413
109B032k7382j5971J6193L0063J6464M689O537L490j2657k2877q488J2483Q997
122A3573j6285k8375r762J6056J9290O927P054J2789M131j3811j7624m5J4242
$$ plain form
135 8160 9804 -10639 -31537 -31162 -14150 -1050 4679 15803 30029 28613 10824 -4989 -1987
148 -1987 7875 1624 -18677 -29622 -20949 -5818 1122 5042 17449 27383 19069 -885 -10851 -3552
162 -3552 3796 -4895 -18936 -18968 -6796 2014 1927 4449 15974 20499 7598 -8024 -8581 2038 5889
177 5889 -4406 -13369 -8223 503 1100 -3826 138 11077 12243 507 -7252 -535 9219 7030 -5284
192 -5284 -10287 -4389 -1218 -6006 -9446 -1676 9982 9290 877 222 9127 12990 3254 -9411 -10997
207 -10997 -5267 -5407 -10800 -9219 2826 12114 8929 3221 6545 12965 9576 -4406 -14521 -11476
221 -11476 -5694 -7640 -10204 -3522 8550 13588 7922 4356 9366 11633 2421 -11363 -15846 -9357
235 -9357 -4913 -6796 -6286 2737 11993 11230 4661 4232 9739 8306 -3434 -14028 -13666 -6132 -4073 -6388
$$ packed form
135H160J644k0443k0898L75J7012J3100N729J1124J4226j416j7789j5813L002
148a987R862o251k0301j0945Q673J5131O940L920J2407R934q314j9954r966P299
162c552P348q691j4041l2J2172Q810q7K522J1525M525j2901j5622n57J0619L851
177E889j0295q963N146Q726N97m926L964J0939J166j1736p759O717R754k189j2314
192e284n003N898L171m788l440P770J1658o92q413o55Q905L863r736j2665j586
207a0997N730j40n393J581J2045R288l185n708L324O420l389j3982j0115L045
221a1476N782j946k564O682J2072N038n666l566N010K267r212j3784m483O489
235i357M444j883N10R023R256p63o569m29N507j433j1740j0594L62P534K059k315
$$ plain form
251 -6388 -2574 6565 11428 7189 2177 5418 10054 4917 -7203 -13964 -10362 -4570 -4560 -5581 685
266 685 9077 9769 3991 1808 7138 9143 1407 -9521 -12225 -7448 -4028 -5596 -3880 4515 10390
281 10390 7631 1745 2483 7924 6832 -2666 -10513 -9748 -5167 -4357 -5607 -985 7411 10081 4718 497
297 497 3080 7287 3646 -5447 -9255 -6528 -3864 -4752 -4955 1330 8446 7570 1928 -123 4164 6491
313 6491 1168 -5805 -6294 -3538 -3544 -6256 -4450 3152 7656 5060 413 1407 5610 5374 -1062 -5326 -3910
330 -3910 -2515 -4907 -7409 -3699 3913 6945 3850 1511 3895 6464 3225 -2695 -4640 -2827 -3218
345 -3218 -6873 -7614 -1984 5004 6112 3247 3072 5723 5459 482 -4549 -4071 -2112 -4262 -7316 -6473
361 -6473 -152 5471 5305 3466 4795 6324 3542 -2232 -5238 -3243 -1847 -4808 -7060 -4402 1611
$$ packed form
251f388L814R139M863m239n012L241M636n137j2120o761L602N792J0j021O266
266F85Q392O92n778k183N330K005p736j0928k704M777L420j568J716Q395N875
281A0390k759n886P38N441j092r498p847P65M581Q10j250M622Q396K670n363m221
297D97K583M207l641r093l808K727K664q88k03O285P116q76n642k051M287K327
313F491n323o973m89K756ok712J806P602M504k596m647R94M203k36o436m264J416
330c910J395k392k502L710P612L032l095k339K384K569l239n920j945J813l91
345c218l655p41N630O988J108k865j75K651k64m977n031M78J959k150l054Q43
361f473O321N623j66j839J329J529k782n774l006J995J396k961k252K658O013
$$ plain form
376 1611 4944 4380 3931 6324 6073 1166 -4323 -4931 -2415 -2215 -5495 -6349 -2381 2621 4462 4098 5696
393 5696 7490 5127 -1487 -5396 -4923 -2670 -3297 -5648 -4963 -618 3168 4179 4934 7295 7729 2760
409 2760 -3769 -6606 -5055 -3251 -4024 -4694 -2305 1681 3793 4136 5423 7629 6316 -25 -6120 -7177
425 -7177 -4982 -3298 -3476 -2549 589 3438 3659 3892 5318 7099 3803 -2852 -7126 -7090 -4544 -3091 -2408
442 -2408 -234 2784 3882 2981 3262 5304 5529 1678 -4550 -7261 -5978 -3923 -2356 -908 1966 3837
458 3837 3573 2324 3023 4775 3992 -537 -5154 -6271 -5243 -3580 -1692 634 3468 4651 2726 1543
474 1543 2420 3583 2025 -2368 -5342 -5249 -3874 -2664 -667 2462 4695 4317 1736 666 1494 1684 56
491 56 -3115 -4445 -3831 -2831 -1701 665 3531 5062 3056 180 -601 510 388 -610 -2320 -2356 -1773
$$ packed form
376A611L333n64m49K393k51m907n489o08K516K00l280q54L968N002J841l64J598
393E696J794k363o614l909M73K253o27k351O85M345L786J011P55K361M34m969
409B760o529k837J551J804p73o70K389L986K112L43J287K206j313o341o095j057
425g177K195J684j78R27L138K849K21K33J426J781l296o655m274L6K546J453O83
442b408K174L018J098r01K81K042K25l851o228k711J283K055J567J448K874J871
458C837k64j249O99J752p83m529m617j117J028J663J888K326K834J183j925j183
474A543Q77J163j558m393k974R3J375J210J997L129K233l78k581j070Q28J90j628
491E6l171j330O14J000J130K366K866J531k006k876p81J111j22r98j710l6N83
$$ plain form
508 -1773 -1770 -872 1329 3309 3459 1213 -727 -1027 102 246 -587 -826 -395 -693 -1507 -1190 325 1756
526 1756 1907 86 -667 -90 987 677 516 336 177 -884 -2266 -1929 -135 1163 1259 420 -9 722
544 722 1196 825 621 292 -90 -1622 -3110 -2385 -412 942 1689 1362 1299 1224 722 38 71 396 -465 -2367
564 -2367 -2890 -1751 -203 1149 1651 1573 1218 859 -88 -400 227 474 -248 -1584 -2312 -1545 -318 805
582 805 1152 1548 1557 788 -209 52 612 476 -84 -1994 -2716 -2054 -1103 102 1426 1979 1991 1328 87 501
602 501 1114 503 -870 -2710 -3109 -2454 -1371 727 2492 3198 2762 1552 203 -20 -296 -922 -1932 -3159
620 -3159 -2860 -1823 -265 1994 3495 3705 2653 705 -630 -956 -1339 -1773 -2004 -2588 -2126 -834 832
637 832 2882 3991 3440 1699 -333 -1784 -1788 -1575 -1461 -1507 -1582 -1221 101 1399 2839 3448 2574 673 -870
$$ packed form
508a773LQ98K201J980J50k246j940l00J129J44q33k39M31k98q14L17J515J431
526A756J51j821p53N77J077l10j61j80j59j061j382L37J794J298R6q39m29P31
544G22M74l71k04l29l82j532j488P25J973J354P47l27o3p5n02o84L3L25q61j902
564b367n23J139J548J352N02p8l55l59r47l12O27K47p22j336p28P67J227J123
582H05L47L96Rp69r97K61N60j36n60j910p22O62R51J205J324N53J2o63j241M14
602E01O13o11j373j840l99O55J083K098J765P06m36j210j349k23k76o26j010j227
620c159K99J037J558K259J501K10j052j948j335l26l83m34k31n84M62J292J666
637H32K050J109n51j741k032j451mK13J14m6p5L61J322J298J440O09q74j901j543
$$ plain form
656 -870 -2136 -1620 -1527 -1376 -988 -1105 -651 311 1436 2516 2795 1791 434 -1117 -1782 -1620 -1176 -883 -963
675 -963 -916 -399 446 1374 2607 2389 1754 235 -1145 -1767 -1663 -1379 -1020 -945 -879 -150 610 1828 2658 2279
695 2279 1208 94 -1358 -1834 -1487 -1447 -1041 -623 -766 133 1019 2070 2457 1713 825 -366 -1233 -1608 -1590
714 -1590 -1167 -688 -607 -283 586 1482 2059 2155 1366 306 -914 -1359 -1371 -1128 -1105 -757 -662 -31 739 1428 2032
735 2032 1935 997 83 -623 -1222 -1201 -1253 -1151 -868 -421 160 1153 1830 2057 1768 688 -109 -951 -1466 -1093 -1277
756 -1277 -1037 -758 -533 553 1440 2149 1855 1327 408 -862 -1412 -1531 -1113 -994 -820 -599 182 1172 1837
775 1837 2141 1722 799 -457 -1118 -1531 -1116 -724 -624 -556 -77 337 932 1531 1767 1304 221 -755 -1159 -1111
795 -1111 -609 -208 -396 -413 -563 -159 805 1464 1425 796 -106 -654 -976 -780 -638 -562 -457 -665 -497 143 1092
$$ packed form
656h70j266N16R3J51L88j17M54R62J125J080K79j004j357j551o65J62M44K93q0
675i63M7N17Q45R28J233k18o35j519j380o22J04K84L59P5O6P29P60J218Q30l79
695B279j071j114j452m76L47M0M06M18j43Q99Q86J051L87p44q88j191q67l75J8
714a590M23M79Q1L24Q69Q96N77R6p89j060j220m45j2K43K3L48R5O31P70O89O04
735B032r7r38r14p06n99K1n2J02K83M47N81R93O77K27k89j080p97q42n15L73j84
756a277K40K79K25J086Q87P09k94n28r19j270n50j19M18J19J74K21P81R90O65
775A837L04m19r23j256o61m13M15L92J00O8M79M14N95N99K36m63j083r76m04M8
795a111N02M01j88j7j50M04R64O59l9o29r02n48l22J96J42P6J05k08J68O40R49
$$ plain form
816 1092 1515 1371 1000 -85 -1013 -1165 -1049 -650 -206 -524 -307 -235 580 1279 1757 1491 589 -546 -1375 -1468
836 -1468 -1212 -410 -8 79 77 435 701 1459 1555 859 -138 -1163 -1884 -1576 -891 89 841 533 807 486 735
857 735 921 614 125 -777 -1472 -1651 -1169 -83 984 1051 682 389 11 249 379 -7 -389 -390 -871 -802 -278
878 -278 280 867 718 359 -117 -339 -56 7 324 169 -189 -645 -645 -221 -52 536 341 -263 -209 -335 31 376
900 376 534 453 10 -415 -739 -389 -45 285 199 -204 73 -38 452 699 526 180 -230 -774 -919 -852 129
921 129 376 469 270 474 399 191 306 137 39 -480 -835 -617 -135 282 489 338 339 111 -59 -128 -106 -124 -83
944 -83 -288 -495 -422 -105 195 608 218 145 5 -439 -284 -204 160 343 106 -150 -136 -115 -9 132 -16 63 -144
967 -144 -85 -78 147 376 252 -176 -162 -187 -463 -5 -1 250 224 341 214 172 398 343 226 -463 -620 -621 -357 -79
$$ packed form
816A092M23j44l71j085r28j52J16L99M44l18K17P2Q15O99M78k66r02j135q29r3
836a468K56Q02M02Q7kL58K66P58R6o96r97j025p21L08O85R80P52l08K74l21K49
857G35J86l07m89r02o95j79M82J086J067O7l69k93l78K38J30l86l82jm81O9N24
878b78N58N87j49l59m76k22K83O3L17j55l58m56%M24J69N88j95o04N4j26L66L45
900C76J58q1m43m25l24L50L44L30q6m03K77j11M90K47j73l46m10n44j45O7R81
921A29K47R3j99K04p5k08J15j69r8n19l55K18M82M17K07j51Jk28j70o9K2j8M1
944h3k05k07P3L17L00M13l90p3j40m44J55Q0L64J83k37k56J4K1J06J41j48P9k07
967a44N9PK25K29j24m28J4k5k76M58MK51k6J17j27m2K26n5j17o89j57jK64K78
$$ plain form
991 -79 114 187 760 233 -10 -51 6 -103 -134 -583 -467 -279 5 190 409 252 432 261 -201 -219 -150 -379 -459
1014 -459 -487 -243 -186 -110 80 406 470 425 124 -268 -77 -426 -335 -296 -97 -77 37 120 134 193 425 295 -109 -292
1038 -292 -415 -505 -405 -161 -149 202 259 -23 321 433 229 -106 -312 -337 -510 -515 -273 -42 119 178 242 140 466
1061 466 311 168 177 -305 -235 -413 -518 -372 8 63 366 107 185 482 344 28 -87 -275 -480 -625 -482 -558
1083 -558 -140 237 394 297 281 208 103 248 -34 -235 -332 -439 -544 -49 319 237 401 230 414 264 227 -50
1105 -50 -318 -408 -258 -567 -325 -42 195 372 279 351 174 303 -181 -61 -20 -274 -498 -420 -376 65 196 244 196
1128 196 277 246 206 -4 -268 -398 -354 -182 -262 -253 282 575 314 478 239 100 116 -259 -437 -247 -459 -240 -219
1151 -219 39 167 182 210 340 354 315 192 -59 -169 -203 -216 -282 -120 -43 190 269 396 582 344 328 -65 -259
$$ packed form
991g9J93P3N73n27k43m1N7j09l1m49J16J88K84J85K19j57J80j71m62j8O9k29q0
1014d59k8K44N7P6J90L26O4m5l01l92J91l49R1L9J99K0J14Q3J4N9K32j30m04j83
1038b92j23r0J00K44J2L51N7k82L44J12k04l35k06k5j73nK42K31J61N9O4j02L26
1061D66j55j43Rm82P0j78j05J46L80N5L03k59P8K97j38l16j15j88k05j45J43p6
1083e58M18L77J57r7j6p3j05J45k82k01r7j07j05M95L68q2J64j71J84j50l7k77
1105e0k68r0J50l09K42K83K37J77r3P2j77J29m84J20M1k54k24P8M4M41J31M8m8
1128A96Q1l1m0k10k64j30M4J72q0RN35K93k61J64k39j39J6l75j78J90k12K19K1
1151b19K58J28J5K8J30J4l9j23k51j10l4j3o6J62P7K33P9J27J86k38j6l93j94
$$ plain form
1174 -259 -218 -139 -385 -180 -88 -60 66 206 445 431 130 -34 -65 -134 -317 -521 -169 -173 43 229 131 201 186 266
1198 266 203 83 -71 -113 -119 -341 -289 -88 -223 86 17 53 220 382 -50 236 -74 -197 -83 -317 -159 -315
1220 -315 210 134 158 58 103 183 95 -268 -271 -316 -270 -242 -433 127 71 215 76 111 313 29 -104 -111 -109 -73 -372 -106
1246 -106 -305 228 51 43 123 63 54 332 53 277 -242 -178 -317 -175 -236 125 128 161 390 96 272 -31 -68 -217
1270 -217 -492 -161 -309 -64 -208 -65 308 106 189 26 -101 25 21 -164 -91 29 -85 180 141 203 368 10
1292 10 -69 -21 -171 -212 -247 -79 -37 -19 -47 -128 195 94 71 40 -90 54 9 49 -108 27 49 146 -295 -161 65
1317 65 84 30 24 102 23 -1 106 151 -105 -231 132 -232 -136 -181 -126 91 10 274 99 118 -9 29 -153 -194 -279 -93
1343 -93 -300 -34 -23 14 228 203 142 -41 12 -104 -134 -157 -10 -163 117 133 101 193 107 35 132 214 135 -49 -181
$$ packed form
1174b59M1P9k46K05R2K8J26J40K39j4l01j64l1o9j83k04L52mK16J86r8P0j5Q0
1198B66o3j20j54m2ok22N2K01j35L09o9L6J67J62m32K86l10j23J14k34J58j56
1220c15N25p6K4j00M5Q0q8l63lm5M6K8j91N60n6J44j39L5K02k84j33pKL6k99K66
1246a06j99N33j77qQ0o0rK78k79K24n19O4j39J42o1L61LL3K29k94J76l03l7j49
1270b17k75L31j48K45j44J43L73k02Q3j63j27J26mj85P3J20j14K65l9O2J65l58
1292A0p9M8j50m1l5J68M2J8k8q1L23j01k3l1j30J44m5M0j57J35K2R7m41J34K26
1317F5J9n4oP8p9k4J07M5k56j26L63l64R6m5N5K17q1K64j75J9j27L8j82m1q5J86
1343i3k07K66J1L7K14k5o1j83N3j16l0k3J47j53K80J6l2R2q6p2R7Q2p9j84j32
$$ plain form
1368 -181 80 2 -241 -113 164 184 97 242 -16 53 -1 -63 185 -7 -324 -100 60 -11 87 6 107 -116 167
1391 167 218 -59 -139 118 -287 -100 11 61 -133 -113 185 -83 248 80 46 50 138 111 -182 -59 -339 -240 112
1414 112 63 102 266 93 254 105 -62 -64 -138 -207 -217 -212 -49 -179 153 128 250 134 123 -21 -73 -63 4 120 -322
1439 -322 -84 -112 132 25 30 103 -66 -201 -72 -17 -194 -137 -167 38 -42 29 186 258 154 -96 -108 22 -141 -123
1463 -123 -118 -185 -131 -3 -26 97 -74 215 117 194 -45 -62 132 121 -127 -171 153 129 -184 205 168 -23 158 181
1487 181 175 209 31 -78 42 -234 -19 18 -12 270 120 75 -44 192 12 65 -246 -261 -184 -398 -68 116 22
1510 22 137 276 178 219 98 69 -62 -84 -70 -163 17 -43 26 -36 -13 139 19 50 -154 -96 -158 -200 -315 -36 -157
1535 -157 6 8 15 252 133 36 12 -13 31 -43 -164 196 -184 -42 119 66 117 209 130 -129 114 -104 47 -216
$$ packed form
1368a81K61p8k43J28K77K0q7J45k58O9n4o2K48j92l17K24J60p1R8q1J01k23K83
1391A67N1k77q0K57m05J87J11N0j94K0K98k68L31j68l4MQ8k7k93J23k80R9L52
1414A12m9L9J64j73J61j49j67kp4o9j0NJ63j30L32k5J22j16j1j44n2J0O7J16m42
1439c22K38k8K44j07NP3j69j35J29N5j77N7l0K05q0P1J57P2j04k50j2J30j63J8
1463a23No7N4J28k3J23j71K89r8P7k39j7J94j1k48m4L24k4l13L89l7j91J81K3
1487A81oL4j78j09J20k76K15L7l0K82j50m5j19K36j80N3l11j5P7k14L30J84r4
1510B2J15J39r8M1j21k9j31k2J4r3J80o0O9o2K3J52j20L1k04N8o2m2j15K79j21
1535a57J63KPK37j19r7k4k5M4p4j21L60l80J42J61n3N1R2p9k59K43k18J51k63
$$ plain form
1559 -216 -142 -25 -266 -168 73 90 29 61 223 -21 54 189 -119 -248 -247 -59 -45 -142 72 -89 160 86 -69 -40
1583 -40 -3 -33 -107 115 -126 32 -88 -108 -103 234 156 140 44 90 229 -45 -68 -96 -246 47 -100 -244 -2 238
1607 238 106 -24 69 130 129 -43 -126 -124 -99 33 -163 26 178 63 148 84 160 192 -59 -21 -203 -71 -10 -20 -104
1632 -104 89 142 29 97 7 87 88 -121 -33 23 -23 -28 29 -155 129 118 193 -119 129 61 74 56 -234 -136 190 15
1658 15 -340 98 95 -38 104 -62 28 81 142 -57 -189 161 -73 115 43 -353 -89 9 -32 113 145 -257 60
1681 60 -107 114 -18 -50 -25 76 117 264 39 -6 -53 125 -7 -130 -4 -11 47 -227 -242 -143 -1 221 168 -200
1705 -200 106 90 0 -107 -118 -18 166 -145 -256 122 11 29 -17 98 215 -14 199 -300 24 -16 -31 -73 -107
1728 -107 137 318 -141 -93 134 370 -114 -146 -127 -180 223 -66 -361 74 392 -18 -35 125 244 -2 -60 104
$$ packed form
1559b16P4J17k41R8K41J7o1L2J62k44P5J35l08j29JJ88J4r7K14j61K49p4j55K9
1583d0L7l0p4K22k41J58j20k0NL37p8j6r6M6J39k74k3k8j50K93j47j44K42K40
1607B38j32j30R3O1jj72q3KK5J32j96J89J52j15Q5o4P6L2k51L8j82J32O1j0q4
1632a04J93N3j13O8r0Q0Jk09Q8N6m6nN7j84K84j1P5l12K48o8J3j8k90R8L26j75
1658A5l55M38lj33J42j66R0N3O1j99j32L50k34J88p2l96K64R8m1J45L2m02L17
1681F0j67K21j32l2K5J01M1J47k25m5m7J78j32j23J26pN8k74j5R9J42K22n3l68
1705b00L06j6r0j07j1J00J84l11j11L78j11J8m6J15J17k29K13m99L24m0j5m2l4
1728a07K44J81m59M8K27K36m84l2J9n3M03k89k95M35L18m10j7J60J19k46n8J64
$$ plain form
1750 104 -76 -18 -91 -43 -46 230 117 -59 -101 6 205 99 6 -62 -82 -97 101 -145 -106 128 429 128 3 -112
1774 -112 193 198 -235 -60 126 66 -150 -127 -52 92 -26 -64 -14 165 24 -234 -210 20 0 -226 -248 -134 219
1797 219 204 43 -156 -31 86 261 -2 -244 294 212 -241 -65 -62 -50 352 30 77 266 111 -212 -283 -208 183
1820 183 -69 -316 -102 -138 77 71 -107 -96 195 190 -137 -458 -82 220 37 -183 29 69 122 141 -116 -114 67 -4
1844 -4 -78 53 -55 -97 -152 -49 109 112 179 -198 -102 16 140 -65 -113 -98 206 -58 41 -34 174 202 -19 -100 13
1869 13 -33 370 -146 -371 309 13 -173 -219 -189 221 253 6 -128 -12 77 -86 -69 -283 38 -131 60 -170
1891 -170 -74 72 -205 -16 -218 38 -43 16 -144 159 350 149 -89 -146 155 -79 24 -85 -222 249 72
1912 72 -155 -75 135 143 -167 -128 -162 31 -40 -60 153 112 164 36 -107 248 79 -45 -75 -30 255 145 93 -125
$$ packed form
1750A04j80N8p3M8lK76j13j76m2J07J99j06r3o8k0j5J98k46L9K34L01l01j25j15
1774a12L05Nm33J75J86o0k16K3P5J44j18l8N0J79j41k58K4K30k0k26k2J14L53
1797B19j5j61j99J25J17J75k63k42N38q2m53J76LJ2M02l22M7J89j55l23p1P5L91
1820A83k52k47K14l6K15oj78J1K91nl27l21L76L02j83k20K12M0N3J9k57KJ81p1
1844dp4J31j08m2n5J03J58LO7l77R6J18J24k05m8J5L04k64R9p5K08K8k21q1J13
1869A3m6M03n16k25O80k96j86m6L0M10L2k47j34J16Q9j63J7k14L21j69J91k30
1891a70R6J46k77J89k02K56q1N9j60L03J91k01k38n7L01k34J03j09j37M71j77
1912G2k27Q0K10Ql10L9l4J93p1k0K13m1N2j28j43L55j69j24l0M5K85j10n2k18
$$ plain form
1936 -125 88 7 -8 -95 -45 146 -8 -36 -185 -120 240 -53 -89 -149 -121 120 78 -108 -92 129 195 -71 -10 48 147
1961 147 -69 -76 -89 41 25 -239 -190 44 70 -73 2 -102 -125 74 -126 -150 -9 61 47 -114 -52 6 80 -113 -364
1986 -364 6 318 105 -188 -13 0 130 24 -98 -209 221 56 -69 -141 28 182 176 57 62 159 114 -60 -101
2009 -101 -6 112 29 -82 23 249 -78 -130 -169 -29 186 -26 -106 -240 118 267 108 -252 -202 144 -22 79
2031 79 -109 -142 -24 40 -157 41 -2 271 -148 -125 239 62 42 14 37 332 120 -92 12 219 143 -97 -74
2054 -74 -135 142 -73 -12 118 3 17 -10 55 15 266 33 -163 60 -6 274 -177 -142 -12 218 171 85 -303 214
2078 214 105 -66 -87 64 139 -54 -230 155 -83 235 184 -2 -60 237 -24 -114 -92 -229 -84 -203 113 -51
2100 -51 31 9 118 -75 -52 365 55 145 39 0 10 91 -80 -65 58 181 17 -148 -114 -9 -149 -352 -147
$$ packed form
1936a25K13q1j5q7N0J91j54k8j49O5L60k93l6o0K8K41m2j86J6K21O6k66O1N8R9
1961A47k16pj3J30j6k64M9K34K6j43P5j04k3J99k00k4J41P0j4j61O2N8P4j93k51
1986c64L70L12k13k93J75J3J30j06j22j11M30j65j25p2J69J54oj19NR7m5j74m1
2009a01R5J18q3j11J05K26l27n2l9J40K15k12q0j34L58J49j59l60N0L46j66J01
2031G9j88l3J18O4j97J98m3K73m19K3L64j77k0k8K3K95k12k12J04K07p6k40K3
2054g4o1K77k15O1J30j15J4k7O5m0K51k33j96K23o6K80m51L5J30K30m7q6l88N17
2078B14j09j71k1J51P5j93j76L85k38L18n1j86n8K97k61r0K2j37J45j19L16j64
2100e1Q2k2J09j93K3M17l10R0j06l9J0Q1j71J5J23J23j64j65L4J05j40k03K05
$$ plain form
2123 -147 145 41 190 -262 76 143 187 -87 -219 180 -14 71 -198 20 152 169 15 24 8 327 53 -34 -2
2146 -2 233 -191 191 -16 -81 22 -38 -72 -30 -64 2 -113 -150 -53 190 55 9 37 13 63 -208 7 -7 -7 -265 80
2172 80 -22 252 64 -129 -15 -25 -52 103 -93 -87 -107 -133 220 106 51 1 1 -128 -14 86 305 21 -89 -199
2196 -199 317 198 -164 -125 132 135 71 -80 146 185 34 90 11 24 208 -101 30 53 -46 -114 43 -95 64 54
2220 54 78 -113 -82 137 19 -60 -112 200 -109 81 49 -200 1 -75 -156 -128 -42 -6 -13 -6 -47 206 -3 -91 -114 68
2246 68 23 -77 37 -367 -14 -75 -15 -76 -88 198 -86 -145 -56 -4 -159 127 131 -236 159 121 30 105 -71 -62 35 189
2272 189 -6 28 67 -60 -161 122 168 78 -14 42 76 7 -125 50 138 -231 100 103 -88 67 12 97 -132 50
2296 50 80 -165 42 -202 106 -206 -131 -72 175 -76 -210 28 40 41 197 -117 -30 -164 59 72 -74 51 -3
$$ packed form
2123a47K92j04J49m52L38O7M4k74j32L99j94Q5k69K18J32J7j54Rj6L19k74q7L2
2146bK35m24L82k07o5J03o0l4M2l4O6j15l7R7K43j35m6K8k4N0k71K15j4%k58L45
2172H0j02K74j88j93J14j0k7J55j96Ok0k6L53j14n5n0%j29J14J00K19k84j10j10
2196a99N16j19l62L9K57Lo4j51K26L9j51N6p9J3J84l09J31K3r9o8J57j38J59j0
2220E4K4j91L1K19j18p9n2L12l09J90l2k49K01p6q1K8Q6L6pPm1K53k09q8k3J82
2246F8m5j00J14m04L53o1O0o1j2K86k84n9Q9N2j55K86Ml67L95l8r1P5j76RR7J54
2272A89j95L4L9j27j01K83M6r0r2N6L4o9j32J75Q8l69L31Lj91J55n5Q5k29J82
2296E0L0k45K07k44L08l12P5N9K47k51j34K38J2JJ56l14Q7j34K23J3j46J25n4
$$ plain form
2319 -3 19 -200 193 136 74 120 14 59 -87 -69 -213 2 10 -137 124 -46 -124 -70 30 -7 -74 -120 65 111 -164
2344 -164 -44 -110 -170 69 -10 -62 10 33 57 63 18 -20 -193 13 -137 -55 8 21 -183 -225 -21 141 -112 127 -14
2369 -14 24 -48 114 58 -42 117 149 74 103 17 -130 222 8 -17 -107 202 59 -34 -92 -251 150 -59 58 40
2393 40 37 -14 16 -43 127 -220 -192 -92 54 199 -65 96 53 32 -183 -16 -191 211 72 -37 166 201 -3
2416 -3 12 37 14 -115 -2 -265 -118 -91 5 -135 27 32 5 -114 151 -40 -183 -14 24 -62 -17 94 -123 -32 84
2441 84 -69 121 89 68 -96 31 37 -33 98 -222 107 167 53 -47 116 22 -57 -139 87 119 -159 -80 -51 54
2465 54 11 -87 -20 -115 -20 241 79 94 -38 56 142 -143 87 -223 -96 -103 15 94 121 67 -66 70 83 -7 -107
2490 -107 33 -321 -63 56 101 -34 -175 181 -63 -78 54 -7 -104 84 151 -58 114 -54 30 -76 -5 51 -4
$$ packed form
2319cK2k19L93n7o2M6j06M5j46J8j44K15Qj47K61j70p8N4J00l7o7m6J85M6k75
2344a64J20o6o0K39p9n2P2K3K4Om5l8j73K06j50Q2O3J3k04m2K04J62k53K39j41
2369a4L8p2J62n6j00J59L2p5K9q6j47L52k14k5r0L09j43r3n8j59M01k09J17j8
2393D0ln1L0n9J70l47K8J00J46J45k64J61m3k1k15J67j75M02j39j09K03L5k04
2416cJ5K5k3j29J13k63J47K7R6j40J62Nk7j19K65j91j43J69L8q6M5J11k17R1J16
2441H4j53J90l2k1j64J27Op0J31l20L29O0j14j00J63r4p9q2K26L2k78P9K9J05
2465E4m3r8O7r5R5K61j62J5j32R4Q6k85K30l10J27pJ18P9K7n4j33J36J3r0j00
2490a07J40l54K58J19M5j35j41L56k44j5J32o1r7J88O7k09J72j68Q4j06P1N6n5
$$ plain form
2513 -4 112 147 -8 -56 -158 86 171 -92 51 -175 19 188 -66 -99 -104 -112 -15 125 42 20 -164 191 -26 217
2537 217 -49 142 40 54 114 107 -127 -146 40 -96 26 84 83 73 121 38 -51 -35 29 1 35 -43 34 -180 40 -294
2563 -294 4 33 -23 4 -1 -100 75 -45 47 84 125 13 69 56 61 44 139 50 -91 11 -128 156 24 39 11 -214
2589 -214 33 169 142 -10 -107 -165 176 -16 -10 180 26 85 -16 78 141 148 -106 -20 -95 71 51 100 -52 -91 -11
2614 -11 45 -95 -75 145 87 80 -55 51 -131 -5 -9 15 122 -124 64 -44 -120 75 31 102 118 -13 -106 94 -110
2639 -110 -199 -18 130 -70 -133 78 146 29 32 -153 -6 48 23 -34 231 42 -145 -159 -46 8 -60 84 30 -272
2663 -272 -70 -303 17 50 204 69 -65 45 90 158 -47 -105 -36 -83 33 -120 67 116 -89 39 51 105 145
2686 145 -44 16 27 13 168 88 22 -21 -64 34 111 5 33 72 22 28 -5 -109 173 43 -97 55 -57 -335 -60
$$ packed form
2513dJ16L5j55m8j02K44Q5k63J43k26J94J69k54l3nqR7J40q3k2j84L55k17K43
2537B17k66J91j02J4O0pk34j9J86j36J22N8jj0M8q3q9J6O4k8L4p8P7k14K20l34
2563b94K98K9n6K7nr9J75j20R2L7M1j12N6j3Nj7R5q9j41J02j39K84j32J5k8k25
2589b14K47J36k7j52r7n8L41j92OJ90j54N9j01R4O3Pk54Q6p5J66k0M9j52l9Q0
2614a1N6j40K0K20n8pj35J06j82J26mK4J07k46J88j08p6J95m4P1J6j31r3K00k04
2639a10q9J81J48k00o3K11O8j17Lj85J47N4k5n7K65j89j87j4J13N4o8J44n4l02
2663b72K02k33L20L3J54j35j34J10M5O8k05n8O9m7J16j53J87M9k05J28J2N4M0
2686A45j89O0J1j4J55q0o6m3m3R8P7j06K8L9n0Ol3j04K82j30j40J52j12k78K75
$$ plain form
2711 -60 27 -135 -56 84 11 -2 85 -77 128 -8 -262 115 133 -219 -122 -286 59 93 -205 206 78 105 21 66
2735 66 85 24 309 121 123 163 36 80 6 91 -36 150 -51 111 129 191 253 -146 116 37 -86 12 81 76 -107 -269
2761 -269 -112 103 81 184 -97 108 -31 106 22 5 72 -74 -259 74 14 43 16 -154 -95 -61 -101 -38 -28 -24 119
2786 119 -85 31 -250 -153 45 135 91 -227 100 33 95 -88 -192 1 -4 -56 -235 30 145 5 13 -101 104
2809 104 236 5 -194 -65 117 34 -265 130 46 -14 269 47 -21 -155 -84 27 -124 200 141 17 -12 7 -61
2832 -61 -178 -83 228 -99 -71 22 133 -67 288 125 -14 12 29 8 -133 137 -116 243 -226 -261 239 105 -145
2855 -145 70 364 -6 109 -56 -74 241 -56 1 -157 -51 -7 -114 16 60 -172 46 105 -113 -4 -4 206
2877 206 7 -1 -163 96 43 98 38 -36 6 90 190 292 166 -134 -40 -21 120 49 -152 -167 -55 -78 -99 -99 -116 -266
$$ packed form
2711f0Q7j62P9J40p3j3Q7j62K05j36k54L77J8l52R7j64L45L4k98M11j28K7q4M5
2735F6J9o1K85j88KM0j27M4p4Q5j27J86k01J62J8O2O2l99K62p9j23R8O9nj83j62
2761b69J57K15k2J03k81K05j39J37q4j7O7j46j85L33o0K9k7j70N9L4m0O3J0MJ43
2786A19k04J16k81R7J98R0m4l18L27o7O2j83j04J93nn2j79K65J15j40Qj14K05
2809A04J32k31j99J29J82q3k99L95q4o0K83k22o8j34P1J11j51L24n9j24k9J9o8
2832f1j17R5L11l27K8R3J11k00L55j63j39K6J7k1j41K70k53L59m69l5N00j34k50
2855a45K15K94l70J15j65j8L15k97N7j58J06M4j07J30M4k32K18N9k18J09%K10
2877B06j99qj62K59n3N5o0p4M2Q4J00J02j26l00R4J9J41p1k01j5J12k3k1%j7j50
$$ plain form
2903 -266 30 157 3 165 58 101 66 162 122 217 61 -56 -10 1 -76 4 147 85 135 -66 154 31 244 56
2927 56 -110 -35 -69 100 106 208 -151 21 -83 89 19 -137 -108 31 -31 -228 -52 72 216 74 -101 -120 -26
2950 -26 85 168 -27 71 -331 23 38 -55 46 116 -123 -6 -76 -470 -4 -38 -151 40 -75 202 33 256 -65
2973 -65 166 88 -20 173 96 146 -142 50 69 131 -176 -43 125 76 77 -84 135 -82 -50 35 63 -143 -56 44
2997 44 -78 -206 -251 252 67 -231 -123 106 149 -64 -87 -2 -117 40 -78 -175 -60 -13 -59 139 15 35 -19
3020 -19 37 -45 59 -142 -44 69 25 -163 -162 -60 -42 48 -168 41 77 40 27 -74 -12 7 -16 51 -50 136 117 126
3046 126 59 136 62 13 32 -173 -54 -60 137 10 -70 -4 235 90 -136 -54 90 -99 86 -68 23 -11 53 -49
3070 -49 79 -225 -5 -19 9 18 20 -41 -49 -40 -39 -71 77 -1 -99 88 6 85 -111 145 -27 179 8 147 27 74 49
$$ packed form
2903b66K96J27j54J62j07M3l5R6m0R5j56j17M6J1p7Q0J43o2N0k01K20j23K13j88
2927E6j66P5l4J69OJ02l59J72j04J72p0j56K9J39o2j97J76J24J44j42j75j9R4
2950b6J11Q3j95R8m02L54J5r3J01P0k39J17p0l94M66l4j13J91j15K77j69K23l21
2973f5K31p8j08J93p7N0k88J92J9O2l07J33J68m9Jj61K19k17L2Q5K8k06Q7J00
2997D4j22j28m5N03j85k98J08K29M3k13k3Q5j15J57j18r7J15M7m6J98j24K0n4
3020a9N6q2J04k01R8J13m4j88JJ02J8R0k16K09L6l7j3j01O2J9k3O7j01J86j9R
3046A26o7P7p4m9J9k05J19oJ97j27q0O6K39j45k26Q2J44j89J85j54R1l4O4j02
3070d9J28l04K20j4K8RKo1qRJl2J48p8r8J87q2P9j96K56j72K06j71J39j20M7k5
$$ plain form
3097 49 -119 38 -48 -153 161 41 -149 -170 -73 -126 32 118 78 -71 24 14 91 -84 -90 18 3 -20 162 159 -123
3122 -123 -58 -17 -84 -73 90 131 -51 -120 88 -261 114 132 78 11 -109 -61 -75 72 -19 -105 48 -134 103 18 -164
3147 -164 -6 27 -28 -61 -125 71 114 46 -96 -26 -87 196 -59 -85 -136 180 2 7 157 145 3 -221 18 -239
3171 -239 -100 56 49 15 58 -43 -32 -31 125 -75 -166 84 -146 203 -3 -48 -97 75 75 41 20 37 19 274 -167
3196 -167 -71 27 54 -122 270 -260 -111 62 -185 29 -152 113 -69 15 189 -57 -150 43 -75 -70 -163 8 -66
3219 -66 5 137 94 142 136 57 -141 -99 85 64 -148 -14 44 -144 -139 -72 62 -23 69 262 -41 206 59 291 6
3244 6 -271 22 66 -63 -154 -17 -110 2 -87 -38 -150 82 -32 -196 -119 -164 73 231 173 -38 -65 132 -46 180
3268 180 -64 -169 24 138 -16 88 190 198 -23 -25 -45 63 71 64 74 -55 218 2 -195 -65 -126 -21 42 172
$$ packed form
3097D9j68J57q6j05L14j20j90k1R7n3J58Q6m0j49R5j0P7j75oJ08j5k3J82lk82
3122a23O5M1o7J1J63M1j82o9K08l49L75J8n4o7j20M8j4J47r1q6J53j82K37q5j82
3147a64J58L3n5l3o4J96M3o8j42P0o1K83k55k6n1L16j78NJ50j2j42k24K39k57
3171b39J39J56pl4M3j01J1JJ56k00r1K50k30L49k06m5m9J72%l4k1J7j8K55m41
3196a67R6R8K7j76L92n30J49J73k47K14j81K65j82Q4J74k46r3J93j18Nr3J71p4
3219f6P1J32m3M8op9j98M2J84k1k12J34N8j88NO7J34q5R2J93l03K47j47K32k85
3244Fk77K93M4j29r1J37r3J12q9M9j12K32j14j64P7m5K37J58n8k11k7J97j78K26
3268A80k44j05J93J14j54J04J02Qk21kk0J08QpJ0j29K73k16j97J30o1J05O3J30
$$ plain form
3292 172 -46 -99 85 -227 -85 -91 -254 -87 65 236 158 -96 12 -29 104 -206 187 -9 51 -34 39 73 -111
3315 -111 10 93 -21 90 175 35 90 51 -7 247 -71 20 -117 29 -50 -23 -19 86 -43 -21 -68 90 87 159 -10
3340 -10 -164 114 -28 -69 159 -170 100 78 64 7 -131 86 -55 236 13 101 -30 111 -125 -6 151 -40
3362 -40 -17 -150 33 0 -118 245 31 85 165 101 28 -78 8 113 -56 -47 -8 176 221 -32 28 -196 -68 48
3386 48 225 -165 -11 -24 135 115 142 -98 -89 -18 -21 89 -118 -149 104 51 151 234 13 -62 386 157 5 -124
3410 -124 -23 169 67 83 -32 264 -170 -119 -59 -7 -159 -145 98 -214 -30 197 -144 30 18 -80 -54 -130 162
3433 162 -93 197 147 -56 -211 -220 -43 37 -13 84 45 -155 55 66 -78 166 34 73 -39 -30 -49 -147 105 -136
3457 -136 -90 -79 62 -15 61 187 48 215 327 186 -23 -75 128 -14 105 -176 67 -124 -46 8 -267 -177 68
$$ packed form
3292A72k18n3J84l12J42oj63J67J52J71p8k54J08m1J33l10L93j96O0q5P3L4j84
3315a11J21Q3j14J11Q5j40N5l9n8K54l18R1j37J46p9K7MJ05j29K2m7J58lP2j69
3340a0j54K78j42m1K28l29K70k2j4n7j38K17j41K91k23Q8j31J41k36J19J57j91
3362d0K3j33J83l3j18L63k14N4Q0o4p3j06Q6J05j69RL9J84M5k53O0k24J28J16
3386D8J77l90J54j3J59k0K7k40RP1lJ10k07l1K53n3J00Q3k21p5M48k29j52j29
3410a24J01J92j02J6j15K96m34N1O0N2j52J4K43l12J84K27l41J74j2r8K6p6K92
3433A62k55K90n0k03j55rJ77Q0n0R7l9k00K10J1j44K44j32L9j12Rj9r8K52k41
3457a36M6J1J41p7P6J26j39J67J12j41k09n2K03j42J19k81K43j91P8N4k75R0K45
$$ plain form
3480 68 -216 -28 47 -257 117 -146 171 -73 -35 117 264 -41 9 29 -26 62 -119 140 -385 -250 -51 -102 223
3503 223 81 -75 56 -198 146 62 196 18 -258 208 -139 -37 -152 -103 53 176 11 8 71 -209 27 52
3525 52 -203 -24 184 135 174 139 -23 89 -9 55 -248 -13 26 15 -26 -31 11 -32 -112 -80 -259 30 19 -176 99
3550 99 -42 -99 35 167 221 47 -19 -92 196 74 -53 -239 -112 -86 59 -25 300 184 19 1 55 99 1 91
3574 91 61 97 -170 -152 -33 5 -44 71 -18 -178 -63 -52 63 -157 61 9 -124 -17 -1 -14 218 69 -81 -105
3598 -105 35 106 51 166 10 -154 41 -53 56 59 193 15 108 -69 -7 70 -340 46 152 -66 12 -85 92
3621 92 158 -270 -83 -62 -3 6 164 158 134 -126 -22 73 -41 -167 152 113 44 120 112 235 -71 37 208 218 -92
3646 -92 -123 -256 -256 -152 -93 -65 -68 4 136 -65 104 183 207 30 -48 -11 -2 -77 151 -100 133 57 170 -75 119 48
$$ packed form
3480F8k84J88P5l04L74k63L17k44L8J52J47l05N0K0n5Q8j81K59n25J35J99n1L25
3503B23j42j56J31k54L44q4J34j78k76M66l47J02j15M9J56J23j65lO3k80K36K5
3525E2k55J79K08m9L9l5j62J12r8O4l03K35L9j1m1nM2m3q0L2j79K89j1j95K75
3550I9j41n7J34J32N4j74o6p3K88j22j27j86J27K6J45q4L25j16j65j8N4M4r8R0
3574I1l0L6k67J8J19L8m9J15q9j60J15J1J15k20K18n2j33J07J6j3K32j49j50k4
3598a05J40P1n5J15j56j64J95r4J09LJ34j78R3j77O2P7m10L86J06k18P8r7J77
3621I2O6m28J87K1N9RJ58ok4k60J04R5j14j26L19l9o9P6qJ23l06J08J71J0l10
3646i2l1j33%J04N9K8lP2J32k01J69P9K4j77p8L7Rp5K28k51K33p6J13k45J94p1
$$ plain form
3672 48 -91 16 -249 -120 -64 30 34 -70 40 110 11 -70 -88 94 62 -33 -122 14 -25 -7 26 51 22 58 -109 98
3698 98 -27 -85 241 -33 12 -46 73 -28 -96 132 180 -197 107 -32 -81 -77 -268 -59 44 -46 -189 -102 154 2
3722 2 24 -143 68 127 -38 8 -248 -113 158 28 94 7 43 -84 165 147 117 6 13 74 28 -34 80 38 -120
3747 -120 -45 -27 23 236 -100 -247 -35 -83 -83 41 18 84 87 80 123 -6 105 -148 116 134 -103 -40 -134 150 53 -161
3773 -161 187 110 -22 -80 42 88 29 43 -123 -105 -87 108 69 -315 -33 91 -302 139 80 -109 -77 -13 88 -4
3797 -4 -139 -139 -52 2 -62 -93 -2 292 149 -66 -110 90 196 -17 -84 77 -65 -59 39 -1 25 -190 113 -289 -40
3822 -40 -174 -183 -222 -216 -51 -45 -127 29 -73 2 123 120 -24 88 168 -82 -81 140 122 -241 79 -163 -179 104 45 12
3848 12 -155 44 -130 52 -28 -144 -91 13 -34 -242 230 -10 -107 -104 6 -24 -113 -71 -210 194 91 55 -183 -107
$$ packed form
3672D8j39J07k65J29N6R4Mj04J10P0r9q1j8J82l2r5q9J36l9J8L3K5k9L6j67K07
3698I8j25n8L26k74M5n8J19j01o8K28M8l77L04j39m9Mj91K09J03r0j43Q7K56j52
3722BK2j67K11N9j65M6k56J35K71j30O6q7L6j27K49j8l0j11PO1m6o2J14m2j58
3747a20P5J8N0K13l36j47K12m8%J24k3O6LpM3j29J11k53K64J8k37O3r4K84r7k14
3773a61L48p7j32n8J22M6n9J4j66J8J8J95l9l84K82J24l93M41n9j89L2O4J01r2
3797dj35%Q7N4o4l1R1K94j43k15m4K00J06k13o7J61j42OR8m0K6k15L03m02K49
3822d0j34rl9OJ65Oq2J56j02P5J21lj44J12Q0k50JK21j8l63L20k42j6K83n9l3
3848A2j67J99j74J82q0j16N3J04m7k08M72k40r7LJ10l0q9M2j39M04j03l6k38P6
$$ plain form
3872 -107 41 57 -47 181 -107 -147 -31 -12 -61 146 -18 78 -62 60 -74 211 51 145 119 -154 -4 9 -20
3895 -20 -178 18 42 -283 261 -14 104 4 -17 -64 -152 -98 12 -38 -129 -71 6 -41 -93 -176 -14 1 -160 -32 34
3920 34 18 155 -66 -34 20 75 -142 48 34 -30 26 175 -3 128 39 -215 19 135 121 -154 -4 48 -69 87
3944 87 -75 -59 -24 48 -11 -92 -113 -57 -96 -49 -141 -1 -40 5 214 88 -110 -94 -55 -8 -11 148 -36 -35 21 40 -136
3971 -136 -41 -61 -36 -11 23 27 76 -270 -24 95 128 -241 -140 108 -265 51 -145 181 112 117 -166 -53 -118 101
3995 101 93 -131 -122 -50 193 200 -44 -17 15 100 -121 -84 3 58 -92 -36 -361 37 72 59 4 76 -72 -63 63 89 -236
4022 -236 165 217 -102 101 -64 50 -74 57 -15 106 -67 -3 118 -63 -168 163 -52 58 -208 13 74
4043 74 187 223 -214 137 124 118 -73 -17 -89 31 -49 24 -258 108 61 127 0 79 87 -9 -118 1 -31 -99 29 21
$$ packed form
3872a07J48J6j04K28k88m0J16J9m9K07j64R6j40J22j34K85j60R4k6k73J50J3k9
3895b0j58J96K4l25N44k75J18j00k1m7q8N4J10n0r1N8P7m7n2q3J62J5j61J28O6
3920C4j6J37k21L2N4N5k17J90j4o4N6J49j78J31q9k54K34J16j4k75J50N2j17J56
3944H7j62J6L5P2n9q1k1N6l9M7r2J40l9M5K09j26j98J6L9M7lJ59j84JN6J9j76
3971a36R5k0K5K5L4MM9l46K46J19L3l69J01K48l73L16j96L26o9Nk83J13o5K19
3995A01qk24RP2K43Pk44K7L2Q5k21L7Q7N5j50N6l25L98L5j3n5P2j48RJ26K6l25
4022b36M01N2l19K03j65J14j24J31p2J21j73O4J21j81j05L31k15J10k66K21O1
4043G4J13L6m37L51j3oj91N6p2J20q0P3k82L66m7O6j27P9Qr6j09J19l2o8J28q
$$ plain form
4069 21 -96 -24 -93 7 160 147 -24 -129 -74 137 -43 93 -39 21 -163 -135 45 133 19 -14 -75 -223 -7
4092 -7 159 97 18 -103 -86 3 -150 25 -102 42 -229 -23 100 52 166 250 24 172 136 -89 149 68 51 8
4116 8 -82 -16 -137 38 -167 -72 182 31 -132 -69 63 139 58 -119 -54 198 -114 104 -5 31 -160 18 -143
4139 -143 -12 -4 -58 24 -22 0 3 -77 110 -40 -166 -101 -83 -75 -87 -101 -121 51 132 110 -16 121 -6 81 -104 -35 129
4166 129 311 179 -26 -16 14 14 110 -143 -139 7 160 138 128 40 9 21 154 93 -64 -4 140 6 -70 -155 -59 -11
4192 -11 -100 201 167 -61 -279 -71 75 80 -41 101 184 177 102 169 125 80 19 -37 98 -69 -230 -183 139 -114 -186
4217 -186 146 366 50 29 27 175 -121 -8 69 -87 -20 -48 106 -190 -175 232 221 -33 42 -136 -112 -17 25 -87
4241 -87 -73 -39 33 42 92 51 1 108 20 95 -9 73 78 78 -96 13 -179 -14 222 229 10 64 -71 48 -57 -104 25
$$ packed form
4069B1j17P2o9J00J53j3j71j05N5K11j80J36j32O0j84K8J80Q8j14l3o1j48K16
4092gJ66o2p9j21J7Q9j53J75j27J44k71K06J23m8J14Q4k26J48l6k25K38q1j7m3
4116Hr0O6j21J75k05R5K54j51j63O3J32P6q1j77O5K52l12K18j09L6j91J78j61
4139a43J31Qn4Q2m6K2Lq0J87j50j26O5J8Qj2j4k0J72Q1k2j26J37j27Q7j85O9J64
4166A29J82j32k05J0L0%R6k53MJ46J53k2j0q8l1J2J33o1j57O0J44j34p6q5R6M8
4192a1q9L01l4k28k18K08J46Nj21J42Q3pp5O7m4m5o1n6J35j67j61M7L22k53p2
4217a86L32K20l16k1kJ48k96J13P7j56O7k8J54k96J5M07j1k54P5j78K4R5M2j12
4241h7J4L4P2RN0m1n0J07q8P5j04Q2N%j74J09j92J65K36Pk19N4j35J19j05m7J29
$$ plain form
4268 25 138 196 170 -128 95 220 -5 -65 107 -269 61 179 -54 -200 57 -34 153 15 21 -110 -65 -119 39
4291 39 54 77 133 -209 -81 -205 99 -77 -173 -4 3 -75 -47 85 38 -126 179 -14 -25 -123 144 -4 49 11 56
4316 56 -129 -135 -136 -45 5 -175 21 57 160 -328 102 116 214 -6 -81 83 -32 66 115 -19 135 -48 -16 13 125
4341 125 106 107 46 62 13 -90 0 -189 42 117 82 58 -108 -108 158 7 95 -29 176 -126 40 25 201 -172 66
4366 66 118 158 -152 184 84 -28 -216 67 122 -14 74 -76 -142 -46 51 -153 72 -198 -35 20 13 100 43 28 72
4391 72 -3 50 73 25 -61 9 55 59 -67 -122 -196 74 -83 -52 -14 112 -154 -29 260 -34 -21 -19 -61 113 -274 -102
4417 -102 26 39 -99 113 -65 79 -23 -84 -220 -16 90 49 16 172 -7 282 79 -50 -21 -109 -29 39 -88
4440 -88 -96 15 -16 13 65 -283 -229 -143 -182 -154 44 96 -21 -40 99 61 -25 -13 -39 16 -26 -47 154 41 -186 16
$$ packed form
4268B5J13N8k6k98K23J25k25o0J72l76L30J18k33j46K57r1J87j38Oj31M5n4J58
4291C9J5K3N6l42J28j24L04j76r6J69Pp8K8J32m7j64L05j93j1r8K67j48N3l8M5
4316E6j85ojR1N0j80J96L6J03m88M30J4R8k20p5J64j15R8M9j34J54j83L2K9J12
4341A25j9Jo1J6m9j03R0j89K31P5l5k4j66%K66j51Q8j24K05l02J66j5J76l73K38
4366F6N2M0l10L36j00j12j88K83N5j36Q8j50o6R6R7k04K25k70J63N5pQ7n7j5M4
4391G2p5N3K3m8q6P0M6Mj26n5p4K70j57L1L8J26k66J25K89k94J3Km2J74l87J72
4417a02J28J3j38K12j78J44j02o1j36K04J06m1l3J56j79K89k03j29K9q8Q0O8j27
4440h8qJ11l1K9N2l48N4Q6l9K8J98N2j17j9J39l8q6J2k6N5m2k1K01j13k27K02
$$ plain form
4466 16 -63 126 -102 -134 -44 -220 80 43 -79 -74 4 -48 42 -33 -131 -144 42 -45 -202 -109 98 186 134 69 105 -97
4492 -97 34 143 29 24 -156 0 -186 139 56 -20 110 -59 -153 182 -44 116 107 -48 14 -245 36 -72 93
4515 93 83 -5 91 -175 -55 -40 48 -18 -106 -125 -29 105 79 11 -142 77 -158 -105 54 -45 -79 9 192 -92 174
4540 174 149 -111 -85 -67 -122 203 -12 -22 158 -103 143 -117 -55 14 28 -51 31 20 178 199 -163 -5 70 113 24
4565 24 -78 -187 148 153 292 -138 -160 139 49 -56 28 -316 -197 97 -29 -147 -48 -62 104 -9 4 -87 30
4588 30 55 48 139 100 -18 -25 -42 -174 156 -31 -189 -209 -49 96 -143 45 -77 26 -71 77 -54 15 75 -110
4612 -110 -122 -181 22 18 -28 2 100 -153 127 9 176 -68 243 -15 -183 -8 -109 108 -170 -58 32 135 -20
4635 -20 73 -126 170 199 100 -232 -67 62 -23 290 -86 -82 37 54 188 -72 -95 -113 14 209 -47 -80 64 -179
$$ packed form
4466A6p9J89k28l2R0j76L00l7j22NP8n2R0p5r8j3J86q7j57R3K07Q8n2o5L6k02
4492i7J31J09j14nj80J56j86L25q3p6J30j69r4L35k26J60rj55O2k59K81j08J65
4515I3j0q8R6k66J20J5Q8o6q8j9R6J34k6o8j53K19k35N3J59r9l4Q8J83k84K66
4540A74k5k60K6J8n5L25k15j0J80k61K46k60O2O9J4p9Q2j1J58K1l62J58P5M3q9
4565B4j02j09L35NJ39m30k2K99r0j05Q4l44J19K94j26j18R9j4J66j13J3r1J17
4588C0K5pR1l9j18pj7j32L30j87j58k0J60J45k39J88j22J03r7J48j31O9O0j85
4612a10j2n9K03mm6L0R8k53K80j18J67k44L11k58j68J75j01K17k78J12R0J03j55
4635b0R3j99K96K9r9l32J65J29q5L13l76MJ19J7J34k60k3j8J27J95k56l3J44k43
$$ plain form
4659 -179 12 -21 50 -5 -21 90 102 163 -75 103 144 69 80 301 -58 -57 126 108 -148 -126 134 101 77 -146 29
4684 29 -209 16 91 -68 -232 231 -224 25 31 56 -25 26 -89 -7 131 29 -22 79 9 -67 -92 5 -18 34 141
4709 141 -197 -84 190 -64 215 102 27 71 51 105 31 -205 -9 88 -88 -63 -61 -15 -114 -79 -7 -84 -128 35 100
4734 100 -58 72 -136 47 -96 34 -61 -211 -143 110 -145 49 -68 -170 169 -54 16 -192 -88 -18 -39 106
4756 106 -1 242 171 91 94 13 47 -164 36 -14 32 98 79 -16 91 14 -45 -109 145 103 -96 165 118 89 -134 37
4782 37 -157 -62 33 -123 228 -68 42 -15 1 -115 -10 164 149 76 -55 -88 -34 -46 -138 -1 17 -19 84 -11 -121
4807 -121 -114 -172 -61 53 104 84 -82 -27 -50 171 -3 13 20 137 -184 -91 -135 -82 17 3 44 -99 -228 -14 62 124
4833 124 -48 -14 -99 -68 -121 -5 -36 144 -70 105 -78 -17 60 -163 24 -68 39 132 8 17 -113 -68 107 62
$$ packed form
4659a79J91l3P1n5j6J11J2O1k38J78M1p5J1K21l59JJ83j8k56K2K60l3k4k23J75
4684B9k38K25P5j59j64M63m55K49OK5q1N1j15Q2J38j02n1J01p0p6k5R7k3N2J07
4709A41l38J13K74k54K79j13p5M4k0N4p4k36J96R7j76K5KM6r9L5P2p7m4J63O5
4734A00j58J30k08J83j43J30r5j50O8K53k55J94j17j02L39k23P0k08J04P0k1J45
4756A06j07K43p1q0Lq1L4k11K00n0M6O6j9r5J07p7n9o4K54m2j99K61m7k9k23J71
4782C7j94R5R5j56L51k96J10n7J6j16J05J74j5p3j31l3N4j2r2J37J8l6J03r5j10
4807a21Pn8J11J14N1k0j66N5k3K21j74J6PJ17l21R3m4N3R9j4M1j43j29K14P6O2
4833A24j72L4q5L1n3J16l1J80k14J75j83O1P7k23J87r2J07R3j24Rj30M5J75m5
$$ plain form
4857 62 -135 -130 -228 -140 17 149 150 17 162 -167 7 48 -5 -22 -54 -133 -117 -106 94 26 54 -218 173 11 33 -25
4883 -25 67 131 -43 -9 8 -27 101 -95 78 -125 -96 25 -6 153 -20 50 446 83 -345 31 -6 -141 81
4906 81 -80 128 98 -122 72 118 -27 -87 244 215 -15 -222 71 -201 -193 -201 -41 -123 179 142 0 -129 21 34
4930 34 -55 32 106 65 92 37 -89 60 16 35 -145 122 -58 33 -31 -218 75 5 -101 -61 96 -105 -12 38 -35
4955 -35 -210 -175 20 -46 42 218 -138 -54 -14 133 -93 120 -46 100 19 33 46 137 146 -102 -90 -160 160 113 72
4980 72 100 -38 -10 -21 -156 145 28 -10 -52 88 115 67 -206 -164 -107 282 -52 -226 71 -24 -75 226 -151 -80
5004 -80 -43 -101 -174 146 14 0 -167 -221 29 -227 -87 198 -109 102 -113 -104 -77 93 50 -87 52 38 -51 113
5028 113 100 44 5 14 -126 -101 -141 99 -168 7 -110 -193 -65 113 79 -85 12 12 -71 0 -66 98 -95 -211 -91
$$ packed form
4857F2j97Nr8Q8J57J32Jj33J45l29J74M1n3j7l2p9J6J1K00o8K8k72L91j62K2n8
4883b5R2O4j74L4J7l5J28j96J73k03K9J21l1J59j73P0L96l63m28L76l7j35K22
4906H1j61K08l0k20J94M6j45o0L31k9k30k07K93k72QqJ60q2L02l7j42j29J50J3
4930C4q9Q7P4m1K7n5j26J49m4J9j80K67j80R1o4j87K93p0j06M0J57k01R3N0p3
4955c5j75L5J95o6Q8J76l56Q4M0J47k26K13j66J46q1J4J3R1Rk48J2p0L20m7m1
4980G2K8j38K8j1j35L01j17l8m2J40K7m8k73M2N7L89l34j74K97r5n1L01l77P1
5004h0L7n8p3L20j32j4j67n4K50k56J40K85l07K11k15RK7J70m3j37J39j4q9J64
5028A13j3n6l9Rj40K5m0K40k67J75j17q3J28J78l4j64R7%q3P1o6J64j93j16J20
$$ plain form
5053 -91 -35 53 -92 14 -40 -13 -54 -95 -189 -20 -152 202 -26 -132 -272 6 69 297 273 -200 -5 -100 168 55
5077 55 54 213 -40 -156 152 -124 -60 150 147 249 -215 -66 26 -65 127 15 6 -17 42 63 -83 135 149 -40 57
5102 57 49 175 -38 234 69 63 61 -19 61 111 -84 95 -81 -62 115 -9 -77 -21 -92 32 229 -26 -70 -73 -87 -64
5128 -64 -132 -150 115 -186 -11 112 53 186 94 89 151 25 53 -104 -120 20 -7 105 -108 63 -39 68 10 31
5152 31 260 32 37 187 11 81 263 -10 33 0 -140 -105 -39 105 6 140 119 53 158 60 -140 -70 -71 -45 -65 36
5178 36 183 -138 -131 -98 141 -67 94 -73 -159 76 -79 -142 10 5 -87 -39 -91 27 -9 99 -93 -94 282 -116 -11
5203 -11 104 4 -246 163 -142 -29 -128 -190 7 118 81 -203 -109 54 87 80 -93 -59 0 -210 210 -84 1 159
5227 159 126 46 -101 3 292 -172 -220 -228 -30 18 -8 143 72 26 -42 -45 -19 89 -18 -21 12 32 -139 -219 112 123
$$ packed form
5053i1N6Q8j45J06n4K7m1m1r4J69j32L54k28j06j40K78O3K28k4m73J95r5K68j13
5077E5jJ59k53j16L08k76O4K10lJ02m64J49R2r1J92j12rk3N9K1j46K18J4j89R7
5102E7qJ26k13K72j65okq0Q0N0j95J79j76J9J77j24o8N6p1J24J97k55m4lj4K3
5128f4o8j8K65l01J75J23n9J33r2nO2j26K8j57j6J40k7J12k13J71j02J07n8K1
5152C1K29k28NJ50j76P0J82k73M3l3j40L5O6J44r9J34k1o6J05r8k00P0jK6k0J01
5178C6J47l21PL3K39k08J61j67q6K35j55o3J52nr2M8n2J18l6J08j92jL76l98J05
5203a1J15j00k50M09l05J13r9o2J97J11l7k84R4J63L3pj73L4N9k10M20k94Q5J58
5227A59l3q0j47J04K89m64m8qJ98M8k6J51p1m6o8lK6J08j07lL3K0j71q0L31J1
$$ plain form
5253 123 5 92 -11 -51 125 111 -47 18 -173 -214 -185 -16 225 55 48 66 -99 29 109 269 197 -78 106 42
5277 42 -206 200 -160 20 -15 91 -38 244 73 76 -217 128 -74 -62 26 85 -216 -33 33 -85 -35 -187 -106
5300 -106 -22 69 162 -62 -191 229 0 -30 76 -77 16 -113 135 49 -111 20 72 -15 123 -99 139 178 110
5323 110 176 -78 -25 -85 -10 125 -36 83 -65 -18 -99 100 -345 131 -215 -15 -46 -57 -6 -91 -5 -27 -97 3
5347 3 16 -17 -21 14 -39 -185 -110 -5 165 -107 -123 135 -14 27 -208 -42 40 -92 1 -234 113 172 61 22 92
5372 92 -48 63 120 106 112 252 47 -77 -66 121 -230 74 -44 -135 -12 -22 -40 -81 -4 -181 -6 52 232 42
5396 42 63 -80 -109 -109 -129 122 9 -108 -86 69 259 153 -8 119 -260 -187 -13 -50 118 -153 -44 75 -44
5419 -44 82 -106 -179 -107 83 -105 62 -103 237 -61 -134 26 132 -37 12 -91 -250 -309 144 -63 -40 3 258
$$ packed form
5253A23j18Q7j03m0J76j4j58O5j91m1K9J69K41j70pJ8j65J28Q0J60p2k75J84o4
5277D2k48M06l60J80l5J06j29K82j71Lk93L45k02J2Q8N9l01J83O6j18N0j52Q1
5300a06Q4R1R3k24j29M20k29l0J06j53R3j29K48q6j60J31N2q7J38k22K38L9o8
5323A10O6k54N3o0P5J35j61J19j48M7q1J99m45M76l46K00l1j1N1q5Q6k2p0J00
5347CJ3l3mL5n3j46P5J05J70k72j6K58j49M1k35J66Q2j32R3k35L47N9j11l9P0
5372I2j40J11N7j4OJ40k05j24J1J87l51L04j18r1J23j0j8m1P7j77J75N8J80j90
5396D2K1j43k9%k0K51j13j17K2J55J90j06j61J27l79P3J74l7J68k71J09J19j19
5419d4J26j88p3P2J90j88J67j65L40k98p3J60J06j69M9j03j59n9M53k07K3M3K55
$$ plain form
5442 258 -42 198 -70 49 -147 54 -91 -106 67 46 148 -47 -33 -91 -9 163 -108 54 -149 -53 -94 -105 121
5465 121 67 -99 -19 -168 -30 -22 -110 144 -191 -54 -134 13 -287 99 -101 236 21 -41 95 -159 -124 -111 21
5488 21 -15 -70 41 9 -14 -110 22 3 35 -39 -294 69 -94 -64 -23 -53 63 -29 17 -86 4 21 4 157 65 93
5514 93 -125 -42 47 37 23 -82 97 -34 -14 -63 147 -100 -67 84 63 52 -129 64 38 -139 31 116 204 34
5538 34 0 -146 -75 66 161 -44 -56 -165 -88 -74 -140 -38 112 -172 24 -156 156 61 129 -37 -199 -98 120
5561 120 1 60 94 -69 117 -250 128 199 -129 167 102 4 143 -209 151 29 -42 7 150 214 3 49 103
5584 103 122 -61 43 192 -44 14 57 197 58 208 71 63 276 37 -85 156 26 101 -133 -168 188 -77
5606 -77 -74 -107 50 189 69 -109 46 -241 117 28 -50 133 127 161 -56 52 -47 -239 36 147 216 -62 44 -204
$$ packed form
5442B58l00K40k68J19j96K01j45j5J73k1J02j95J4n8Q2J72k71J62k03R6m1j1K26
5465A21n4j66Q0j49J38Qq8K54l35J37q0J47l00L86k00L37k15o2J36k54L5J3J32
5488B1l6n5J11l2k3r6J32j9L2p4k55L63j63L0M1l0J16r2M6j03R0J7j7J53r2K8
5514I3k18Q3Q9j0j4j05J79j31K0m9K10k47L3J51k1j1j81J93k6j77J70Q5Q8j70
5538C4l4j46P1J41R5k05j2j09P7J4o6J02J50k84J96j80L12r5O8j66j62J01K18
5561A20j19N9L4j63J86l67L78P1l28K96o5r8J39l52L60j22p1M9J43O4k11M6N4
5584A03J9j83J04J49k36N8M3J40j39J50j37qK13k39j22K41j30P5k34l5L56k65
5606g7Ll3J57J39j20j78J55k87L58q9p8J83oL4k17J08r9j92K75J11O9k78J06k48
$$ plain form
5630 -204 17 18 12 109 -7 144 -147 -120 117 -18 -153 107 248 -45 -27 -88 4 -108 53 -152 -58 -87 -206 -4
5654 -4 7 10 -19 41 63 196 -94 -14 140 142 197 75 44 -26 90 12 81 77 53 -170 15 -108 65 -74 -126 112 1
5681 1 -37 133 -100 193 -91 -24 -137 -206 -162 -231 -47 59 39 -5 -123 -1 124 154 17 -166 -273 2 24 145
5705 145 -20 146 51 88 214 -99 -89 -91 -13 32 77 -42 15 42 -117 158 -19 180 -131 -162 143 -59 -69 -14
5729 -14 183 -6 -84 -32 109 -11 -52 -80 82 118 60 45 -270 9 55 -15 6 -16 83 27 -70 -82 -44 -230 -84 169
5755 169 -15 -8 -43 76 -117 -9 -59 -54 143 42 231 -11 -57 221 -50 -173 -240 96 -97 199 91 -65 159
5778 159 -46 219 246 135 -94 -146 -171 -144 75 -42 -146 87 -183 -179 -11 255 189 189 31 -78 -30 61 -141 88
5802 88 38 -12 172 -146 43 -115 -91 -103 -46 -191 48 -51 24 -262 -137 152 179 -130 -22 -84 -91 80 258 163
$$ packed form
5630b04K21JoR7j16J51k91K7K37j35j35K60J41k93J8o1R2j12J61k05R4k9j19K02
5654dJ1Lk9O0K2J33k90Q0J54KN5j22l1p0J16p8O9mk4k23J85j23J73j39n2K38j11
5681Al8J70k33K93k84O7j13o9M4o9J84J06k0m4j18J22J25L0j37j83j07K75K2J21
5705A45j65J66r5L7J26l13J0kP8M5M5j19N7K7j59K75j77J99l11l1L05k02j0N5
5729a4J97j89p8N2J41j20m1k8J62L6n8j5l15K79M6p0K1k2R9n6r7j2L8j86J46K53
5755A69j84Pl5J19j93J08n0NJ97j01J89k42m6K78k71j23o7L36j93K96j08j56K24
5778A59k05K65K7j11k29n2k5K7K19j17j04K33k70MJ68K66o6%j58j09M8R1k02K29
5802H8n0n0J84l18J89j58K4j2N7j45K39r9P5k86J25K89K7l09J08o2pJ71J78r5
$$ plain form
5826 163 -61 139 190 -79 -10 -214 -243 -167 68 32 213 -116 -18 -40 -41 16 372 119 -116 186 -24 185 -62
5849 -62 -93 6 -44 -165 -5 117 111 -140 2 -146 -16 17 -16 24 55 -126 5 -82 123 46 -81 -22 -109 27 165
5874 165 90 28 123 8 20 -37 86 99 114 104 -105 42 66 175 -158 -18 196 77 56 -82 -129 192 143 -62
5898 -62 100 87 -156 68 181 -108 -202 13 193 265 -64 -87 88 -85 -113 -50 -50 -19 41 134 -127 10 66 31 -38
5923 -38 142 -127 42 -136 46 26 7 -105 125 16 162 119 15 59 95 66 -79 12 51 105 -27 74 178
5946 178 -120 -136 64 -398 -49 -35 -219 -35 -72 39 -80 142 -291 188 -55 65 46 -128 160 -25 -176
5967 -176 45 128 -158 -292 94 36 18 221 55 180 149 36 69 161 -121 143 106 -85 102 3 108 56 80
5990 80 -27 140 -69 63 102 165 131 -182 -22 78 142 187 -193 39 301 159 55 -84 -88 51 141 27 253
$$ packed form
5826A63k24K00N1k69O9k04k9P6K35l6J81l29R8k2jN7L56k53k35L02k10K09k47
5849f2l1R9n0j21J60J22ok51J42j48J30L3l3M0L1j81J31q7K05p7j27N9q7J36J38
5874A65p5o2R5j15J2n7J23J3J5j0k09J47K4J09l33J40K14j19k1j38m7L21m9k05
5898f2J62j3k43K24J13k89r4K15J80P2l29k3J75j73k8O3%L1O0R3k61J37N6l5o9
5923c8J80k69J69j78J82k0j9j12K30j09J46m3j04M4L6k9j45R1L9N4j32J01J04
5946A78k98j6K00m62L49J4j84J84l7J11j19K22m33M79k43J20j9j74K88j85j51
5967a76K21Q3k86j34L86n8j8K03j66J25l1j13L3R2k82K64l7j91J87r9J05n2K4
5990H0j07J67k09J32L9O3l4l13J60J00O4M5l80K32K62j42j04j39mJ39R0j14K26
$$ plain form
6013 253 -97 245 16 -39 -74 93 39 38 -124 33 -93 145 -126 -50 -19 32 -44 65 17 -70 -74 71 177 -167
6037 -167 179 -16 33 -48 -134 129 46 -184 -12 -17 -68 239 120 -54 -7 -88 94 -397 7 4 -187 17 18 56 -15
6062 -15 22 -118 -182 -149 118 93 -11 4 -143 -102 -122 234 -50 -217 -3 87 144 -83 -48 -81 119 55 219 -10
6086 -10 -188 9 -261 158 118 146 169 -58 8 29 -109 -25 -47 67 127 -153 -154 76 -185 -162 87 136 73 -99 -61
6111 -61 -105 130 33 38 114 -73 90 59 -183 88 50 -77 7 6 -111 93 -31 -142 -34 173 28 -15 21 -227
6135 -227 9 34 -104 23 71 7 -111 99 3 -160 -111 25 56 -65 -59 -69 -50 150 147 -54 -81 -117 -45 108 -93
6160 -93 175 -28 -26 -120 -192 10 -119 118 8 -39 238 133 -3 145 50 -18 226 -50 45 89 107 41 65 221
6184 221 -90 120 229 35 323 -70 -30 51 -167 210 110 93 87 91 48 44 -6 -96 8 70 -105 109 -6 -1 -74
$$ packed form
6013B53l50L42k29n5l5J67n4jj62J57j26K38k71P6L1N1p6J09m8q7mJ45J06l44
6037a67L46j95M9q1q6K63q3k30J72nn1L07j19j74M7q1J82m91M04lj91K04JL8p1
6062a5L7j40o4L3K67k5j04J5j47M1k0L56k84j67K14R0N7k27L5l3K00o4J64k29
6086a0j78J97k70M19m0K8K3k27O6K1j38Q4k2J14O0k80jK30k61K3K49M9o3j72L8
6111f1m4K35r7NP6j87J63l1k42K71l8j27Q4jj17K04j24j11J08K07j45m3L6k48
6135b27K36K5j38J27M8o4j18K10r6j63M9J36L1j21Oj0J9K00lk01k7l6P2J53k01
6160i3K68k03Kr4p2K02j29K37j10m7K77j05j36J48r5o8K44k76R5M4J8o6K4J56
6184B21l11K10J09j94K88l93M0Q1k18L77j00j7oMm3mn0r0J04O2j75K14j15Np3
$$ plain form
6209 -74 -3 260 56 46 -198 -66 -125 -41 209 54 -100 -202 25 -45 -6 -107 -98 -126 21 108 -171 48 9 -213
6233 -213 -153 87 -9 -3 3 -31 -166 -21 8 -60 38 -153 -65 -46 113 113 -121 23 62 20 108 230 308 177 -8 -113
6259 -113 -15 -81 57 -19 193 49 167 34 -127 -181 143 -5 46 88 33 -159 43 -71 272 44 113 -66 175
6282 175 82 196 -57 84 7 -101 -149 -65 -134 -68 126 -27 20 22 -108 148 -43 -184 152 -36 43 -60 34 136
6306 136 -150 74 160 -129 178 -118 -251 142 132 32 24 -89 170 -139 92 -101 94 -198 -18 39 2 37
6328 37 -94 -193 -67 57 -54 81 -55 -12 163 116 -9 157 220 70 177 97 338 -23 155 -164 -143 -125 -45
6351 -45 115 72 101 5 77 -11 78 66 -167 9 442 243 -77 -82 42 -72 50 -64 70 86 -4 -58 78 31 -46
6376 -46 -40 187 -76 79 -114 -96 91 276 -142 34 -69 97 117 4 136 77 137 -135 -58 137 -274 36 109
$$ packed form
6209g4P1K63k04j0k44J32n9Q4K50j55j54j02K27p0L9j01Rk8J47Q7k79K19l9k22
6233b13O0K40r6OOl4j35J45K9o8R8j91Q8J9J59%k34J44L9m2Q8J22P8j31j85j05
6259a13R8o6J38p6K12j44J18j33j61n4L24j48N1M2n5j92K02j14L43k28O9j79K41
6282A75r3J14k53J41p7j08m8Q4o9O6J94j53M7Kj30K56j91j41L36j88P9j03R4J02
6306A36k86K24Q6k89L07k96j33L93j0j00qj13K59l09K31j93J95k92J80N7l7L5
6328C7j31r9J26J24j11J35j36M3J75m7j25J66O3j50J07q0K41l61J78l19K1J8Q0
6351d5J60m3K9r6P2q8Q9j2k33J76M33j99l20nJ24j14J22j14J34J6r0n4J36m7p7
6376d6OK27k63J55j93J8J87J85m18J76j03J66K0j13J32n9O0k72P7J95m11L10P3
$$ plain form
6399 109 153 -47 -5 66 55 3 -30 48 -259 -9 -141 114 80 218 -55 -42 -209 -69 -56 63 -36 104 148 -154
6423 -154 -41 1 -53 64 36 -233 -148 -66 93 -217 -97 6 102 175 59 -54 89 87 -71 -42 1 -122 92 -33
6447 -33 120 84 21 120 -175 -8 179 -6 43 -50 205 -74 206 -34 107 10 71 -173 -194 -226 -73 115 27 52
6471 52 98 95 -28 -36 50 25 7 -99 -117 -3 5 -9 205 -184 -96 -159 -182 12 -78 77 48 -82 -105 98 -20 78 1
6498 1 -109 -4 -89 -99 35 35 -187 -78 5 56 83 -87 136 8 -45 -184 -226 33 -216 85 143 8 -8 70 -73
$$ packed form
6399A09M4k00M2P1j1n2l3P8l07K50j32K55l4J38k73J3j67J40J3J19r9J40M4l02
6423a54J13M2n4J17k8k69Q5Q2J59l10J20J03R6P3j16j13J43kj58K9M3j23K14j25
6447c3J53l6o3R9k95J67J87j85M9r3K55k79K80k40J41r7O1k44k1l2J53J88q8K5
6471E2M6lj23qQ6k5j8j06j8J14Qj4K14l89Q8o3k3J94r0J55k9j30k3K03j18R8p7
6498Aj10J05q5j0J34%k22J09Q3N1K7j70K23j28n3j39m2K59k49L01N8j35j6P8j43
$$ [...]
8191A19
##END NTUPLES=NMR FID
##END=
