##TITLE=1H_11-2024
 CDCl3
 8 sc, 
 9.2.2024
##JCAMPDX= 6.0         $$ Bruker NMR JCAMP-DX V2.0
##DATA TYPE= NMR FID
##DATA CLASS= NTUPLES
##ORIGIN= UXNMR, Bruker Analytische Messtechnik GmbH
##OWNER= root
$$ XWIN-NMR		Version 3.5
$$ Fri Feb  9 13:54:25 2024 Russian Standard Time (UT+4h)  she@DPX200
##.OBSERVE FREQUENCY= 200.1313
##.OBSERVE NUCLEUS= ^1H
##.DELAY= (6, 6)
##.ACQUISITION MODE= SIMULTANEOUS
##.ACQUISITION SCHEME= undefined
##.AVERAGES= 8
##.DIGITISER RES= 18
##SPECTROMETER/DATA SYSTEM= spect
##.PULSE SEQUENCE= zg30
##.SOLVENT NAME= DMSO
##.SHIFT REFERENCE= (INTERNAL, DMSO, 0, 15.7039)
##AUDIT TRAIL= $$ (NUMBER, WHEN, WHO, WHERE, WHAT)
$$ ##TITLE= Audit trail, XWIN-NMR		Version 3.5
$$ ##JCAMPDX= 5.01
$$ ##ORIGIN= Bruker BioSpin GmbH
$$ ##OWNER= she
$$ F:/spectra/data/she/nmr/H-F/1/audita.txt
$$ ##AUDIT TRAIL=  $$ (NUMBER, WHEN, WHO, WHERE, WHAT)
(   1,<2024-02-09 13:52:57.70 +0400>,<she>,<DPX200>,
      <created by zg, POWCHK disabled, PULCHK disabled
       configuration hash MD5:
       00 E9 B6 7A A2 85 ED C7 34 08 36 98 17 FE 4E 26
       data hash MD5: 16K
       4A 01 2D D2 33 C9 88 0A 8B 8A AF F1 49 23 38 7C>)
$$ ##END=
$$ 
$$ hash MD5
$$ 1C 34 17 E9 43 07 A6 C4 97 6E 22 01 E7 47 A4 93
##$RELAX= 
##$RELAX= 
##$RELAX= 
##$RELAX= 
##$RELAX= 
##$RELAX= 
$$ Bruker specific parameters
$$ --------------------------
##$DU= <F:/spectra>
##$EXPNO= 1
##$NAME= <H-F>
##$PROCNO= 1
##$TYPE= <nmr>
##$USER= <she>
##$AMP= (0..31)
100 100 100 100 100 100 100 100 100 100 100 100 100 100 100 100 100 100 
100 100 100 100 100 100 100 100 100 100 100 100 100 100 
##$AQSEQ= 0
##$AQ_mod= 1
##$AUNM= <au_zg>
##$AUTOPOS= <>
##$BF1= 200.13
##$BF2= 200.13
##$BF3= 200.13
##$BF4= 200.13
##$BF5= 200.13
##$BF6= 200.13
##$BF7= 200.13
##$BF8= 200.13
##$BYTORDA= 1
##$CFDGTYP= 0
##$CFRGTYP= 5
##$CHEMSTR= <none>
##$CNST= (0..31)
1 1 145 1 1 1 1 1 1 1 1 1 1 1 1 1 1 1 1 1 1 1 1 1 1 1 1 1 1 1 1 1 
##$CPDPRG= <>
##$CPDPRG1= <>
##$CPDPRG2= <>
##$CPDPRG3= <>
##$CPDPRG4= <mlev>
##$CPDPRG5= <mlev>
##$CPDPRG6= <mlev>
##$CPDPRG7= <mlev>
##$CPDPRG8= <mlev>
##$CPDPRGB= <>
##$CPDPRGT= <>
##$D= (0..31)
0 1.2 0 0 0 0 0 0 0 0.06 0 0.03 0 0 0 0 0.0002 0 0 0 0 0 0 0 0 0 0 0 0 
0 0 0 
##$DATE= 1707472377
##$DBL= (0..7)
120 120 120 120 120 120 120 120 
##$DBP= (0..7)
150 150 150 150 150 150 150 150 
##$DBP07= 0
##$DBPNAM0= <>
##$DBPNAM1= <>
##$DBPNAM2= <>
##$DBPNAM3= <>
##$DBPNAM4= <>
##$DBPNAM5= <>
##$DBPNAM6= <>
##$DBPNAM7= <>
##$DBPOAL= (0..7)
0.5 0.5 0.5 0.5 0.5 0.5 0.5 0.5 
##$DBPOFFS= (0..7)
0 0 0 0 0 0 0 0 
##$DE= 6
##$DECBNUC= <off>
##$DECIM= 32
##$DECNUC= <off>
##$DECSTAT= 4
##$DIGMOD= 1
##$DIGTYP= 9
##$DL= (0..7)
0 120 120 120 120 120 120 120 
##$DP= (0..7)
150 150 150 150 150 150 150 150 
##$DP07= 0
##$DPNAME0= <>
##$DPNAME1= <>
##$DPNAME2= <>
##$DPNAME3= <>
##$DPNAME4= <>
##$DPNAME5= <>
##$DPNAME6= <>
##$DPNAME7= <>
##$DPOAL= (0..7)
0.5 0.5 0.5 0.5 0.5 0.5 0.5 0.5 
##$DPOFFS= (0..7)
0 0 0 0 0 0 0 0 
##$DQDMODE= 0
##$DR= 18
##$DS= 0
##$DSLIST= <SSSSSSSSSSSSSSS>
##$DSPFIRM= 0
$$ [...]
##$SUBNAM2= <"">
##$SUBNAM3= <"">
##$SUBNAM4= <"">
##$SUBNAM5= <"">
##$SUBNAM6= <"">
##$SUBNAM7= <"">
##$SUBNAM8= <"">
##$SUBNAM9= <"">
##$SW= 18.0517328524113
##$SWIBOX= (0..15)
0 0 2 0 0 0 0 0 0 0 0 0 0 0 0 0 
##$SW_h= 3612.71676300578
##$TD= 16384
##$TD0= 1
##$TE= 0
##$TE2= 300
##$TE3= 300
##$TEG= 300
##$TL= (0..7)
0 120 120 120 120 120 120 120 
##$TP= (0..7)
150 150 150 150 150 150 150 150 
##$TP07= 0
##$TPNAME0= <>
##$TPNAME1= <>
##$TPNAME2= <>
##$TPNAME3= <>
##$TPNAME4= <>
##$TPNAME5= <>
##$TPNAME6= <>
##$TPNAME7= <>
##$TPOAL= (0..7)
0.5 0.5 0.5 0.5 0.5 0.5 0.5 0.5 
##$TPOFFS= (0..7)
0 0 0 0 0 0 0 0 
##$TUNHIN= 0
##$TUNHOUT= 0
##$TUNXOUT= 0
##$USERA1= <user>
##$USERA2= <user>
##$USERA3= <user>
##$USERA4= <user>
##$USERA5= <user>
##$V9= 5
##$VALIST= <valist>
##$VCLIST= <CCCCCCCCCCCCCCC>
##$VD= 0
##$VDLIST= <DDDDDDDDDDDDDDD>
##$VPLIST= <PPPPPPPPPPPPPPP>
##$VTLIST= <TTTTTTTTTTTTTTT>
##$WBST= 1024
##$WBSW= 4
##$XGAIN= (0..3)
0 0 0 0 
##$XL= 0
##$YL= 0
##$YMAX_a= 399764
##$YMIN_a= -469855
##$ZGOPTNS= <>
##$ZL1= 120
##$ZL2= 120
##$ZL3= 120
##$ZL4= 120
##$ABSF1= 10
##$ABSF2= 0
##$ABSG= 5
##$ABSL= 3
##$ALPHA= 0
##$AQORDER= 0
##$ASSFAC= 0
##$ASSFACI= 0
##$ASSFACX= 0
##$ASSWID= 0
##$AUNMP= <proc_1d>
##$AZFE= 0.1
##$AZFW= 0.1
##$BCFW= 1
##$BC_mod= 2
##$BYTORDP= 1
##$COROFFS= 0
##$CY= 11.3945322036743
##$DATMOD= 1
##$DC= 2
##$DFILT= <>
##$DTYPP= 0
##$F1P= 15.7292609196834
##$F2P= 12.9074282941183
##$FCOR= 0.5
##$FTSIZE= 0
##$FT_mod= 4
##$GAMMA= 1
##$GB= 0.15
##$INTBC= 1
##$INTSCL= 1
##$ISEN= 128
##$LB= 0.24
##$LEV0= 0
##$LPBIN= 0
##$MAXI= 10000
##$MC2= 0
##$MEAN= 0
##$ME_mod= 0
##$MI= 1.114404
##$NCOEF= 0
##$NC_proc= 0
##$NLEV= 6
##$NOISF1= 3.799351
##$NOISF2= 2.8
##$NSP= 1
##$NTH_PI= 0
##$NZP= 0
##$OFFSET= 15.70392
##$PC= 1
##$PHC0= -24599.48
##$PHC1= 20.05267
##$PH_mod= 1
##$PKNL= yes
##$PPARMOD= 0
##$PSCAL= 0
##$PSIGN= 0
##$REVERSE= no
##$SF= 200.130013532006
##$SI= 16384
##$SIGF1= 3
##$SIGF2= 2
##$SINO= 400
##$SIOLD= 16384
##$SREGLST= <1H.CDCl3>
##$SSB= 0
##$STSI= 0
##$STSR= 0
##$SW_p= 3612.71676300578
##$SYMM= 0
##$S_DEV= 0
##$TDeff= 0
##$TDoff= 0
##$TI= <>
##$TILT= no
##$TM1= 0
##$TM2= 0
##$TOPLEV= 0
##$USERP1= <user>
##$USERP2= <user>
##$USERP3= <user>
##$USERP4= <user>
##$USERP5= <user>
##$WDW= 1
##$XDIM= 8192
##$YMAX_p= 0
##$YMIN_p= 0
$$ End of Bruker specific parameters
$$ ---------------------------------
##NTUPLES= NMR FID
##VAR_NAME=  TIME,          FID/REAL,        FID/IMAG
##SYMBOL=    X,             R,               I
##VAR_TYPE=  INDEPENDENT,   DEPENDENT,       DEPENDENT
##VAR_FORM=  AFFN,          ASDF,            ASDF
##VAR_DIM=   8192,          8192,            8192
##UNITS=     SECONDS,       ARBITRARY UNITS, ARBITRARY UNITS
##FACTOR=    0.0002768,     1,               1
##FIRST=     0,             0,               0
##LAST=      2.2672688,     0,               0
##MIN=       0,             -469855,         0
##MAX=       2.2672688,     399764,          0
$$ Real data points
##PAGE= N=1
##DATA TABLE= (X++(R..R)), XYDATA
0@%%%%%%%%%%%%%%Qj6J6j6J6k4L2l2M0m8N6o7P5q7J00j14J30j47J68j90K14k42
$$ 0 0 0 0 0 0 0 0 0 0 0 0 0 0 0 8 -8 8 -8 8 -16 16 -16 24 -24 32 -35 40 -47 53 -61 69 -78 90 -100 114 -128
36a28K70l00L33l72M14m58N07n61O19o81P50q25R10j002J100j212J339j479J636
$$ -128 142 -158 175 -197 217 -241 266 -295 324 -357 393 -432 478 -524 576 -636 703 -776 860
55H60j818K026k266K552k892L306l828M504n414O701q652J1917j8308L5023j53220
$$ 860 -958 1068 -1198 1354 -1538 1768 -2060 2444 -2970 3731 -4921 6996 -11312 23711 -129509
70a29509l40346N08803K11939l61096O299L13759r8764k64319J49754J47238l20634
$$ -129509 -469855 38948 250887 -110209 -103910 209849 111085 -153234 -3480 143758 -176876
81a76876n8499M22829N2840l12625l6747J49666J3616j36641n2710J32511Q2953
$$ -176876 -235375 187454 240294 -72331 -109078 40588 54204 -82437 -135147 -2636 80317
92H0317m02J6110j05818j17009M9564R6036N5643n1924q8734J01649J01077j15811
$$ 80317 79915 96025 -9793 -126802 -77238 18798 74441 22517 -66217 35432 136509 20698
104B0698j37153j7212J21009J21630o9236n9938N0184l4253l0766K9540m4267
$$ 20698 -116455 -133667 -12658 108972 39736 -20202 29982 -4271 -35037 -5497 -49764
115d9764k3950R5057J25526l8988k13624j1653J82996k9248r5423N6628J9099
$$ -49764 -73714 21343 146869 107881 -105743 -117396 65600 36352 -59071 -2443 16656
126A6656N048N5382m0939j28408m3256J43704J13241j18481n8016R6104k2715
$$ 16656 21704 77086 36147 -92261 -135517 8187 121428 2947 -55069 41035 18320
137A8320m0726K7187n6412j4220J16767O9859q3339j33380M2341J28002o0885
$$ 18320 -22406 4781 -51631 -65851 50916 120775 37436 -95944 -53603 74399 13514
148A3514q0570N5964K9123J7401K0843o4040o7245l36Q6455Q6155q6450q7112
$$ 13514 -67056 -11092 18031 35432 56275 -7765 -75010 -75346 11109 97264 10814 -76298
160g6298Q6516N6029n1836o4515j7024Q0705N3990l7157k0937l8152j8800P3590
$$ -76298 10218 66247 14411 -50104 -67128 13577 67567 30410 9473 -28679 -47479 26111
172B6111Q944o9477j5602M7633Q2555k2502j34166k228R6038K0818j7726l3935
$$ 26111 35055 -34422 -50024 -2391 80164 57662 -76504 -78732 17306 38124 20398 -13537
184a3537p054M1918L021q046k9126o1761O6480J03267n8986q6484O199N8737K9849
$$ -13537 -20591 21327 24348 16302 -12824 -74585 -8105 95162 36176 -50308 -44109 14628 44477
197D4477o3978l1991N2447J3481J6411O118q1848j9419P8886L9380l1069o6697
$$ 44477 -19501 -51492 955 14436 30847 36965 -44883 -64302 14584 53964 22895 -43802
209d3802J2073Q7830j6067o6363n341M019M3021M1301n0753m6074Q324M1892L9064
$$ -43802 -31729 56101 40034 -26329 -31670 -27651 15370 56671 5918 -40156 -31832 10060 49124
222D9124n9455n4387O0703M5443r549l3424m9497L0002O1410j0580k9110l2046
$$ 49124 -10331 -64718 -4015 41428 31879 -1545 -51042 -21040 40370 29790 680 -31366
234c1366O906O9242p584o5831r859K4766M9842O681p4122j4592M5584K1676P850
$$ -31366 -24460 44782 37198 -28633 -38492 -13726 36116 42797 -31325 -45917 -333 21343 29193
247B9193m2627l4147N3738L2757j9795l3907l2770M8619N6808m0003l9894n961
$$ 29193 -13434 -47581 6157 38914 19119 -14788 -47558 1061 57869 17866 -22028 -27989
259b7989J7802M8925j8894n6235R267L3085L2613j3477p4087N091O2930Q688j1569
$$ -27989 -10187 38738 19844 -36391 -27124 5961 38574 25097 -48990 -43899 19031 27719 16150
272A6150k9726j6950M6382J8086k9580l0400j5249O0681M8730o5381m4975K4401
$$ 16150 -13576 -30526 15856 33942 4362 -26038 -41287 19394 68124 2743 -42232 -17831
284a7831K4627J6931k7477k9937K7956K2719J3586j3970o8616N758P5799J0459
$$ -17831 6796 23727 -3750 -33687 -5731 16988 30574 16604 -52012 -46254 29545 40004
296D0004l3823l1340J2303N2440j9604n0874O823J2294L0486L0114m4669l9458
$$ 40004 6181 -25159 -12856 39584 19980 -30894 -24071 -11777 18709 48823 4154 -35304
308c5304J1809K8520K2074m2025l2672O0890L5286k8427l5629l2455K9433N0591
$$ -35304 -23495 5025 27099 -14926 -47598 13292 48578 20151 -15478 -47933 -18500 32091
320C2091j3102j5694p779l250L6420p535n6820q118L6882N2079j118p0852n438
$$ 32091 18989 3295 -4484 -7734 28686 21151 -35669 -43787 -6905 45174 44056 -26796 -32234
333c2234M1677q477p018p466j0422M1705K9510k5409m3824l0022M3916M8854l1498
$$ -32234 9443 966 -6052 -13518 -23940 17765 47275 21866 -21958 -51980 -8064 40790 9292
346I292k1115J3044R511K0214l0231n3832K1188M4180K1210n529m3677o799K7031
$$ 9292 -11823 1221 10732 30946 715 -53117 -31929 12251 33461 27932 -15745 -22544 4487
359D487k346o606j9815P76O5022J4085n8249k8103J685K8432K4614k5751o953
$$ 4487 2141 -4465 -24280 -23504 41518 55603 -2646 -30749 -29064 -632 23982 -1769 -8722
372h722J7953N744J2015l4902n3898L2173N5023J0163k1967l4783J5095K5443
$$ -8722 9231 14975 26990 -7912 -61810 -29637 25386 35549 13582 -21201 -6106 19337
384A9337k7950j1390M623M257M9699J4458n7888l2285J3872L4582N212l8270J1411
$$ 19337 -8613 -20003 -15380 -11123 38576 53034 -4854 -37139 -23267 11315 16527 -21743 -10332
397a0332L7492p782p733k6263l9884L3203N0112P71k3711k3497K1510K3061l8911
$$ -10332 27160 19378 11645 -14618 -54502 -21299 28813 29584 5873 -17624 3886 26947 -11964
410a1964k0200J7739J8323L7301l800n1776j2522J3695J7063M122l0757R984M4613
$$ -11964 -32164 -14425 3898 41199 37399 -14377 -26899 -13204 3859 7981 -22776 -12792 31821
423C1821l850k4061l0544j9213M3053L1416j5559j0705p661J5370J5211m0022
$$ 31821 27971 3910 -26634 -45847 -2794 28622 13063 2358 -5303 10067 25278 -14744
435a4744k2097K3465K4740K9081j5671m9174M930K0070q31m555j8522J7489M1038
$$ -14744 -36841 -13376 11364 40445 24774 -24400 -19470 600 -231 -4786 -23308 -5819 35219
448C5219j0034k6834k4534j0209M3757K0888k7941l482R219J0271J863l8981j5083
$$ 35219 25185 -1649 -26183 -36392 7365 28253 312 -3170 6049 16320 18183 -20798 -35881
461c5881K8708K1268J8755j9027m1358J6366K1081j4075r895o170K3108L5140
$$ -35881 -7173 14095 32850 13823 -27535 -11169 9912 -4163 -14058 -20228 2880 38020
473C8020j8338k8630j2648k197L5827J1162l1458K852J7565O626o354l9568q002
$$ 38020 19682 -8948 -21596 -23793 12034 23196 -8262 -5410 12155 18781 12427 -27141 -35143
486c5143L7543J5159K185j6633k5815K1162J4905k1231q253j97K3242L2293k4448
$$ -35143 2400 17559 19744 3111 -22704 -1542 13363 -7868 -16121 -16318 6924 39217 14769
499A4769l1833M43P494K3757j930k8943J3517J9819l389q682l1226l811L7662
$$ 14769 -17064 -16621 -9127 14630 12700 -16243 -2726 17093 13704 5022 -26204 -30015 7647
512G647J0578q150j4472j3300K5644Q604k9788k936R593J7745K1556k5354k6928
$$ 7647 18225 10075 -4397 -17697 7947 16551 -13237 -16173 -6580 11165 32721 7367 -19561
525a9561R126R754J3616q417k5740K0215K1051j1158j1473k2169L403L6799L92
$$ -19561 -10435 -681 12935 4518 -21222 -1007 20044 8886 -2587 -24756 -21353 15446 15838
538A5838j6208o565l349K3677L292l1663k75J4998J4027J1898k8009j9931K0047
$$ 15838 -370 -6935 -10284 13393 16685 -14978 -15253 -255 13772 25670 -2339 -22270 -2223
551b223Q320J925r837j9252K1488J9399j5793j1376j2644R340L1642r400k0098
$$ -2223 6097 8022 -1815 -21067 421 19820 4027 -7349 -19993 -10653 20989 11589 -8509
564h509L038K575J6934m34k9006L343J7573P030L362k6537j1686K7166N237p496
$$ -8509 -5471 -2896 14038 13604 -15402 -12059 5514 12544 15906 -10631 -22317 4849 10086 2590
578B590q052j2645K1046J5528k0105q702j708J0571K4771j5627k1767Q741P418
$$ 2590 -5462 -18107 2939 18467 -1638 -10340 -12048 -1477 23294 7667 -14100 -5359 2059
591B059J1492l996k6458R020J9842l354l559j9752m744K8957K686j2467o401p485
$$ 2059 13551 9555 -16903 -7883 11959 8605 5046 -14706 -19450 9507 12193 -274 -6675 -14160
605a4160K0335J1132k4879m238R051R274J4888j8675j9386J3238O117O726l484
$$ -14160 6175 17307 -7572 -11810 -2759 6515 21403 2728 -16658 -3420 2697 9423 5939
618E939k2607J2341J9922j0505j0086j2305L823K7291k909j3892N3n437J4481
$$ 5939 -16668 -4327 15595 5090 -4996 -17301 -13478 13813 10904 -2988 -2935 -8372 6109
631F109Q052k5260j877J6881R174N283k1531j5317J7828M200m73j290j5055J3243
$$ 6109 14161 -11099 -12976 3905 13079 18362 -3169 -18486 -658 3542 3069 1779 -13276 -33
645c3J7826j6331j2123n716P425K5415n099j6464M120j007Q847J212k3435M899
$$ -33 17793 1462 -10661 -16377 -8952 16463 11364 -5100 -980 -1987 6860 8072 -15363 -10464
659a0464K0131L153P86j8831j3817J8469M374n472l14p314J5388J2520k2013r860
$$ -10464 9667 12820 13606 -5225 -19042 -573 3801 -1671 -1985 -9299 6089 18609 -3404 -13264
673a3264P94O566K2585n726j6755P654J149K054k680k0600R695K2057j742l077
$$ -13264 -12470 -5904 16681 10955 -5800 1854 3003 5057 2377 -18223 -8528 13529 11787 8710
687H710j5463j0671J8693J721r382L097j139J4677Q668k5083q958P346O413J6283
$$ 8710 -6753 -17424 1269 2990 -6392 -3295 -4434 10243 18911 -6172 -15130 -7784 -1371 14912
701A4912p013j3925J0936J053l815m926j6846J2566K3121o336o493r689p300J6585
$$ 14912 7899 -6026 4910 5963 2148 -2778 -19624 -7058 16063 9727 3234 -6455 -13755 2830
715B830j610j0495P234L185J1610M848k5955o809J1296M499J1187o834j1039J3763
$$ 2830 1220 -9275 -2041 1144 12754 17602 -8353 -15162 -3866 633 11820 4986 -6053 7710
729G710n35j0345l664j1364J3050K1818q498p540o113m220J4555m957j2347J2833
$$ 7710 7175 -3170 -6834 -18198 -5148 16670 8172 632 -5481 -9701 4854 -103 -12450 383
743C83O868O248J198k3928n271J3208K398O704o185q020J6155j618j5138l123
$$ 383 7251 13499 14697 -9231 -14502 -1294 1104 7808 1623 -6397 9758 8140 -6998 -10121
757a0121n421J3090J8527j0209o922q75l990J0942o244j2464J5607Q964J619j999
$$ -10121 -15542 -2452 16075 5866 -1056 -1931 -5921 5021 -1223 -13687 1920 10884 12503 10504
771A0504k1191k384J3975j012K989k575n227J5469k580j7765j429q84J2623J5608
$$ 10504 -10687 -13071 904 -108 2881 306 -4921 10548 7968 -9797 -11226 -12110 513 16121
785A6121j2615n474L887l698N947o526j1303J6977R122k347l488j8194M26J4890
$$ 16121 3506 -1968 1919 -1779 4168 -2358 -13661 3316 12438 10091 6603 -11591 -11165 3725
799C725n254l95J023k156J4677m552j8606J864K239R854J2679j3504m294P342
$$ 3725 -1529 -1924 -901 -3057 11620 7068 -11538 -9674 -7435 2419 15098 1594 -2700 4642
813D642m070K294p045r501J8118P980p296k620j3043J269J4241p687j818L762
$$ 4642 572 2866 -4179 -13680 4438 12418 5122 2502 -10541 -9272 4969 -2718 -4536 -774
827g74r2J2445n065j8678N077N207N438Q796j3060k744J0274n281j175n732p202
$$ -774 -866 11579 6514 -12164 -7087 -1880 3558 12354 -706 -3450 6824 1543 368 -5364 -12566
842a2566J7307O745j0229k223p767L134J2039r520k629O976N4R754n134j8124
$$ -12566 4741 11486 1257 -966 -8733 -5599 6440 -3080 -5709 1267 1321 11075 5941 -12183
856a2183P433P231J427M526j1330q84J1508o604l211l064o235J6160N760j2673
$$ -12183 -4750 2481 3908 8434 -2896 -3780 7728 1124 -2087 -5151 -11386 4774 10534 -2139
870b139q81l256L725J0626j1825k836J0538j029N749m260j5281Q011P563j328
$$ -2139 -3020 -6276 -2551 8075 -3750 -6586 3952 2923 8672 4412 -10869 -2858 4705 3377
884C377J774j0708J303J2694q260n075L35l421J3477L678j4267J332J437K302
$$ 3377 5151 -5557 -4254 8440 180 -4895 -4560 -7981 5496 9174 -5093 -3761 -2324 -22
898b2P922j0499l455R906k12L517n641j3473J1931P623p857J019n622J09J1598
$$ -22 7900 -2599 -6054 3852 3640 7157 1516 -11957 -26 7597 -260 759 -4863 -4754 6844
913F844o290n875J174j209J2856K07j5733N173M437l75O894j0601l902J1942j856
$$ 6844 554 -5321 -4147 -5356 7500 7707 -8026 -2853 1584 1209 8103 -2498 -6400 5542 3686
928C686o54l463r752J1045P226r504m30m187J982J2154q866n962O355j342Q471
$$ 3686 3032 -431 -10183 862 8088 -1416 -1846 -6033 -4051 8103 -763 -6725 -370 -1712 6759
943F759J12j5606M745P846n79K938r287k457J1600l658l010j690p604J2898O276
$$ 6759 6871 -8735 -3990 3856 3277 6215 -3072 -5529 6071 2413 -597 -2287 -9891 3007 9283
958I283j2765qm77O66J0318p559o623Q696J438M443l637j4002Q237P284l542M002
$$ 9283 -3482 -3490 -3967 -3301 7017 -542 -7165 1531 2969 7412 3775 -10227 -1990 5294 1752 5754
974E754q694l385J3545m714q192J373k155J0440M444j1673J85J07J412R285r997
$$ 5754 -2940 -6325 7220 2506 -5686 -4313 -6468 3972 8416 -3257 -3072 -2965 -1553 7732 -2265
989b265n013J3226k75j498j741j1933O370Q954l790J44o984L86J2690q123q595
$$ -2265 -7278 5948 5673 4175 2434 -9499 -3129 5825 2035 2179 -4805 -4419 8271 148 -8447
1004h447N023r43Q814M531j2587M59L288l17O180r017l691J4279p94m540l105
$$ -8447 -3424 -4367 4447 8978 -3609 -3150 138 -179 6001 -3016 -6707 7572 6778 2238 -867
1019h67q959Q129P991o776J98k771p3J1391q425r913O925K365O932K430j3011
$$ -867 -9826 -1697 6294 -482 -284 -3055 -3128 8263 -162 -10075 -3150 -785 6147 8577 -4434
1034d434J821N184k764L961o819k752J4136k006p083j729o841Q453P679r745P79
$$ -4434 -2613 2571 -193 3768 -3051 -5803 8333 6327 -756 -2485 -9326 -873 6806 -2939 -2160
1049b160J690j29Q242r334q862R402L364M800O08j3310L542P247n430Q75m405
$$ -2160 -470 -599 7643 -1691 -10553 -1151 2213 7013 7621 -5689 -2147 5100 -330 545 -3860
1064c860q36J3373l248q707j82m776P877O871j0656J061N590m86M151r120p322
$$ -3860 -4696 8677 5429 -3278 -3460 -8236 -359 6512 -4144 -3083 2507 2021 6172 -2948 -10270
1079a0270J1765K992R56j10j1240M209P799p565j144j755Q13J2560m447j0170
$$ -10270 1495 4487 5443 5333 -5907 -1698 6101 -1464 -2608 -4363 -3550 9010 4563 -5607
1093e607K175k255O222N463j0723K387P619j840J218q280n540J2400K230k446
$$ -5607 -3432 -5687 535 5998 -4725 -2338 5281 3441 4659 -3621 -9161 3239 5469 3023
1107C023l1q677M913P656j0401k022J764K163J0866n925j0337M846k37L873L461
$$ 3023 2992 -5685 -772 6884 -3517 -5539 -3775 -1612 9254 3329 -7008 -2162 -2399 1474 4935
1122D935j0045L526R333m104j099o652m472J3064J078n577M91n048N084N544j1489
$$ 4935 -5110 -1584 7749 3645 2546 -4106 -8578 4486 5564 -13 478 -4570 514 6058 -5431
1137e431j310N032J788P857n617r568O276J751J117J927r395M902R544o481k370
$$ -5431 -6741 -1709 79 7936 2319 -7249 -973 778 1895 3822 -5573 -671 8873 2392 22
1152B2m144k851J1669k50p402K061k397M921M213j2063o84P821R45N298o475q137
$$ 22 -4122 -6973 4696 4446 -2956 -895 -3292 1629 5842 -6221 -6905 916 1861 7159 684 -7453
1168g453R539J142k500J296p465N350R468q031m264k000m44J0747k388q233M444
$$ -7453 2086 3228 728 2024 -5441 -91 9377 1346 -2918 -4918 -5362 5385 2997 -5236 -792
1183g92l91K861L578j1754K53J0089k77J501n180o115R342J190m679K83m896N729
$$ -792 -1183 1678 5256 -6498 -6245 3844 3567 5068 -112 -6227 3115 4305 -374 -91 -4987 742
1199G42Q268j0204l829J966k72Q242k751q815N444K769J032P31r740K422J0058
$$ 742 9010 -1194 -5023 -3057 -3329 4913 2162 -6653 -1209 1560 2592 3323 -6417 -3995 6063
1214F063k793m05l952m354R775K60p590J292k476N162O800j0604l870N544P04
$$ 6063 3270 2865 -1087 -5441 4334 4594 -2996 -1704 -4180 982 7782 -2822 -6692 -1148 -444
1229d44M761m079o690P596K043j221J238r372K851J1669n641l560j176j604Q081
$$ -444 4317 238 -6452 1144 3187 1966 3204 -6168 -3317 8352 2711 -849 -2025 -3629 4452
1244D452j193p650K066q10M596N005j1127j995Q384n89K249k798o672Q026L310
$$ 4452 3259 -4391 -2325 -3135 1461 6466 -4661 -6656 1728 1139 3388 590 -6082 1944 5254
1259E254l784j003n504M213R085p488l827J229j245P283j351r569M148K606K044
$$ 5254 1470 467 -5037 -824 8261 773 -3054 -1825 -3070 4213 2862 -6707 -2559 47 2091
1274B091K280r910J59R212j236L87l289n230R290K119p066K24k575L636P459q666
$$ 2091 4371 -5539 -5380 3832 2596 2983 -306 -5536 3754 5873 -1193 -969 -3544 92 7551 -1115
1290a115l767L063j04O155k820q499N901L710o75P78p760J411R791l245j650j991
$$ -1115 -4882 -1819 -1923 4232 1412 -7087 -1186 2524 1849 2627 -5133 -3722 6069 2824 1174 -817
1306h17l715Q900O55q404J021L25L577M662r265k929N731N9L552k520p609P470
$$ -817 -4532 4368 5023 -3381 -2360 -2035 1542 6204 -3061 -5990 -259 -200 3352 832 -6777 693
1322F93M191l648k46n563K535R402m733l820J5k222P474j96r489K667K559K000
$$ 693 4884 1236 990 -4573 -2038 7364 2631 -1189 -1174 -3396 4078 3882 -5607 -2940 -381 1619
1338A619K953q598j946P403k29J170k238n803Q050L709o034q67k961L068Q141
$$ 1619 4572 -4026 -5972 1431 1202 2372 134 -5669 2381 6090 56 -811 -3772 -704 7437
1353G437o532m172K191q22N299j381r043M801L695J36J694p751p59Q690j120j147
$$ 7437 905 -3267 -1076 -1898 3401 2020 -7023 -2222 1473 1609 3303 -4448 -5207 3483 2363 1216
1369A216j399m052Q138J943p921M2p92K897O382o973m534M439J17K779j947p592
$$ 1216 -183 -4235 3903 5846 -2075 -2033 -2825 72 6454 -519 -5053 -614 -497 2282 335 -7257
1385g257O282M960k281K03n860J79Q868k616l203k2j639O745O42r151J116J678
$$ -7257 -975 3985 1704 1907 -3953 -3774 5094 2478 -725 -747 -2386 4359 5001 -4150 -3034 -1356
1401a356J686M500p034l168O470n91R18j809o126P034M814m336j13m005J114P803
$$ -1356 330 4830 -2204 -5372 1098 507 1425 -384 -6510 524 5338 1002 889 -3116 -2002 5801
1417E801m090m422K361p23N288r25r098K702L486L71K655o243k249P892r46j714
$$ 5801 1711 -2711 -350 -1073 4215 3290 -5808 -3106 380 751 3406 -2837 -5086 2806 1860 146
1433A46j312l638P219L784o361k63j665J129O507n016m711L990O37L038j664q390
$$ 146 -1166 -4804 2415 6199 -162 -425 -2090 -961 5546 530 -4181 -191 446 3484 1820 -6570
1449f570M103M419j465J477n015n30P813j818l360m8k311O332K689p360K03N37
$$ -6570 -2467 1952 487 1964 -3051 -3581 4232 2414 -946 -994 -3305 3027 5716 -1644 -1441 -904
1465i04Q59M611n881l927N853P05N64j714o347M845M472k742K09l260L63P987
$$ -904 -45 4566 -1315 -5242 611 1316 1880 166 -6181 -1336 3136 394 603 -2657 -2294 5693
1481E693l514m356J308n81N227J144q018P33K635r2K848n556k705O895J66j110
$$ 5693 2179 -2177 -869 -1450 3777 4921 -3097 -2364 271 179 3027 -2529 -5234 1661 1827 717
1497G17j105m790N402M428m764o0j277P79O356m367m864L248j95L347K76p437
$$ 717 -388 -5178 224 4652 -112 -172 -1449 -670 5686 1319 -3545 -297 -492 2855 3131 -4306
1513d306J834L724j180J324m243j965P719m12k897m23k591N144L063n581J70L98
$$ -4306 -2472 1252 72 1396 -2847 -4812 2907 2495 -402 -825 -3416 1728 4791 -790 -620 -222
1529b22N01M750m968m561M646L22J530o15o429L317M399k788K39k864m88P232
$$ -222 279 5029 61 -4500 146 468 1998 1383 -5046 -1729 2670 -118 121 -2743 -3231 4001
1545D001j546m083J082j222M256K316o735J18K337m2L271m901l789N913K95o88
$$ 4001 2455 -1628 -546 -1768 2488 4804 -1931 -1813 524 482 3753 -1148 -4937 976 1271 583
1561E83k59n078L762M212l469j47j486R2O570k746m447K020m9L016R90o706J293
$$ 583 324 -4754 -992 3220 -249 -396 -1882 -1790 4780 2034 -2413 -393 -442 2574 3564 -3142 -1849
1578a849L536j224J614m077k614O307r7j999K4l714M314L982n264J40O26K73M676
$$ -1849 1687 463 2077 -2000 -4614 1693 1596 -403 -379 -4093 221 4203 -1061 -921 -295 -22 4654
1595D654l964l978L526J17J267N71n872J639M143j952L22k723j215O197r74l199
$$ 4654 690 -3288 238 355 1622 2193 -3679 -2040 2103 151 473 -2250 -3465 2732 1758 -1441
1611a441Q36j585L458L095n539j97J957L8L074l520m005M730K18l60Pn013K938
$$ -1441 -605 -2190 1268 4363 -1176 -1373 584 622 3696 176 -3829 901 1119 759 766 -4247 -1309
1628a309L941l568M48j485j87N410j411m049J794n02K890J875n671K56L108q68
$$ -1309 2632 -936 -488 -1973 -2160 3250 1839 -2210 -416 -918 1972 3847 -1824 -1568 1540 672
1644F72J499l079l105N311J05j920O24l623K465M368m053n83N47P4M629k393m243
$$ 672 2171 -908 -4013 1298 1403 -517 107 -3516 -1051 3317 -736 -1319 -772 -698 3931 1538 -2705
1661b705K902J15J616R38n487J098L674k176Q63k482k213N578j29k773O50k153
$$ -2705 197 312 1928 2866 -2621 -1523 2151 -25 838 -1644 -3857 1721 1592 -1181 -531 -2684
1677b684K658L520m762q3J597o9L129k372l978L402P94j88Q48m770J372M231l017
$$ -2684 -26 3494 -1268 -1351 246 177 3306 934 -3044 358 1152 964 1812 -2958 -1586 2645 -372
1694c72l34j140j248N214l87l567J252q23K099K772m837o1K951q47J952k380l484
$$ -372 -706 -1846 -3094 2120 1733 -1834 -582 -1405 694 3466 -1371 -1432 1519 672 2624 244 -3240
1711c240M311N66j389J43l353J914L720l509m69J06o26M552j073l810K435m36
$$ -3240 1071 1637 248 391 -2962 -1048 2672 -837 -1306 -1200 -1826 2726 1653 -2157 278 -158
1727a58J118K021m827M59L858j860O96j865l037M562M04k312R27k277J838L311
$$ -158 960 2981 -1846 -1387 2471 611 1307 -558 -3595 967 1371 -941 -14 -2291 -453 2858
1743B858m169n69J608o40L745j202l942K845P30m23J141l782P18L579k358Kr84
$$ 2858 -1311 -1880 -272 -912 2833 1631 -2311 534 1264 841 1982 -1800 -1082 2497 139 141 -843
1760h43k451M398L54l265J654j198J064L051m365k04K723q72K604j543l636L373
$$ -843 -3294 1104 1458 -1807 -153 -1351 -287 2764 -1601 -1805 918 46 2650 1107 -2529 844
1776H44O01j477J099l402R45M111l020o01k12j335L930l53l283K086N2P48J788
$$ 844 1445 -32 1067 -2335 -1390 2721 -299 -900 -1112 -2447 1483 1130 -2153 -67 -15 733 2521
1793B521m173J62L339j405J356j015l021L179K02k212J325k379R51L796l270r49
$$ 2521 -1652 -1490 1849 444 1800 785 -2236 943 1145 -1067 258 -2121 -1170 2626 -644 -1593
1809a593J157j192L080J09l517K479M30m18J594l629K93L446j821M13o37k726
$$ -1593 -436 -1628 1452 1561 -1956 523 953 535 2129 -1500 -1207 2239 418 831 194 -2532
1825b532L505K16l071J575j002N83L308l506n46J834j293K657m12l229K807P71
$$ -2532 973 1189 -1882 -307 -1309 -726 2582 -924 -1470 364 -929 1728 1316 -1913 894 1665
1841A665j371J201l111J94L890k332k96J01k303L113j7l019J980o2L64K230l167
$$ 1665 294 1495 -1616 -1422 2468 136 -160 -59 -2362 751 734 -2285 -305 -367 -3 2227 -940
1858i40p45K737r55J411m19k687K992K35k163J125k391O00L265k641n20J133j795
$$ -940 -1685 1052 97 1508 1089 -1598 1394 1629 -534 591 -1800 -1200 2065 -576 -1096 37 -1758
1875a758K602l0l116K321L57k65K039l088k89L000j588N17k7k433K993L06k804
$$ -1758 844 814 -2302 19 376 111 2150 -938 -1227 1773 185 702 675 -1758 1235 1541 -1263
1892a263J114j124j04L421k777o60J913j855K044K40l325K842O50j117J746k409
$$ -1263 -149 -1273 -1377 2044 -733 -1393 520 -1335 709 949 -2376 466 1116 -1 1745 -664
1908f64l17K948j987l4O41k223K512M24l246J593m63l31K872k639o70K620j626
$$ -664 -981 1967 -20 -54 587 -1636 876 1300 -1946 -353 -816 -1147 1725 -914 -1584 1036 -590
1925e90J454L00k892K502P11j671J636k161o54L338k209n12J351k008K007L93
$$ -590 864 1164 -1728 774 1485 -186 1450 -711 -1365 1973 -236 -748 603 -1405 602 995
1941I95l446K021O1m19K560k267q62K738j662R49K52k480K758L19k071J631j882
$$ 995 -2451 -430 -369 -788 1772 -495 -1357 1381 -281 668 920 -1560 1198 1517 -554 1077 -805
1958h05m97K721k182l89J760j930J468N69l070K355M52r56K374j892r82K882j765
$$ -805 -1302 1419 -763 -1152 608 -1322 146 715 -2355 0 452 -504 1870 -22 -1004 1878 113
1975A13O6O55k126K298L20k459J127o09p62K631j817q29K050j595R58J008l067
$$ 113 179 834 -1292 1006 1326 -1133 -6 -615 -1377 1254 -563 -1392 658 -937 21 1029 -2038
1992b038K328Q97j328J656j591p73K795k061l31J205k038J674O87l024J538J37
$$ -2038 290 1187 -141 1515 -76 -849 1946 -115 -446 759 -1279 395 1082 -1942 -404 -267
2008b67j324K775j758p31K621j871Q97P81k627K208Q20k105K019j499j122K820
$$ -267 -1591 1184 -574 -1305 1316 -555 342 1123 -1504 704 1524 -581 1438 -61 -1183 1637
2024A637k002o41J645j504J161Q11l202J623L16j238K538j336q47K905j974J00
$$ 1637 -365 -1006 639 -865 296 1107 -2095 -472 -156 -1394 1144 -192 -1039 1866 -108 -8
2040hJ283k556K029R55k318J466r10j165K246j906k93J940j664J019R24k753J556
$$ -8 1275 -1281 748 1703 -615 851 -59 -1224 1022 -884 -1177 763 -901 118 1042 -1711 -155
2057a55O95j512K186r58j060K487j696n6J227k309J654J051k438J287k20j922
$$ -155 540 -972 1214 256 -804 1683 -13 -69 1158 -1151 503 1554 -884 403 183 -1739
2073a739K591j230j086K325j365O68Q78k485J484P96j552K069r19j042K146j469
$$ -1739 852 -378 -1464 861 -504 164 1042 -1443 41 837 -715 1354 435 -607 1539 70
2089G0o84J537k067R82J489k655J469l70j345K234j292p98K550j298L56J269k659
$$ 70 -614 923 -1144 -162 1327 -1328 141 -229 -1574 660 -632 -1430 1120 -178 178 1447 -1212
2106a212R27J580j978J711k36j343K093j534j032J707k000Q26J573k211Q81M49
$$ -1212 -285 1295 -683 1028 792 -551 1542 8 -1024 683 -1317 -491 1082 -1129 -248 201
2122B01j713J991l87j328K596j034j52J366k379Q30J292k038J523J19j856J877
$$ 201 -1512 479 92 -1236 1360 326 174 1540 -839 -9 1283 -755 768 887 -969 908
2138I08j231j307K083j542O41J401k222J103Q49j979J931k77j337K629j224o74
$$ 908 -323 -1630 453 -1089 -448 953 -1269 -166 683 -1296 635 358 -979 1650 426 -248
2154b48J700k491P36J330k002J149N96j788J650j016j505K437j188J70J789k362
$$ -248 1452 -1039 -303 1027 -975 174 770 -1018 632 -384 -1889 548 -640 -470 1319 -1043
2170a043R00J046k188J932J9j451K431j022j194J819k251L93J683k305J159O11
$$ -1043 -143 903 -1285 647 666 -785 1646 624 -570 1249 -1002 -609 1074 -1231 -72 539
2186E39k050J953p26j402K349r53j76J995k167P14Q50j758J465j1j353K050r64
$$ 539 -1511 442 -284 -1686 663 -290 -466 1529 -638 76 926 -832 633 622 -731 1319 355
2203C55j034J674j839k90K068k046Q59R86k029J656k04j411K061p03k06J900k129
$$ 355 -679 995 -844 -1134 934 -1112 -253 733 -1296 360 156 -1255 806 103 -103 1797 -332
2220c32J23J308j728R35L94j987K191k73j936J817j761K39K112k273J237R44k098
$$ -332 -209 1099 -629 306 700 -1287 904 631 -1305 512 -1249 -1010 1102 -1171 66 1010 -1088
2237a088J513J0j782K093k96o87J924k306K80J413j881Q99K37j858K683j102j539
$$ -1088 425 435 -1347 746 450 -237 1687 -619 -339 1074 -807 92 329 -1529 1154 52 -1487
2254a487J567q38k89K055j448K54J419k020J446J47j784J904k14r39J561j863
$$ -1487 80 -758 -1047 1008 -440 -186 1233 -787 659 806 -978 926 712 -227 1334 -529
2270e29o72K063j548M13P82j982K078m26j874K050r43P1J831j394k59J660j713
$$ -529 -1201 862 -686 -273 509 -1473 605 179 -1695 355 -588 -517 1314 -80 -339 1321 -392
2287c92Q00L63j960K122j67j333J450j479k79J785j822P1J190j400J263L57j995
$$ -392 408 771 -1189 933 766 -567 883 -596 -875 910 -912 -841 349 -1051 212 569 -1426
2304a426J848l95o99K196j753j21J552j858P47N04j804J738L75j770J578j202
$$ -1426 422 27 -672 1524 -229 -350 1202 -656 91 595 -1209 529 904 -866 712 -490
2320d90p96K145j705L59J104j430J266M00k110J668K19r57J988j786l11J643j621
$$ -490 -1286 859 -846 -487 617 -813 453 853 -1257 411 630 -327 1661 -125 -436 1207 -414
2337d14J80R21k105J560P86k067J439o16p83J914j477n8K139j757J007M84k448
$$ -414 -234 687 -1418 142 928 -1139 300 -316 -1099 815 -662 -720 1419 -338 669 1153 -1295
2354a295J488O06j163J668j303n54J727j696l92J235j625J627L72j894J280k49
$$ -1295 193 799 -364 1304 1 -553 1174 -522 -914 321 -1304 323 695 -1199 81 -168
2370a68o28K092j527m38K180j430L83J95j841J470N59j431J287r19q28J973j446
$$ -168 -796 1296 -231 -669 1511 81 464 659 -1182 288 847 -584 703 -216 -1044 929 -517
2387e17o57J438j315J301R35k291J027J78p21J928j498j68K060j896N02M85j859
$$ -517 -1174 264 -1051 250 1185 -1106 -79 99 -622 1306 -192 -360 1700 -196 306 791 -1068
2404a068J505L69j492J260o78o83O99q06k18J388p69R91O69k294J333L86j116
$$ -1068 437 806 -686 574 -104 -787 -88 -894 -1112 276 -493 498 1167 -1127 206 592 -524
2421e24J377o53q87K305j542m56O45j586J280Q18j808J523n25p43J763j501o50
$$ -524 853 200 -687 1618 76 -380 265 -1321 -41 777 -1031 492 -33 -776 987 -514 -1164
2438a164K066j132N95R41k380J622M74j662J298o39o89K089j243r45R29j542J293
$$ -1164 902 -230 365 1306 -1074 548 1022 -640 658 19 -670 1419 176 -769 160 -1382 -89
2455h9R18j909J405k5r46J562j226p96K247r91J10R77k174J048P90j801J354n07
$$ -89 829 -1080 325 300 -646 916 -310 -1106 1141 150 260 1237 -937 111 901 -900 454 -53
2473e3p53K216j406j244J330j232J018J117k051J063R32j296J085q02p74K077
$$ -53 -806 1410 4 -1240 90 -1142 -124 993 -1058 5 937 -359 726 -76 -850 1227
2489A227p37l37O10j507Q25P04j938R78K52r65J667j157j088J795q45M22R90j718
$$ 1227 490 153 763 -744 81 785 -1153 -175 77 -888 779 -378 -1466 329 -516 -94 896 -822
2507h22J294O27j581J261j025n96K171r76m31R02j773O60R29k045J244K46q51
$$ -822 472 1099 -482 779 -246 -842 1329 353 -78 824 -949 -289 640 -1405 -161 85 -766
2524g66J606j470r60K240o80n4J164j675R70P63j890J006m54n35J966q55j087
$$ -766 840 -630 -1590 650 -30 -84 1080 -595 375 1138 -752 254 -200 -735 1231 376 -711
2541g11J151j072L32N73j482Q61J063j244J402r94r86K068q64Q1P52j478R12R15
$$ -711 440 -632 -300 273 -1209 -348 715 -529 873 -121 -1107 961 97 178 930 -548 364 1279
2559A279k350R74q1p02J877r54p31J067q29O4J281k058Q35J176j038Q89o56j038
$$ 1279 -1071 -97 -178 -880 997 43 -688 379 -450 -386 895 -1163 -328 848 -190 699 43 -995
2577i95K172r57m89R66j190K56J004j648K59O41r90J983r53j361J576m26j79J200
$$ -995 1177 220 -269 697 -493 -237 767 -881 -622 19 -971 1012 59 -1302 274 -152 -331 869
2595H69k032J111J281j375O33m27r58K084q01j197J513j114M02Q51j722J80Q97
$$ 869 -1163 -52 1229 -146 487 60 -898 1186 385 -812 701 -413 -11 840 -882 -702 195
2612A95p51J320q07j193J760n63l01J040j593J066J376j653M39l12r02J680p60
$$ 195 -556 764 -43 -1236 524 -39 -340 700 -893 173 1549 -104 335 23 -879 801 41
2629D1j148J413o51L72P17j956N18J208j111J168l80j134J876n93p29R68r00N68
$$ 41 -1107 306 -345 27 744 -1212 -694 514 -597 571 191 -943 933 340 -389 579 -321 247
2647B47J274j811K28J43r76J514m90j210J383l48l31O73j391O64J317j010P49
$$ 247 1521 -290 -62 81 -895 619 129 -1081 302 -46 -377 296 -1095 -431 886 -124 625
2664F25l13p63J617p55r06J122r23N28R39j865K12Q60j401J544m81j399J869l10
$$ 625 312 -451 1166 411 -495 627 -296 232 1171 -694 -482 378 -1023 521 40 -1359 510 200
2682B00p96J126j346M41K048j995P70j43j010J675p55p47J191p88j40J238k015
$$ 200 -596 530 -816 -375 1673 -322 448 305 -705 970 215 -532 659 -129 -269 969 -1046
2699a046O36R00j159J366o42q01J741q43n23J020q12K72Q49q59m71J513k075J045
$$ -1046 -410 490 -669 697 55 -746 995 152 -371 649 -163 109 958 99 -372 1141 -934 111
2717A11j6q88J225R8p19N58k022M90K136j354o6P55q68J438o83q10J333q35K39
$$ 111 95 -793 432 530 -189 369 -1653 -1163 973 -381 -447 308 -560 878 195 -615 718 -117 122
2736A22J153j595J89M69j041J289p47j079J492M1q52J118j444N28J174j257P41
$$ 122 1275 -320 -131 338 -703 586 -161 -1240 252 293 -559 559 -885 -357 817 -440 301
2753C01M38j345J631m78j188J254p57K19J088j827L93Q23j581J049l8j115J589
$$ 301 739 -606 1025 547 -641 613 -144 75 1163 -664 -271 552 -1029 20 -18 -1133 456
2770D56k37o14Q45j147M07J206j175M41N06r52J162m40j351J085m76k84J447j587
$$ 456 219 -395 450 -697 -290 916 -259 182 688 -264 898 458 -893 192 -284 -568 879 -708
2788g08J25J034j473Q43L20j257J762J81j449J120q63J62J128j321J18J181j222
$$ -708 -583 451 -1022 -179 141 -1116 646 827 -622 498 -365 -203 925 -396 -278 903 -319
2805c19P21l00j208J255k30o27J420j224M8J097j465P31J64q06J733q0j413R35
$$ -319 402 102 -1106 149 -81 -708 712 -512 -464 633 -832 -101 63 -743 990 910 -503 432
2823D32n46k32J384j397K15R35j013N04k05j325J112K85q74J271r69J57J333j492
$$ 432 -114 -346 1038 -359 -144 791 -222 282 77 -1248 -136 149 -725 546 -423 -266 1067 -425
2841d25K21O11q14J158j25j070R22l00k75R87j334j28J458j488M37o5j264J628
$$ -425 -204 407 -407 751 626 -444 478 178 -97 890 -444 -572 886 -602 -165 -230 -1494 134
2859A34O5p34Q36m72j9J000j578L54J133r42R32r1j413J221l79p05J246j280J51
$$ 134 199 -535 301 -171 -190 810 -768 -414 719 -223 709 618 -795 426 47 -658 588 -692 -541
2878e41J278j403K99M80j174J043O29j217J266p07j26J091j267O5Q52n53N64r0
$$ -541 737 -666 -367 113 -1061 -18 611 -606 660 -47 -173 918 -349 -284 568 15 579 489
2896D89j350J060j91n72P56o57j25J307j017r0N10q30J184J36j181J246n14m82
$$ 489 -861 199 8 -564 192 -465 -590 717 -300 -390 120 -710 474 610 -571 675 161 -321
2914c21J117j263P6Q57q10N73O2j041J066j68j124J502p95l66J479j132J01O04
$$ -321 796 -467 -391 466 -344 229 291 -750 316 148 -976 526 -269 -635 844 -288 -187 417
2932D17q88Q86K25j121R64n3q25Q83r34j19J513j241N6M54j076J062o6j045J036
$$ 417 -471 415 640 -481 483 430 -395 488 -446 -565 948 -293 -237 217 -859 203 137 -908 128
2951A28j71L6R93j068k03P84q58N97K92r63Q35j6j062J060q27l65J381p70L5M99
$$ 128 -43 -7 986 -82 -285 499 -359 238 530 -433 402 386 -676 384 -443 -808 573 -197 -162 337
2971C37j279R84L47j248J447k31p47J596j206m08J098r59M04N23j386Q21L14j239
$$ 337 -942 42 389 -859 588 357 -390 1206 0 -408 690 -269 135 658 -728 93 407 -832
2989h32J049o84l71J485o35l67P30r14R22K62j367J220k00m46J039j023l55R28
$$ -832 217 -467 -838 647 12 -355 375 -539 383 645 -722 498 298 -148 891 -132 -487 441
3007D41m14J46K57j171O52K19r24O51m3m31J470j006m10J313j147O04L34r32O52
$$ 441 27 173 430 -741 -89 130 -794 -143 -186 -617 853 -153 -563 750 -397 207 541 -391 261
3026B61L26j060J017n09n85R90r84M6P98j023O84L79r20N89Q3n93J364r71k09
$$ 261 587 -473 544 35 -550 440 -544 -498 300 -723 -39 340 -580 9 92 -501 863 -108 -317
3045c17R06q67M45O11j352P90K22q50R82q50p05J944j291k49J000r22N20M95j353
$$ -317 589 -278 167 778 -574 216 438 -412 570 -280 -985 959 -332 -581 419 -503 17 512 -841
3064h41J053j6n87J394q30p86J317q66J23M58j069N46O52r43M65k14o05J290q09
$$ -841 212 196 -391 1003 173 -613 704 -162 -39 419 -650 -104 548 -395 70 -144 -749 541 -268
3083b68j28P31o27K83O11j397R96L52p62O75l17o44J064p71l1Q53j034M82N61
$$ -268 -396 335 -292 -9 602 -795 201 553 -209 466 149 -495 569 -202 -233 620 -414 68 629
3102F29j195N42j87n81J346o81o01J311r33K74O40j084O61M10r69J201o14p20
$$ 629 -566 -24 -211 -792 554 -127 -728 583 -350 -76 564 -520 141 551 -418 783 169 -551
3120e51J091j090K24N05q11L20Q44j428J176k03p91J318n36n31J226q35N9O23
$$ -551 540 -550 -326 179 -632 -312 532 -896 280 77 -714 604 68 -463 763 -72 -13 610
3138F10j046P51M68j097P79kj421J604q80m27Q91q06N67L74r57P35R2o37R76n69
$$ 610 -436 315 783 -314 465 463 -958 646 -234 -661 230 -576 -9 365 -592 143 235 -402 574 5
3158En65J418p05m78Q83j175O33P74j581O73M84j275J262o69m01J354j048L02
$$ 5 -560 858 153 -325 558 -617 16 790 -791 -118 366 -909 353 -316 -717 637 -411 -109
3176a09O59j137O25N10p61R04k84q65J199p96j08P09j057J38J099j432O79K99
$$ -109 550 -587 38 548 -213 691 407 -458 741 -55 -163 546 -511 -373 726 -706 -27 272
3194B72j084J154m36n83J352q71r0R24j080L84M26r09J265k23j017J183q43k35
$$ 272 -812 342 -94 -677 675 -196 -286 638 -442 -58 368 -541 724 501 -516 667 -176 -411
3212d11N58n87O7J097j406Q36K62j122R12K23q11J239r25k95J073j083K21P10
$$ -411 147 -440 -373 724 -682 154 416 -706 206 429 -382 857 -68 -363 710 -373 -152 558
3230E58j071P87N8r93J035m41p32J325r21P8R86r99L61L91j075J186l45n82Q45
$$ 558 -513 274 332 -661 374 -67 -799 526 -395 -317 669 -330 31 422 -653 533 188 -394 451
3249D51k23p50J074j020K44Q09j191Q86J31j108P42o2q96J402p91J65Q93j236
$$ 451 228 -522 552 -468 -224 585 -606 280 411 -697 45 -17 -913 489 -302 -137 756 -480
3267d80M89O15j088N53K2o13J325p10n29R54r05j7Q08r73N29N94j381J035o5q06
$$ -480 9 624 -464 89 111 -502 823 113 -416 538 -367 -384 424 -549 -20 574 -807 228 163 -643
3287f43J071l61m82J294j014J38P01j287Q40L51j310J428o60o46J008j061K2J256
$$ -643 428 67 -415 879 -135 3 704 -583 257 608 -702 726 66 -580 428 -633 -611 645
3305F45j133L65M66j079J055j31m97Q02m86j65Q30q12j1Q35j278Q14J46j065R88
$$ 645 -488 -123 343 -736 319 188 -309 493 7 -158 672 -140 -151 684 -594 220 366 -699 289
3324B89p9r38J031l85m25J065j150N81O17j261P52J54p88R66n22j29J018j110
$$ 289 210 -728 303 -82 -507 558 -592 -11 606 -655 97 251 -537 429 -93 -222 796 -314
3342c14p8J102j447M93O04j128J008N9q96R51m82m54J348j223L94Q18j248O00
$$ -314 -392 710 -737 -244 360 -768 240 299 -597 354 -128 -582 766 -457 -63 755 -493 107
3360A07N39j299J048J6q95J112q07p0P21j000L07N23j078J051M2j070J172p47
$$ 107 646 -653 395 411 -484 628 -179 -249 472 -528 -221 302 -776 275 317 -753 419 -328
3378c28k8J168j057L06N34j017N82N54j359J062r1r72R80m55l94R69p89R9Q04
$$ -328 -356 812 -245 61 595 -422 160 714 -645 417 326 -646 334 -121 -515 454 -335 -236 568
3397E68j046O30L99j186J077m90l11R56o53m16J203r67M42K51j327R83J46r45
$$ 568 -478 152 551 -635 442 -48 -359 597 -56 -472 731 -236 206 457 -870 113 259 -686
3415f86J020l81l20O90q08O5Q93p60N77L62j154P06K01p64J237r85r1O87p54k
$$ -686 334 -47 -367 323 -485 -420 473 -287 290 652 -502 204 405 -359 878 -107 -198 489 -265 -267
3435b67N43r46R05J94j053R61n03m68J145n61l30Q77p80L26N45j327J012j43n69
$$ -267 276 -670 235 429 -624 337 -166 -634 511 -50 -380 497 -283 43 588 -739 273 130 -439
3454d39R75m94k68O25p16k13P75q29O78J85r44R33n18j79J152p47k84R27q66L17
$$ -439 536 42 -226 399 -317 -530 245 -584 94 279 -665 268 -250 -429 723 -24 -308 619 -247 70
3474G0M97j195P27J20o59P32k17o33R68p14n8Q09j092P24N15j141P33Jn01N32
$$ 70 567 -628 99 219 -440 292 75 -558 410 -304 -362 447 -645 79 594 -547 186 187 -314 218
3494B18k58j23R34r59NP85j102N04M07j230J187k97n72J016p40l51J180q81K79
$$ 218 -40 -163 771 -188 -183 602 -500 4 411 -819 368 71 -501 515 -225 -576 604 -277 2
3513BO14r76N59J21n09O45n16k12P21p71M9O30j075O61M58r95R17k56q56J123
$$ 2 616 -360 199 320 -189 456 -60 -272 449 -322 -273 357 -718 -57 401 -594 323 67 -789 334
3533C34l09m57Q34n32K10O86j091L00L61p59P65k78p12J284p49l57Q29j234Q88
$$ 334 25 -432 402 -130 80 766 -325 -25 336 -423 342 64 -648 636 -113 -470 359 -875 13
3552A3N62j203Q57J63q87J138m59n97J080n70k00J008j188K76N46j064O79j26
$$ 13 575 -628 229 392 -495 643 184 -413 667 97 -103 905 -283 -7 539 -525 154 28
3570B8o10R45m43m70Q64q04M84K50n82O10L45j004P46k60n24J065j023K57M36
$$ 28 -582 363 -80 -550 314 -490 -6 244 -338 272 617 -387 359 99 -425 640 -383 -126 310
3589C10p54J49N73q04M15L12o16O72k18o47R69n24K01O22p12R3N17r19P25k32
$$ 310 -444 -295 278 -526 -111 201 -415 257 39 -608 361 -163 38 660 -52 41 558 -361 364 132
3609A32o83J233p35l20O22r54N49N46r86O17J27o50R48m18n91J304p63j46Q20
$$ 132 -551 682 -53 -373 249 -705 -156 390 -596 21 148 -502 446 28 -563 741 -22 -168 652
3628F52j073N85K70p66N03j44n97Q60j06n68O25n88J06L63o64M34N03o49O57k95
$$ 652 -421 164 434 -332 171 27 -570 290 184 -384 241 -347 -241 122 -542 -108 395 -254 403 108
3648A08m48Q45m02k8O75j168j43J245j251P01L3q17J117l58o87Q18n41J16O92
$$ 108 -340 505 103 75 750 -418 -561 684 -567 134 167 -650 467 109 -578 240 -301 -185 507
3667E07j054N68M81n83P46l03o79Q39l70m49R04r79K08N39q97L84J63p91J133
$$ 507 -547 21 502 -81 665 362 -317 522 152 -297 607 -372 -164 375 -522 -138 25 -766 367
3686C67k94n94Q32n09M6P61q60K32L58p51O43o9m27O70j88o14N82p21L36N22q58
$$ 367 73 -521 311 -198 -152 609 -251 -19 339 -412 231 162 -265 405 217 -397 185 -536 -200 322 -536
3707e36K23M06o45P74l9o00P67j85l38O31p93J51P68o97kL22q79J024k10n84O04
$$ -536 -313 93 -552 222 183 -417 350 165 -173 458 -335 -184 584 -113 -115 207 -672 352 142 -442 162
3728A62l34r4N55q75M51O69q09P73k73o92J052k35o43P87q22J40Q48q84n9M61
$$ 162 -172 -266 289 -586 -135 534 -275 498 225 -467 585 350 -293 494 -328 -188 660 -224 -283 178
3748A78q26P69l8m99Q44m22j92P74r59M90M35p33M35p4l99M43K1n98P09m88j8
$$ 178 -648 121 83 -416 428 6 -186 588 -371 119 554 -179 256 182 -217 226 247 -351 358 -130 -148
3769a48N59p86R2L82m74M87m6o94R52j26n99P80n72q4R29p57K36K67q62O08K65
$$ -148 411 -375 -283 99 -375 112 66 -628 324 198 -401 379 -193 -277 652 -105 131 398 -464 144 409
3790D09r09P74l17j23R51j133J52M32n92M60J08p11R65l3p56Q26n47l12Q63p07
$$ 409 -500 274 -43 -166 785 -348 -196 236 -356 104 212 -499 466 433 -323 503 -44 -356 507 -200
3810b00J42M56p10P10l2j037Q54l70J71M11q49o2J096j103P90l7o32Q19j34n62
$$ -200 -58 398 -312 398 366 -671 183 -187 -16 395 -454 -516 580 -523 267 230 -402 417 283 -279
3830b79Q37p20j56Q00q66j38R53p38N52j61n30N16Q0m00O61n35j10Q72r16L98
$$ -279 558 -162 -318 482 -384 -522 431 -307 245 84 -446 70 150 -250 411 -124 -234 638 -278 120
3850A20J56o09L94L06q92Q53l34k91O74n21N8L40p47O41kp17P25K20o70M00k24
$$ 120 276 -333 61 367 -525 328 -6 -297 377 -144 -86 254 -493 148 146 -571 154 374 -296 104 -120
3871a20j11Q18q81K40K70n94P81K0q11L19O6k71O97o20m14R31p17M76M14j083
$$ -120 -231 587 -294 -54 216 -378 403 423 -388 -69 -3 -274 423 -197 -611 320 -397 79 493 -590
3891e90N96L22o07P56l61j92N52p08J43J87k03L24r8r62J180j89p59J179p91J0
$$ -590 6 328 -279 477 116 -76 476 -232 -89 98 -105 219 121 -841 339 150 -609 570 -221 -211
3911b11M74o20J55O35p43N98O7q10R65m55k45P94p15k59M66m59M64J50q32P35
$$ -211 263 -357 -202 433 -310 288 355 -455 510 55 -190 604 -111 -370 96 -363 101 251 -581 154
3931A54m2n65P63m29l15R26p22k7O99q84L60L15n86P15k10l52P19p93j94O74n06
$$ 154 112 -453 310 -119 -434 492 -230 -257 442 -442 -82 233 -353 362 152 -200 519 -274 -468 206 -300
3952c00J75L99q25N02L47o71O37l8m48Q21m33k66N67o66K00K94n98L60J04m78
$$ -300 -125 274 -551 -49 298 -373 264 226 -222 599 166 -100 467 -199 1 295 -303 57 161 -317
3972c17M93o24j31Q62k59k24O38j013O84J20n01N66k07l40R46o07m05P23n10Q5
$$ -317 176 -448 -579 283 24 -200 438 -575 109 229 -272 294 87 -253 693 86 -319 404 -106 -21
3992b1M70j106O98J85p48P66l43l36P37m13j96N56p43O98K50o45M86k03l58P22
$$ -21 449 -657 41 226 -522 244 -99 -435 302 -111 -307 249 -494 204 454 -191 295 92 -266 456
4012D56m55j53N59n57J22L33p48N58j17l88N40Mn63R51o86p7O73r96O16K69p35
$$ 456 1 -152 407 -150 -28 305 -443 115 -2 -390 150 154 -409 542 -144 -221 452 -544 72 341 -394
4033c94N03J38p28Q77n71j60O56n32J42K41o41M50N76j004P03l5n59R10o26k01
$$ -394 109 247 -481 396 -175 -335 321 -211 -69 172 -469 -19 557 -447 256 221 -338 572 -54 -255
4053b55M57m62L16M63r63N43M37r58O64l15p93J352o75o7M41l31K39J18n57K10
$$ -255 202 -260 56 519 -444 99 536 -422 242 -73 -866 486 -189 -256 185 -146 93 211 -346 -136
4073a36K39n81R04q03k3O46m00J30L53j076N21M43p80L98J96o10P69j52k29O83
$$ -136 103 -478 426 -377 -400 246 -154 -24 329 -747 -226 217 -563 -165 31 -579 190 38 -191 492
4093D92p96L49J26p88Q90j91m33P15k65m85Q53n54k40O64q69O45L61q07L09O1
$$ 492 -304 45 171 -617 273 82 -351 364 99 -386 467 -87 -327 337 -532 113 474 -333 -24 37
4113C7m01P77p15j07Q67n44n7N98q27N86M2o41O78j38n68P09k57j44L91n49K33
$$ 37 -364 413 -302 -409 458 -86 -143 455 -372 214 256 -385 293 155 -413 296 39 -105 286 -263 -30
4134c0L37o35L72K39m91O97m67k30O03m18lN37j158O49K77q20O46j8o36Q65m56
$$ -30 307 -328 44 283 -208 489 22 -208 395 -23 -26 511 -647 2 279 -541 105 87 -549 316 -140
4155a40j26P46q25L27M84q40O13k48p32J004k71l05R23q88M4N20n97L33L65q81
$$ -140 -266 480 -345 -18 466 -374 239 -9 -741 263 -8 -313 610 -278 -234 286 -311 22 387 -494
4175d94N07J02p26P70k87l87Q24n74J53N16o98L61M00p77O24m8l73N54n81k53
$$ -494 13 115 -611 159 -128 -515 309 -265 -112 404 -294 67 467 -310 314 266 -107 447 -134 -387
4195c87J020r65J28O25q34L22K67o00M10P5m62Q58o05O6M14n92K89K81l93L91
$$ -387 633 -332 -204 421 -413 -91 176 -424 -14 61 -401 457 -148 -82 332 -260 29 310 -83 308
4215C08P0r15R83m31n32Q72p07K53M17o72K09M34l11K95M2q81R48k12l38R08q72
$$ 308 378 -537 446 15 -517 355 -352 -99 318 -354 -145 289 -22 273 315 -566 382 170 -168 740 -132
4236a32J64N08r02M83j4p78P35L0n32N50l55k6O57o54K48N94p21L90q2o35R12
$$ -132 32 540 -362 121 107 -671 64 94 -438 112 -243 -269 388 -266 -18 576 -145 245 163 -472 440
4257D40l18o08J073o77j84P04q07K07L13o83O42rl93P19p19K66O18q78MO89p42
$$ 440 122 -486 587 -90 -274 430 -377 -170 143 -540 102 93 -300 419 -300 -34 584 -294 -290 399 -343
4278c43K64L48p09O59l68k49P50p82J51Q22q00rO04n59M60j4n75R56o55l83J008
$$ -343 -79 269 -440 219 -149 -398 352 -430 -279 543 -257 -266 338 -221 239 225 -350 606 -49 -432 576
4299E76p16L0M39n97L01J68n74N92qn98O09l44r9N02o52K89N30r35P16K13o30
$$ 576 -140 -110 329 -268 33 201 -373 219 211 -387 222 -122 -221 281 -371 -82 448 -487 229 442 -188
4320a88M20j12j40L56l11j82N53q19M23L4k48L56J86o74N84j98k95N83n55n1Q17
$$ -188 232 120 -20 336 25 -157 396 -423 0 34 -214 142 328 -346 238 40 -255 328 -227 -278 539
4341E39r43N07K46m30L65r1m34L98l11n7Q40j004K50L79o12N51k27l85M52Jm45
$$ 539 -404 103 349 -81 284 193 -241 157 -154 -211 629 -375 -125 254 -358 193 -34 -419 33 34 -411
4362d11Q18n14k29Q71n82k9M13p53O20O3p30P94l75l02O05o04L39M22p76L23K09
$$ -411 407 -107 -336 535 -47 -76 337 -416 204 267 -463 331 -44 -346 259 -345 -6 416 -360 -37 172
4383A72m66O06k42l02P14n04j06O13m70N0K03p41O50N0q96Q75k5m08O01n54N8
$$ 172 -294 312 70 -232 482 -22 -128 485 15 65 268 -473 177 227 -669 206 181 -227 374 -180 -122
4404a22N57q13M19J05n06N35J99o86O23l47r6O69q45K58J52o11N79P1n28M21l8
$$ -122 435 -378 41 146 -360 175 374 -312 311 -36 -132 537 -308 -50 102 -509 70 141 -387 34 -4
4425dm14Q38n02p5O29n95J02J49m81P05K9q43Q33k17n47P57l22l46N43n13K58
$$ -4 -418 420 -82 -157 472 -123 -21 128 -353 352 381 -462 371 154 -393 364 42 -304 239 -274 -16
4446a6L25n61M99k68l15M81k85k41P55m17K0M83q65M93J74p40N91j23k08O93m49
$$ -16 309 -252 247 -21 -336 145 -140 -381 374 -43 -23 460 -405 88 262 -478 113 -10 -218 475 26
4467B6j71O16p49M26j09n65O83o2m05P28l42JL54m81l2K74n20L39J73n16M07k4
$$ 26 -145 471 -278 148 39 -526 157 95 -310 418 76 77 431 -50 -82 192 -328 11 184 -332 75 51
4489E1l06M56k70k58N39l61J60N85q56J54O5k43N54l35k04O04m52j24N34o29L41
$$ 51 -255 201 -69 -327 212 -149 11 596 -260 -106 -41 -284 270 -65 -269 335 -117 -241 293 -336 5
4510EK16p14P32qo52P35l99j08L48j95j37L30k84L31L59q46M56j45l55N35k04
$$ 5 221 -493 239 231 -421 314 -85 -193 155 -40 -177 153 -131 200 559 -287 169 24 -331 204 0
4531@m37P43p02M23M34o08K09K31m47M00l23k09O83k76k72M06m31J58K75o94O30
$$ 0 -437 306 -396 27 461 -147 62 293 -154 246 -77 -286 397 121 -151 255 -176 -18 257 -437 193
4552A93j02n37P18l41l48P93n47Q3L02m86K46K10k84K85O9o18M18j2k2Q2l75K10
$$ 193 91 -446 272 -69 -417 376 -171 -88 214 -272 -26 184 -100 185 254 -364 54 42 20 102 -273 -63
4574f3K04m84N13o2o03P19k88k99O66n32N7M29l88J70R3l67M44m2o37Q66l76M7
$$ -63 141 -343 170 108 -495 224 -64 -363 303 -229 -172 257 -131 39 132 -235 209 167 -470 396 20 67
4596F7J66m50r3N33n39K98L50q84P55p0m32N12j84q4M35o79L29K01m99K92j6l50
$$ 67 233 -217 -310 223 -316 -18 332 -552 203 133 -299 213 29 -55 380 -299 30 231 -268 24 8 -342
4618c42O73l43l38O40l20l6L14n45L97O3n05N81R2n41O06m57m1L35l03MK73n32
$$ -342 331 -12 -350 290 -30 -66 248 -297 100 163 -342 239 331 -210 396 -61 -102 233 -70 -66 207 -325
4640c25L58J75o20O86l90j87N80l64k35O36m74O5N27r51Q50q2m87M59p6l28M07
$$ -325 33 208 -412 274 -116 -303 277 -87 -322 314 -160 -95 432 -519 331 249 -238 221 145 -183 224
4661B24k29k91Q15q20J81K90n26N59j09m77N06k67r6N65m39K40J26p00M08K29
$$ 224 -5 -296 519 -301 -120 170 -356 203 94 -383 123 -144 -240 325 -114 126 252 -448 -40 189
4681A89p48R03k7m99M5LN2M33n16K48J62m70J92L31r55R42j93j58L48j29j40O9
$$ 189 -559 344 317 -182 -137 -134 -82 351 -165 83 245 -225 -33 298 -657 285 92 -66 282 153 13 82
4703H2j57J28J24l60K16K14o16K79q4l3N65n72R0M81m77O3L23m03L24k73j08N85
$$ 82 -75 53 177 -183 33 247 -369 -90 -174 -207 358 -214 -124 357 -120 -57 266 -137 187 -86 -194 391
4725C91m69j7O19o62R1K20n95M10L4l25L37k41j40P16m23k31O85n81L42J71o39
$$ 391 -78 -95 524 -138 -47 173 -422 -12 22 -303 34 -207 -347 369 -54 -285 400 -181 161 332 -307
4746c07L93n3k85N09l89j75O79m85j70K99k24K12K0m26L76K14o87R06m97j30O38
$$ -307 86 33 -252 257 -132 -307 372 -113 -283 16 -208 4 24 -402 -26 188 -499 407 -90 -220 418
4767D18o98N30kn17N26j16l07L57m48k04N64m04K05L55n51K58L09m05K43M7n47
$$ 418 -280 250 248 -269 257 141 -166 191 -257 -461 103 -301 -96 259 -292 -34 275 -130 113 160 -387
4788c87N95l74n5P36m18q5L56n75P6L39m73N26l08j51N05n51p7N86n27L49L00
$$ -387 208 -166 -221 515 97 12 368 -207 -131 208 -265 261 -47 -198 307 -244 -321 265 -262 87 387
4809C87p42L50K06m64N55j40j25M09o50K59L33n99N08oo62N51k88j83P57j62m11
$$ 387 -355 -5 201 -263 292 152 27 436 -214 45 378 -221 287 281 -381 170 -118 -301 456 294 -117
4830a17J60j80O6M27n50L08j06k75N11n31oO39m76nL07j82pJ92o22M55j23k3N88
$$ -117 43 -137 -71 356 -194 114 8 -267 244 -287 -293 346 -130 -135 172 -10 -17 175 -447 8 -115 -138 450
4853D50m10m80Q41m02J17J56m82K17J08q1J4K8m93M64k60J11L03k94O1L62o00
$$ 450 40 -440 401 -1 116 272 -210 7 115 34 48 76 -417 47 -213 -102 201 -93 -32 330 -270
4874b70M03r8k59L30o5n3K6K7L3M48r11K97K26n41N66p1m06Q00p65J3N18l98p1
$$ -270 133 35 -224 106 41 -12 14 41 74 522 -389 -92 134 -407 159 88 -318 482 -283 -270 248 -150 -221
4897b21O13k99j42K26l96K03q3p2M89k9n21K54k80J06P7P2j07K12l55O44n74j17
$$ -221 392 93 -49 177 -219 -16 -99 -171 318 289 -232 22 -258 -152 -75 -3 -110 102 -253 391 -183 -300
4919c00N93k12n3J70j96K0L14p26R14m64k96K57o9J19J75m53p2M87p04N76Q6m58
$$ -300 293 81 28 198 2 22 336 -390 524 60 -236 21 -48 71 246 -207 -279 208 -496 80 166 -292
4941b92N09k26p5J93k96K84J36l89K55L09n64lK05m43N15j21j95L52j99O2J20
$$ -292 217 -9 -84 109 -187 97 233 -156 99 408 -156 -159 46 -397 118 -3 -198 154 -45 17 137
4962A37m46K80Q9k83N85l22j93N28j11k84L00k84n7K44o24L05L02l91L11k20n
$$ 137 -309 -29 60 -223 362 40 -153 375 264 -20 280 -4 -61 183 -441 -136 166 -225 86 -134 -139
4983a39K99j22j60K38n42M47M06o20K47K37p40P81m36o2M47k92j37K71k46J55
$$ -139 160 38 -122 116 -426 21 427 -193 54 291 -449 332 -104 -166 281 -11 -148 123 -123 32
5003C2M6l51M71r6l50L94l37p0P66n38l3N61n38J27K05l54J73k5m33O57n61J8
$$ 32 78 -273 198 102 -248 146 -191 -261 505 -33 -66 495 -43 84 289 -65 108 83 -350 307 -254 -236
5025b36L15j63j0M30o88L76Q8j04M23k47k16N30m45j50J88m17J80M03n80N54L5
$$ -236 79 -84 -94 336 -352 24 112 8 431 184 -32 498 53 -97 91 -326 -146 257 -323 231 266
5046B66n71P13m35l83O38o05J12P04p59L25J49m16M89l41pK25k85J66M03n18M0
$$ 266 -305 408 -27 -410 228 -377 -265 439 -320 5 154 -262 227 -114 -121 104 -181 -15 388 -130 -90
5067i0J97k40K49n8m71N52k09j56N07p43L51M21n56L48J57o88O30k61j39K77q7
$$ -90 107 -133 116 58 -413 139 -70 -226 281 -462 -111 310 -246 102 259 -429 201 -60 -199 78 -9
5088ik33N23k93k40K28k76K86r1KL19j61m37O09l40j2M15j74j55L67l89M10m17
$$ -9 -242 281 -12 -252 -24 -300 -14 -105 -103 216 55 -382 227 -113 -125 290 116 -39 328 -61 349 -68
5110f8j66L67j24k16L02m04J22M05l25M8J45m14L23N7n38P65k21k93L39k56P3
$$ -68 -234 133 9 -207 95 -309 -187 218 -107 -59 86 -328 -5 52 -486 279 58 -235 104 -152 -79
5131g9L77p48M18O2k80L98k3l45M23l74J84J81j53j08j2j5K59k61k61O03o9j22
$$ -79 298 -450 -32 30 -250 148 125 -220 203 -171 13 194 41 -67 -79 -94 165 -96 -357 246 177 55
5153E5K61n22J30K36m03J81K31n65M31L7k97O00m32J1L36n44L99J46o16N38j86
$$ 55 316 -206 -76 160 -243 -62 169 -396 35 72 -225 375 -57 -46 290 -254 145 291 -325 213 27
5174B7k75K68l36K14K86l54J43J64m06K12J19K0mJ14l44J08l0M6J27k74L34J0
$$ 27 -248 20 -316 -102 184 -170 -27 137 -269 -57 62 82 78 192 -152 -44 -74 -28 99 -175 159 169
5196A69m36M04N6m56N88j05j87J40r5j57K24m7j54J21m23M12Jk74Q9R2m9K27l26
$$ 169 -267 137 193 -263 325 220 33 173 78 -79 145 98 -56 65 -358 54 55 -219 -130 -38 -87 140 -186
5219a86J4K91l60K20K97n64L55O5l02K35j2k5L90n34p3L35l12L78k13k89O18k68
$$ -186 -172 119 -241 -21 276 -288 67 132 -170 65 53 28 418 -116 -189 146 -166 212 -1 -290 328 60
5241F0k08L76m24J22J21k10J37P7k44K04M16o08K09j22k0L42j02j87L03j89O6
$$ 60 -148 228 -196 -74 47 -163 -26 51 -193 11 427 -181 28 -94 -114 228 126 -61 242 53 119
5262A19K69n25K02k7j88K34n5k80L85l99R6K61k96J29K35o35O42qk29K42J28o62
$$ 119 388 -137 65 38 -150 84 29 -251 134 -265 -169 92 -204 -75 160 -475 167 159 -70 172 300 -362
5284c62P20n59L54J05m42J92J44k78J48J43k87O67o84q3L52l50M71R8o14N75l96
$$ -362 358 -201 153 258 -184 8 152 -126 22 165 -122 545 -139 -222 130 -220 251 349 -265 310 -86
5305h6j38M37m4k66J90k05L42N9m59R7J95k24J48j71K8M45m85J27M13m04j63K25
$$ -86 -224 213 169 -97 93 -112 230 289 -170 -73 122 -102 46 -125 -97 348 -137 -10 403 -1 -164 61
5327F1q0J68J23n78N03n2m56N17k83k3K87l26lK59k37J67lk54M87k59N1J77l84
$$ 61 -19 149 272 -306 197 145 -311 206 -77 -100 187 -139 -142 117 -120 47 44 -210 277 18 69 246 -138
5350a38J84K10l41J71N8k22L58l23j14L01j11l23K72j54P5J77l22J80J72m35M69
$$ -138 46 256 -85 86 144 -78 280 -43 -157 144 33 -290 -18 -172 -97 80 -242 -62 110 -325 144
5371A44j29p6K03k8k87J22O1J60k3m69K66J30l03M10r2k34M13l14q2p0L2K9K66
$$ 144 15 -61 142 114 -173 -51 10 170 147 -322 -56 74 -229 181 89 -145 268 -46 -128 -198 -166 -137 129
5394A29l25L42j40m58O29j98j57L87l85J53L10n73M62l31j72N94j5m19L28k39
$$ 129 -196 146 6 -452 177 -21 -178 209 -176 -23 287 -286 176 -155 -327 267 252 -167 161 -78
5414g8k00N02k75K60Qm66M40rm58K36M2k12N41j58j54j4j15R8L78n72L73k65k20
$$ -78 -278 224 -51 209 217 -249 191 182 -276 -40 2 -210 331 173 19 5 -110 -12 366 -206 167 -98 -318
5437c18N57j01MJ39p90M64K32l52K63R6j66K3J48l03K62k90L0J47j92J41j65r9
$$ -318 239 138 142 281 -509 -45 187 -165 98 194 28 51 199 -104 158 -132 -102 45 -147 -6 -171 -270
5459b70K25L10n70M59k60Q6K88j27K0Kl03k3Q0p5O1j1k31M82l54o2K74j11J80
$$ -270 -45 265 -305 154 -106 -20 268 141 161 163 -140 -163 -83 -158 -97 -108 -339 143 -211 -273 1 -110 70
5482G0o3k7P2Q8l24K66j34j7L12k07n9J7k55K71q1p5m9J84j34K31k46J39K32l84
$$ 70 7 -20 52 140 -184 82 -52 -69 243 36 -23 -6 -261 10 -71 -146 -195 -11 -145 86 -160 -21 211 -173
5506a73M7M47p23N99j74k70N90l63l80M52R7j68Q9k23J30O1j2jo4p1K5J26p9J50
$$ -173 -126 321 -402 197 23 -247 343 -20 -400 52 149 -19 70 -153 -23 38 26 25 -39 -110 -85 41 -38 112
5530A12l13L28M1k60R5R9l01L70k84k07L44n2j60M09k20l0J68n58L89j4J08J36
$$ 112 -201 127 168 -92 3 102 -199 171 -113 -320 24 -28 -188 221 1 -29 139 -419 -30 -44 64 200
5552B00k48j65L50k94J67J73J8l47N31n19J69j77k62N96j85k32K56n3M7K89m97
$$ 200 -48 -213 137 -157 10 183 201 -146 385 -134 35 -142 -404 192 7 -225 31 -22 25 314 -183
5573a83L37P1k80K53k1l35L30k5p2L21q28N99K2j46j10L57k61K81k34j74K62k64
$$ -183 154 225 -55 198 177 -158 172 147 75 396 -432 167 189 43 -67 290 29 310 76 -98 164 -100
5595a00J41L40l63r5M08m37K47j57j91L25j80N1J43j57k00L38j50kL10l95K42
$$ -100 41 381 18 -77 331 -106 141 -16 -207 118 -62 -11 132 -25 -225 113 -37 -39 271 -124 118
5616A18j55K5j9m0j04L34l41K09O6j5Q0k92l74N82J50l87J75j15R2K8k00J25L47
$$ 118 -37 -12 -31 -71 -175 159 -182 27 93 78 158 -134 -508 74 224 -163 12 -103 -11 17 -183 -58 289
5639B89m19N07j39m24L21P3k48J98j56k28M68l97J40J75m94N19j13l49L12k8J17
$$ 289 -130 377 238 -186 135 208 -40 158 2 -226 242 -155 -15 160 -334 185 72 -277 35 7 124
5660A24J4j91j57L60j40K71k25l85N15k23R0J15l26j37K73LN9k0j59K05k5k89
$$ 124 138 -53 -210 150 10 281 56 -329 186 -37 53 168 -158 -295 -22 -19 40 20 -139 66 41 -248
5682b48K74j12J92K02m53M01j44l48j6K48l08L00j0m34N17j13P8K90j63o9R4k33
$$ -248 26 -86 106 308 -145 256 112 -236 -252 -4 -312 -12 -22 -456 61 -52 26 316 153 84 178 -55
5704e5K21l24J5K76M8m38M59j37l87M05l23M08k20p6K75j42l75O64k56J5J65m71
$$ -55 166 -158 -143 133 181 -257 202 65 -322 83 -240 168 -52 -128 147 5 -370 294 38 53 218 -253
5726b53M22O5m70L57L4l29N70n06L1J95k2k88K98l42L49j07j73K23l9j87K28k27
$$ -253 169 234 -236 121 155 -174 396 -110 -79 116 94 -194 104 -238 111 4 -169 54 15 -172 56 -171
5748a71P5L10l76J10M37m75J15j50o0L13J42l94M52m01K6K12k43J90J32n87K51
$$ -171 -96 214 -162 -52 385 -90 25 -125 -185 128 270 -124 328 -73 -47 165 -78 112 244 -343 -92
5769i2J96k54J79m4m5m6NQ1J86l48O8L39k19R2m7k14K55p4k26K42j53J11J81l60
$$ -92 104 -150 29 -15 -60 -106 -101 -20 166 -182 -114 225 6 98 51 -163 92 18 -208 34 -119 -8 173 -187
5793a87K40j8op1J45m41L75j36M0P7r4J45O4l13J25J06l86L87j82p4K69l9k97
$$ -187 53 35 29 -42 103 -338 37 -99 -59 18 -76 69 133 -180 -55 51 -335 52 -130 -204 65 26 -271
5816b71K34J51rk6m1L0Ol93M68k76Q7J03K3j12Q1k15K54O6l78M15j49O6K1k29
$$ -271 -37 114 105 79 38 68 74 -319 149 -127 -40 63 86 -26 55 -160 94 160 -218 197 48 114 135 -94
5840i4j29N18j68k56K75p0j15J55j34j08Q5k28J51M4K08Ml86K66p8p7LL04l47
$$ -94 -223 295 127 -129 146 76 -39 116 -18 -126 -41 -269 -118 -74 134 138 -248 18 -60 -137 -134 170 -177
5863a77K69l0K8n8r4K99j72l07J45M44n73J16K68l42M44l01l2L02m21O9L69l18
$$ -177 92 62 90 32 -62 237 65 -242 -97 347 -226 -110 158 -184 260 -41 -73 229 -192 -123 246 -72
5885g2K00Nn4K32m31r6K17j54M7K72J1j54K45l39OO6k05K54R5k44L8R4J3L2j47
$$ -72 128 133 79 311 -120 -216 1 -153 -106 166 177 23 268 -71 -65 1 -204 50 145 -99 -61 33 46 78 -69
5910f9J72J34j95o0J59l41J24q0P7J1K8K34k06o6K02J38n39M84k32j10M17l06
$$ -69 103 237 42 -18 141 -200 -76 -156 -79 -68 -40 194 -12 -78 124 262 -277 207 -25 -135 282 -24
5932b4m6K08k0J7n7j30L27m9j85k6r8r1K25p6j24N0m8J22M4K2J66j35j64O9J29
$$ -24 -70 138 118 135 78 -52 275 226 41 15 -83 -174 51 -25 -149 -99 -147 -25 19 41 207 72 -92 -23 106
5957A06j61M9j57J06K30l13R9j63K65J25p32N34r7K8K34r6j37J74J66k90O5J01
$$ 106 -55 -6 -163 -57 173 -140 -41 -204 61 186 -546 -12 -109 -81 153 57 -80 94 260 -30 35 136
5979A36j46R7k32K65k23n5j7P0K5K14J29l51p5J11j7J90k96J47L83n48O8L21j03
$$ 136 -10 87 -145 120 -103 -158 -175 -105 -80 134 263 -88 -163 -52 -69 121 -175 -28 355 -193 -125 196 93
6002I3J42l48P7p8j38Q9L3lJ45J27j08p4J79p9J1o5mo3K14p6j26K64l66L50k97
$$ 93 235 -113 -36 -114 -252 -163 -130 -133 12 139 31 -43 136 57 68 3 -1 -64 150 74 -52 212 -154 196 -101
6027a01K85R9m49L28j95o9Q4j18J37j3K09j33M2q8N2n3n9K77l21j14L39k10N2
$$ -101 184 283 -166 162 -33 -102 -18 -136 1 -12 197 64 106 18 70 17 -42 235 -86 -200 139 -71 -19
6050a9P7k03L49l3l07J53J54m35L05l15J02M42l74K02j0l43L95J29k64o6J58j70
$$ -19 58 -145 204 171 -136 17 171 -264 41 -274 -172 270 -104 98 88 -255 140 269 5 -61 97 -73
6072g3N6K21j17J27m22J55K13k88J06L32l17j7j02J45j16J30M9J02j70J59j09
$$ -73 -17 204 87 214 -208 -53 160 -128 -22 310 -7 -24 -126 19 -97 33 82 184 14 173 64
6093F4n42L94M3n6J32k7n8J62k97m6N80k68r6Kj78K74j45J83j29K5l8R5l7j81
$$ 64 -478 -84 -41 -97 35 8 -50 112 -185 -231 349 81 -15 -13 -191 83 -62 121 -8 17 -21 74 37 -144
6117a44K61k08K4K31l94L64n9k16K36k60N3j12j12L71n9Q4R0l3k41L85l44K02
$$ -144 117 -91 -67 164 -230 134 75 -141 95 -165 -112 -224 -336 35 -24 60 150 117 -124 261 -83 119
6139A19N5j17m3r1r2N7J94k57J16O7J7J0o0J50J07m74K99Q5j37N7K83n51M57j99
$$ 119 174 57 14 -77 -169 -112 82 -175 -59 8 25 35 -25 125 232 -242 57 142 5 62 345 -206 251 52
6163E2k87K50n0j24K83k86J41J9k18M60q8m24M73O4m93K26J9j60K09J75k11O0
$$ 52 -235 15 -35 -159 124 -162 -21 -2 -220 240 152 -272 201 265 -228 -2 17 -143 66 241 30 90
6185I0j40M3k62J03N3N0J12J19j06jJ05l92K38M3n0J03k03J1J44k95L04m2l04
$$ 90 -50 -7 -269 -166 -113 -63 49 168 62 61 166 -226 12 55 5 108 -95 -84 60 -235 69 27 -277
6208b77N65l41k66K68J32j3o7m0K78o0j84J98L9n02L98K9l85L31Q4m89O69n03
$$ -277 288 -53 -319 -51 81 68 1 -39 239 179 -5 193 232 -270 128 157 -228 103 187 -302 367 -136
6230a36L9K21j12l9L6k62K70K18k91L9r8J99j78j9J23K64l30K11j61k14M41j91
$$ -136 -97 124 12 -27 9 -253 17 235 -56 -17 -115 84 -94 -113 10 274 -56 155 -6 -220 221 30
6252C0j14L41k40j32R3j17P4M1OK67j10l67K33J12j30J46q0j11J82j41j05K49
$$ 30 -84 257 17 -115 -22 -139 -65 -24 -18 249 139 -228 5 117 -13 133 53 -58 124 -17 -122 127
6274A27j65k6K10k51K33k9j56K56k19N4K65m38K23J32l60P4P5j63J33N5L04j23
$$ 127 -38 -64 146 -105 128 99 -57 199 -20 34 299 -139 84 216 -144 -70 5 -158 -25 30 334 211
6296B11l58J63Lo3J04l48R5J20Q7M4L5L1l55J97J84J02j85l7j4L1j60K90j89j25
$$ 211 -147 16 19 -44 60 -288 -193 -73 14 58 93 124 -231 -34 150 252 67 30 16 47 -113 177 -12 -137
6320a37r8L51m0Ml32J73K23j20j49K25N7j44j47J50k8n5K78j0k73J2J40l50L99
$$ -137 -235 116 76 80 -252 -79 144 24 -125 100 157 13 -134 16 -12 -67 211 201 -72 -60 80 -270 129
6343A29l54J27j14J57O9K8k51J21o8J11L61M1l37J78l61M1J59L9l07J81J14j73
$$ 129 -225 -98 -212 -55 14 42 -209 -88 -156 -45 316 357 20 198 -163 -122 37 76 -231 -50 64 -109
6365a09J53m05L57o4m32P85m19K96J16k86j64J96l7K00j36k15M26l62j92M23N8
$$ -109 44 -361 -4 -68 -500 285 -134 162 278 -8 -172 24 -13 187 51 -164 262 -100 -292 131 189
6386A89l33n0N2O8N6n1J38j11m9j66L30m9J47k34M71l85k17Q5M11j97j44K47l22
$$ 189 -144 -194 -142 -74 -18 -69 69 -42 -91 -257 73 24 171 -63 408 23 -194 -109 302 105 -39 208 -114
6409a14J01j8n1K3J76k64Q4q8J09J95m29L51K26m88L57r7J3j2k87J22K00l27K33
$$ -114 -13 -31 -82 -59 117 -147 -63 -151 -42 153 -276 75 301 -187 170 73 86 74 -213 -91 109 -218 15
6432A5L2j86J75k34k41O65m26K83J33o16M61r5m8M2J97m62L36j49K19J3k2j68
$$ 15 47 -139 36 -198 -439 226 -200 83 216 -400 61 -34 -82 -40 157 -305 31 -118 101 114 92 -76
6454g6K36k99K7O8p1J52J06j04J18j93j5J58P9l46K01Q0k22J79k24L01l3k41j48
$$ -76 160 -139 -112 -44 -115 37 143 39 157 -36 -51 107 186 -160 41 121 -101 78 -146 155 122 -119 -267
6477b67J13r4K63k95K05P5j20J26J31Rj12l29N5M01j36P0j40j2J26j61K4K9L5
$$ -267 -154 -248 15 -280 -75 0 -120 6 137 146 34 -295 -240 161 25 95 -45 -57 69 -92 -68 -39 -4
6500dn8J13j07l9J65l86M66j06n5m6MK66k53j64M10j38j24J26o6j39J48P9j16
$$ -4 -62 51 -56 -95 70 -316 150 44 -11 -57 -53 213 -40 -204 206 68 -56 70 4 -135 13 92 -24
6523b4K20l10M9O8j5j07K99k85m6L82n72N57j09k31N5m9J66J93j56j46J16k33
$$ -24 196 -114 -65 3 -12 -119 180 -105 -151 231 -341 216 107 -124 -69 -118 48 241 85 -61 55 -178
6545a78L23p5k9J5q9l1K30k61J12J74j70m2L22j85J59l11P7K53m26N1K01j52J6
$$ -178 145 70 41 56 -33 -64 166 -95 17 191 21 -21 301 116 275 -36 41 294 -132 -81 120 -32 -16
6568a6J35j87j67K81j11n6K15k38K79k45K32j6l28N2J94k67K17R8j78K52o2m80
$$ -16 119 -68 -235 46 -65 -121 94 -144 135 -110 122 106 -222 -170 24 -243 -26 72 -106 146 84 -396
6590c96J42K13l3J48k52L72j50j79o8M86l81j16L12J83k62N3K8m8k88Q4J14q4
$$ -396 -254 -41 -74 74 -178 194 44 -135 -203 283 -98 -214 98 281 19 72 100 52 -236 -152 -38 -122
6612a22K56J90m58K24j75J35M0j85K53k0j45K9J53l10K71n8J09k62j47O9L15k19
$$ -122 134 324 -134 90 -85 50 90 -95 158 138 -7 22 175 -135 136 78 187 -75 -222 -153 162 -57
6634e7j44L70j36kJ23j51L3ok73J98K48k90K47p0O0Pk06J03K17l39J60j68J93
$$ -57 -201 169 33 31 154 3 36 30 -243 -45 203 -87 160 90 150 157 -49 54 271 -68 92 -76 117
6657A17j38n1j64L06j%R2q0J48k8l07L4J33n8J49j92J33p2j42K0K14l24J90J86
$$ 117 -21 -72 -236 70 69 69 161 81 229 201 -106 -72 61 3 152 -40 93 21 -121 -101 113 -211 -21 165
6681A65k28m6Q3N4M1k40J69K36l48K3K35j09J82j11j15K85m23O8J63k82J80j2
$$ 165 -63 -109 -26 28 69 -171 -2 234 -114 -91 144 35 217 106 -9 276 -147 -79 84 -198 -18 -30
6703c0M7K18k08L4J4j71K98j48j09p4K69l1J29j97r7J72Q0l40K69n4m7K64l06
$$ -30 17 235 27 61 75 -96 202 54 -55 -129 140 109 238 41 -56 116 196 -144 125 71 24 288 -18
6726a8j44J46k89M64k11r3K68k69K88l2j03l1J59l31J38R4o4L14qk82J93m02K52
$$ -18 -162 -16 -305 159 -52 -145 123 -146 142 110 7 -24 135 -196 -58 36 -28 286 278 -4 189 -213 39
6749C9l4m7J26j25L9n5J21o1J28J09k87J88j25l5J28j02J79j01l78L01o2J0l6
$$ 39 5 -42 84 -41 -2 -57 64 3 131 240 -47 141 16 -19 109 7 186 85 -293 8 -54 -44 -80
6772h0J53j17n3J62k72J01K7J20k7J08p1n8j7oJ19Q1R4m03jK25j98j01L99m45
$$ -80 73 -44 -97 65 -207 -106 -79 41 14 122 51 -7 -24 -30 89 170 264 -139 -140 85 -113 -214 185 -260
6796b60K40J00j67K21L5j97J64k37J34J69k66Q2Q3j12J20K2l3j59m1K45l41k8
$$ -260 -20 80 -87 134 169 -28 136 -101 33 202 -64 18 101 -11 109 131 98 -61 -102 143 -198 -226
6818b26r0N84j49J54l08l3PJ23J39j76N1j88K90k98J44r4J43j24J97k48K86j79
$$ -226 -316 268 119 273 -35 -68 -61 62 201 25 76 -112 178 -120 24 -70 73 -51 146 -102 184 5
6840Ej27K67k00j7r4L9L70j06K7j01o3K08j29m08M43N3q0r5L3k09J47J01l84L75
$$ 5 -122 145 -55 -72 -166 -127 243 137 164 63 0 208 79 -329 114 167 87 -8 25 -184 -37 64 -320 55
6864E5l40L9N19l76r5J01j19L80j68o2J38q9j87K37L6n5j05j6J35J72m52K38j09
$$ 55 -285 -246 273 -103 -198 -97 -216 164 -4 -66 72 -17 -204 33 69 14 -91 -107 28 200 -252 -14 -123
6887a23J48Q2k77J84J56k03ll1p6L23j42k81J25%J30Q0j43p0J18j67J94O5l79
$$ -123 25 107 -170 14 170 -33 -36 -67 -143 180 38 -243 -118 -118 12 92 -51 -121 -3 -170 24 89 -290
6910b90K49P4j55J88m5p1J44k02K44k4j37R9j71J11N6j40N7K76m85J89pq2j09
$$ -290 -41 33 -122 66 21 -50 94 -108 136 112 -25 74 -97 14 70 -70 -13 263 -222 -33 -40 -122 -231
6933b31K12M7k14L32j71J35o9p9r4K26Qp8m01M97j37k66J33K32r9P3J9P8k51J79
$$ -231 -19 28 -186 146 -25 110 41 -38 -132 94 102 24 -377 120 -17 -283 -150 82 -17 56 75 153 -98 81
6957H1q1K26k63n7O8jN8po5m3lK49l41q7L39l7j11k0L9r6M4Q0p5K49j66j0M2r8
$$ 81 0 226 -37 -94 -26 -27 31 24 -41 -84 -87 162 -179 -266 73 36 -75 -95 -56 -152 -108 -28 -103 146 -20 -30 12 -86
6985h6J72P8k70L8K16k71K38n7m9j2j45L9P3O7J23k50J91o5J72l32N44k47k86
$$ -86 86 164 -106 -68 148 -123 115 58 9 -3 -148 -109 -36 31 154 -96 95 30 202 -130 414 167 -119
7008a19L57j53j60lP9K35k37n3o8j4M2J9q4J27P2j42J68m6MK17j99j6J99m28L01
$$ -119 238 85 -75 -78 1 236 -1 -54 -122 -136 -94 -75 -159 -32 40 -102 66 20 24 241 42 26 225 -203 98
7033I8k06J64J59j41r1J20k39J68L3j21K4J82j90j48K70l69M37k73J07K17l40
$$ 98 -108 56 215 74 -17 103 -136 32 65 -56 -32 150 -40 -188 82 -287 150 -123 -16 201 -139
7054a39J10R5j55L8K51j25K3K05m23J45J10k08L29l52J49n7J68k60J83j23P6R1
$$ -139 -29 66 -89 -51 200 75 98 303 -120 25 135 -73 256 -96 53 -4 164 -96 87 -36 40 131
7076A31k52K82Q4k99J2k02K61K86l86j18Q4j10J26K65l7l9k9j98K02K5M5J7m7
$$ 131 -121 161 245 -54 -42 -244 17 303 -83 -201 -117 -227 -101 164 127 88 59 -139 63 88 133 150 103
7099A03q0j65rJ30j2J09k58J28m3k9n0R4Lj72J61J34j53Q3J25r5J07j33j41Q0
$$ 103 23 -142 -151 -21 -33 76 -182 -54 -97 -126 -176 -82 -79 -251 -90 44 -109 -26 99 4 111 -22 -163 -83
7123h3l8J61j42J41j02m0J78O8k66J71l20J99K8oO5J26J7l04J55J02j90J26k27
$$ -83 -121 40 -102 39 -63 -103 75 143 -123 48 -272 -73 -45 -51 14 140 157 -147 8 110 -80 46 -181
7146a81J9K79j7l3N3j29j3j20LJO4P0l4l99O83L6k27p4n2J50J45j92ll17K13K04
$$ -181 -162 117 100 67 120 -9 -22 -142 -139 -138 -74 -4 -38 -437 246 282 55 -19 -71 79 224 32 29 -288 -75 129
7172A29k4j47j91J57J53j34J58j6o6M7n99N08q7l4J76j95K56J35k46R5m4Q1l20
$$ 129 105 -42 -233 -76 77 -57 101 85 19 66 -533 -25 -112 -146 30 -165 91 226 -20 75 31 112 -208
7195b08K33k45J73r3M49j60l57L46k06k07K17Np8J15k76L92n1j37J41Jj9o6k8
$$ -208 25 -220 -47 -140 309 149 -208 138 -68 -275 -58 -53 -131 -16 -292 100 49 -88 53 54 35 -31 -59
7218e9j10J42M8k04lK47J49k02J18p1J02j34q4P6pK9P2j52r3J91j18r9j3R5Q4
$$ -59 -169 -27 21 -183 -186 61 210 8 126 55 157 23 -61 15 8 37 109 -43 -136 55 -63 -162 -175 -80 4
7243Dkoo4J10J23j30p9J07j16M82l70r8K96m43N9J90j34j98K16L2J4L4o7j34J89
$$ 4 2 -4 -68 42 165 35 -44 63 -53 429 59 -39 257 -186 -127 63 -71 -269 -53 -21 -7 27 -40 -174 15
7268A5l1J09j17K60k42K51l45J76N9j71ql1J50K8k43K69k35P2j19k42M39m9n8
$$ 15 -16 93 -24 236 -6 245 -100 76 135 -36 -44 -75 75 103 -140 129 -106 -34 -153 -395 44 -5 -63
7291f3mJ31k48M08k08K5L6M4k20J56j06K09l2M3j51jN2j20N2J6K46k58Q0J20m6
$$ -63 -67 64 -184 224 16 41 77 121 -99 57 -49 160 128 171 20 19 71 -49 3 19 265 7 87 207 161
7316A61j70Qk6K38j42J11j7n2k79J84L1K9KJ29m1l70J8J95K7R8j31Q3j56P9K04
$$ 161 -9 -1 -27 211 69 180 163 111 -168 16 47 76 78 207 166 -204 -186 9 36 134 3 86 -70 9 213
7341B13k53K25k97l1M08j07j99k3r8K13l2n4J27j76M5J19m7j74K24j14P2Q3O3
$$ 213 -40 185 -112 -143 265 158 -41 -64 -162 51 19 -35 92 -84 -39 80 33 -141 83 -31 41 124 187
7364A87k33J82j05J80k01nO5l06K69k70j4K27J09j36L9J08j44oK45r8K0p9j9q4
$$ 187 -46 136 31 211 10 5 70 -236 33 -237 -251 -24 85 -51 -12 96 -48 -54 191 93 113 34 15 -69
7388f9J07j64J43n9Q6m6n9K3N7l00L11k09K62j09QJ8j09K38o6r8R2J00k55O4K89
$$ -69 38 -126 17 -42 44 -2 -61 -38 19 -281 30 -179 83 -26 -18 0 -109 129 63 -35 57 157 -98 -34 255
7413B55k57J97j08n6o4j22L11j93K96l10K22r3j08QJ74m25N09k72O5j20O5K25
$$ 255 -2 195 87 31 -33 -155 156 -37 259 -51 171 78 -30 -22 152 -273 236 -36 29 -91 -26 199
7435A99k05j77J86k62L65m7J71j77o7n0K29j84l8K45k96O9J61k7j7j69L28l53
$$ 199 -6 -183 3 -259 106 59 230 53 -14 -64 165 -19 -57 188 -108 -39 122 95 78 -91 237 -116
7457a16P9K0j37J4P4J22k05M30k78K09k35M8k10M77l30J95l1K6j69J30p6j07q
$$ -116 -37 -17 -154 -140 -66 56 -149 281 3 212 -23 25 -185 292 -38 157 126 152 -17 113 37 -70 -78
7480g8j05L94j16p8l1J40rKm35L48k01L2L41p7L4j23J02n8K3M0k60K33L2j63L2
$$ -78 -183 211 95 17 -14 126 117 119 -316 32 -169 -137 204 127 161 38 140 82 105 145 -115 118 150 -13 19
7505A9k19Q6K2p1K76mr3J21j37KQ5j12k51L39P9j23j7Q2K1j68m3K09l46K08K3
$$ 19 -200 -114 -92 -163 113 109 16 137 0 2 87 -25 -276 63 142 19 2 84 105 -63 -106 103 -243 -35 -12
7530a2k98M51j18PP3o8J27j52O1k8J48j69j25L02m10J11j5P4P0k74K07QL0j07
$$ -12 -310 141 23 30 103 35 162 10 71 43 191 22 -103 199 -211 -100 -115 -41 29 -245 -38 -30 0 -107
7554a07J62O7q0r2K33j47n1r6J76r1J86q4Nl74L33m3J3R9r0J50j50J18k65nk9
$$ -107 55 122 42 -50 183 36 -15 -111 65 -26 160 76 81 -293 40 -3 10 109 19 169 19 137 -128 -133 -162
7579a62K44l18Q9L94k6j49P7l0p1j3PJ7No6M2J6k21K49rp8j17L9K23j88j11J90
$$ -162 82 -236 -147 247 221 72 149 119 48 35 42 59 64 -2 40 56 -165 84 75 -3 -120 -81 142 -46 -157 33
7605C3j54K8J90l48J63l3K45j83R1k31R2k4K20J06k46j2M7M6J37k71K51j37j10
$$ 33 -121 -93 97 -251 -88 -121 124 -59 32 -199 -107 -131 89 195 -51 -63 -16 30 167 -104 147 10 -100
7628a00K4L25l09O7J70j88R9Lk23K18N5j95K4r3K14m12J35L23j21j68J98n4j27
$$ -100 -76 249 -60 7 177 -11 88 91 -132 86 141 -54 -30 -123 91 -321 -186 137 16 -152 46 -8 -135
7651a35J82M8rj35K45n5k21K50k58j05K77J14j18k78K77j37M3m7j5j26j09K18
$$ -135 47 95 86 -49 196 141 -80 170 -88 -193 84 198 80 -198 79 -58 -15 -62 -77 -203 -312 -94
7673i4K42j63k6P7omN2P4k2j42Q9q2oJ43j24p2m9K44k47J30JJ27J24k44r0J7n8
$$ -94 148 -15 -41 36 30 26 78 152 130 -12 77 -5 -11 132 8 -64 -113 131 -116 14 15 142 266 22 -68 -51 -109
7700a09M4L57j97j01J75m8k1K3m0j26J81k68J07J01j15j03J37p3J40j34p3L5j44
$$ -109 -65 292 95 -6 169 121 100 123 83 -43 138 -130 -23 78 -37 -140 -3 -76 64 -70 -143 -108 -252
7723b52K11R2q8k3J86k72K60l08J13j21L86j55q6J43k3M8O9j76J14j25R7q7L49
$$ -252 -41 51 -37 -60 126 -146 114 -194 -81 -202 184 29 -57 86 63 111 180 4 118 -7 90 3 352
7746C52j85k90qM3J17p7J35P6l00O2Q1Mj78J59P6n8J00k53J51N0O7o0l7k17K30
$$ 352 167 -123 -131 -88 29 -48 87 163 -137 -75 6 10 -168 -9 67 9 109 -144 7 57 124 64 27 -190 40
7771D0J80r0j14j6j00J29o2j67M00p6j50Q5Q0k27J13R6j7k9k45K46j0j87J87p0
$$ 40 220 130 16 0 -100 29 -33 -200 200 124 -26 59 139 -88 25 121 104 75 -170 76 66 -121 66 -4
7795dj09J81P2k93Q2J1mJ65k51M8L3J06j69K33K4R8j70j60K20M3l9J7j72Q9m0
$$ -4 -113 68 140 -153 -71 -60 -64 101 -150 -102 -69 37 -132 101 125 223 53 -107 113 156 117 134 -38 51 11
7820A1j64K12l5j32Q9O3j12J60J0j16K56j94l4J65k04R2L3J38m24q9M01j74J50
$$ 11 -153 59 24 -108 -19 44 -68 92 102 -14 242 48 14 179 -25 67 100 238 -186 -275 126 -48 102
7843A02j96J50k45K16k17J48K03l17K57n1J40j42J89k45J51j83L0J18j99J87m4
$$ 102 -94 56 -189 27 -190 -42 161 -156 101 50 190 48 237 -8 143 -40 -10 108 -91 96 52
7864E2k41K32J08j7j79R4n4j37K66j10Q5j35mK6N4J87j18j83K18P6k41J07k16
$$ 52 -189 43 151 134 -45 49 -5 -142 124 14 99 -36 -40 -14 40 227 109 -74 144 220 -21 86 -130
7887a30R9O1J1r4P0j26K4j60K40NO9L5J40k14j45R1r6K9L33Pl05J48k2O1O2m6
$$ -130 -31 30 41 -53 17 -109 -85 -245 -5 0 69 104 244 30 -115 -24 -120 -91 242 249 -56 92 70 131 193 147
7913A47j62R7J07k71P0L03k59q8L08q7j92J57k23N7K49j99j00R4N4L8j94J2J26
$$ 147 -15 82 189 -82 -12 291 32 -56 252 165 -27 130 -93 -36 213 14 -86 8 62 100 -94 -82 44
7936D4k89L77k33K57J34j07j72L2P9k25L56l60K54rr8J49j36o4o3M4o3P2P9k36
$$ 44 -245 132 -101 156 290 183 11 43 122 -103 253 -107 147 138 40 189 53 -11 -74 -30 -93 -21 58 -178
7960a78J79nJ65K5m32P7M01m18J24j0m3kJ53k41r1J19K61k71K01j78J63k9R4J08
$$ -178 1 -4 161 186 -246 -169 232 -186 -62 -72 -115 -117 36 -205 -296 -177 84 -187 14 -164 -1 -30 64 172
7984A72k21P1Oj01L69l43Q2N5k53K21Mn7k32K34k74L09j33J72l36J10J98N4j88
$$ 172 -49 22 28 -73 296 -47 35 90 -163 58 62 5 -227 7 -267 42 -91 81 -255 -145 53 107 -81
8007h1K28k30K34k48O0PO2j04K6J37Mj52m8K01j80K78k25J4k4m2R8k47J6J23J51
$$ -81 147 -83 151 -97 -37 -30 32 -72 -46 91 95 -57 -105 96 -84 194 -31 -17 -41 -83 15 -232 -216 -93 58
8032E8j09l6J00J9m9r6n1K88l2k09J14k14K72k39J26J44j25r9m9QL15o3k0p0N0
$$ 58 -51 -87 13 32 -17 -113 -164 124 92 -117 -3 -217 55 -184 -58 86 -39 -138 -187 -179 136 73 53 -17 33
8057C3N4k21J94M9k31L05k16M6j4O8lJ5j60l0J59Pq1mj24J92j33qk1L19l07J48
$$ 33 87 -134 60 109 -122 183 -33 13 -1 67 64 79 -81 -111 48 55 -26 -30 -154 38 -95 -103 -124 195 -112 36
8083C6j89L35m60K32k5o6m8n6O09n08j8J99j03J49Q3j77K59j63j81J41L9l08M04
$$ 36 -153 182 -278 -46 -71 -137 -185 -241 368 -140 -158 41 -62 87 170 -7 252 89 -92 49 88 -220 184
8106A84l29P6J33j76M1Q9M4j15K61l04P4o8J12j32M0J83j54j47K62k16k4K68k13
$$ 184 -145 -69 64 -112 -71 18 62 -53 208 -96 -22 -90 22 -110 -70 113 -41 -188 74 -142 -166 102 -111
8129a11P9j03mK82J8j15p1P4q8K45j44j67L4K4K49j84k1L73m19J55mj34j16O1
$$ -111 -32 -135 -139 143 161 46 -25 49 -39 206 62 -105 -71 -47 202 18 -3 370 -49 106 102 -32 -148 -87
8153h7J89k26O3j6O4m7j07J87L7J92k30p9R4J24j81L07q1N9j10k13J68k00LK14
$$ -87 102 -124 -61 -77 -13 -60 -167 20 57 249 19 -60 34 158 -23 284 203 262 152 -61 107 -93 -90 124
8177A24j90m8n5K26J09j75J49k26J42K09p6k47J85j29
$$ 124 -66 -114 -169 57 166 -9 140 -86 56 265 189 -58 127 -2
8191b
$$ Imaginary data points
##PAGE= N=2
##DATA TABLE= (X++(I..I)), XYDATA
0@%%%%%%%%%%Qj6J6k4L2m0M8n6P2q8J04j28J52j76K09k48K88l31L86m46N11n84
$$ 0 0 0 0 0 0 0 0 0 0 0 8 -8 8 -16 16 -24 24 -32 40 -48 56 -72 80 -96 113 -135 153 -178 208 -238 273 -311
32c11O63p51Q48r56J076j209J353j508J680j871K077k301K548k817L111l431L781
$$ -311 352 -399 449 -507 569 -640 713 -795 885 -986 1091 -1210 1338 -1479 1632 -1799 1982
49A982m165M589n055N570o144O784p502Q313r243J0316j1570J3063j4870J7115
$$ 1982 -2183 2406 -2649 2921 -3223 3561 -3941 4372 -4871 5445 -6125 6938 -7932 9183
63I183j9989K3818k9206L7399n1495Q2266k69103K09142M07749m85934n2606K97373
$$ 9183 -10806 13012 -16194 21205 -30290 51976 -217127 -7985 399764 -86170 -138776 158597
75A58597m3802l16444J32684J97893k11028j01953M06993M0190l84008n8710K23514
$$ 158597 114795 -201649 -68965 128928 -82100 -184053 222940 263130 -120878 -179588 43926
86D3926J2235j23103l2185J51356P5183p5588n0823o6485q0663R9237J20126J2559
$$ 43926 56161 -66942 -99127 52229 127412 51824 1001 -65484 -146147 -46910 73216 85775
98H5775o4492p7523O8178R3635j26414j19183O0976J38183Q5716r5023j10815
$$ 85775 21283 -56240 11938 105573 -20841 -140024 -79048 59135 144851 49828 -60987
109f0987N3698Q29m7117M0980j798j5966Q1981O5763p5951j80704M549K14255
$$ -60987 -7289 -6460 -53577 -12597 -14395 -30361 51620 117383 41432 -139272 -134723 79532
121G9532J116j38538N5304N6114l2961J5897l7352r7031Q564J42860Q9890j33828
$$ 79532 80648 -57890 -2586 53528 20567 36464 -888 -97919 -89355 53505 143395 9567
133I567j00315J06508R938p5630L4274m967j4385R9226L5631j07067j06233N7356
$$ 9567 -90748 15760 25698 -49932 -15658 -20625 -35010 64216 99847 -7220 -113453 -56097
145e6097J41172m6762j05304O7940N3634k5372n810n4088m7087M2176P9240M8912
$$ -56097 85075 38313 -66991 949 54583 29211 23401 -30687 -77774 -35598 43642 92554
157I2554q7302r7707Q7809O9641p5347n3617J9834P8736M5701o6095m3105q34
$$ 92554 5252 -92455 -4646 64995 -10352 -63969 -44135 34601 80302 14207 -28898 -29732
169b9732l615O2657J7822p5471n565N8264M2768l6904j18363Q588J25226J1859
$$ -29732 -33347 29310 47132 -28339 -33904 24360 67128 30224 -88139 -79551 45675 57534
181E7534n4099k7839k046M1688M792l0508r864k4503N1175R0742o9688j00476
$$ 57534 3435 -24404 -26450 15238 20030 -10478 -20342 -44845 6330 97072 27384 -73092
193g3092L4783O9127J5652n9611l5888O3653K2569k4695l861n5523j3585Q9969
$$ -73092 -38309 30818 46470 -13141 -49029 14624 37193 12498 8637 -46886 -60471 29498
205B9498K8482n4500n1300J6919Q1849j3541q3169J1152L7784K5262K3832n3661
$$ 29498 57980 3480 -47820 -30901 50948 37407 -45762 -34610 3174 28436 52268 -1393
217a393m8208L2805M1171J6642n0309n1935O5286N0003m0545l8519k3486L2530
$$ -1393 -49601 -16796 24375 41017 -9292 -61227 4059 54062 13517 -25002 -48488 -15958
229a5958O3771k2851m6420p216J5081N4857n918p3337L326M6953K8238n967o8432
$$ -15958 47813 24962 -21458 -28674 -13593 41264 35346 -37991 -34665 12288 40526 34559 -33873
242c3873j3968O5189J5438j9097l1949k6570N2360L4917m1441l0402o605M2194
$$ -33873 -47841 17348 32786 13689 -18260 -44830 7530 42447 1006 -29396 -36001 6193
254F193N1661m8234n0827K0449K7242L0825j6483n7629J7128M5186P412k2701
$$ 6193 57854 9620 -41207 -20758 6484 37309 20826 -36803 -19675 25511 32923 10222
266A0222n8204P870P5620l03l8517j8687p523M1133J9437m1820k0070R812M6486
$$ 10222 -47982 -40112 35508 35205 -3312 -21999 -29522 11611 31048 -10772 -30842 -21030 25456
279B5456L7010o8480n0965M8661L3425j132k4449k7793L0644K6259j3884j8592
$$ 25456 62466 -6014 -56979 -8318 25107 23975 -474 -28267 2377 28636 14752 -3840
291c840m4766J0555Q0169J797n6223j9921J8602M3738j4004n5358J8802L5815
$$ -3840 -48606 -38051 42118 43915 -12308 -32229 -13627 30111 16107 -39251 -20449 15366
303A5366J1778J1502m3499m0450L1688L2404O636l2458l0289N3939L3380n2605
$$ 15366 27144 38646 -4853 -45303 -13615 18789 25425 -7033 -37322 16617 49997 -2608
315b608l6251l377L4671N0380k1122l4882M339J870K2116q36m9814N828N2149
$$ -2608 -38859 -42236 -7565 42815 21693 -13189 -8850 -6980 15136 14300 -35514 -29686 22463
328B2463K9352j8503o8922p788N9444l532k3258N475l685K6614J9405m1862l7571
$$ 22463 51815 33312 -35610 -43398 16046 12514 -10744 -5269 -8954 17660 37065 -4797 -42368
341d2368j339M6906M7953l7327l6711K4552J0244J827j9180m0259L1556N4777
$$ -42368 -43707 3199 51152 13825 -22886 1666 11910 13737 -5443 -45702 -14146 40631
353D0631j738k5707l8958o916L7970R99j5397k576L431M4577N698p0461k1682
$$ 40631 38893 13186 -25772 -32688 5282 6281 -9116 -11692 -8261 36316 42014 -28447 -50129
366e0129L2774L0380J9523k6295j7294K3576R59o885k0723l5787L9907O0657j4124
$$ -50129 -17355 13025 32548 6253 -11041 12535 13494 6609 -14114 -49901 -9994 50663 36539
379C6539l9309k7866J2679L2443k2873j6657K4074Q857K4047M328o2373k4130
$$ 36539 -2770 -30636 -17957 14486 -8387 -25044 -970 7887 31934 36262 -26111 -50241
391e0241L8868L5073K280l5605J816L9235j5926k7564r373j8275L5293N1099j8504
$$ -50241 -11373 23700 25980 -9625 -7809 31426 15500 -12064 -21437 -39712 -4419 46680 28176
404B8176l8255j5825J7693K5213l1015j9832L6174K0971J1063j2142n2617n338
$$ 28176 -10079 -25904 -8211 17002 -14013 -33845 2329 23300 34363 22221 -30396 -35734
416c5734L5209J5147R61k2983J264L9287j2926m0712j3117J171M2448L1378l1942
$$ -35734 -525 14622 15583 -7400 -6136 33151 20225 -20487 -33604 -32433 10015 41393 9451
429I451k1324K153Q402J3055k8425j7594L9726K5440L172k1367m6977R388L6627
$$ 9451 -11873 -9720 -1318 11737 -16688 -34282 5444 30884 34056 12689 -34288 -24900 11727
442A1727l939q338p244R493L1572j9132m0015o444Q070L9026K1479l8128j1820
$$ 11727 7788 -550 -7794 1699 33271 14139 -25876 -32320 -24250 14776 36255 -1873 -13693
455a3693J8211K311k519k5225p919M0942K0427o444k1365l6937J6015L3129j6989
$$ -13693 4518 6829 4310 -20915 -28834 12108 32535 26091 4726 -32211 -16196 16933 -56
468e6j2433O225J5669K2418k5464l7482M783J3718K8479J2152l5788l456K5317
$$ -56 -12489 -6264 9405 31823 6359 -31123 -26340 -12622 15857 28009 -7779 -11235 14082
481A4082k798j1798k3479p45M4806J2376k0209j6467j9797J7358K2371k3457r091
$$ 14082 11284 -514 -23993 -24738 20068 32444 12235 -4232 -24029 -6671 15700 -7757 -16848
494a6848J3411J4886J8283k7363l6218J5160K0290J4364j19k8325Q711K4958j3005
$$ -16848 -3437 11449 29732 2369 -33849 -18689 1601 15965 15846 -12479 -3768 21190 8185
507H185j4641j4366J556L9712P262k5665j2621p070J9146J2995k9987l268K3458
$$ 8185 -6456 -20822 -19266 20446 27708 2043 -10578 -17648 1498 14493 -15494 -18762 4696
520D696R602P646k3782k7837K0555J8909L428n721k1519J4527K4176j9998j7451
$$ 4696 14298 21944 -1838 -29675 -9120 9789 13217 7496 -14023 504 24680 4682 -12769
533a2769n304O248L3312j834k9568k435M266J4225N707k9611N18K7151N518J75
$$ -12769 -18073 -11825 21487 19653 -9915 -12350 -8084 6141 11848 -17763 -17245 9906 15424 15599
547A5599k2096j8838K7067J4520r545o839j3054J5523K0682k3267j5697K374Q619
$$ 15599 -6497 -25335 1732 16252 6707 -132 -13186 2337 23019 -248 -15945 -13571 -4952
560d952K5324r371k8959Q190J0490O923J254k4980L426K6770K46o733j7019j0287
$$ -4952 20372 11001 -17958 -9768 722 7645 8899 -16081 -12655 14115 14361 7628 -9391 -19678
574a9678K9850Q377j9284n295m649J3809J5693k3803j2572J0658Q824J5355j3472
$$ -19678 10172 18549 -735 -6030 -10679 3130 18823 -4980 -17552 -6894 1930 17285 3813
587C813k5667J4978J4900J210k695k1107P272K5425q804j1183q265k880K7109
$$ 3813 -21854 -6876 8024 9234 6539 -14568 -7296 18129 9325 -1858 -10123 -13003 14106
600A4106L379k3652l686P72J2692J1494k5193p209J9837N479M432j4383j9308
$$ 14106 17485 -6167 -9853 -9081 3611 15105 -10088 -17297 2540 8019 12451 -1932 -21240
613b1240J8953J3569l332k408j6552P177K3190j4684j5935L39N292K1906l143
$$ -21240 -2287 11282 7950 5542 -11010 -3833 19357 4673 -11262 -10923 -5631 16275 13132
626A3132k3857K423K713O658R103k0979l785K4505L843n190j5976j2820K2732
$$ 13132 -10725 -8302 -5589 1069 10172 -10807 -14592 9913 13756 8566 -7410 -20230 2502
639B502J0868r951k19r208N825J7315j8482j5875P064Q852J8049n736k4344N596
$$ 2502 13370 3419 3200 -6008 -183 17132 -1350 -17225 -10161 -1309 16740 11004 -13340 -7744
653g744P290J122L777j6337L077K5495k611j0138j1449j0561K1258J0249j3100
$$ -7744 -454 668 4445 -11892 -8815 16680 14069 3931 -7518 -18079 3179 13428 328
666C28j11k461N864J0608k2510j2223J4399P840J3189n222k2147P415Q481m395
$$ 328 217 -2244 3620 14228 -8282 -20505 -6106 1734 14923 9701 -12446 -5031 3450 -945
680i45Q89j1018P577K4403p628j3958p661o931J8798P309j5244L109L079L568
$$ -945 -56 -11074 -3497 20906 13278 -680 -8341 -15272 3526 10835 -4409 -1300 1779 5347
694E347N155k2847r446J9443P857P037n277j7823R660P096r364m15n945R776K3070
$$ 5347 10502 -12345 -21791 -2348 5509 12546 7269 -10554 -894 6202 -3162 -3577 -9522 254 23324
709B3324j2055j7102k568l596J4514M422j4510O863O800m47J072k1358o240K2275
$$ 23324 11269 -5833 -8401 -11997 2517 6939 -7571 -708 6092 5645 6717 -14641 -20881 1394
723A394O883J929m205j3818J0723M687j4382L17o4R139J9233j3457j7265Q73j417
$$ 1394 8277 10206 6001 -7817 2906 7593 -6789 -6472 -6536 2603 21836 8379 -8886 -8013 -9430
738i430J1450J380j4099J1803R947n269k586j7295l691K2677M423j785k717j0259
$$ -9430 2020 3400 -10699 1104 11051 5782 3196 -14099 -17790 4887 9310 7525 4808 -5451
752e451J1319K461j8911R96N607Q143J4732j4118j5182M357p42O718J170j1882
$$ -5451 5868 8329 -10582 -9586 -3979 4164 18896 4778 -10404 -6047 -6789 -71 1099 -10783
766a0783J3642J1932r206n429j3281p41K1507P94m680Q64o943Q228O64j9914J801
$$ -10783 2859 14791 5585 156 -13125 -13866 7641 8435 3755 4619 -2324 5904 6568 -13346 -11545
781a1545R736O826J1051j4700j2934R128j342J898J279q956J4600J1669j2026
$$ -11545 -1809 5017 16068 1368 -11566 -2438 -3780 -1882 -603 -9559 5041 16710 4684
794D684o240r293P83J9676l100p570M818l810N862j462k0094M685J1971L868P614
$$ 4684 -1556 -10849 -10066 9610 6510 -1060 3758 -52 5810 4348 -15746 -11061 910 4778 12392
809A2392j2805j0210J1487r83k287R15n959J4930R744j4996n624m656P18J6098
$$ 12392 -413 -10623 864 -119 -2406 -1491 -7450 7480 17224 2228 -3396 -8052 -7334 8764
823H764n082q286P523j684L389k652j8291O733J3856N31L716r805p210J2865j922
$$ 8764 3682 -4604 2919 1235 4624 1972 -16319 -9586 4270 4801 8517 -1288 -8498 4367 2445
838B445o041J922l575J3067Q075j6944m526J26J045J1700o586q353J0245j88J136
$$ 2445 -3596 -1674 -5249 7818 15893 -1051 -5577 -5451 -4406 7294 708 -7645 2600 2412 3548
853C548k806j5903Q170J4804l542Q41o942m306J3316m210p784L586k650J0885
$$ 3548 742 -15161 -6991 7813 4271 5112 -1830 -6136 7180 2970 -4814 -1228 -3878 7007
867G007O489j7530l424M208O25R005p920p638J3089k35k414q72j1891P487J3360
$$ 7007 13496 -4034 -7458 -3250 -2625 6380 -1540 -9178 3911 3676 1262 390 -11501 -4014 9346
882I346n547j250m733k298J3603o067j0350O139k53O742M280j6903p68Q242r78
$$ 9346 3799 2549 -2184 -4482 9121 3054 -7296 -1157 -1410 5332 9612 -7291 -8059 183 -795
897g95M964o618o601J2811J044l794j168r603R708J2640j2062k185J214k466J0284
$$ -795 4169 -2449 -9050 3761 4805 1011 -157 -9760 -52 12588 526 -1659 -445 -2911 7373
912G373m324j0304M993J662N586J667j6808K928J1333l852K957n242o240J3194
$$ 7373 3049 -7255 -2262 -600 4986 6653 -10155 -7227 4106 254 3211 -2031 -8271 4923
926D923Q43o714N53n245P704R739j2683l087K241m01R572o034j0592R251J282
$$ 4923 5766 -948 -395 -5640 2064 11803 -880 -3967 -1726 -2127 7445 1411 -9181 70 1352
941A352K48K095j3819L354J3442l737j099l846l999J1981j174p732K507l352P623
$$ 1352 1600 3695 -10124 -6770 6672 2935 1836 -2010 -6009 5972 4798 -2934 -427 -3779 3844
956C844P907j5657l148O677j411O473m036r640R806L226k586j125j0695O673J3075
$$ 3844 11751 -3906 -7054 -377 -1788 4685 649 -8991 815 4041 1455 330 -10365 -3692 9383
971I383o590q39k516n140J2435j298j1921M445K181M224M337j3532k569O388j131
$$ 9383 2793 1954 -562 -5702 6733 5435 -6486 -2041 140 4364 8701 -4831 -7400 -1012 -2143
986b143O279m911q344J3745K218q604M44o381N142J2788o542l627j238j694J0363
$$ -2143 4136 -775 -9119 4626 6844 -1760 -1316 -7697 -2555 10233 3691 64 -1174 -2868 7495
1001G495m999j2406Q691L357J138L923j3075k460R122j603K942l200n882J3580
$$ 7495 2496 -9910 -1219 2138 3276 7199 -5876 -8336 786 -817 2125 -1075 -6957 6623
1015F623J619j1375L74l396O312J0770r147l924K560k322P300m374j2564R324
$$ 6623 8242 -3133 -2759 -6155 157 10927 1780 -2144 416 -1906 5394 1020 -11544 -2220
1029b220O512l63R12j2080l99J0760l419R05p80m148J2205L67j2394P13p57N108
$$ -2220 4292 3929 4841 -7239 -7638 3122 -297 608 -172 -4320 7885 8252 -4142 -3429 -4186 922
1045I22R129j0620l630O246k622L756n293r947J1521O839l186J49j0300R29J1985
$$ 922 10051 -569 -4199 2047 -575 3181 -2112 -12059 -538 6301 3115 3264 -7036 -6107 5878
1060E878n162k280J720j171R820j874j3208K360J379L394P579j0573l180Q784
$$ 5878 716 -1564 156 -1015 8805 6931 -6277 -3917 -2538 856 8435 -2138 -5318 3466
1074C466k707n39m059o950J2659N995n691m21p652K099J1141o917l770M196l44
$$ 3466 759 220 -3839 -10789 1870 7865 2174 1753 -5899 -3800 7341 424 -3346 850 506
1089E06P806l129j3717M357L005J561N714r695j774J0769m239l134k468l876J2593
$$ 506 8312 5183 -8534 -4177 -1172 389 6103 -3592 -5366 5403 1164 -1970 -4438 -8314 4279
1104D279M636q254Q4m244J903R422r033m658P393J103M706m674j2587N896M973
$$ 4279 8915 661 745 -3499 -1596 7826 -1207 -5865 1528 2631 7337 2663 -9924 -4028 945
1119I45r80L977p881k22J1110n118m999n57k264J1659L669j0796Q01m95J249O301
$$ 945 -35 3942 -3939 -4161 6949 1831 -3168 -3725 -5989 5670 9339 -1457 -656 -1151 98 6399
1135F399r505l932R759M48J521m030j0948P143O094l154J674n357J496J1044p203
$$ 6399 -3106 -7038 2721 3169 4690 660 -10288 -3145 2949 -205 1469 -3888 -2392 8652 1449
1150A449o052K151p79R344J737j1241J988J806j43M281r299k942J1438p9r91l865
$$ 1449 -4603 -2452 -3231 6113 7850 -3391 -1403 403 260 4541 -4758 -7700 3738 3659 2668 -1197
1166a197q381Q996N517o582J734k191J269R975p558p422L926J052P198o27j1259
$$ -1197 -9578 -582 4935 -1647 87 -2104 -835 9140 1582 -5840 -1914 -862 6336 5709 -5550
1181e550M108L563k051K437q030j795J2804j463m475j357n261Q485M402p893Q64
$$ -5550 -1442 2121 70 2507 -5523 -7318 5486 4023 -452 -1809 -7070 1415 5817 -2076 -1212
1196a212M00J804P991r194o597O994O24L379o16j0527N098N590l806R9o035N84
$$ -1212 -812 992 8983 -211 -6808 186 810 4189 3573 -6954 -1856 3734 -72 27 -6008 -5424
1212e424J1930l203n289M64k971P910L084j0125J832K961O64N492q846o526R144
$$ -5424 6506 3303 -1986 -1522 -4493 3417 6501 -3624 -1792 1169 1833 7325 -1521 -8047 1097
1227A097J478k11k059p475O842M732n564M55m159P46J2092m598p785L278J19N127
$$ 1097 2575 2364 305 -7170 -328 4404 -1160 -705 -4864 -4118 7974 3376 -4409 -1131 -1012 4115
1243D115Q96r272K505L384K94L691r268m496J1370l06l154p91n359O321N866o989
$$ 4115 5011 -4261 -1756 1628 1922 5613 -3655 -8151 3219 2913 -241 -1032 -6391 -70 5796 -1193
1259a193q53r16K159Q947o473o962N618J26L406O12j0285L292O143k339M77o520
$$ -1193 -2046 -2962 -803 8144 1671 -5291 327 453 3859 4471 -5814 -2522 3621 1282 1759 -4761
1275d761j880J0940j196m846O0l506P292M290q972K8K341J323O282p079o321O622
$$ -4761 -6641 4299 3103 -1743 -1683 -5189 2103 6393 -2579 -2551 -210 1113 7395 316 -6005 617
1291F17J145J335p17q921M684O128m570k97l916k62J0248k551o049J963k041O108
$$ 617 1762 3097 2380 -6541 -1857 4271 -299 -596 -4512 -4774 5474 2923 -3126 -1163 -3204 2904
1307B904L271r762R02M712L85L222p245m976Q434P71j451o33o939N761O178o687
$$ 2904 6175 -3587 -2685 2027 2412 5634 -1611 -6587 1847 2618 1167 534 -6405 -644 5534 -1153
1323a153j537q31J304Q749l917o455L147k36M334J730r817K277O265j443N87n956
$$ -1153 -2690 -3521 -2217 6532 2615 -3840 -693 -929 3405 5135 -4682 -2405 3860 2417 3004 -2952
1339b952l733R244Q0l330j58m350N454N290p960j221K147J496O840n041o695N145
$$ -2952 -6685 2559 2639 -691 -849 -5199 255 5545 -2415 -3636 -1489 7 6847 1806 -4889 256
1355B56J110J281M84q410L293P068l828p18m490j794R377m80n495Q67j949N403
$$ 256 1366 2647 3131 -5279 -1986 5082 1254 536 -3954 -5748 3629 3149 -2346 -1479 -3428 1975
1371A975L714q969k46M178Q40M653n435o158O507J293j167j58o453M290O744n459
$$ 1975 5689 -3280 -3526 652 1492 6145 710 -5448 1059 2352 1185 1027 -5426 -1136 5608 149
1387A49j862k040o50Q516j281o271K476p3L863K221r152P02O034k45K086m825
$$ 149 -1713 -3753 -4403 4113 2832 -3439 -963 -1036 2827 5048 -4104 -3402 2632 2387 4473 -352
1403c52n212P431J066l594j35m255M768O205p047k149N30L92P036k450o642M470
$$ -352 -5564 1867 2933 -661 -796 -5051 -283 5922 -1125 -3274 -2744 -2352 4684 2234 -4408 62
1419F2J653J074Q98q650K060O911j803J65m038l593P881K17n434L78j362M555
$$ 62 1715 2789 3687 -4963 -2903 4008 2205 2370 -1668 -5261 2620 2837 -2597 -2219 -3581 974
1435I74M758p840j504K916K65N225k982o381N671J958q01m45p034K960P180l726
$$ 974 5732 -2108 -3612 -696 -431 4794 1812 -4569 1102 3060 2259 1814 -5220 -2260 4920 1194
1451A194j503j899k116P498r59o397K033K45L855L256p579j239M788r6K562l164
$$ 1194 -309 -2208 -4324 3174 2215 -4182 -2149 -1904 1951 5207 -2372 -3611 1177 1081 3643 479
1467D79n128O769J798l372o65m446L208O148n090j664Rq74O289j647o668L413
$$ 479 -4649 2120 3918 546 -119 -4565 -1357 4791 -299 -1963 -1954 -2828 3461 1814 -4854 -1441
1483a441K007J876J906p595L13N989j289L89k532l865P072J125n338K6k787L258
$$ -1441 566 2442 4348 -3247 -2934 3055 1766 2155 -377 -4242 2830 3955 -1383 -1357 -4144 -886
1499h86N590n802k067K462l75M530k150o034M430K631q9Q65o300P98O417k602
$$ -886 4704 -1098 -3165 -703 -1078 3452 1302 -4732 -302 2329 2240 3105 -3195 -2397 4020 1418
1515A418j064j771k414O778L39o359Q37l09K794M261o642j165M263q37K791k038
$$ 1418 354 -1417 -3831 2947 3286 -3073 -2236 -2545 249 4510 -2132 -3297 966 129 2920 882
1531H82n595N622K657k155J94m882J849N851m132j983J29j455O094p78o497K327
$$ 882 -4713 909 3566 1411 1605 -3277 -1428 4423 291 -1692 -1563 -3018 3076 2298 -4199 -1872
1547a872J048J636K801o113o60N295p27J144k554m082O000J694l681L00l120J736
$$ -1872 -824 812 3613 -2500 -3160 2135 1408 2552 -2 -4084 1916 3610 -71 229 -2891 -1155
1563a155N269m582k255J421m27M634j348o073L602K051J36J828n673J71O100j943
$$ -1155 4114 -468 -2723 -1302 -1729 2905 1557 -4516 -914 1137 1273 3101 -2572 -2401 3699 1756
1579A756r55j325k690N517J060n180N00r06J770M197n359j972L542l47K745j509
$$ 1756 801 -524 -3214 2303 3363 -1817 -1317 -2223 -453 3744 -1615 -3587 -45 -392 2353 844
1595H44n180M793K059j497R75m391Q91N668k909j915p9j778M856K44n840J703
$$ 844 -4336 457 2516 1019 1994 -2397 -1506 4162 1253 -662 -741 -2519 2337 2581 -3259 -1556
1611a556J32J161L594n102j585M350n90J574j383m392M919K515l198J52k620J103
$$ -1556 -1424 -263 3331 -1771 -3356 994 404 1978 595 -3797 1122 3637 439 591 -2029 -926
1627i26M950l680k533J394j031L814l41n740K553J715L67K019m713p10N557j456
$$ -926 4024 344 -2189 -795 -1826 1988 1647 -4093 -1540 175 542 2561 -2152 -2862 2695 1239
1643A239m82o78l014M771J817m233L14j509J121M217l994k522K633m40K477p57
$$ 1239 757 79 -2935 1836 3653 -580 -266 -1775 -654 3563 -431 -2953 -320 -760 1717 960
1659I60n165L611K083j007J437l857k75N773k065j571M0k190M462J055n209O26
$$ 960 -4205 -594 1489 482 1919 -1938 -2213 3560 1495 -76 -36 -2226 2236 3291 -1918 -1292
1675a292m8O61L550m184j904L697l13J253p26m512L782K715k282J174k611J2M574
$$ -1292 -1340 -679 2871 -1313 -3217 480 167 1420 694 -3818 -36 2679 397 1571 -1040 -1028 3546
1692C546k507k629J261j153L339N21n281J397J112k17K873l856j396M698m54m89
$$ 3546 1039 -1590 -329 -1482 1857 2378 -2903 -1506 -394 -611 2262 -1594 -2990 1708 1254 765
1708G65k90l562M107K225l167L05j415R1M230l237k618K528r35K476J12n236K028
$$ 765 475 -3087 1020 3245 78 383 -1032 -941 3289 52 -2566 -38 -973 1503 1615 -3621 -1593
1725a593J933p46J926k999n59N000j536j455J98k275L832J511m195P21j78l95
$$ -1593 340 -406 1520 -1479 -2038 2962 1426 -29 169 -2106 1726 3237 -958 -237 -415 -810
1741h10L444l577k517L520l01J320j42m445K688K537j934J082k074r7M687j755
$$ -810 2634 -943 -3460 60 -241 1079 937 -3508 -820 1717 -217 865 -1209 -1306 3381 1626
1757A626k387R02j770L073J480m675R86O79m50K389l264j798L818l08M98n4l611
$$ 1626 -761 141 -1629 1444 2924 -1751 -765 -86 -536 1853 -1411 -3209 609 301 799 745 -2866
1774b866K953K457k777P34r17k99M066k431k832K122j138K256N61m471J364J487
$$ -2866 87 2544 -233 501 -416 -715 3351 920 -1912 210 -928 1328 1889 -2582 -1218 269
1790B69j174J716k722p49M656j117p83P93l087L075J851l422R33k43l49L095k763
$$ 269 -905 811 -1911 -2660 1996 879 96 889 -2198 877 2728 -694 239 -4 -353 2742 -21
1807b1k688K533o72J236R93m235J783K076j642R80j634o07M530j308j646J144
$$ -21 -2709 -176 -848 388 1381 -2854 -1071 1005 -637 343 -1291 -1898 2632 1324 -322 822
1823H22k276K397J914m285J112J057r92K105k433k491L497q55L47J016l646K499
$$ 822 -1454 943 2857 -1428 -316 741 -251 1854 -579 -3070 427 -428 -81 935 -2711 -212
1839b12K169k657O94l93p53M080j573k377J823j744J677J134l962J283J467j385
$$ -212 1957 -700 -6 -399 -1152 2928 1355 -1022 801 -943 734 1868 -2094 -811 656 -729
1855g29K108k297k089L707n63m13J189k785J960K533l543Q83L02j029L510j908
$$ -729 1379 -918 -3007 700 137 -276 913 -1872 88 2621 -922 -39 263 -766 2744 836
1871H36k395K075j035Q83Q13l508J574J997k139J216j228j528L799o68j206J618
$$ 836 -1559 516 -519 364 1177 -2331 -757 1240 -899 317 -911 -2439 1360 692 -514 1104
1887A104k234J948J824l578R09N60q48K458j623k564K312o63j84J361l141J642
$$ 1104 -1130 818 2642 -936 -27 533 -315 2143 520 -2044 268 -395 -579 782 -2359 -717
1903g17K397k798J301p38j239L637r50j902J938j364R80J605l451J015J377j608
$$ -717 1680 -1118 183 -555 -1794 1843 893 -1009 929 -435 545 2150 -1301 -286 1091 -517
1919e17J766j523k165L045j036n74J653k717J536K476k843J021j61j397L323j025
$$ -517 1249 -274 -2439 606 -430 -1004 649 -2068 -532 1944 -899 122 -39 -1436 1887 862
1935H62j876K358j447L67J324l091Q73J829j999J528r18k111K944p56j037J777
$$ 862 -1014 1344 -103 264 1588 -1503 -630 1199 -800 728 -190 -2301 643 -113 -1150 627
1951F27j579R59K057k987R94O24j435K305o42k033K105j005l79J384k814Q85K043
$$ 627 -952 7 2064 -923 71 695 -740 1565 923 -1110 995 -10 -389 995 -1819 -934 1109
1968A109k037J318n96j996L195o76j627K356j551Q62K026l219O09J092j846K553
$$ 1109 -928 390 -206 -2202 993 317 -1310 1046 -505 357 2383 -836 -227 865 -981 1572
1984A572q32k364K651j183q89J725k551R45K433k395O60L42j621K709l72j711
$$ 1572 740 -1624 1027 -156 -1045 680 -1871 -926 1507 -888 -228 114 -1507 1202 830 -881
2000h81K341j268K20J647l357N62J918j917J595m43k162K347o90j175J702j903
$$ -881 1460 192 412 2059 -1298 -736 1182 -735 860 417 -1745 602 -88 -1263 439 -1464
2016a464J126K127k707Q20N98j755K479l38j937K367j074k82J734k659l7J894
$$ -1464 -338 1789 -918 -98 500 -1255 1224 886 -1051 1316 242 -40 1694 -965 -1002 892
2032H92j781J517q9k208K352q23j338K088j494O74K384k493K17R10j539J874j39
$$ 892 -889 628 539 -1669 683 -140 -1478 610 -884 -210 2174 -319 -102 808 -731 1143 1004
2049A004j824K139o64j056J349k372J70K251k177J263L26k099K339l31j743K009
$$ 1004 -820 1319 655 -401 948 -1424 -1254 997 -1180 83 409 -1690 649 318 -1425 584
2065E84p25J84K043k399O9J233k048J860J17k085J968r4j879J872k228K53K518
$$ 584 -141 43 2086 -313 -244 989 -1059 801 918 -1167 801 707 -1172 700 -1528 -1275 1243
2082A243k119P78P67j896K099l61j753K345p79m59K295k522k76J535j994J490
$$ 1243 -876 -98 669 -1227 872 511 -1242 1103 324 -135 2160 -362 -638 897 -1097 393
2098C93K86j988K136o64j502K007j958NK674k052O45J391k188J395P3k009K127
$$ 393 679 -1309 827 163 -1339 668 -1290 -1285 1389 -663 -18 1373 -815 580 653 -1356 771
2115G71j41j129K509k323m78J733k070Q44J026k297K137r9j760J808j342q7K161
$$ 771 630 -499 2010 -313 -791 942 -1128 -284 742 -1555 582 483 -1277 531 -811 -898 1263
2132A263j673L31J546k179J394L07k239K104k36j141J981j892o77J669j836Q54
$$ 1263 -410 -79 1467 -712 682 989 -1250 854 618 -523 1458 -434 -1111 558 -1278 -424
2148d24J222j986J807J12k000J780n94j022K676j468N7J478k299R39O14k270J960
$$ -424 798 -1188 619 731 -1269 511 -83 -1105 1571 103 160 1638 -661 278 892 -1378 582
2165E82O1j572K126j854p88J816j611P11J381j799J560L98k095J770p30o79K409
$$ 582 643 -929 1197 -657 -1445 371 -1240 -529 852 -947 613 1011 -1084 686 -44 -723 1686
$$ [...]
8191I2
##END NTUPLES=NMR FID
##END=
