##TITLE=1H_11-2022
 CDCl3
 8 sc, 
 18.02.2022
##JCAMPDX= 6.0         $$ Bruker NMR JCAMP-DX V2.0
##DATA TYPE= NMR FID
##DATA CLASS= NTUPLES
##ORIGIN= UXNMR, Bruker Analytische Messtechnik GmbH
##OWNER= root
$$ XWIN-NMR		Version 3.5
$$ Fri Feb 18 10:37:00 2022 Russian Standard Time (UT+4h)  she@DPX200
##.OBSERVE FREQUENCY= 200.131346
##.OBSERVE NUCLEUS= ^1H
##.DELAY= (6, 6)
##.ACQUISITION MODE= SIMULTANEOUS
##.ACQUISITION SCHEME= undefined
##.AVERAGES= 8
##.DIGITISER RES= 18
##SPECTROMETER/DATA SYSTEM= spect
##.PULSE SEQUENCE= zg30
##.SOLVENT NAME= CDCl3
##.SHIFT REFERENCE= (INTERNAL, CDCl3, 0, 15.7039)
##AUDIT TRAIL= $$ (NUMBER, WHEN, WHO, WHERE, WHAT)
$$ ##TITLE= Audit trail, XWIN-NMR		Version 3.5
$$ ##JCAMPDX= 5.01
$$ ##ORIGIN= Bruker BioSpin GmbH
$$ ##OWNER= she
$$ F:/spectra/data/she/nmr/H-F/1/audita.txt
$$ ##AUDIT TRAIL=  $$ (NUMBER, WHEN, WHO, WHERE, WHAT)
(   1,<2022-02-18 10:35:22.87 +0400>,<she>,<DPX200>,
      <created by zg, POWCHK disabled, PULCHK disabled
       configuration hash MD5:
       00 E9 B6 7A A2 85 ED C7 34 08 36 98 17 FE 4E 26
       data hash MD5: 16K
       BD 4C F8 34 A5 2F 86 BB 54 49 76 18 DF 9F 7A FB>)
$$ ##END=
$$ 
$$ hash MD5
$$ C2 D6 50 6C B0 D1 EC 82 A4 91 4D 2B 61 7E E7 52
##$RELAX= 
##$RELAX= 
##$RELAX= 
##$RELAX= 
##$RELAX= 
##$RELAX= 
$$ Bruker specific parameters
$$ --------------------------
##$DU= <F:/spectra>
##$EXPNO= 1
##$NAME= <H-F>
##$PROCNO= 1
##$TYPE= <nmr>
##$USER= <she>
##$AMP= (0..31)
100 100 100 100 100 100 100 100 100 100 100 100 100 100 100 100 100 100 
100 100 100 100 100 100 100 100 100 100 100 100 100 100 
##$AQSEQ= 0
##$AQ_mod= 1
##$AUNM= <au_zg>
##$AUTOPOS= <>
##$BF1= 200.13
##$BF2= 200.13
##$BF3= 200.13
##$BF4= 200.13
##$BF5= 200.13
##$BF6= 200.13
##$BF7= 200.13
##$BF8= 200.13
##$BYTORDA= 1
##$CFDGTYP= 0
##$CFRGTYP= 5
##$CHEMSTR= <none>
##$CNST= (0..31)
1 1 145 1 1 1 1 1 1 1 1 1 1 1 1 1 1 1 1 1 1 1 1 1 1 1 1 1 1 1 1 1 
##$CPDPRG= <>
##$CPDPRG1= <>
##$CPDPRG2= <>
##$CPDPRG3= <>
##$CPDPRG4= <mlev>
##$CPDPRG5= <mlev>
##$CPDPRG6= <mlev>
##$CPDPRG7= <mlev>
##$CPDPRG8= <mlev>
##$CPDPRGB= <>
##$CPDPRGT= <>
##$D= (0..31)
0 1.2 0 0 0 0 0 0 0 0.06 0 0.03 0 0 0 0 0.0002 0 0 0 0 0 0 0 0 0 0 0 0 
0 0 0 
##$DATE= 1645166122
##$DBL= (0..7)
120 120 120 120 120 120 120 120 
##$DBP= (0..7)
150 150 150 150 150 150 150 150 
##$DBP07= 0
##$DBPNAM0= <>
##$DBPNAM1= <>
##$DBPNAM2= <>
##$DBPNAM3= <>
##$DBPNAM4= <>
##$DBPNAM5= <>
##$DBPNAM6= <>
##$DBPNAM7= <>
##$DBPOAL= (0..7)
0.5 0.5 0.5 0.5 0.5 0.5 0.5 0.5 
##$DBPOFFS= (0..7)
0 0 0 0 0 0 0 0 
##$DE= 6
##$DECBNUC= <off>
##$DECIM= 32
##$DECNUC= <off>
##$DECSTAT= 4
##$DIGMOD= 1
##$DIGTYP= 9
##$DL= (0..7)
0 120 120 120 120 120 120 120 
##$DP= (0..7)
150 150 150 150 150 150 150 150 
##$DP07= 0
##$DPNAME0= <>
##$DPNAME1= <>
##$DPNAME2= <>
##$DPNAME3= <>
##$DPNAME4= <>
##$DPNAME5= <>
##$DPNAME6= <>
##$DPNAME7= <>
##$DPOAL= (0..7)
0.5 0.5 0.5 0.5 0.5 0.5 0.5 0.5 
##$DPOFFS= (0..7)
0 0 0 0 0 0 0 0 
##$DQDMODE= 0
##$DR= 18
##$DS= 0
##$DSLIST= <SSSSSSSSSSSSSSS>
$$ [...]
##$SUBNAM2= <"">
##$SUBNAM3= <"">
##$SUBNAM4= <"">
##$SUBNAM5= <"">
##$SUBNAM6= <"">
##$SUBNAM7= <"">
##$SUBNAM8= <"">
##$SUBNAM9= <"">
##$SW= 18.0517287032376
##$SWIBOX= (0..15)
0 0 2 0 0 0 0 0 0 0 0 0 0 0 0 0 
##$SW_h= 3612.71676300578
##$TD= 16384
##$TD0= 1
##$TE= 0
##$TE2= 300
##$TE3= 300
##$TEG= 300
##$TL= (0..7)
0 120 120 120 120 120 120 120 
##$TP= (0..7)
150 150 150 150 150 150 150 150 
##$TP07= 0
##$TPNAME0= <>
##$TPNAME1= <>
##$TPNAME2= <>
##$TPNAME3= <>
##$TPNAME4= <>
##$TPNAME5= <>
##$TPNAME6= <>
##$TPNAME7= <>
##$TPOAL= (0..7)
0.5 0.5 0.5 0.5 0.5 0.5 0.5 0.5 
##$TPOFFS= (0..7)
0 0 0 0 0 0 0 0 
##$TUNHIN= 0
##$TUNHOUT= 0
##$TUNXOUT= 0
##$USERA1= <user>
##$USERA2= <user>
##$USERA3= <user>
##$USERA4= <user>
##$USERA5= <user>
##$V9= 5
##$VALIST= <valist>
##$VCLIST= <CCCCCCCCCCCCCCC>
##$VD= 0
##$VDLIST= <DDDDDDDDDDDDDDD>
##$VPLIST= <PPPPPPPPPPPPPPP>
##$VTLIST= <TTTTTTTTTTTTTTT>
##$WBST= 1024
##$WBSW= 4
##$XGAIN= (0..3)
0 0 0 0 
##$XL= 0
##$YL= 0
##$YMAX_a= 654395
##$YMIN_a= -629547
##$ZGOPTNS= <>
##$ZL1= 120
##$ZL2= 120
##$ZL3= 120
##$ZL4= 120
##$ABSF1= 10
##$ABSF2= 0
##$ABSG= 5
##$ABSL= 3
##$ALPHA= 0
##$AQORDER= 0
##$ASSFAC= 0
##$ASSFACI= 0
##$ASSFACX= 0
##$ASSWID= 0
##$AUNMP= <proc_1d>
##$AZFE= 0.1
##$AZFW= 0.1
##$BCFW= 1
##$BC_mod= 2
##$BYTORDP= 1
##$COROFFS= 0
##$CY= 11.3945322036743
##$DATMOD= 1
##$DC= 2
##$DFILT= <>
##$DTYPP= 0
##$F1P= 2.36226072786647
##$F2P= -0.459571619588291
##$FCOR= 0.5
##$FTSIZE= 0
##$FT_mod= 4
##$GAMMA= 1
##$GB= 0.15
##$INTBC= 1
##$INTSCL= 1
##$ISEN= 128
##$LB= 0.24
##$LEV0= 0
##$LPBIN= 0
##$MAXI= 10000
##$MC2= 0
##$MEAN= 0
##$ME_mod= 0
##$MI= 1.114404
##$NCOEF= 0
##$NC_proc= 0
##$NLEV= 6
##$NOISF1= 3.799351
##$NOISF2= 2.8
##$NSP= 1
##$NTH_PI= 0
##$NZP= 0
##$OFFSET= 15.70392
##$PC= 1
##$PHC0= -16588.64
##$PHC1= 9.60078
##$PH_mod= 1
##$PKNL= yes
##$PPARMOD= 0
##$PSCAL= 0
##$PSIGN= 0
##$REVERSE= no
##$SF= 200.130013532006
##$SI= 16384
##$SIGF1= 3
##$SIGF2= 2
##$SINO= 400
##$SIOLD= 16384
##$SREGLST= <1H.CDCl3>
##$SSB= 0
##$STSI= 0
##$STSR= 0
##$SW_p= 3612.71676300578
##$SYMM= 0
##$S_DEV= 0
##$TDeff= 0
##$TDoff= 0
##$TI= <>
##$TILT= no
##$TM1= 0
##$TM2= 0
##$TOPLEV= 0
##$USERP1= <user>
##$USERP2= <user>
##$USERP3= <user>
##$USERP4= <user>
##$USERP5= <user>
##$WDW= 1
##$XDIM= 8192
##$YMAX_p= 0
##$YMIN_p= 0
$$ End of Bruker specific parameters
$$ ---------------------------------
##NTUPLES= NMR FID
##VAR_NAME=  TIME,          FID/REAL,        FID/IMAG
##SYMBOL=    X,             R,               I
##VAR_TYPE=  INDEPENDENT,   DEPENDENT,       DEPENDENT
##VAR_FORM=  AFFN,          ASDF,            ASDF
##VAR_DIM=   8192,          8192,            8192
##UNITS=     SECONDS,       ARBITRARY UNITS, ARBITRARY UNITS
##FACTOR=    0.0002768,     1,               1
##FIRST=     0,             0,               0
##LAST=      2.2672688,     0,               0
##MIN=       0,             -629547,         0
##MAX=       2.2672688,     654395,          0
$$ Real data points
##PAGE= N=1
##DATA TABLE= (X++(R..R)), XYDATA
0 0 0 0 0 0 0 0 0 8 -8 8 -8 16 -21 24 -32 40 -48 60 -72 88 -104 126 -151 177 -206 241 -281 327 -375 431
30 431 -492 563 -641 724 -818 923 -1035 1162 -1298 1449 -1612 1794 -1990 2203 -2436 2692
46 2692 -2973 3279 -3611 3976 -4381 4827 -5322 5869 -6483 7175 -7960 8860 -9904 11128
60 11128 -12596 14385 -16628 19527 -23441 29047 -37770 53312 -89404 351316 -91092 -383675
72 -383675 654395 55379 -412836 355316 425842 -363409 -7237 382275 -233938 -334754
82 -334754 342228 133868 -203568 176246 237512 -165374 -113533 107105 39107 -59327 143356
93 143356 114968 -227751 -70390 207087 -174823 -180805 331793 106320 -310794 75039 165427
104 165427 -385010 -180494 319074 -171507 -331117 272627 -76524 -542419 128778 259448
114 259448 -303584 -5172 343805 -101147 -194427 151802 -7756 -172459 140875 95912
124 95912 -185954 -2927 28838 -215066 -54938 133528 21377 -8706 39596 12446 -50020
135 -50020 -22917 76274 7108 -25384 142048 50905 -169917 -9068 151151 -51554 -63000
146 -63000 237230 112432 -198638 34176 121405 -184933 -1555 185547 -145532 -105603
156 -105603 142456 -102384 -195508 103659 93356 -73561 85218 122377 -98833 -7684 105746
167 105746 -85800 6685 175091 -64159 -129218 59324 -5690 -105826 -2006 81527 22717
178 22717 -22953 33669 1761 -73725 19865 76926 -11393 -12911 67662 15507 -112594 -6117
190 -6117 142576 -14280 -38140 148300 22405 -79516 73239 653 -84681 84808 66362
201 66362 -109414 -30202 66788 -88896 -92664 106438 27771 -70325 76893 11427 -102342
212 -102342 52152 43894 -89858 4316 74218 -39517 -96098 -13622 12906 -51749 -12125
223 -12125 41629 -15887 -18685 573 -34314 -21619 15842 25016 -23248 -45559 39572 3203
235 3203 -93166 16351 59862 -29161 20260 42036 -37607 -5040 48158 -19902 -38851 69818
247 69818 38204 -94989 2073 69777 -61018 -14302 72539 -17696 930 59707 -21606 -37064
259 -37064 48806 44914 -38435 -9719 62937 -15168 -54326 25154 9126 -14617 19880 -2052
271 -2052 -12966 6162 7916 -11366 -35441 22974 43470 -50798 -26979 41975 -15988 -32314
283 -32314 15049 10316 -7757 7502 12747 -28702 -3632 57201 -23905 -43732 65921 16626
295 16626 -52714 16781 20620 -15356 7684 10933 -14136 -5511 29348 -8857 -46895 33042 34736
308 34736 -46221 -3778 29500 -9031 -6569 -5535 -2784 5925 -2351 -1031 -21794 -8287 31177
321 31177 -18951 -34476 26571 15927 -18863 -13107 8405 14035 -16356 -8106 3743 -20823 11550
334 11550 4219 -47925 9173 34765 -26534 -15764 22892 17445 -4469 -4287 16302 3644 6512
347 6512 17557 -23080 3062 43998 -14607 -16023 32599 21003 8554 2970 11657 27806 6076
360 6076 564 1285 -4234 17116 -8227 -32533 5297 8965 -8811 -12833 -5766 26150 4195 -22529
374 -22529 11389 4576 -4777 5178 -27371 -15140 11963 -22445 -33085 -9074 7825 -4065 -27497
387 -27497 -455 7908 -14460 -608 -15780 -16450 21590 -16315 -40427 1305 1685 -7798 -6895 -387
401 -387 23879 13242 -1226 5149 6632 23156 6742 -18714 10379 7571 -17127 -14589 -15218 14793
415 14793 23019 -11285 10340 26580 9876 17276 5200 8389 34585 9485 -15753 -8363 4357
428 4357 -2534 -28944 -1493 24087 -9281 -4401 -4724 -24629 14367 8750 -30056 -1283 9289
441 9289 -16051 -28222 -21777 5975 7584 1014 15159 12589 19231 10506 -15366 17441 32497
454 32497 3036 -1334 -16737 -13895 1314 -30754 -17384 23362 12387 9078 9860 2915 18944
467 18944 23913 19627 20333 34584 36688 -19251 -24394 29706 6679 -7229 24365 8378 7624 10011
481 10011 -23462 -12226 12140 5910 -4021 -15224 -14084 -24809 -40479 -25132 -12452 12262 16437
494 16437 -30373 -14490 15327 -21265 -18617 1134 -2442 4583 -28404 -56425 -35650 -36372 -37785
507 -37785 -17516 -3621 -2108 -19053 -20711 -18120 -10177 34052 20482 -16723 26707 20577 -33783
520 -33783 -15819 3830 14011 34562 14906 5951 15949 2980 -7658 9806 43980 34452 1626
533 1626 10861 -2463 -14681 21603 10342 8653 60464 44963 8713 10702 13016 34360 37761
546 37761 19883 33320 26207 -17572 -40915 -17497 10961 -10853 -9027 18960 -12386 -19103 -2148
559 -2148 -33049 -6505 40495 12981 -5086 -11062 -27796 -21855 -20749 -13509 13887 19846 -10484
572 -10484 -40105 -11484 4664 -36010 -11837 28682 -5070 -14064 -22713 -54235 -25467 542
584 542 -1869 12472 9168 -1198 -6738 -16110 -1898 24298 34563 9844 -10680 16142 -6632
597 -6632 -55057 -12438 19666 7241 17683 -3648 -21640 -1383 -9358 -2591 28931 28449 12978
610 12978 -2000 -13315 -17636 -7538 13491 -721 5188 43714 -3488 -46957 -3214 7029
622 7029 4372 22066 6229 300 -4292 -32005 -25966 2328 15603 10168 5989 15143 -1826 -11361
636 -11361 5173 -1666 24334 54503 5587 -18115 -2368 -13949 -5840 3545 5086 26842 10369
649 10369 -22817 -13073 4900 3947 -2010 20680 32740 -1909 -9460 -11847 -31086 12169 33859
662 33859 -4962 5025 12956 -14992 -15390 -7787 5970 21602 9259 -5892 -10758 -8062 -18542
675 -18542 -33825 2918 25483 -2603 -4643 -14733 -27351 2625 599 -7666 19503 12798 -7422
688 -7422 -15178 -21553 -5715 3875 -258 4998 10534 8229 -21022 -28949 13119 16029 4626 18533
702 18533 -2735 -8916 6042 -19117 -12967 21536 14599 472 -1887 -1446 -5485 -11756 732 10075
716 10075 16861 20930 -15940 -22835 9460 -2981 -6362 12042 5392 8964 19 -21229 -5875
729 -5875 6669 3825 5281 4484 10396 -2302 -19332 -9730 790 16211 12490 -14674 1997 9315
743 9315 -18772 -6121 6190 3214 16902 2676 -12789 473 1350 -5510 -4394 12848 21487
756 21487 -4938 -9631 -959 -5153 11076 5596 -8860 17876 12191 -15728 -5815 1104 4877 6637
770 6637 -2428 3395 2721 -7571 -10753 -13506 5408 11912 -9845 -6216 -2108 -4638 580 -14538
784 -14538 -3976 20503 -1576 -10348 298 -5520 -1037 -2507 -5850 7094 7676 -1276 -12425 -6781
798 -6781 15913 352 -9363 12195 3231 -1179 3595 -13566 -166 15914 -2082 -4100 4934
811 4934 8921 2582 -9522 6789 15717 4189 5376 -1395 1862 12430 -5664 -5665 8205 3359
825 3359 5869 -5168 -9710 12573 3612 -10572 2518 5139 2123 -6334 -11851 -1136 -2389 -3928
839 -3928 -7482 -14435 6159 2955 -21749 -2209 7687 -4710 -267 -4919 -3315 5761 -5523 -9461
853 -9461 -4708 3302 4818 -13919 -5288 10944 -2323 -1743 432 -541 13727 334 -9545 7121
867 7121 3961 1031 -857 -6032 9793 8765 -6139 1037 7145 10862 3916 -5282 9395 8420 -1472
882 -1472 2086 -6539 2550 12139 -12029 -6979 11380 255 -2934 -1994 1048 8176 -505 -4410 -3566
897 -3566 -500 6503 -12252 -14303 8504 -3219 -11618 -2629 -6024 3101 1582 -11194 1756 5938
911 5938 196 -3030 -7794 5612 7828 -7274 -930 4261 7167 6101 -6830 6736 15670 662
925 662 5583 2999 321 13051 -2250 -9356 10744 7872 -2119 -3775 2651 10380 115 784 7221
940 7221 3005 12411 2487 -13516 8719 8854 -8899 -1282 127 -93 -1201 -12915 -5410 1962 -1669
955 -1669 -4326 -11356 -2565 1454 -16518 -12535 -4069 -4078 -1015 -15252 -12291 3458 -10450 -10466 80
970 80 -3715 3805 -2089 -14667 -3107 2116 -3367 -8388 -2244 11964 -2971 -12250 3327 274
984 274 5280 13078 -3425 5987 15519 -3357 -2800 6478 10365 10500 602 4037 8002 1931 2515 -1397
1000 -1397 9201 22319 3043 -2579 6391 1359 6734 2486 -86 17035 7052 -6860 630 348
1014 348 3077 4891 243 6523 6162 -535 -10644 -14553 7846 7756 -11882 956 606 -11641 -5057
1029 -5057 -10594 -6275 10680 1048 -6951 -3608 -2439 -5025 -12820 -1320 10488 2010 32 -9716
1043 -9716 -14207 4930 -1190 -7852 8324 5376 -229 -6391 -14986 278 5414 -4348 3495 6940
1057 6940 692 -9600 -14013 -71 5538 6247 8204 -7211 -1640 6804 -14556 -6795 12521 5664
1071 5664 5366 441 -7619 -1229 -3900 -5076 4360 13235 11918 -10011 -12518 3446 -3461 -117 8456
1086 8456 434 7661 2913 -15960 -6152 2042 4039 9045 2419 4605 3287 -12331 -9514 3829
1100 3829 15248 11216 -4379 3119 3236 -10039 -270 1528 3070 19951 4085 -10516 69
1113 69 -4000 -5774 2733 8365 12680 1702 -9021 -10440 -6672 8461 2492 -5367 12901 5539
1127 5539 -12596 -7761 -8249 1059 12074 1757 2996 2843 -9643 -10927 -7264 4789 13293 2966
1141 2966 -2869 -6527 -5168 -362 -11730 -1725 18218 3749 -3482 -3877 -13556 -2674 2118 -1559
1155 -1559 10791 10191 -4275 -12499 -9334 4533 3536 2170 9058 1790 2444 -1551 -18317 -1324
1169 -1324 14175 3733 5859 3197 -5322 -4742 -10057 -2595 11473 9406 2692 -6983 -5547 359
1183 359 -8563 -3306 6746 5670 9946 -5478 -17584 -138 9 -3311 9334 7318 2373 -3355
1197 -3355 -12458 -4258 4485 6397 4096 -229 7737 469 -14690 -3629 2097 5724 14129 -2106
1211 -2106 -6400 3039 -8288 -7658 4766 9088 8717 -2276 -5493 -582 -3140 -495 -41 4292 15617
1226 15617 1100 -10279 -3197 -5356 3654 8800 -1036 6613 5434 -11316 -8515 -758 4326 4421
1240 4421 -2333 1703 417 -6645 -7105 -9629 4391 13382 -2852 -2520 547 -8568 -1670 -517 -1777
1255 -1777 10530 4945 -6327 -5785 -2404 2079 -3095 -1047 10976 5306 -1053 -5218 -8850 5640
1269 5640 6508 -3160 6503 4076 -3971 -1863 -6677 -86 9163 2540 417 1231 2089 -505 -9249 -210
1285 -210 8996 3268 2728 -5408 -6539 5191 -4231 -5485 9122 4826 -134 -1839 -5300 922 717
1300 717 -2198 357 1001 4095 -5166 -13567 -466 2109 -1108 2362 -3370 1193 3466 -9912 -3762
1315 -3762 5526 1204 953 -2621 -1435 1799 -4316 -3183 703 5305 8630 -3506 -3257 7059 -559
1330 -559 -180 3044 -707 6700 1415 -9284 -58 2714 -206 -229 -214 6198 3078 -4034 -806 -229
1346 -229 4949 4010 -6942 1261 4172 -6040 -1793 -1631 2 7814 -1538 -3608 4913 2057 -1152
1361 -1152 -3825 164 5508 -3318 -5573 -2988 -4461 2171 -3256 -7502 6146 2860 -4472 601 -868
1376 -868 2914 3590 -4436 363 3696 -68 -2867 -4798 3479 5037 -3170 1626 2351 2087 5723 -4350
1392 -4350 -1292 8597 -1184 -3687 83 -1623 2536 -1709 -3995 3860 4378 2729 -1433 -480 8650
1407 8650 1143 -3812 2756 -1317 472 -404 -9564 -19 3654 -5656 -2470 385 2321 2636 -3584
1422 -3584 -457 3468 1310 -561 -5918 -588 4118 -6780 -4377 1122 -1824 2491 -2678 -4821 5919
1437 5919 1193 -5166 -1023 -275 1511 -2772 -6429 -287 109 527 -821 -2754 8228 5847 -3437
1452 -3437 4673 5195 2453 4422 -3380 -677 5267 -3282 -5385 -1521 1716 2253 -4078 -449 4557
1467 4557 964 2522 -1352 -239 8670 -879 -4899 2940 -295 77 -154 -3406 5041 4998 -2625 -989
1483 -989 1494 4396 140 -4819 1602 110 -3669 -2582 -7805 -91 5105 -5851 -1108 5027 -136
1498 -136 1093 -909 -186 5881 1071 -3539 -3112 -627 1145 -6558 -4461 4761 -155 -255 -285 -3840
1514 -3840 5412 2780 -4367 4193 3976 -1332 -2033 -5104 136 2848 -1450 -949 562 4183 911 -6520
1530 -6520 1684 5043 -448 2260 -2527 -3816 2583 -5759 -6187 4706 2941 357 -818 -594 3662
1545 3662 1216 114 1662 3152 6695 -2653 -8528 1608 -885 -2889 2113 -960 2088 2526 -6726
1560 -6726 -1914 4454 1891 816 -646 1654 692 -5169 -3926 -1974 3727 7127 -3494 -1781 4864
1575 4864 -3096 -1023 3466 1649 6674 1405 -6643 -1135 -105 -2551 -2804 899 6279 167 -4532
1590 -4532 -3079 -3844 4037 4353 -3431 4219 3252 -6994 -3757 -2020 424 5613 152 -415 3017 21
1606 21 -3426 -4286 4244 8690 562 -191 -2403 -5512 508 -3275 -3582 7979 2236 -4660 -1960 -3260
1622 -3260 -247 1637 -169 4907 5827 826 -5649 -6590 3662 3994 176 4850 -29 -2114 77
1637 77 -7874 -1867 8161 1319 -430 1279 -2048 -2999 -5375 -1695 5382 6124 3652 -4557 -4404 2390
1653 2390 -2698 -1033 6181 1824 2615 -1018 -8978 -1300 1246 -3191 1993 4123 1984 -3140 -8157
1668 -8157 -3368 2046 5340 4546 -1901 2799 2327 -7641 -647 4850 2145 6498 990 -4785 -464
1683 -464 -4350 -6694 -65 5119 4927 -3415 -6417 -2293 -2186 1741 2022 1443 9172 1940 -7376 69
1699 69 -619 -137 5663 2083 3054 3518 -5593 -6539 -1327 4627 4729 -1318 -182 -1541 -5579 -3062 -5301
1716 -5301 198 9190 -599 -3345 2060 -3354 -2521 1952 3230 8141 4548 -3196 -5547 -3729 1245
1731 1245 -1472 -2179 4523 640 -2764 -2953 -7394 1303 6490 -652 3404 4801 -3062 -4897 -4884 438
1747 438 5423 2181 -210 -1716 -425 310 -4929 793 7157 2426 3011 -1552 -6711 348 -1491 -4246
1763 -4246 4940 5387 -354 -3330 -3325 2184 3083 2781 4226 2833 4567 -1147 -8877 -1258 1064 -1624
1779 -1624 2611 -1380 -2769 263 -5567 -3329 5417 5287 2463 -1332 -957 509 -4000 -2843 -445
1794 -445 1662 5130 -2610 -5546 2028 -1157 -483 5032 1690 3884 1646 -6741 -3668 437 -348 -1861
1810 -1861 -2284 2074 -132 -4731 -1143 -426 4286 7436 -872 1118 4011 -4366 -3058 319 306 3669
1826 3669 -558 -3571 480 1021 810 -513 2802 7876 1695 -1982 -1094 -3609 481 -709 -5116 2360
1842 2360 941 -5448 -2005 -729 1815 4022 625 1615 2947 777 -2421 -5356 830 2847 -3699
1857 -3699 -1115 -809 -2908 1474 -2266 -1197 6777 2224 -1718 -308 -715 51 -2584 -3592 381 196
1873 196 272 -2811 -3320 4210 2574 -271 4651 2729 1677 1700 -4697 -683 3264 -2551 -2733 -670 84
1890 84 309 -2238 494 3976 3740 4194 -748 645 4843 -2733 -2827 1886 -1117 284 -1386 -4625 1648
1907 1648 1806 -1466 439 2227 3698 -346 -3268 381 -788 -956 -886 -4668 1157 1896 -4761 532
1923 532 2702 1215 3498 -146 294 3683 -793 -2956 -2079 -666 -294 -5256 -3585 236 -2382 319
1939 319 -948 -1145 5938 1273 -3058 2685 832 -467 -309 -3018 281 1068 -2103 -1614 -825 3076
1955 3076 1775 -2580 2769 2492 -745 669 -2850 -1177 2447 -4454 -3467 1243 -877 51 -620 -106
1971 -106 4091 1922 545 559 1061 3346 -1850 -2938 2539 -886 -1688 36 -2591 2545 2772 -2386
1987 -2386 1906 3866 1487 798 -1339 959 1596 -1474 -1056 -1683 621 1661 -3819 327 4182 83
2003 83 1366 858 -516 3484 -646 -3197 1289 843 -894 -2484 -2153 1519 -527 -968 559 -278 3194
2020 3194 685 -4167 1809 1202 -2756 -289 -1858 -641 1197 -3934 -2161 1658 884 437 -1539 1031
2036 1031 1842 -2044 -805 -969 -842 2434 -2802 -2963 2821 -1296 -1726 1392 361 3478 2003 -1783
2052 -1783 764 1851 1236 -886 -1444 2890 -80 -3424 -478 -2332 395 1897 -3500 632 2854
2067 2854 -2656 -1636 -315 558 2600 -642 -991 1144 640 475 -1957 1030 4768 -68 -427 424
2083 424 -2103 1013 -1007 -3346 2833 705 -3802 -1902 -1686 112 985 -1089 1502 1724 1558 -149
2099 -149 -2849 2854 3861 -885 2763 1387 -1233 987 -2780 -1069 4053 308 -1288 -967 -1384 383
2115 383 -2326 -1124 2176 1812 2268 -1109 -2399 2732 -280 -841 4002 1204 607 -203 -4742 -556
2131 -556 1589 -1287 -697 -171 458 -1323 -4533 -1541 102 842 2324 -2295 -521 1994 -3898 -676
2147 -676 3912 2164 3154 386 -2049 1125 -570 -1983 -377 1033 2369 -2010 -4410 -1507 -2501 370
2163 370 1979 -263 3940 1963 -3869 961 2118 1836 3359 381 1476 1976 -2178 -3007 -1472 2194
2179 2194 3349 -1384 -572 -1096 -3869 -975 -1888 -1486 3748 -1200 -4549 -583 -1821 -1267 -342 634 4466
2196 4466 2613 -961 -2109 -2198 1941 1041 -1205 2313 -879 -3959 -2365 -4287 -443 3326 -941 969
2212 969 2606 -315 -725 -1464 1432 5176 2733 927 -991 -1583 1052 -2153 741 5950 1643 1175
2228 1175 774 -2540 1286 1696 -857 2713 2868 405 -2427 -4119 359 1723 1728 3078 1001 1793 700
2245 700 -4018 734 2880 -765 1052 -1259 -3282 -1704 -5340 -4254 1273 1745 1208 -1842 -2476 -136
2261 -136 -1666 176 1314 193 2910 -1983 -5557 -114 -1425 -2288 2015 1126 1881 852 -3648 -1706
2277 -1706 854 1857 1450 -1444 448 -681 -4287 -1160 -597 922 4812 108 422 3303 -1232 -537
2293 -537 2064 2663 4012 495 -2388 -1482 -1536 62 -447 159 3949 882 -1280 452 -1511 1338 2275
2310 2275 -1544 1928 1264 -4420 -3252 -2324 -341 2122 53 323 67 -600 -172 -2288 1049 3757
2326 3757 -803 -329 -714 -3483 -1091 -2242 -1688 3594 1856 -1030 -701 -937 1669 704 14 2207 672
2343 672 66 -1726 -3959 383 891 -1114 2848 1567 377 1499 -1908 789 4286 1505 497 -503
2359 -503 -441 -267 -2538 -654 1495 772 2224 -596 -1081 2754 -456 -469 3155 695 601 -605 -3583
2376 -3583 -785 122 -1006 -127 143 1767 -20 -2380 941 522 654 1789 -1405 79 647 -3982
2392 -3982 -1344 478 -263 1527 -934 -901 1672 81 -605 -131 999 2413 -2019 -2401 -367 -2576
2408 -2576 -1076 -577 -2116 2026 259 -2772 495 712 499 907 -588 804 611 -1763 -1411 -1889 483
2425 483 1033 -2126 569 1343 -1133 726 -536 239 3142 -779 -1404 493 -660 -298 -1207 -867 2035
2442 2035 559 224 431 105 2878 761 -665 3111 890 -222 902 -1277 836 1971 -1263 309
2458 309 1774 1113 738 -1002 1499 1936 -351 547 -714 -436 1267 -2473 -1184 1619 -980 -93 -201
2475 -201 -1014 1791 175 -1184 1108 556 434 -968 -1817 860 -713 -1675 -308 -1506 577 232 -3208
2492 -3208 507 1085 -1146 94 -590 -390 852 -1701 -1161 172 200 617 -1445 -15 1905 -1079 137
2509 137 614 -623 1971 -805 -2128 1953 21 -1031 329 -565 1317 606 -1006 518 806 928
2525 928 340 -1242 1879 1055 -1797 203 -855 -357 1181 -2633 -1079 1318 -1521 -969 -596 -529 1078
2542 1078 -521 -627 657 179 918 -699 -302 2733 -233 -708 1049 -622 915 429 -1959 944
2558 944 869 -1389 -692 -956 671 561 -1359 602 436 265 886 -1203 1254 2763 -520 1130 1632
2575 1632 237 1783 -212 -578 2433 541 -287 -359 -676 756 -938 -1148 820 -415 363 -793 -1886
2592 -1886 1878 604 -1436 1378 598 -91 542 -2112 -115 970 -569 -396 -1013 -11 -45 -2417 -300
2609 -300 448 -318 1083 -991 -454 1638 -1226 -804 1380 711 1441 10 -1187 1237 711 402 406 351
2627 351 1817 -462 -2110 14 -814 -768 605 -1474 717 882 -2430 -277 772 1016 1562 -57 179
2644 179 853 -653 -830 -1010 -5 1172 -1896 -1464 -79 -2265 -891 -1061 -1511 1625 -763 -2747 -784
2661 -784 -1046 -477 -343 -940 1157 386 -610 -382 -739 1494 1722 -422 1974 1137 -1274 -76 -1364 264
2679 264 2587 -266 194 962 -167 456 -252 1175 3061 1596 1567 664 -146 1750 21 301 3278
2696 3278 1341 177 55 -1204 1409 1500 126 1709 1167 546 -517 -2117 71 675 -186 1100 -669
2713 -669 -762 -188 -3089 -534 1769 17 153 -1014 -1924 -702 -2052 -2294 -549 -242 39 -1934 -2606
2730 -2606 -814 -1743 -423 1084 95 1463 -238 -2963 182 28 -418 630 -12 295 -70 -2114 -1108
2747 -1108 76 1456 2112 -86 505 625 -2212 -555 523 609 2564 -650 -1348 998 -473 -86 1056
2764 1056 1203 3051 1072 -563 -156 -808 669 592 -172 2278 -421 -2304 -325 -1110 763 1894 -104
2781 -104 914 1184 -1044 -1318 -1401 623 1492 -315 221 -567 -1454 -111 -921 599 3102 -81 -18 319
2799 319 -1442 54 -101 -905 1955 964 -849 -1418 -1618 631 675 211 1730 468 -431 -323 -2455 597
2817 597 1335 -841 752 388 -1105 -425 -1846 -524 1974 1626 736 -556 -714 579 -1593 -90 1629
2834 1629 302 889 -926 -2038 725 -456 -744 1785 918 919 -462 -2137 -292 579 555 552 -294 367
2852 367 -362 -2504 -269 503 482 1932 -264 -3 1112 -1909 -886 1041 657 1181 -761 -1642 -298
2869 -298 -1201 -109 -6 -17 1762 -693 -1836 -74 -1207 -535 372 -994 1295 -122 -2568 -947 -234
2886 -234 617 893 -646 812 184 -1003 -117 -784 649 1807 -827 -117 754 -1421 8 -527 212
2903 212 2445 478 -478 86 -394 577 -17 345 1757 307 -140 -211 -930 1369 705 -727 1996 1142
2921 1142 -321 554 -515 778 1914 9 437 264 -109 145 -1578 224 1311 -184 437 -445 -810
2938 -810 501 -1298 -965 1269 -188 -251 -647 -1384 532 -465 -958 630 -43 581 -486 -1342 667 399
2956 399 -569 622 -611 151 423 -2163 -177 1079 -129 482 -636 -342 728 -863 -71 471 278
2973 278 1130 -891 -771 1142 -744 -179 498 -546 1175 -8 -1283 972 159 -193 398 -341 751
2990 751 172 -1003 -91 -463 430 211 -1244 477 560 -1553 -181 -256 -362 910 -1142 -1113 409 -843
3008 -843 -225 -653 -185 1138 -712 -537 445 -364 293 -295 -776 1771 139 -684 552 -194 506 953
3026 953 -846 901 701 -326 53 -570 924 1058 -1036 601 493 150 906 -924 282 1836 -401
3043 -401 183 369 -186 1017 -301 -503 1207 178 101 -220 -402 1058 -583 -903 744 -440 109 83
3061 83 -1578 689 592 -1412 94 282 80 347 -1002 253 670 -185 326 -648 456 955 -1030 -26
3079 -26 846 -4 1188 11 -645 1432 -143 -563 671 -50 599 -54 -699 723 18 41 95 -637 874
3098 874 149 -1568 575 -15 -627 478 -1159 -196 727 -1322 -517 -272 -474 1 -1100 -319 262 -1020
3116 -1020 -352 -983 -886 717 -1171 -1527 441 -987 -439 -584 -1414 500 169 -1436 -138 -284 196 -76
3134 -76 -753 1002 63 -483 629 -616 762 1394 -674 720 1241 -170 941 -2 480 2027 402
3151 402 633 814 302 1222 32 560 2136 405 555 582 -422 1548 161 -407 1370 797 260 309
3169 309 -706 583 876 -232 881 -34 102 293 -1353 201 337 -646 391 -563 -927 320 -1566
3186 -1566 -1140 695 -550 -438 -996 -1272 -483 -1225 -875 65 -770 407 -973 -1600 412 -653 -606 440
3204 440 -608 204 12 -2135 -253 433 -68 521 -308 293 174 -1542 -227 78 31 1019 -1013 -321
3222 -321 730 -1383 -291 745 16 1461 -92 -785 643 23 191 461 305 1633 127 -628 364
3239 364 -524 671 1145 -428 1680 549 -1220 150 -19 530 1548 -434 298 337 -555 -232 -729 339
3257 339 1388 -294 204 255 -961 431 -452 27 2262 44 -575 -233 -877 389 328 -149 958 -119
3275 -119 -25 -587 -1110 359 320 -357 962 -244 -715 -376 -1754 -27 923 -533 233 -66 -731 -183 -1079
3294 -1079 -93 1026 155 624 -705 -968 238 -1082 -124 1605 491 485 -189 -1561 465 196 -484 741
3312 741 173 368 134 -1640 141 305 129 926 -333 330 -301 -1786 361 944 293 1261 -309 -556
3330 -556 328 -841 -358 468 583 1173 -356 -697 218 -980 273 368 -283 1280 -465 -1837 159 -479
3348 -479 31 521 -325 490 385 -1159 -536 -291 723 1234 -311 430 -237 -1166 -45 -420 572 1631
3366 1631 -579 -394 720 -672 115 97 78 1647 259 -362 -389 -1001 342 84 76 1473 -120 -361 -200
3385 -200 -872 564 1090 -159 846 671 -433 0 -829 298 1245 23 325 -268 -766 332 -1151
3402 -1151 199 1255 -638 186 -349 -1056 323 -690 -602 923 277 67 -533 -1168 80 -122 -162 692
3420 692 -221 83 -199 -1253 501 539 -368 1030 -160 -227 543 -1309 -30 1183 317 572 -155 -335
3438 -335 401 -740 82 419 -52 982 -492 -900 780 -916 -413 885 -343 665 310 -988 233
3455 233 19 266 618 -345 692 -98 -1015 -57 -499 32 538 -1157 44 252 -1395 -184 -92 -358 826
3474 826 -451 -479 103 -542 200 -46 112 1007 -184 -348 530 -577 632 411 -563 1041 254 -538 60
3493 60 -419 180 733 -614 387 -191 -231 -93 -649 515 839 -338 391 407 -456 605 -501 -234 1309
3512 1309 -334 -212 168 -318 535 -258 -4 956 -50 13 -49 -453 859 -236 -568 834 -182 183
3530 183 553 -838 404 766 -526 322 15 -67 373 -830 -13 166 -205 416 -439 -120 809 -670 117
3549 117 1036 -100 624 54 -453 743 -122 -256 341 -150 344 -361 -787 209 -472 -295 -5 -1285 157
3568 157 -38 -1635 12 -367 -735 429 -822 -365 170 -688 -285 -256 -143 520 -839 -254 113 -1096
3586 -1096 -143 -433 -1007 565 -486 -1125 262 -540 -117 184 -507 448 130 -436 328 -107 331 388 -490
3605 -490 769 110 -139 906 -201 413 1273 -334 660 997 10 590 68 145 1150 144 506 452 323
3624 323 870 54 105 955 207 245 729 -538 586 474 -723 580 177 19 250 -316 543 398 -450
3643 -450 440 -96 -24 345 -961 330 602 -1045 200 -274 -702 192 -723 -819 194 -518 -240 -471 -828
3662 -828 -74 -940 -645 -89 -823 -52 -327 -1304 375 -146 -786 399 -718 48 145 -1147 157 -212 -87
3681 -87 -77 -556 71 -20 -999 144 141 -379 1013 -363 -302 656 -466 -163 213 -360 763 24 -356 418
3701 418 114 353 459 -8 1175 350 -297 712 23 363 938 -120 688 637 -450 541 203 275 1007
3720 1007 -62 336 365 -415 272 -364 -116 719 -459 -20 332 -697 561 77 -372 918 137 -370
3738 -370 40 -308 -107 446 -303 437 -22 -393 -42 -976 229 548 -916 578 121 -681 110 -1037 -548
3757 -548 630 -625 -266 -315 -697 -156 -704 -206 432 -292 421 -212 -705 620 -85 -277 1026 -153 363
3776 363 203 -1195 274 288 -73 457 -124 102 -157 -798 421 93 90 699 -654 -268 399 -1363 -30
3795 -30 869 -86 679 -48 -317 170 -270 101 176 237 614 -303 -619 394 -634 90 543 -339 509 -33
3815 -33 -1213 312 -167 116 420 -165 -77 -205 -667 -383 -133 532 647 -341 671 238 -1002 181 -147
3834 -147 71 1110 23 -493 277 -435 142 321 -62 585 51 -379 -91 -707 441 144 -442 985 -141
3853 -141 -607 145 -800 308 838 -172 499 118 -368 153 -520 74 757 201 714 -110 -369 310 -531
3872 -531 26 1001 -251 18 -103 -1062 193 -35 -449 711 110 -55 -179 -943 261 83 159 1034 -76
3891 -76 -58 -147 -1132 311 499 -107 682 -292 -439 351 -490 -293 421 239 383 -220 -375 -265 -764 154 753
3912 753 -480 583 -384 -973 253 -320 -119 516 -276 172 384 -811 -240 -43 425 523 -177 619 -87
3931 -87 -1007 28 99 133 1012 -431 -361 430 -1000 121 -48 -18 473 -150 -415 -245 -703 44 30 -97 767
3952 767 -304 -454 351 -492 401 588 -269 764 248 -659 241 -534 -44 601 -188 261 20 -544 -167
3971 -167 -482 276 728 -726 271 65 -537 380 -46 11 878 138 -164 249 -442 195 -16 -123 692 50
3991 50 193 200 -403 516 108 -226 797 -61 -260 388 -731 25 530 18 377 -62 -296 108 -650 109
4011 109 59 -440 588 -452 -448 544 -554 -19 736 -323 226 240 -587 429 -53 -27 348 -215 223 -380
4031 -380 -606 113 -269 -322 333 -365 42 33 -1079 -370 114 -49 48 -363 -465 91 -583 -24 -233 -305 296
4052 296 -291 -337 414 -447 64 67 -640 589 -199 -618 343 -287 -215 281 -191 272 -18 -88 310 -265 353
4073 353 723 -239 447 143 -486 508 -61 70 1202 -146 -18 559 94 221 178 151 811 80 235 329
4093 329 -268 694 -2 -300 823 -119 -175 580 -420 428 390 -513 232 193 -359 218 -505 141 178 -470 348
4114 348 -314 -190 518 -910 -139 548 -724 -24 -116 -573 123 -216 -508 218 -401 -346 -389 -483 142 -452 -403
4135 -403 88 -795 -20 219 -1009 255 136 -536 251 -381 -115 368 -793 120 311 -382 675 -375
4153 -375 -95 272 -648 201 187 -340 487 -123 -233 434 -359 -251 407 -74 418 65 -271 337 -311 127
4173 127 467 -128 799 442 -260 510 -127 117 747 -194 295 582 -266 273 305 15 342 -343 78 284
4193 284 -323 471 -303 69 752 -245 -108 517 -388 241 -11 -406 474 -24 8 2 -291 196 57 -371 159
4214 159 -92 17 304 -663 78 393 -625 485 89 -696 85 -327 -221 166 -574 291 -102 -320 315
4233 315 -446 -66 418 -305 4 -116 -472 431 15 -336 618 -338 -60 330 -392 368 113 -230 672 -48
4253 -48 -94 183 -745 217 139 -285 211 -287 -437 265 -623 -31 332 -50 454 124 -357 391 -87 193 225
4274 225 86 634 -128 -622 639 3 -96 624 -199 288 212 -547 -60 -375 -259 579 -201 -149 -259 -725 238
4295 238 67 -80 695 -281 -177 414 -602 616 157 -204 647 -50 -85 228 -429 192 380 -130 263 -242
4315 -242 -67 -77 -309 295 257 -465 549 76 -554 224 -513 -270 345 -166 327 -77 -156 158 -123 151 691
4336 691 -151 218 149 -508 439 -20 -10 571 -52 -68 224 -862 -12 181 -232 485 11 -330 -187 -709 237
4357 237 182 -290 596 -341 33 333 -383 350 492 -130 549 204 -352 267 -414 148 573 -262 458 -202
4377 -202 -215 404 -493 3 560 -474 234 83 -812 209 -129 88 660 -63 -149 145 -562 260 37 132
4397 132 631 -101 258 -6 -584 514 154 -51 700 -261 -230 123 -609 26 422 -206 537 -149 -405 154
4417 154 -783 354 237 -237 621 -115 -433 325 -296 445 837 -414 531 152 -456 293 -115 -175 447 -75
4437 -75 291 -112 -560 36 -490 92 587 -546 -93 27 -824 91 -47 26 399 41 -10 86 -325 114 200
4458 200 -21 683 -176 66 -119 -372 474 422 -400 570 -176 -359 454 -449 162 510 -121 370 16 -599
4478 -599 66 -563 -13 337 52 387 -110 -549 298 -361 160 583 -158 47 365 -383 136 -128 31 486
4498 486 -470 117 -131 -647 426 -213 -164 516 -326 -201 -8 -911 54 117 -428 159 -119 -232 13 -381
4518 -381 283 348 -215 655 -168 -438 451 -301 342 323 -489 467 13 -521 294 -417 -135 537 -128 368 47
4539 47 -360 81 -104 -70 597 -325 242 91 -699 468 -58 -122 843 -3 212 -38 -312 231 189 -122 485
4560 485 -349 81 172 -521 282 160 -99 523 5 -49 226 -368 145 154 -416 253 128 -474 45 -219 288
4581 288 20 -222 606 -27 -196 279 -320 -349 173 -468 -93 347 -595 181 -194 128 543 -272 288 -215
4601 -215 -241 357 -140 -294 337 -455 26 261 -766 116 383 -302 319 -201 31 271 -168 289 91 -439
4621 -439 327 -157 -446 336 -546 -81 222 -499 450 248 -303 254 -401 -260 159 -272 120 -150 -262 394
4641 394 -203 120 225 -344 446 249 -437 466 -108 0 431 -53 190 25 -383 450 -199 -138 356 -45
4661 -45 220 267 -424 227 53 -339 337 -367 -122 50 -399 47 264 -174 477 -89 -51 369 138 110 97 -215
4683 -215 273 -189 -47 347 -266 67 476 -409 239 173 -334 326 -50 -152 517 -250 40 82 -357 335 -91
4704 -91 -174 430 -384 177 326 -476 403 147 -89 462 -214 67 149 -344 22 25 -196 234 -197 -157 449 -360
4726 -360 -21 100 -590 63 40 -255 478 -208 -165 335 -419 187 -38 -188 342 -90 41 215 -184 296 -148
4747 -148 -185 448 -266 -217 515 -273 138 56 -120 155 -67 -136 223 -458 -47 -131 -495 141 -18 -407 78 -273
4769 -273 -9 444 -400 83 301 -278 500 -63 -192 241 -69 179 1 57 257 -269 -246 479 -527 -203
4789 -203 404 -360 304 169 -642 116 -193 -121 537 -260 146 109 -41 237 92 -106 423 -113 244 77 -485
4810 -485 538 106 87 221 -366 67 429 -359 -4 -167 -159 349 -246 136 30 -377 -55 186 -413 448 -20
4831 -20 -239 535 -476 45 482 -152 277 75 -112 216 -194 294 293 35 301 -20 -351 247 -368 -16 365
4852 365 -381 -43 35 -400 312 -118 -213 303 -120 225 158 -422 350 -27 -20 785 -179 -146 337 -311 -12 99
4874 99 -288 368 -64 -20 33 -250 -69 218 -267 418 -106 -184 182 -171 132 311 -276 217 227 -321 420 -251
4896 -251 -90 564 -95 89 154 -271 110 -208 -50 376 -13 132 -335 -690 22 84 107 339 -345 35 162
4917 162 -598 205 94 146 298 -342 2 99 -174 66 221 56 407 -251 -181 357 -126 -83 376 -91 540
4938 540 91 -480 117 -316 -52 244 -20 166 -255 -511 84 -292 162 374 -49 219 173 -534 28 -154
4958 -154 95 582 -234 120 111 -118 210 -90 -158 337 -167 -35 236 -151 127 -55 26 630 38 -26 131 -446
4980 -446 28 198 -18 283 157 87 492 -726 509 454 -254 485 -40 -136 360 -273 -126 667 167 64
5000 64 -140 -160 -38 -89 -18 370 -159 106 -31 -629 311 -249 -172 411 -128 253 67 -482 175 385 -250 242
5022 242 54 -190 222 -520 286 250 42 222 -267 -77 235 -693 -2 -18 -349 10 -366 -520 219 -556 -261
5043 -261 196 -355 326 19 -219 2 -250 159 312 2 147 239 -366 283 48 167 564 -56 -85 96 -446
5064 -446 245 -82 67 622 113 71 292 -184 219 -34 -194 337 -140 -136 573 -321 12 482 -55 479 211
5085 211 -179 55 -294 195 23 -40 554 57 -327 8 -387 -160 321 -166 175 -185 -330 189 -197 -107 154
5106 154 -201 -269 62 -252 22 -334 -245 165 -255 -61 102 -334 -42 -197 -358 95 -106 -17 -64 -289 236
5127 236 -45 -243 191 -237 -133 82 -489 -67 54 49 7 -343 0 237 -181 19 351 -283 301 -117 30
5148 30 132 -143 291 293 -18 541 -26 -172 372 -81 -83 696 23 387 202 -283 228 193 208 15 -98 -59 314
5171 314 -376 443 286 -14 370 -277 -21 497 -31 123 380 85 201 -296 -463 52 -94 114 24 -257
5191 -257 286 -226 -502 368 -197 -290 179 -570 141 -3 -438 244 -203 309 368 -382 -56 198 -164 237 -421
5212 -421 -110 245 -372 134 171 -108 81 98 -42 307 -173 -242 148 -81 60 62 -141 152 -214 143 137 -328
5234 -328 223 233 -443 125 -108 -80 272 -152 201 305 -190 268 126 -103 297 -73 -27 404 -358 15 -45
5255 -45 -359 391 -251 -96 244 -173 183 -2 -403 121 94 -257 40 -188 214 -17 -279 278 66 -162 340
5276 340 -197 23 218 -141 97 392 -155 219 80 252 441 -82 258 292 -53 633 -215 -160 326 -31 218
5297 218 165 -334 424 147 -394 241 -355 -150 174 -289 246 130 -377 245 -243 1 231 -288 184 75
5317 75 -226 -88 -253 -133 375 -413 11 -8 -212 150 55 -31 612 -96 -7 202 75 -30 269 -170 409 -138
5339 -138 -188 41 -344 379 236 -68 185 74 -105 108 -300 86 304 -413 0 -6 -505 199 -448 -128 366
5360 366 -207 48 152 -218 247 -138 -127 573 58 -2 144 -264 111 77 -302 381 -174 -17 72 -633 343
5381 343 -137 -263 245 -101 -18 -141 -276 116 112 -352 -34 -252 32 594 -540 153 387 -201 342 -84 -92
5402 -92 585 -167 23 114 -327 59 30 -97 110 -57 37 36 -228 307 -348 -434 76 -283 -129 225 -292 -116
5424 -116 302 -395 -151 -99 -22 350 -55 162 113 113 172 7 16 828 -74 -142 255 -425 245 237 -338 588 179 -279
5448 -279 214 -48 232 293 -156 319 -73 -281 244 -416 133 456 30 59 292 -132 193 -345 66 336 -309
5469 -309 -109 -259 -537 56 -172 -145 364 -309 119 11 -87 288 -127 -299 28 -113 -217 -28 -305 -15 244
5490 244 -319 -32 -200 75 15 -315 -83 154 59 362 -256 -317 69 -45 -127 223 -420 320 68 -76 272
5511 272 29 19 194 36 7 217 -75 250 -113 104 396 135 252 284 -190 181 -26 -47 299 83 33 341
5533 341 -223 31 73 -176 280 164 113 151 -80 -31 -133 -132 500 -124 -258 126 156 220 358 -197 484 52 -174
5556 -174 50 -205 72 203 -85 199 -26 -467 246 -156 -64 666 -192 27 31 -116 394 -349 133 -53 -427
5577 -427 -288 -208 -386 51 -316 -270 507 -217 -345 76 -318 103 -86 -403 124 -144 -141 53 -434 131 56 -247
5599 -247 282 -12 -66 300 -488 -165 87 -199 60 -237 -354 235 -209 -85 182 135 389 109 110 305 -13
5620 -13 214 400 117 388 221 -253 421 421 -151 266 -103 242 0 -271 207 285 -35 253 -103 156 158 -287
5642 -287 -40 224 40 269 57 -25 281 -215 -175 63 -343 184 -222 -378 -212 -221 -57 -120 -149 303 42 -417
5664 -417 390 -201 151 27 -204 186 73 -179 -179 -108 9 40 -196 187 61 -50 177 -300 -23 399 159
5685 159 184 120 -115 80 -224 132 389 52 287 -25 70 131 1 -87 154 -148 -106 213 -193 324 -65 -348
5707 -348 204 -133 -240 75 -91 105 421 -143 -191 -38 -332 261 -125 -267 192 -361 -45 46 -472 199 -103
5728 -103 -135 265 -177 -132 -183 -230 261 118 24 -48 130 136 24 -412 317 187 -14 112 90 297 170 -10 119
5751 119 178 -59 183 -97 -122 237 -134 -7 245 -42 537 70 -58 302 -99 -251 110 -124 198 92 -294
5772 -294 231 16 81 144 -162 95 339 -125 -5 -66 -20 37 -213 -5 204 -32 -50 -66 -155 68 -58 -206 344
5795 344 112 204 60 256 183 -77 16 349 -90 295 84 -285 340 233 -69 292 -261 71 194 -434 -74
5816 -74 -37 -185 -133 -151 165 139 -172 185 -288 110 184 -49 131 71 -267 -142 -191 -242 -189 -10 -28 149 -81 -111
5840 -111 19 23 153 121 -329 226 17 -67 194 -524 -104 157 -171 9 67 176 9 -27 -157 253 -275 151
5862 151 -97 -97 293 -285 55 214 -99 425 147 -346 65 198 -109 -112 -53 0 34 -99 6 -5 19 -29 -103 44
5886 44 220 -138 27 110 145 156 -3 -208 282 -51 -157 114 208 317 104 118 359 108 -29 81 -109 302
5908 302 -150 -189 -149 -114 -9 122 -208 288 -60 -22 76 65 192 -82 -160 157 -167 -31 76 -187 -355 356
5930 356 -178 115 106 -158 166 106 -23 153 -231 -108 -137 -285 128 -194 -335 87 64 109 236 -184 176 297
5952 297 -153 113 -217 -225 -115 -183 -341 6 -318 -145 -60 -144 -39 -275 -7 350 -31 28 -97 -135 -2 -389
5974 -389 -313 203 -184 60 -25 -107 145 42 -3 32 82 11 51 -427 43 -163 -50 5 -158 356 466 -118 62
5997 62 182 72 151 -35 336 135 -256 126 -142 -78 134 -93 -192 204 133 51 508 -161 404 281 -193 -1
6019 -1 83 196 253 72 244 350 -55 77 -13 179 374 -16 -219 212 -313 -364 -231 -98 47 34 69 11 -78
6042 -78 -122 -149 -28 396 -236 -371 -213 -433 184 -309 -513 67 -239 -264 -212 -129 -75 44 -212 -73 -101 -237 -143
6065 -143 -237 -7 136 -160 126 -137 -42 389 2 88 197 -38 163 97 -198 298 -23 -230 191 133 251 65
6087 65 114 466 389 71 631 277 295 160 -207 91 247 -34 116 -369 93 -78 -330 176 65 97 240 -189
6109 -189 -195 141 -257 11 16 -183 230 -147 -93 144 -38 30 26 -53 117 -147 -327 -57 -252 -216 -183 -229 -145 14
6133 14 -166 124 -78 -123 137 -75 -77 138 -173 -171 -162 125 40 -71 63 3 129 43 173 -212 325 -187 -119 230
6157 230 -80 60 160 -44 270 0 -165 -4 -212 278 240 -295 132 -119 -155 210 -422 144 155 -244 -12
6178 -12 -20 -146 138 -99 -153 84 -74 35 -137 -344 282 -88 -113 189 -38 -55 360 -266 -11 133 -315 -89
6200 -89 94 54 46 -102 102 30 102 185 134 100 -35 17 121 269 75 -190 15 -105 194 -253 27 239 38
6223 38 124 -147 4 121 -41 108 -194 38 185 -248 -301 195 138 171 375 -193 128 -41 -138 -56 -12 -39 -69
6246 -69 -279 -143 34 -70 21 -142 175 416 -175 -136 136 -257 -160 156 75 61 74 -142 213 -84 -111 -4 106
6269 106 379 227 -210 7 -100 0 20 9 152 -155 -201 124 -119 14 300 -172 0 51 -185 239 -123
6290 -123 120 25 -381 -285 43 -148 175 0 -56 185 -201 21 60 -25 87 -56 -127 217 257 72 2 -291 62
6313 62 124 171 179 -6 -29 279 -290 63 185 -97 234 -293 139 99 -240 -198 100 74 9 32 5 -26 52 -163 208
6338 208 -268 -132 -181 33 80 -85 -79 -99 -85 87 94 -151 40 -56 -113 -361 -112 127 219 -302 129 130 6 242
6362 242 203 57 305 123 -245 -208 -112 229 -214 100 88 -25 167 36 103 505 133 -65 167 -47 193 84
6384 84 -321 55 -142 -114 9 -143 255 85 -107 229 210 -253 175 55 60 -27 -170 -113 -290 -32 212 -231
6406 -231 -138 69 -13 80 96 -140 51 -58 -280 -40 -253 -183 -76 -251 224 297 -92 106 135 99 -79 -226 -68
6429 -68 -75 80 8 -33 143 137 -167 61 265 18 299 353 -109 286 -39 -261 87 -205 -70 78 -229 27 -35
6452 -35 -3 -51 -117 90 108 -346 -21 45 -205 42 -168 -31 -140 -125 24 260 152 170 48 163 283 -145 233
6475 233 129 148 273 207 -103 -39 42 -289 96 72 185 224 -90 213 41 379 -81 -2 55 123 -138 -124 174
6498 174 -158 199 -163 41 141 -196 5 -95 35 143 -91 15 -69 -204 -4 -133 -109 116 -126 56 54
6519 54 -249 119 -127 -378 185 37 -59 -117 -278 140 260 -209 -127 -36 27 4 42 155 113 -202 -191 77 56 315
6543 315 -145 -101 267 -56 297 -109 135 207 82 54 92 151 130 80 -192 244 161 3 243 95 52 123 -96
6566 -96 109 252 104 -32 236 123 -48 -209 -213 -252 -313 180 -195 -95 126 -151 -22 -62 -66 -1 90 -152 -136 -126
6590 -126 27 -138 -286 149 71 -43 258 -15 -125 127 -144 151 128 -66 -139 -109 206 150 -125 351 116 -71
6612 -71 98 -9 50 168 -179 -214 227 223 -38 -84 58 73 41 -184 20 10 324 30 -178 -37 122 -159 -120
6635 -120 -12 245 118 -195 -28 172 -195 106 -273 123 65 -430 -401 269 134 -85 -49 -340 98 26 3 -57
6657 -57 -83 314 -66 -68 38 83 159 -2 87 83 116 -257 112 -18 -134 190 206 146 -133 101 75 -141 290 25
6681 25 -215 314 156 -150 35 -314 -151 -218 115 -116 28 132 154 -97 -30 282 133 114 -228 -35 -14 -9 -347
6704 -347 237 -48 -104 173 -340 -107 90 -272 67 71 35 117 -182 -59 43 -173 4 -6 20 368 -184 -126 223
6727 223 18 80 -108 75 25 -265 -281 -87 -198 -51 154 -154 205 14 -278 -201 -183 66 170 -48 101 -71
6749 -71 -248 97 -112 -95 57 -32 -176 -10 84 62 31 61 141 69 116 34 -305 273 -155 93 4 195 54 51 157
6774 157 275 255 -308 40 -115 121 58 -225 53 179 -8 -110 10 202 34 -22 90 122 180 254 5 -37
6796 -37 79 -166 -65 172 -103 249 -93 -38 176 -60 -26 25 310 -81 121 -204 16 67 129 167 23 202
6818 202 -18 49 51 148 2 95 186 -32 151 -274 -85 170 71 24 141 -33 -26 -81 -81 252 143 170 20 -94 -65
6843 -65 223 -101 -9 -216 35 -39 -349 -5 -21 75 -119 123 112 19 23 -151 -6 -15 -204 -258 39 97 -80 7 -54
6868 -54 74 93 -43 73 6 -123 119 -225 -104 234 -164 94 55 -49 78 -104 -289 -8 81 191 -75 132
6890 132 75 -74 -213 -33 171 -25 -53 -131 -62 170 163 -124 -142 -94 31 96 29 -2 -259 31 -94 -209 80 -263
6914 -263 88 40 -36 24 -50 191 117 -263 -192 -109 76 -98 -176 -20 10 76 46 -81 -201 118 75 -240 -129 -97
6938 -97 159 45 -44 18 -15 18 -36 386 131 115 123 -79 17 -76 194 -48 59 162 16 15 -99 239 71 75 -47
6963 -47 -125 102 76 35 94 112 99 -232 -163 111 -180 -69 -107 -127 99 -225 -187 55 -129 -145 -114 -180 130 31 12
6988 12 -140 56 159 154 -278 23 209 -197 -28 4 46 123 -242 75 2 -26 236 -26 -199 90 -79 -103 26
7011 26 -135 14 192 -66 372 -3 -29 35 81 150 49 -131 9 -70 -14 134 -114 53 -51 -29 118 -53 -90
7034 -90 -148 -142 -174 81 102 93 -125 -48 18 77 -114 144 -60 -28 -243 -285 222 -113 -5 -17 -101 -53 6 -15 92 -42
7060 -42 -82 105 -119 4 -78 -245 243 120 147 33 -121 239 186 -78 -290 -188 127 76 -192 -187 50 197 -40
7083 -40 225 42 28 -101 -92 -177 143 238 78 190 -45 138 -259 -66 57 -55 106 -156 112 142 -210 0
7105 0 -351 -38 41 49 -151 -122 -25 -110 -167 107 387 -239 -148 -66 -64 28 63 23 -66 -57 -109 -84 -10 149 -83 -198 137
7132 137 -99 31 -42 121 6 180 169 159 -69 22 -79 -237 -171 -115 38 -190 -97 314 246 -180 178 161 -99
7155 -99 8 51 -45 329 -81 33 -100 55 114 -57 -17 56 107 -31 -20 18 -70 -16 -79 0 40 52 32 -343 3
7180 3 137 -336 -156 132 -24 3 -235 -141 126 -103 -73 -88 -8 -109 130 -215 210 -327 40 -204 -81 173
7202 173 -98 15 159 -80 188 -28 -81 155 77 -77 -75 20 19 38 -199 -24 29 -81 145 -127 84 -23 -69
7225 -69 -4 194 73 73 -144 -291 113 -275 158 -123 17 213 4 87 50 124 171 -172 97 56 -65 88 -150
7248 -150 93 -74 304 -97 -7 -35 -61 -75 -102 37 199 -261 -212 173 -163 176 -129 -49 255 137 34 49 102
7271 102 30 -44 13 378 -174 -88 181 17 -26 77 10 100 -32 -15 53 -27 -1 93 50 -62 240 58 131 -176 -240
7296 -240 126 -60 -73 -62 -220 -89 65 13 -224 167 -68 -51 -333 88 -139 -154 28 -9 111 7 140 -43
7318 -43 10 -239 235 -221 -132 -270 -98 -132 24 -268 87 -342 -61 -28 -102 136 -238 -117 169 183 51 -73
7340 -73 -172 26 -160 -64 324 62 -246 66 119 25 29 130 186 221 -230 -41 -187 -23 299 70 165 -137 1
7363 1 -4 -4 -22 125 -96 88 6 61 62 -2 -163 197 -9 -137 264 -92 267 -232 165 64 -149 -138 -215 -91 -203
7388 -203 157 -129 22 97 -87 -18 -176 43 250 79 96 100 -246 -49 -151 -6 94 -20 87 102 -11 263
7410 263 167 -27 340 158 134 -144 -31 133 -25 -189 -77 284 -47 -45 -50 122 110 89 94 -87 -120 19 -134 -152
7434 -152 -220 12 -98 -53 -233 -8 -238 -100 168 79 -58 -332 -77 -45 254 165 -217 -180 -106 132 -168 -72 12
7457 12 14 113 39 33 -39 133 -63 -193 27 192 -157 155 -8 -139 61 -79 -29 206 -95 103 145 -124 10
7480 10 -69 54 18 30 30 140 324 139 99 175 92 5 -18 -62 126 92 66 13 -131 -62 -18 -57 93 225 -103 -1
7506 -1 -61 199 -172 80 71 -158 253 136 183 -105 94 123 -6 96 70 43 -25 24 -16 -69 -113 176 139 -156 149
7531 149 139 -113 41 -39 -148 64 48 -12 16 -75 -51 297 248 -299 -102 -96 7 88 127 28 233 25 43 -64 27
7556 27 -193 -9 -260 -36 1 -37 34 91 52 -240 -38 105 -84 166 -74 129 93 -368 -138 -121 218 -90 -76
7579 -76 89 13 -51 194 -316 -126 -62 177 50 108 22 62 -189 -65 254 -85 -83 48 -69 -59 125 -94 -13 -7
7603 -7 -174 -103 -180 189 198 102 26 41 -7 15 -58 -40 206 56 -83 -68 116 13 64 -100 53 -88 -118 -101 6 31
7629 31 -154 -160 -78 -53 159 175 37 41 -48 34 5 -139 -36 118 -355 123 11 151 39 -52 89 130 177 93 157
7654 157 -72 178 28 11 -81 -50 -69 151 35 -178 59 -265 -15 119 121 -123 -104 -242 113 -343 -292 -208 -94
7677 -94 62 -284 13 106 219 379 168 77 295 35 105 160 -67 -170 -226 257 179 -60 37 110 42 275 -112
7700 -112 327 220 85 -78 119 -26 117 -252 -40 99 67 17 24 16 260 -102 -175 87 -92 -12 -53 -245 122
7723 122 -13 -332 25 103 -149 231 -93 -166 164 -41 -126 -456 78 -145 122 -277 56 57 91 -19 23 56 167
7746 167 -161 40 38 3 19 -65 -111 96 38 -347 -42 15 88 194 -58 84 175 -209 -252 -70 20 -20 -310 102
7770 102 -66 -16 2 -36 277 -99 17 62 -206 84 -13 -45 144 -253 28 -4 49 -38 -3 -183 -22 -65 223 -105
7794 -105 -113 -21 35 31 -132 -2 21 80 -175 11 -31 -175 250 -106 -69 -1 46 60 144 41 48 68 -297 -117 -101 129
7820 129 80 -93 91 137 17 -192 -40 21 -107 -43 -392 -29 47 -29 -510 -23 60 157 30 107 133 2 -90 -10
7844 -10 244 119 100 108 -83 136 -13 -79 34 158 101 -24 118 125 54 -138 -91 28 -68 119 -153 43 8 97
7868 97 213 14 134 66 -225 34 129 -285 -182 144 275 -49 -335 -52 42 -132 175 -22 -169 49 -28 -216
7890 -216 32 -59 99 -117 -304 121 92 -239 -72 4 109 146 -121 -16 106 88 -95 -287 24 -221 -94 119
7912 119 -17 -314 -160 27 41 223 -247 88 57 -138 23 -93 -42 -131 -140 142 -24 48 170 -8 -86 -1 -159
7935 -159 -148 81 -267 -102 118 -61 42 61 -95 -81 -56 -126 338 142 -154 146 -93 106 -39 51 -102 34
7957 34 -14 -46 -106 88 29 0 -74 -160 19 -172 -215 -111 -42 -69 60 -112 134 -26 -56 -79 169 0 180 -87
7981 -87 141 -48 -48 -52 37 -199 155 -172 -211 1 -55 -11 -54 -102 30 121 -127 -84 -207 144 36 -53 -23 -43 28 187
8007 187 69 175 51 -35 -16 34 -68 38 209 89 14 -86 -133 93 112 40 245 85 337 138 -84 -58 -108
8030 -108 130 38 -162 32 149 263 203 159 33 -233 -123 3 55 -16 14 28 -178 98 -68 -89 -149 55 176
8053 176 -324 28 53 144 -110 -69 104 76 161 -12 -10 71 -123 138 -332 24 110 36 117 79 -147 45 48 378 102
8078 102 14 111 106 90 99 -125 217 111 67 -509 -134 26 119 -51 -96 38 -173 244 255 -122 -35 -57 -142 -80 14
8103 14 -38 35 -39 181 -57 40 46 127 244 157 -124 41 5 27 129 -223 -129 75 -168 28 248 182 161 -158 163
8128 163 24 -148 59 -111 -53 145 -119 68 10 -62 34 -23 -111 293 290 -87 -65 93 -59 -12 -131 -30 -129 -93
8152 -93 139 -186 -26 31 -55 -122 107 -156 -92 -25 18 -64 -277 -108 -30 33 -130 73 -93 34 65 -36 -202 -40
8176 -40 12 -183 -132 86 -189 -25 -40 -22 276 16 83 -55 -37 222 211
8191B11
$$ Imaginary data points
##PAGE= N=2
##DATA TABLE= (X++(I..I)), XYDATA
0 0 0 0 0 0 0 0 0 0 0 0 8 -8 8 -8 16 -16 24 -24 32 -38 45 -56 64 -72 85 -99 115 -131 149 -172 197 -223
32 -223 252 -283 319 -360 402 -449 499 -556 617 -685 755 -837 923 -1018 1125 -1236 1362
49 1362 -1499 1653 -1822 2011 -2220 2459 -2731 3041 -3404 3829 -4341 4969 -5755 6776 -8152
64 -8152 10106 -13093 18148 -28216 55424 -268559 -629547 478152 191204 -517961 298780
75 298780 609480 -313624 -204962 439833 -20397 -344250 271654 237138 -211460 77672
85 77672 188018 -216915 -94654 250258 128583 -56672 134683 207917 -148011 -140086 243418
96 243418 43689 -133446 265083 166301 -240151 88840 286463 -208433 -78330 513024
106 513024 74051 -372089 220275 159456 -469320 -2837 322770 -259968 -155438 245395
116 245395 -162415 -290820 181313 102039 -191228 119199 229050 -149310 -108120 65925
126 65925 -109122 -40107 111894 -58878 -97861 4631 -60649 -131300 -38695 109301 35729
137 35729 -102548 39245 67765 -157569 -94923 105824 -2778 -68553 128698 50393 -211231
148 -211231 25575 215795 -115516 -28998 294036 -22356 -183061 111944 790 -172065
158 -172065 53462 64856 -123490 4528 70844 -168125 -87771 171342 9883 -56201 149877
169 149877 18931 -110171 51194 16090 -78503 42411 75200 -50224 -80893 23087 12863
180 12863 -102845 -12155 121846 23245 -68211 -6088 16573 -63983 -37881 78459 -9177
191 -9177 -61264 97361 -1968 -132388 89744 106645 -71530 57959 139046 -34577 -43401
202 -43401 58606 -23903 -43675 106888 21089 -119827 57087 67265 -124187 8959 124904
213 124904 -13931 -3013 69072 -4831 -36925 18137 16207 -33858 15806 60698 -48614 -73772
225 -73772 23963 14693 -28756 -7036 31816 20677 -43865 -20666 6003 -51444 5687 34399
237 34399 -67665 -10015 53384 -65569 -65596 55204 33177 -41594 12080 39359 -51418 -14299
249 -14299 48441 -64199 -27018 90875 -37747 -80284 50090 15169 -56143 6618 48619
260 48619 3648 -9178 27431 -11454 -27525 52365 14067 -47984 29121 39888 -26948 -26115
272 -26115 12459 31592 -8579 -13282 34302 -5259 -17640 23566 -24596 -22215 45094 3001
284 3001 -49125 -2648 38417 -18243 -48271 32603 22338 -38310 21822 9053 -42753 32961
296 32961 25056 -47267 7546 48972 -8418 -38002 15739 34495 -23934 -5686 26134 -18935
308 -18935 7481 25169 -33701 -3267 37986 -20 -19919 -1592 29682 4881 -35138 9576
320 9576 18432 -16186 3015 -4975 -13895 16190 5442 -15715 -9733 20133 22885 -35552 -12939
333 -12939 39221 -18269 -27823 9583 -17218 -9152 5348 -26212 -18887 12057 10635 -26378 -20439
346 -20439 34466 1267 -36048 10604 2497 -12803 9253 -17579 -11004 22325 4309 -7573
358 -7573 959 27480 32218 -9909 5277 34808 8415 2664 -852 150 19097 -2659 -10909
371 -10909 2797 4160 23759 1781 -14109 39072 25377 -14731 7896 12111 7612 3896 -13032
384 -13032 -4538 2386 2794 -10464 -26382 17507 22702 -26181 -1768 11893 -13434 -4261 -19704
397 -19704 -22727 6469 -11685 -30118 -21453 -5142 6346 -17762 -10009 23840 10534 1964 -6075
410 -6075 -12609 14798 -2561 -24265 -2451 -8046 -9528 -14224 -32771 8165 25458 -7491 6204
423 6204 22115 17111 9646 -3337 8310 16491 16424 9702 -23426 -1076 24869 -23368 -9797 33925
437 33925 8976 1855 -1167 -15468 997 -3758 -19121 -15345 -4679 3833 -27632 -38641 515
450 515 5019 6710 14642 4450 23981 11567 -23674 1511 9491 -1160 862 -26235 -20881 -917
464 -917 -32391 -34638 4361 25825 13227 -5164 11215 9090 -3019 25467 13903 6710 46711
477 46711 10205 -24644 16430 21647 12254 22197 27552 41904 26809 -5775 -7425 9069 27106
490 27106 8495 -7879 14063 -7350 -24977 -1546 -7465 15627 43592 8170 6915 20625
502 20625 -3013 -8371 -10566 -1403 20760 -7329 -47243 -49896 -28040 -24399 -44931 -11333 17223
515 17223 -26398 -25736 -15323 -41227 -9637 4217 -23442 -497 3827 -31476 -41583 -32479 -5300
528 -5300 15141 11304 -3577 -14118 4283 -11913 -45529 5182 28115 -14267 -6183 -5264 -23213
541 -23213 -8908 -11600 7790 51281 43584 25344 16355 7505 20753 33638 34261 21087 23641
554 23641 36222 -17461 -40253 19366 14667 -3374 33412 27139 9973 916 -24917 -13 36828
567 36828 25986 9837 5483 96 -16978 -15503 6049 -88 21222 44897 -11426 -24647 10765
580 10765 -20045 -26005 10249 14053 5803 -28062 -53013 -24686 -6902 -10678 -1360 19034 19309
593 19309 -12532 -12755 -2669 -17199 16212 31253 -10054 1250 459 -45146 -33592 -4144 13318
606 13318 25173 -2609 -16583 1271 -2932 -20098 -9823 31581 27437 -12056 -125 -8283 -36229
619 -36229 735 11593 2032 35987 17230 -26101 -18891 -7560 3526 8372 -1522 1599 1563 -13335
633 -13335 -39136 -34097 14931 14233 -3678 24697 8794 -19126 -6699 -9989 12146 39641 9622
646 9622 -5073 -2731 -14888 -10838 -6107 -1386 15903 27338 12372 -25606 -14650 17879 -8926
659 -8926 746 42512 13151 -8433 -7538 -23291 2111 22738 6960 12003 20364 11228 -8172
672 -8172 -15412 2996 11960 20735 18974 -12231 -5347 -1170 -34150 -8954 24494 10289 6092 -7222
686 -7222 -15753 2244 -7651 -13266 8712 18121 8675 -14359 -20545 -13526 -12483 6613 6957 -2213
700 -2213 19364 -5148 -36606 -221 11080 -1214 10464 3076 -611 2449 -16015 -21193 -2081
713 -2081 20845 13533 -8182 3410 -546 -19092 -596 2697 6624 25205 -4090 -19010 2329
726 2329 -3069 -7241 -1164 4909 19040 6147 -14393 -12702 -4148 8517 1638 235 16177 -1607
740 -1607 -13421 -5606 -13869 7789 18386 -11869 -1005 13209 -9079 -14934 -7473 5560 13795
753 13795 4047 -2246 -8686 -2829 3844 -14304 1697 24330 -940 -5288 801 -8424 6752 4653
767 4653 -6541 12869 17220 2269 -9123 -7477 12088 8031 -1983 7393 3605 2700 -4649 -17547
781 -17547 5092 10147 -6079 2792 -2477 -3265 6320 -14363 -11096 13936 7253 -5245 -9531 -2651
795 -2651 1443 -10524 -4144 1875 -574 10226 -8990 -18006 12832 2464 -13895 3049 3708 1559
809 1559 -3094 -13562 -3628 2498 2927 -654 -7912 9114 9477 -11357 397 9012 7773 8055 -6584
824 -6584 3510 14518 -5737 -2712 6140 4463 13471 1491 -5502 10303 10573 2397 -3612 4991
838 4991 15985 -4705 -9245 5135 -4272 823 1298 -14501 4879 10666 -11323 -7467 2839 5379
852 5379 -832 -11013 355 1405 -6039 -4592 -12767 -1822 8534 -12770 -8638 4362 -1106 894
866 894 -8055 -5664 11081 -2638 -10340 -1717 -1783 2903 -4920 -9172 5328 5029 1194 -2544 -2607 15807
882 15807 5119 -10364 8588 6745 -840 4130 -7693 -64 12262 -2645 -5488 3866 10293
895 10293 5368 -7539 5500 11508 -1515 3083 -3391 -4346 10651 -7034 -14537 3714 802 -3432
909 -3432 -7476 -8575 6071 -1062 -10334 -2841 -2156 2119 -5481 -14388 445 1105 -5130 -2747 -7075
924 -7075 7426 8556 -13306 1034 12368 289 2663 -729 -1295 7668 -778 -5658 -1691 7679
938 7679 10248 -8349 -368 16853 791 2175 9981 4147 15525 9223 -6697 6646 11075 5225
952 5225 1788 587 13395 7645 -4930 1847 2885 7104 5839 -7312 3717 5344 -9296 -5908
966 -5908 -7592 -1275 8694 -11781 -12108 4365 -4860 -10081 -7331 -2692 2890 -5848 -9080 -11096 -11360
981 -11360 155 -12687 -16095 8971 -2268 -17456 -6391 -7352 -908 2764 -7905 -413 4791
994 4791 -1869 -8796 -11208 4824 7317 -4731 2856 1515 -1799 2251 -8471 2389 18252 3799
1008 3799 1112 1946 -662 8684 -219 -4251 14815 15528 4141 -2467 1085 9638 1532 5526 15440
1023 15440 5295 8028 1931 -15260 5452 12974 -3814 2155 5693 1482 -1420 -10845 -4857 6134
1037 6134 8992 5133 -6674 36 2406 -15001 -4294 9313 3517 5896 -5317 -10425 3301
1050 3301 -4623 -7223 4324 4760 8475 -948 -15471 -7942 232 2900 -931 49 11308 -5130
1064 -5130 -19091 -992 -295 310 9598 -3827 -141 6703 -11971 -13661 318 8388 9215 -473
1078 -473 -2693 -5008 -8330 -542 -3940 3360 18591 -2531 -13220 72 -5079 -4180 -793 8 13760
1093 13760 4610 -13210 -10445 -6924 1622 5683 2603 6241 -339 -5365 -7493 -12130 8534 15355
1107 15355 -4678 4641 7841 -8052 -5792 -5986 912 18499 10915 -2834 -5204 -2377 -625 -6439
1121 -6439 5672 16365 3180 1834 -3511 -12855 3503 2580 -4490 12222 11757 -1088 -8569 -14814
1135 -14814 269 10626 4496 4891 3636 1070 -7205 -13668 2463 8106 3290 8715 -2530 -5745
1149 -5745 1429 -14465 -8738 14327 10306 3062 -4895 -11318 -4554 -3167 -1156 3413 7104 9535
1163 9535 -8325 -14718 1987 -3333 -2634 10545 4599 6323 1364 -17709 -7977 6785 7748 7086
1177 7086 909 1879 -262 -10139 -5460 827 9037 11717 -4373 -1867 2057 -12912 -5949 3183 4180
1192 4180 14101 426 -15167 -5426 -1478 -2044 11 4401 10085 -418 -8345 -6391 -6931 5252
1206 5252 5746 -2740 11148 5147 -14165 -7245 -3129 3235 12095 1127 -2497 433 -3646 -5894
1220 -5894 -7707 4273 12569 1540 -539 -2437 -6599 103 -5126 690 18433 5089 -6365 -2980
1234 -2980 -5358 2310 5379 194 7033 7170 369 -7162 -9361 3887 4314 -803 6593 535 -3031
1249 -3031 -3210 -14376 -280 14001 523 -1896 336 -2882 -2685 -7055 -3110 5236 4803 2646 -6196
1264 -6196 -6702 2228 -5358 -2877 8559 4086 4557 -3336 -12614 2459 4687 -3854 2027 4080 3508
1279 3508 -1545 -9131 -1515 3713 4699 4973 -1260 4434 2590 -10923 -1284 5303 2438 6897 -3154
1294 -3154 -5857 5531 -1186 -5068 2268 7391 8522 -1837 -4075 1966 -2060 -219 437 -963 8077
1309 8077 -1400 -11625 -594 -351 109 2818 -3922 2208 4734 -6215 -6873 -2528 2642 1940 -5950
1324 -5950 -571 642 -5258 -1727 -4252 2035 10804 -2931 -3902 4776 -608 -640 -1263 -2049 6076 1805
1340 1805 -4469 -3162 -935 4525 -715 -2940 8015 3156 -1406 -236 -5040 4383 4966 -7520 499
1355 499 4495 -1849 -963 -3362 1788 7642 1692 669 1029 3181 4275 -6432 -1517 6239 -2974
1370 -2974 -2745 -3224 -5355 3800 -2156 -7389 3359 3015 -287 -2289 -3982 3000 670 -4153 -1627
1385 -1627 -1613 2528 -1257 -8699 2991 4677 -2078 2251 -533 2123 6617 -4864 -3667 4332 681
1400 681 -1793 -4380 -486 4087 -2489 -776 1945 2913 8096 -860 -2489 9071 2267 -2630 1279
1415 1279 -2064 2538 785 -7194 -760 2878 596 -1060 -2147 5445 4003 -2898 972 260 1996
1430 1996 2912 -7409 -1311 5452 -4204 -2830 -385 -457 4460 -1731 -4162 2545 988 -2024 -5965
1445 -5965 -3430 2607 -5354 -6443 -1217 -3310 2304 -268 -6129 6574 6363 -2335 1449 1816 2958
1460 2958 2649 -4117 -1069 1290 -816 -2870 -6287 2122 4614 -4431 275 2956 401 3930 -3401
1475 -3401 -2886 7331 377 -3759 -211 76 2982 -12 -1450 4608 4693 3603 -746 -1784 6991 606
1491 606 -5948 1998 -528 -1590 -555 -8355 -763 5877 -1631 -973 2362 3822 2306 -2997 297
1506 297 3040 440 754 -5232 -2449 3846 -6655 -5190 3802 1236 3137 -446 -4813 3777 2671
1521 2671 -3386 -7 2016 2640 -2457 -5882 320 -281 729 1632 -2146 6070 4322 -7758 -615
1536 -615 3337 -134 2241 -3330 -3612 1636 -3927 -5636 -1373 3799 4841 -2080 531 3523 -1576
1551 -1576 1062 -10 -44 8766 -152 -8194 -382 -933 -1192 756 -1366 4118 4059 -3029 -3630 -1178 3669
1568 3669 1128 -3064 3955 866 -5870 -2883 -5547 1424 9093 -1771 -1717 4414 -443 -1164 -1034 877
1584 877 6132 3222 -1221 -3718 -2625 965 -4760 -1365 9020 1658 -2444 -2030 -5849 2407 3506
1599 3506 -3944 2202 4088 -1967 -4556 -5862 -762 3058 2182 3245 1056 1999 -124 -8008 1495
1614 1495 8533 648 1677 -1516 -4936 922 -4367 -5992 4431 5101 1173 -2857 -3998 -1188 -2078
1629 -2078 576 4074 3264 5527 -3037 -9544 2477 2637 -1538 4832 1919 1354 1611 -7272 -5252 2535
1645 2535 4173 2673 -616 846 -1092 -7293 -1511 1922 4621 7810 -2658 -3756 3973 -3071 -3788
1660 -3788 3021 3002 6341 1890 -7020 -4613 -1881 -693 93 2003 5688 -1984 -7232 -2908 -3489 3039
1676 3039 5892 -2149 4224 6656 -5414 -4384 111 2860 7001 2454 -1007 -1752 -4243 -4701 -4885
1691 -4885 2247 6987 -1760 -2783 -1546 -5237 554 -464 -1980 9126 5893 -4191 -3683 -2894 776
1706 776 3079 2703 5283 3405 -362 -3797 -5582 3862 4107 -2128 3080 565 -4771 -2665 -8143 -4020
1722 -4020 8263 4354 -308 -241 -769 -733 -2154 1913 6721 4034 1916 -4441 -5644 1283 -3906 -3971
1738 -3971 5753 3000 680 -1026 -8221 -1836 4312 1650 2099 2144 705 -3305 -7653 -1712 1503 2371
1754 2371 3457 -1597 1463 2899 -7205 -2780 5644 2922 3936 -650 -6303 -2347 -2334 -3485 432
1769 432 3933 5284 -1380 -2639 2256 155 2546 4063 1366 6990 1759 -9096 -3601 231 -328
1784 -328 2558 -273 799 1240 -2837 -2819 -244 4660 4552 -1980 315 315 -5325 -2829 -3351 12 8231
1801 8231 146 -4584 1711 265 -136 1811 1686 4160 1252 -3326 -4838 -4402 343 -2195 -3812 4386
1817 4386 1417 -3274 -691 -3159 2352 7026 -591 -548 2174 -1950 -3576 -4320 -149 3157 166 635
1833 635 59 999 3506 -1929 1202 8323 2097 -263 -1297 -4812 729 -468 -4927 801 2723 -43
1849 -43 -2027 -1757 3060 2164 813 3198 494 1768 -760 -7895 -1042 2861 -2552 -71 -389 -834
1865 -834 2727 -1561 -1598 3594 3268 735 -3124 -1926 39 -4833 -3563 -721 -1408 2806 -1532 -4476
1881 -4476 3855 2518 -391 2643 944 2152 1008 -4558 -2987 -612 -678 -2127 -2978 2357 1884 -2754
1897 -2754 1479 1856 2845 5739 -1656 -382 4438 -1861 -2893 -179 -345 2078 -661 -1793 1284 1717
1913 1717 2345 -586 442 5531 -376 -3234 43 -2475 80 -95 -4815 1387 3212 -1581 399
1928 399 2090 3456 3941 123 1479 1946 382 -984 -4963 -755 2058 -4802 -2452 633 -1452 2023
1944 2023 -672 -1908 4511 1645 -2142 -477 -202 999 -2219 -3138 777 -313 623 -494 -2657 4240
1960 4240 2796 -2739 2059 1055 -648 501 -4372 -2433 1339 -3082 -3280 -1442 565 1377 -2040
1975 -2040 298 2726 876 1692 -1769 -1522 3780 -2661 -4144 1135 -885 -203 -353 -2381 2250 2605
1991 2605 -483 595 1524 3688 222 -3089 1233 -199 -946 119 -3189 961 3673 -3100 71
2006 71 3410 1099 2404 -83 82 2776 -412 -1643 -1326 358 2479 -2832 -1656 2945 -416 889
2022 889 972 -1281 4558 1761 -3838 788 691 -470 -414 -2113 476 745 -2001 -894 -818 2357 1624 -2843
2040 -2843 1484 1937 -2563 -582 -2853 -1847 2874 -2237 -3198 1258 -157 -586 -708 508 3449 996
2056 996 435 -216 -543 2973 -1019 -2977 3494 777 -2060 -177 -2839 682 2087 -2563 226 1412
2072 1412 -993 -1714 -2785 587 1582 -1006 558 -197 710 2214 -3173 326 5162 676 631 292 -2534
2089 -2534 667 -875 -3471 838 712 -716 -3023 -3053 767 -1398 -1189 1622 144 2724 953 -4570
2105 -4570 1334 3339 51 2180 1023 697 1648 -2725 -1483 1370 1396 1020 -1842 -220 803 -3624
2121 -3624 -957 1055 1224 5027 -556 -3281 3081 309 -279 2533 1619 2910 800 -2730 -869 -408
2137 -408 688 -492 -1019 3095 -685 -5216 -1475 -2084 83 3297 -1926 -563 2226 -1891 -1654 418
2153 418 2031 4141 1011 149 420 -1564 -984 -2778 -354 4283 -1993 -3921 -1784 -3803 103 994
2169 994 -1411 3637 2877 -1164 -887 -518 1656 2521 1134 3032 1522 -39 -1151 -3477 2726 5028
2185 5028 -697 1223 610 -2828 -967 -3046 -2497 2680 952 -1328 -1728 -2045 -387 -2063 585 4830
2201 4830 2599 1854 -1903 -4285 1586 -261 -3005 1546 -403 -2106 -2391 -5856 -2308 929 -64 1456
2217 1456 713 521 -1282 -4300 -311 1662 1155 2467 -2073 -1851 2052 -2990 -1734 3527 2992 3293
2233 3293 870 -1888 -45 -1113 -590 1239 2039 3177 -1489 -3638 1334 592 2357 4556 1586 4394
2249 4394 3532 -3054 -734 1134 1239 2402 13 -638 -1064 -3864 -2541 -578 2510 3911 -1406 -552
2265 -552 837 -2947 -580 -539 -1013 3723 50 -4273 -1858 -1864 -1110 741 1179 3507 887 -2083 -1883
2282 -1883 -2619 1166 556 -3322 768 -360 -4082 -2200 -3139 -280 4545 1185 926 1705 -480 -402 -1201
2299 -1201 1227 3724 234 -331 -1453 -1798 1234 -1278 -547 5469 2390 687 726 -2523 876 1757
2315 1757 -755 1202 1023 -1025 -2923 -3607 705 1342 64 2185 465 1029 1072 -3879 -921 3100
2331 3100 -340 -18 -1327 -2838 -1059 -2597 -1366 1777 1586 1604 -1047 -1590 1298 -1573 -1149 945
2347 945 -410 1361 -1516 -5630 -364 375 -784 2134 1342 1718 1075 -1742 -332 1223 1628 1076 -2051
2364 -2051 558 590 -3569 -444 545 858 3986 217 -840 2828 17 -145 1153 958 2062 -959
2380 -959 -2131 -505 -1027 519 8 -349 3826 1316 -1822 672 -528 1213 2011 -1704 178 1194
2396 1194 -2193 -1495 -679 793 2185 -298 1076 1453 255 842 -1502 63 3216 -1651 -1733 -235
2412 -235 -2367 -187 -933 -2020 2063 1015 -982 -681 -413 1337 -391 -1399 1193 -398 -962 -1067
2428 -1067 -3302 478 1508 -2004 724 733 -517 714 -1648 -700 1501 -682 -1160 -1375 -835 -70 -2660
2445 -2660 -1278 1107 -352 1081 -811 -1476 2615 311 -1385 1831 535 88 279 -1564 876 1046
2461 1046 202 589 366 2415 1297 -1659 1780 1268 17 1470 -1047 270 2059 -1629 -841 1315
2477 1315 376 1074 -248 65 2164 567 529 132 289 2473 -1032 -1684 1268 -876 -410 448 -1511
2494 -1511 1482 1023 -2076 185 426 -65 -20 -1600 262 145 -1098 -360 -1164 605 1354 -2104 52
2511 52 1817 -1159 486 -548 -881 1725 -773 -1900 314 -232 335 -1092 -604 2079 -9 53 233
2528 233 -440 2142 599 -1519 1951 1026 -1021 405 -1186 59 1264 -1780 -1062 -31 -612 -634 -2154
2545 -2154 -45 964 -1352 -120 -546 -438 1700 -1084 -1173 2005 19 -205 290 -592 1184 -158 -1682
2562 -1682 -135 19 62 -1269 -2397 845 -380 -1555 277 -934 463 1030 -2372 598 1813 -119
2578 -119 1037 553 672 1829 -435 303 1173 1033 1379 -1278 -207 1556 -1118 -718 847 -620 1851
2595 1851 117 -1665 1641 566 -271 980 256 1547 290 -1497 -90 120 249 219 -1942 947
2611 947 720 -2354 -390 -613 -556 1589 -1429 -639 870 -1146 -927 -124 883 1894 -265 -45 641
2628 641 98 1056 -342 -597 2920 -4 -1794 18 -1509 -53 880 -1129 1275 1253 -654 -317 48
2645 48 2009 1403 -125 1723 1010 -88 500 -1761 199 2506 -572 -97 -28 -1348 -244 -1439 -1674
2662 -1674 1053 -530 -1442 -1989 -2059 -486 -2033 -1629 930 -401 103 -949 -2827 645 763 -1130 926
2679 926 237 -1015 -1193 -2858 -1202 515 -479 -99 -805 226 328 -1997 -65 1987 1008 2191 -241
2696 -241 -1166 1182 -633 -287 2111 1582 1951 570 -645 1353 888 1086 1730 1648 2684 402 -2045
2713 -2045 910 688 1035 2522 282 1040 1659 -1358 94 1617 989 1675 -64 322 238 -2126 -1366
2730 -1366 -996 114 1921 -1362 -1985 70 -1842 -477 501 -589 1897 -146 -2247 -1249 -1439 -632
2746 -632 -557 -598 1537 37 -1939 -1268 -1902 751 1766 -1175 379 -44 -2026 -1041 -1647 -507 1592
2763 1592 80 -351 -133 -527 -253 -933 1162 3008 855 91 -484 -1624 914 31 -942 2474 770
2780 770 -410 -367 -1472 529 879 524 1440 851 -106 -1165 -2507 198 1461 -121 747 -679 -818
2797 -818 301 -1840 -235 2485 786 980 63 -1252 -258 -1257 -652 1585 1074 1219 -1168 -1876 727
2814 727 -376 -40 1400 -145 896 -18 -2825 -492 419 -137 1074 318 369 -387 -2053 -121 736
2831 736 1272 1885 -838 12 704 -1908 -389 625 330 2028 -45 -1119 372 -623 -367 788 1065
2848 1065 1980 -178 -1580 -239 -867 315 503 -790 1496 436 -1958 -6 -525 544 2031 68
2864 68 562 829 -1073 -640 -584 1102 1816 -492 -209 23 -1093 473 -732 -26 2456 173 -1166 -210
2882 -210 -1302 -338 73 -492 1086 31 -1170 -1396 -1539 1002 322 -1003 1034 -159 -916 -596 -2200
2899 -2200 -184 1273 -805 76 -411 -1199 -236 -1070 -147 1522 17 -155 -1064 -824 879 -1558 -776
2916 -776 1180 -30 770 -499 -2046 715 479 -226 1375 812 582 65 -1069 713 804 502 1195 131
2934 131 811 745 -1607 604 1593 256 1488 -419 -361 1016 -967 -629 778 402 866 -892 -753 519
2952 519 -437 54 273 -316 1510 -418 -1525 658 -303 -172 739 -816 644 413 -1456 -471 35 757
2970 757 473 -1135 445 602 -1142 196 -597 136 1529 -1100 -338 1019 -559 162 -13 -304 1556
2987 1556 127 -735 237 -66 649 -163 -667 1473 79 -127 353 -914 1039 687 -1343 738 664 -817
3005 -817 -159 -807 -44 420 -1005 -261 -430 -175 203 -1407 -453 1083 -1031 -465 -318 -806 986 -672
3023 -672 -1032 1141 -234 -74 175 -734 907 232 -784 425 -31 267 267 -1247 1097 389 -854 487
3041 487 -200 8 1127 -1047 79 1324 -153 329 160 484 1090 -258 -5 600 9 1109 -254
3058 -254 -418 1728 -501 -514 452 -434 968 -28 -1138 887 224 -466 -5 -502 619 -4 -996 276
3076 276 -221 -103 669 -1583 401 665 -912 -92 203 -46 1148 -613 -235 1196 8 -27 34 91 1509
3095 1509 -70 -351 1017 -361 1098 131 -753 1598 503 -1000 564 -211 563 538 -700 760 628
3112 628 -214 211 -819 521 974 -1357 282 159 -743 527 -1040 -749 936 -999 -648 -20 -1216
3129 -1216 -216 -1446 -1461 178 -782 -734 -1055 -1616 290 -924 -1775 310 -933 -805 -256 -1772 41
3146 41 296 -935 -84 -76 -47 407 -850 306 908 210 1058 -202 215 1557 -890 87 1437 27 1185
3165 1185 167 -306 1334 113 208 1019 911 1307 524 -141 1293 588 631 1257 232 1714 1036 -935
3183 -935 914 842 240 1570 71 587 920 -916 -93 540 249 491 -803 -175 716 -1326 -154 -6
3201 -6 -771 1205 -651 -1304 168 -1060 -273 46 -744 465 -320 -1488 -623 -657 36 23 -768 609 -124
3220 -124 -1465 -352 -912 -203 843 -1262 -91 -70 -1612 -443 -657 -87 844 -325 -568 -447 -997 343
3238 343 -781 -278 1640 -360 -285 16 -1466 639 437 -697 1318 561 -441 -142 -798 527 714
3255 714 -61 803 -176 -16 114 -1554 553 1292 -119 962 147 -642 977 -690 -87 1647 315
3272 315 397 -185 -264 501 -451 40 1466 413 994 -80 -1713 797 62 -43 1058 -161 -38 46 -1658
3291 -1658 82 318 -37 524 -356 253 51 -1596 -172 539 255 1480 -731 -712 482 -1302 -226
3308 -226 873 126 897 -284 -954 151 -563 135 283 -77 1366 -337 -1596 -438 -798 583 1065
3325 1065 -360 692 256 -1393 -177 -131 620 1106 143 275 288 -743 -169 -414 382 1536 -97 41
3343 41 327 -1110 198 -9 -297 1849 -188 -1033 -450 -962 -106 -5 -380 1030 33 -434 -794 -1185 529
3362 529 662 -694 704 -256 -996 235 -1258 49 1261 198 100 -147 -548 -273 -790 24 1133 -2
3380 -2 375 -684 -1002 527 -636 -399 1330 -53 264 127 -1079 289 545 -92 1077 524 480 -150
3398 -150 -1269 667 618 386 1066 -538 1 633 -1076 120 892 -159 968 -155 -760 276 -755
3415 -755 -149 374 381 739 -757 -1000 348 -913 235 348 -249 813 109 -1235 259 -260 -168 687 -52
3434 -52 492 255 -1081 -254 -240 731 1087 -586 579 268 -837 308 73 -140 1312 -221 -627 198
3452 198 -681 -63 39 -107 964 -284 -518 148 -367 955 430 -323 1021 -74 -455 396 -731 -182
3470 -182 977 -736 298 -10 -891 -89 -541 42 678 -734 -248 -290 -618 197 -875 -404 1417 -494
3488 -494 -46 286 -926 386 109 -275 532 35 -284 -229 -586 486 67 -584 493 -215 -21 19 -1316
3507 -1316 581 467 -831 910 -136 -417 450 -777 -93 925 -300 144 -340 -455 516 -828 9
3524 9 234 -583 768 -492 -991 862 -443 -368 474 -169 666 238 -617 249 28 287 412 -360 583 48
3544 48 -996 415 -349 -346 644 -755 -82 721 -543 361 600 357 1013 68 233 802 279 748 381 124
3564 124 1373 -89 -110 975 -270 406 524 -856 446 541 -1019 -15 -430 190 728 -664 384
3581 384 89 -161 145 -420 87 655 -957 -132 94 -787 376 -864 -903 278 -625 -536 -425 -813 -55
3600 -55 -728 -866 180 -781 -180 -518 -1185 237 -288 -926 302 -432 -502 225 -917 -109 554 -381 -100
3619 -100 3 -219 146 -626 330 595 -454 733 -163 -53 1011 92 420 1184 152 848 364 -91 858
3638 858 218 -105 627 251 710 292 -53 894 408 293 1129 -200 989 1071 -417 596 611 -157 443
3657 443 -30 219 656 -377 315 78 131 841 -549 -308 517 -835 36 207 -865 510 -221 -1083 320
3676 320 -332 -242 255 -548 163 -107 -773 -156 -836 -255 32 -1227 92 -358 -990 75 -634 -371 459
3695 459 -915 -256 94 -735 -401 -351 -232 415 -715 -48 3 -765 304 -27 -16 880 -291 -246 339 -762
3715 -762 339 360 -376 895 147 48 484 -341 646 563 203 722 -25 -102 680 -694 -5 921 -304 651
3735 651 165 -531 675 -137 81 1128 433 529 -48 -215 555 -384 62 834 -25 287 63 -1052 404
3754 404 367 -342 407 40 -132 -170 -664 -248 402 85 179 -588 -187 183 -999 -9 230 -177 692 -389
3774 -389 -924 347 -468 -366 543 -52 521 -222 -620 30 -184 24 232 -262 833 -20 -1084 143 -86
3793 -86 111 792 -509 200 80 -1044 -126 -148 -63 681 2 -238 71 -333 356 -340 41 1132 10 -322
3813 -322 176 -870 429 540 -154 724 -62 -558 -121 -616 -74 229 -393 546 -220 -610 -148 -883 291
3832 291 901 -292 498 197 -688 288 -481 8 967 197 94 -158 -431 153 -322 76 860 -73 442 -203
3852 -203 -1114 367 -115 -221 1110 -240 -287 -98 -801 110 587 138 826 -100 311 -115 -814 515 150
3871 150 -77 1128 -464 -430 253 -685 -16 686 58 334 -235 -629 167 -354 72 356 -23 536 -197 -916
3891 -916 3 -370 -124 889 -261 519 -3 -1024 88 70 -39 541 -59 -46 54 -684 -47 -185 483
3910 483 1021 -525 28 332 -1086 310 271 -104 1001 -258 -583 102 -278 -66 239 -207 836 -79
3928 -79 -435 -149 -393 353 781 -472 664 22 -628 267 -303 -36 912 -351 335 571 -825 -236 -730
3947 -730 71 730 -535 277 -483 -926 421 -465 -228 772 -196 -32 240 -775 286 445 -164 794
3965 794 159 144 -286 -468 497 -95 -97 364 -376 -385 213 -1049 107 585 -587 715 28 -568 148 -545
3985 -545 -270 358 35 238 -508 -567 493 -634 -199 487 -287 468 187 -693 510 -136 -228 814 -148
4004 -148 292 118 -392 184 38 238 607 -256 569 138 -585 333 122 -45 743 -23 -12 413 -434 310
4024 310 321 24 606 67 95 347 -176 828 220 -287 1023 -216 -413 521 -390 272 583 -595 374
4043 374 23 -609 -62 -512 -74 161 -714 125 -3 -593 86 -487 -129 548 -565 86 -181 -721 94 -239
4063 -239 -673 364 -668 -511 -101 -633 272 -520 -201 170 -437 -348 102 -514 153 143 -732 462 16 -194
4083 -194 53 -307 274 96 -192 -6 -37 -16 509 -246 290 630 -295 416 313 -155 630 -163 46 657 -95
4104 -95 207 531 -250 311 80 -3 369 -144 526 183 -168 815 36 131 748 -200 160 754 -280 271 751
4125 751 -170 513 26 -145 639 -246 220 184 -142 310 -359 -426 220 -485 -75 -165 -437 76 -58 -527 295
4146 295 -231 -223 76 -447 288 -147 -598 277 -512 -95 181 -657 235 -68 -816 105 -266 -419 166 -438 -424
4167 -424 -167 -152 -102 -343 -563 32 -402 -342 312 -507 239 183 -489 777 -260 -112 589 -222 103 494 -38
4188 -38 553 129 205 492 -271 147 625 -266 602 -35 -255 537 -312 -219 654 -118 83 205 -479 673 58
4209 58 46 433 -405 331 241 -170 418 -155 32 576 -312 171 406 -360 325 199 -340 240 -126 -137 164
4230 164 -609 -25 -105 -352 355 -414 -182 282 -878 240 226 -362 196 -122 -470 581 -460 -59 116
4249 116 -180 229 169 -69 327 -365 56 474 -820 323 -128 -638 201 -356 -219 622 -307 -256 122 -345
4269 -345 112 144 -13 464 -259 -190 145 -510 107 -24 -253 863 -225 -192 452 -453 140 182 -348 515 -89
4290 -89 -167 119 -572 113 134 -149 407 13 -267 363 -391 -35 573 -342 197 234 -416 422 -48 -97 608 -142
4312 -142 207 -161 -404 350 -121 -38 502 -482 164 23 -534 146 313 -503 384 -10 -337 229 -818 102
4332 102 229 -35 251 -494 -34 156 -614 310 152 -268 850 -100 -384 332 -545 -180 667 -45 269 -104
4352 -104 -431 -123 -254 127 416 -295 294 -322 -390 333 -461 -161 733 -235 -33 176 -577 421 -6 126
4372 126 889 0 103 292 -513 176 138 -163 499 -328 -78 377 -1028 162 258 -233 615 -360 -606 210
4392 210 -701 85 132 -10 526 -151 -217 264 -431 258 527 -347 356 63 -604 356 -247 -91 717 -144 224
4413 224 -61 -344 135 -129 -52 542 -304 257 193 -860 298 -15 -426 796 -326 -81 260 -666 284
4432 284 199 43 398 -27 -235 -70 -692 162 42 -278 610 -225 -612 402 -508 139 533 -347 280 -281
4452 -281 -449 201 -326 21 291 -22 258 -159 -608 376 -347 182 1028 -331 216 261 -327 285 -56 -172
4472 -172 696 15 125 -98 -407 454 -61 156 645 -229 -33 69 -482 381 66 -192 438 -347 -286 304
4492 304 -124 243 446 99 494 -32 -273 129 -523 171 304 -278 446 -46 -522 437 -82 -117 402 -239
4512 -239 126 232 -575 16 -277 -23 589 -373 91 -79 -699 165 -112 -137 830 -258 -187 325 -708 165
4532 165 151 -168 191 106 -113 -6 -277 318 193 -17 203 -286 -151 -169 -437 87 118 -474 485 -177 -628
4553 -628 355 -168 -47 530 -149 286 307 -329 150 -313 320 323 -376 273 182 -429 420 -3 -118 330 -158
4574 -158 107 -56 -334 198 -159 51 429 -222 -14 -2 -403 558 38 -294 544 -23 -185 249 -608 97
4594 97 311 -276 388 -63 -129 206 -222 119 204 -422 339 58 -428 358 -412 -293 291 -546 -7 -125 -625
4615 -625 343 -164 6 342 -64 117 -53 -276 95 -307 -109 311 -191 -25 296 -433 207 142 -402 689
4635 689 -57 -120 -91 -398 25 -78 -10 149 -206 -154 103 -260 283 273 -22 440 -89 -335 395 -41 107 247
4657 247 -158 157 124 -309 407 -219 240 298 -66 207 -137 -455 277 -234 -209 132 -507 -42 180 -377 371
4678 371 89 -313 430 -56 147 103 -394 222 -103 -155 307 -269 -126 450 -407 137 191 -300 189 -217 -370
4699 -370 197 -339 97 142 -253 265 -99 -361 116 -287 -22 298 -335 72 305 -329 219 -259 65 154 -468
4720 -468 216 95 -46 346 -53 155 462 -200 258 119 -463 251 -37 -388 472 -260 -236 192 -365 277
4740 277 92 -100 278 -87 -90 418 -436 35 183 -389 367 -453 -446 437 -118 -15 477 -159 278 45 -286
4761 -286 273 -313 29 79 -147 286 -104 -426 338 -55 -227 319 -181 231 262 -304 165 171 5 6 -62 166
4783 166 185 -157 324 -7 -60 513 -266 -71 138 -484 143 -186 -368 166 -434 -34 271 -143 -62 258 53
4804 53 549 -182 -265 209 -366 272 428 -192 324 -212 -204 413 -351 25 -4 -267 278 107 -234 83 -244 180
4826 180 211 -472 166 -319 -530 156 59 -392 402 -119 9 228 -472 294 188 65 291 -176 -213 34 -222
4847 -222 394 -43 -437 531 -41 -58 159 -472 179 212 -389 160 -115 -154 98 -319 57 573 95 333 -62
4868 -62 -437 53 -365 -189 386 44 184 300 -503 111 -30 -194 311 20 134 -125 -458 327 -56 -1 391
4889 391 -253 -63 57 -674 257 166 -69 492 -215 -214 447 -436 23 264 380 715 -69 23 181 -273 199
4910 199 240 68 376 -27 -346 108 -137 -78 240 -453 381 65 -230 4 -262 128 340 -232 215 294 -741
4931 -741 193 -164 46 482 -199 -10 143 -223 122 311 -96 263 -134 63 -75 -550 238 -120 -119 433 -116
4952 -116 -41 -210 -651 -46 409 -510 415 -267 -110 -51 -165 136 269 72 180 68 -62 124 -580 -65 298
4973 298 -130 -7 77 -255 391 -108 -20 697 -71 105 147 -317 226 -223 13 306 -19 33 39 -503 128 188
4995 188 -216 473 80 -158 418 -366 -66 98 13 -4 39 -81 233 -500 269 163 1 482 37 -470 281
5016 281 -327 -22 431 -333 160 211 -337 19 -110 62 129 -115 448 181 -442 -19 -199 11 235 -304 -113
5037 -113 56 -258 -125 -104 104 522 -81 -260 -297 -467 -15 -254 -337 468 -439 -374 -98 -332 -86 -19 -343 395
5059 395 324 -117 11 -119 170 369 53 287 -97 -136 -43 -286 106 368 -198 2 -131 -74 272 31 118 322
5081 322 -153 42 -30 -110 196 -213 -17 250 -155 162 -32 -279 248 107 -250 367 -50 -65 396 -30 149
5102 149 279 -134 193 103 59 179 -200 136 329 -348 201 -243 -341 112 -222 -23 225 -295 128 -95 -150
5123 -150 236 -134 102 154 21 208 -25 -285 136 -211 -43 388 -380 -76 -122 -572 161 150 -20 33 -372
5144 -372 -60 77 -426 -74 -251 -117 107 -401 -195 278 -391 156 263 -153 497 -119 -307 221 -64 152
5164 152 128 -238 256 -301 -36 196 -171 81 9 -193 367 141 -320 479 146 -193 554 -248 437 377 -170
5185 -170 408 119 27 484 -85 131 172 2 337 -306 106 339 95 -77 179 -603 262 -96 -182 128 -179
5206 -179 35 -2 41 165 -213 -161 -27 -302 -89 111 -319 -46 204 -275 -48 353 -130 266 -327 -120 225
5227 225 -125 63 -313 -114 393 -248 -179 232 -259 174 -106 -197 302 5 -205 293 -272 12 221 -125 45
5248 45 388 -109 174 -102 393 342 -297 106 35 -255 259 -337 -354 313 -191 71 -13 -64 167 -316 -196 204
5270 204 -171 -74 74 -105 307 -99 -376 243 5 110 23 -376 65 -186 -145 414 59 -29 209 -341 348
5291 348 225 -220 299 -21 -194 272 -361 31 491 -332 266 -1 -245 326 20 106 267 97 248 0
5311 0 -318 158 56 -70 46 -601 30 78 -280 167 -60 -264 187 -246 -223 306 -414 -221 -364 -457 -40 -296
5333 -296 -154 235 -226 300 4 -248 411 -297 -396 350 -60 204 20 -64 206 69 6 146 -129 175 201
5354 201 -330 63 -173 -112 206 -260 -47 410 -387 49 59 -197 399 -89 -281 188 -79 178 27 -420 646
5375 646 80 -144 361 -23 32 262 -132 -69 19 -416 51 -46 12 123 -338 403 62 -293 -56 136 -222 431
5397 431 -371 146 13 -263 105 59 -326 596 28 -205 194 -400 137 -266 -181 203 -200 -331 19 -128 -11
5418 -11 114 -264 504 242 -589 41 -451 -83 -2 -437 -27 -200 -298 -3 -277 289 182 -101 253 -2 -196
5439 -196 216 -279 152 356 -60 0 158 -173 231 19 -47 378 -131 -149 -120 -320 487 -49 125 291 37
5460 37 -139 141 -260 396 466 -25 326 255 31 331 -403 -120 248 -94 259 -291 166 451 -21 140 86
5481 86 -251 209 -150 -255 90 -72 -320 465 -159 170 -131 -508 142 -4 0 57 -28 -41 98 -620 -44 -10
5503 -10 -319 103 -318 -111 122 -187 -129 -83 -159 295 -136 -159 106 -307 -290 -258 -447 330 -238 -521 166 -120
5525 -120 89 119 -26 179 -51 -210 70 -439 -35 -40 -346 121 0 -257 7 -174 265 461 90 -6 216
5546 216 15 220 -156 39 300 -14 -108 -39 -167 417 16 19 527 -11 150 364 -260 177 35 -41 494 39
5568 39 138 299 -37 364 545 -125 246 122 160 27 -416 193 297 -162 -50 -54 -201 303 -499 -202 340 -19
5590 -19 198 14 -350 -14 -117 -192 -148 -50 -60 65 -619 89 15 -292 250 -340 -231 177 -327 -37 -326 -382
5612 -382 -135 -337 -321 -107 -312 -1 -15 149 377 -482 -35 134 -369 -143 272 -30 350 145 -353 175 7
5633 7 254 295 -312 330 167 -138 323 -116 -66 246 -197 339 304 -3 267 85 228 444 -38 238 292 127
5655 127 118 -80 24 314 -82 -209 -32 -266 465 82 -134 275 149 86 48 -331 37 140 -352 -37 -296
5676 -296 -91 -33 -463 -56 1 -277 24 -63 -548 67 -569 -162 342 -155 -87 -147 -159 139 -152 214 236 175 292
5699 292 75 59 393 7 -153 65 -150 132 86 -183 -70 -5 -114 488 -206 225 28 -270 40 -53 -130 337
5721 337 -158 76 155 -484 -82 26 3 211 -111 -187 -55 -326 -207 14 -334 -67 -133 -275 216 -4 143
5742 143 23 -283 149 -63 -401 42 24 118 156 -189 121 344 -40 130 153 47 376 -190 87 306 9
5763 9 358 -168 72 516 -84 -76 443 -47 192 172 -75 258 -182 -283 -39 -271 123 81 -465 199 -69 -283
5785 -283 482 -92 -10 531 -289 -88 47 -159 192 -253 41 306 -125 165 -136 -254 215 -151 46 383
5805 383 -174 24 47 -114 291 49 78 418 135 81 35 -88 130 322 -29 44 -101 84 -61 -259 136 208
5827 208 -1 229 -256 215 231 -141 112 32 -10 -42 -251 -95 304 -118 25 221 -23 296 -109 -166 431 -63
5849 -63 -115 121 -73 399 50 -229 74 236 59 49 -84 117 267 19 409 -44 -69 310 -540 -96 74
5870 74 -264 -28 107 -34 258 68 -106 152 -234 -9 56 -75 303 -87 -107 54 -194 2 78 -386 89
5891 89 90 -138 312 -444 -170 -204 -238 144 12 13 -20 -388 51 200 -44 268 60 296 390 96 -164 351 -101
5914 -101 -155 -127 -128 150 -283 -5 477 211 55 195 -244 247 192 -247 182 25 91 87 -124 144 462 -129 246
5937 246 325 131 365 -277 65 266 117 166 -104 -130 314 -417 -149 195 64 217 3 -121 124 155 -235
5958 -235 -51 -35 -62 -28 -397 -89 39 -113 -127 -91 221 545 -144 269 151 -109 -62 -252 -373 390 -329 -31
5980 -31 -81 63 135 -90 33 401 -191 124 -35 -112 381 -63 -294 -160 -22 -205 0 -131 22 42 41 454
6002 454 65 -67 50 21 180 -158 -198 5 -77 -82 320 -480 35 392 -148 491 -9 -19 403 272 -182 -47
6024 -47 -172 132 -76 -94 329 68 210 274 -30 205 275 -74 60 95 -96 115 -258 -232 200 81 229 -106
6046 -106 -85 439 -76 321 -151 -235 76 -215 -220 170 -201 -284 78 12 -244 -69 -179 365 97 -219 -95 -70
6068 -70 -180 -164 -500 152 103 -129 -78 -75 -100 19 -96 -77 -113 -38 14 -160 -187 54 -287 10 -53 -238 295 192
6092 192 156 341 -18 253 221 -108 224 -52 122 239 10 55 14 -19 212 125 -144 -111 -91 230 340 -88 48
6115 48 186 137 48 -33 214 496 -195 124 154 -77 193 -227 -69 175 -182 -34 -121 -157 -73 -86 -127 221 -7
6138 -7 -175 -75 -77 -61 191 -151 228 55 -119 -187 -449 -66 324 -278 3 61 -53 288 -121 -17 300 216 -292
6161 -292 -106 -55 147 155 -328 102 82 164 218 112 339 -75 -195 201 -57 -13 127 -396 70 -57 -280 -17
6183 -17 -200 37 -87 -143 12 12 -54 278 -101 114 0 -275 -96 325 28 65 -237 -124 105 -45 -197 -158
6205 -158 159 111 -148 -147 231 135 18 98 -106 -93 5 -22 204 73 52 -53 -158 17 212 -43 114 -109 184
6228 184 348 -226 -16 229 -156 70 -110 -32 175 -144 -126 26 38 -41 27 -230 303 -143 -148 -1 -177 122
6250 122 188 -66 -56 -105 -225 -226 -55 13 377 -93 -230 -18 -75 -210 -14 97 319 -33 161 231 209 126 4
6273 4 -36 490 114 -62 -58 -361 77 70 -524 368 41 -46 -18 -93 102 63 166 112 421 134 161 -171 -165 53 -156
6298 -156 -126 5 -255 16 -66 -165 67 57 70 -39 -4 0 39 -45 100 -126 -28 -82 -231 347 -52 -92 187 23
6322 23 -72 69 -280 -42 -132 116 68 -282 182 225 37 208 -44 -279 264 86 -59 -209 -140 59 -269 -71
6344 -71 170 -153 62 41 10 51 123 -195 139 70 -171 -134 -41 -129 -43 -317 146 3 -49 -113 -113 -62 139 -248 130
6369 130 -130 220 -110 -190 243 238 -111 147 119 122 170 85 224 222 36 -33 240 -84 122 28 -205 14 274 1
6393 1 213 -174 -97 289 6 -205 127 -26 212 -238 24 264 -196 -65 -292 -309 273 -186 -209 84 -49 253
6415 253 -158 87 278 19 -69 8 -311 73 120 -194 -116 307 296 44 -57 118 -42 -35 63 -168 -80 -75 -87 194
6439 194 54 85 66 70 -116 150 -230 -50 168 79 -17 9 -21 168 -92 -202 77 -229 65 48 20 151 -129
6462 -129 -80 -140 -152 -33 1 -381 -54 -222 -213 -6 -197 192 -7 -77 35 228 -233 -161 -47 -298 33 -348 -59
6485 -59 110 -43 181 -109 -11 184 23 -62 232 114 30 243 3 60 225 151 196 6 255 498 -244 162
6507 162 87 190 226 -221 155 147 -160 79 94 60 71 -102 -169 250 49 -85 189 31 414 -282 -29 -250 -93
6530 -93 -156 -230 -256 -100 -308 81 82 -251 -36 -38 -329 19 -50 -279 -11 -199 23 2 -298 0 -1 223 6 -104
6554 -104 -2 370 -9 -22 -66 0 85 -32 76 352 -182 61 352 -73 453 -111 54 -63 127 343 110
6575 110 -447 158 286 -341 257 176 -186 57 -249 7 -41 48 175 -36 -57 397 12 110 56 -258 48 -78
6597 -78 -39 69 -323 -180 -71 -312 71 -145 -112 313 -57 -169 -166 -291 -134 -5 0 -55 283 -113 208 -212 234
6620 234 257 15 -71 32 166 211 -35 -285 25 -156 251 -133 -19 275 -101 -40 149 -122 232 -191 72
6641 72 47 61 -211 -86 84 36 12 -33 -153 86 -164 324 21 4 -22 -255 -24 -59 80 211 -125 -134 351 -308
6665 -308 289 201 -179 326 71 -122 50 93 -129 170 75 -32 193 -239 273 -17 71 107 -81 -24 45 -14 54
6688 54 -70 -39 -68 102 94 10 -149 -53 191 -198 124 -323 -96 38 -31 -18 0 -82 49 265 172 100 37 -145 -72
6713 -72 -203 280 233 -66 -2 -226 44 -68 -319 -160 221 -18 88 -112 -12 215 -293 73 278 -23 329
6734 329 -39 80 -53 -319 -148 -200 -194 56 -185 -85 304 -386 -187 41 -189 44 188 -67 104 -6 1 -114
6756 -114 -198 -11 8 -30 20 -24 123 230 -348 -152 18 -67 6 -28 -283 191 -297 -7 -10 -30 23 -220 -117 -60
6780 -60 10 -170 135 87 112 48 -89 -211 222 -115 -41 -91 60 107 -189 79 -63 57 27 -4 48 121 177 362
6804 362 -106 47 122 61 -17 94 65 32 74 -162 51 -147 -132 -49 154 77 -11 -265 34 225 -84 34 204
6827 204 143 -22 76 -58 -121 -131 -27 -74 -48 -27 183 -122 292 155 184 10 -131 9 104 -111 39 -266 106
6850 106 -40 -40 165 58 -80 -13 160 192 -22 -272 51 69 -16 -116 -55 -21 -81 -48 172 -69 34 -72 -229
6873 -229 74 53 -145 -274 -149 88 -49 -402 -300 66 -117 -195 92 -81 270 -201 -75 17 -85 64 93
6894 93 -41 60 -46 -50 17 -62 -165 105 -26 -40 23 -127 209 -136 -61 2 -269 -101 152 -148 128 48 -141
6917 -141 26 -34 190 -32 83 -26 -168 -50 -41 -37 128 250 46 93 -117 -87 128 105 256 -126 -359 -25 -42
6940 -42 36 -136 -259 -29 -181 218 -145 -61 -258 -39 84 -116 107 310 48 78 -195 -150 -69 -112 202 -114
6962 -114 -164 94 263 241 332 18 170 36 13 91 160 -140 206 159 -48 -78 127 106 0 74 86 70 137 -85
6986 -85 -138 134 0 -427 -124 138 40 -244 -30 -117 -275 -2 94 -32 -91 -74 -341 -48 -53 -82 293 -90 87
7009 87 -42 132 62 181 -126 141 15 -133 -69 -140 153 -145 -68 145 -207 -68 -235 -147 321 111 -102 14
7031 14 -50 -30 119 135 -134 74 -96 20 32 69 82 46 -25 26 -229 -193 -228 111 12 64 91 97 -49 -75 -108 45
7057 45 -103 -166 -45 -109 13 -191 -11 245 245 -264 -10 -77 -12 121 209 -58 -103 58 104 177 -141 -89 76 -231
7081 -231 97 165 -42 -221 -90 112 123 -97 18 351 -91 31 84 -22 -45 189 22 25 224 281 -95 -173 -21
7104 -21 122 51 -92 141 -1 -6 -121 14 58 -147 -112 -341 57 -95 -108 187 172 60 317 47 170 80 -115
7127 -115 51 -39 -60 215 22 -208 -243 -76 -45 -67 -59 211 29 159 -24 -79 -4 -56 -266 -58 58 -259 -2
7150 -2 -65 84 -203 43 6 97 52 -166 109 113 -178 -75 -45 82 -26 -41 246 -31 -140 -137 17 139 134 -121 81
7175 81 -32 205 -38 -242 -42 -192 71 49 20 -164 24 43 -72 92 56 171 -247 -271 240 -54 42 -51 15
7198 15 176 -219 38 167 -174 -77 232 121 65 -3 -207 -121 -162 253 -44 -105 -29 76 -260 -195 -2 -94 272
7221 272 -4 -77 -163 -4 -90 -46 144 -3 44 121 20 45 170 14 56 -164 -120 -47 -100 -391 25 -55 -282 15
7245 15 0 -50 -301 -155 95 -48 -105 -82 -287 107 -16 -26 157 25 -16 8 -233 156 -210 -41 -119 6 280
7268 280 -216 -155 178 72 72 -31 -26 165 5 -184 69 343 137 44 -104 -14 194 9 -170 119 21 129 152
7291 152 85 60 25 -17 -10 -30 -119 0 -41 -25 15 23 -39 103 24 107 -82 72 -48 -145 -32 65 28 256 325 10 127
7318 127 -128 152 -49 -158 -64 -62 -112 -39 29 56 93 -136 306 213 9 253 -265 -175 139 -409 56 -30 68 -125
7342 -125 33 -33 -55 -23 -99 145 -19 158 -12 254 -71 77 124 -6 -216 -23 -188 -20 -19 -158 124 37 143
7365 143 114 299 -95 -36 -94 147 46 19 87 -172 -79 76 -162 146 36 75 54 65 -95 133 -117 59 -108
7388 -108 2 -57 -7 79 -26 -19 -84 112 191 35 -152 64 -90 213 146 -141 -216 -17 -6 -248 134 -12 111
7411 111 -64 -284 -90 203 -56 10 149 -216 90 181 22 -107 1 -113 -30 -22 352 -30 53 -64 -15 25 152
7434 152 -90 370 108 -138 28 -70 48 -37 -19 139 264 72 35 -177 -147 12 -6 -18 78 -304 -73 24 62
7457 62 72 73 145 23 89 115 46 -133 -37 99 325 58 8 261 151 -56 383 136 -106 -60 -185 303 -66 -213
7481 -213 -130 -267 269 136 34 95 -28 -45 -186 168 -198 27 71 -2 56 -99 4 -169 -183 202 69 -349
7503 -349 -38 144 -120 42 41 -105 -53 -193 49 163 -36 174 138 -70 66 -198 72 -82 -189 -98 -171 -59
7525 -59 -213 -64 113 84 -306 24 77 118 -110 -194 125 124 -243 -5 85 14 -36 100 74 59 75 -89 90 9 -29
7550 -29 -384 202 8 -2 47 -34 -152 -157 -106 118 162 -54 -102 -92 -171 147 -151 62 38 -4 -42 62 -172 -48 -125
7575 -125 -34 146 113 102 7 -177 -132 -64 -172 181 -50 -92 -231 18 -93 -189 -77 25 10 -24 68 -181 52 163
7599 163 141 236 111 -138 142 -183 -158 60 40 257 -11 -97 42 103 -10 95 -220 144 33 -161 116 -33
7621 -33 199 32 -89 -51 -167 -7 28 -211 -148 60 -163 -8 192 -21 192 61 53 -214 135 -43 135 31
7643 31 145 -194 -79 95 -156 51 114 16 109 89 -59 202 -204 29 217 -297 8 -99 -166 -28 -42 -117 146
7666 146 -21 -5 -3 -115 62 -74 -91 155 -67 133 207 -65 -91 -211 61 57 140 -89 129 -39 44 125 46 -70
7690 -70 -68 -44 -137 -93 4 71 -181 -51 336 -204 -162 160 98 428 81 152 93 44 110 -206 163 -37 -309 97 -176
7715 -176 -229 169 48 126 2 -104 -10 76 -75 34 153 -66 32 -110 -16 30 8 36 -101 58 236 3 -8
7738 -8 39 -88 45 67 -82 -16 -110 -1 285 -86 -164 117 -20 11 88 -165 -113 215 -112 35 163 -91 -25 -24
7762 -24 53 -129 70 -76 3 205 -149 -129 78 -99 43 7 -32 45 91 -22 146 97 21 -66 -62 -31 130 -294 -55
7787 -55 -47 12 48 -55 -123 -24 79 -108 101 -195 38 132 77 109 183 48 -16 -67 -151 133 54 -246 -42 91 -203
7812 -203 -64 -4 22 125 152 -14 -154 15 78 -215 132 10 -9 -49 -147 15 50 -90 11 -233 -149 232 -44
7835 -44 -45 -1 288 193 -189 298 55 199 23 1 -183 79 -183 -16 101 -111 133 -84 73 29 -109 -158 123
7858 123 -146 125 22 57 -19 -60 43 -33 -25 199 21 -6 -132 -33 -92 212 -55 246 226 20 10 10 -47 -6 -59
7883 -59 4 74 28 -16 -57 -72 188 -22 -120 119 -106 -107 -196 -153 232 180 -132 -27 280 10 -138 -4 228 126
7907 126 85 -68 -64 -139 103 62 -154 79 -173 58 -18 -97 212 -96 76 164 5 277 -118 -7 3 139 -20
7930 -20 280 184 1 54 -42 61 42 53 39 86 260 -152 11 -31 -39 -425 -238 -37 42 98 29 133 -14 -114 -33
7955 -33 20 91 -69 -69 -73 206 34 136 87 127 54 120 135 -145 -41 133 56 -62 68 246 15 53 -136 -165 53
7980 53 -37 143 -65 38 200 -127 304 -85 -23 112 121 101 125 -213 -73 4 -39 32 -115 -59 11 -23 97 -180
8004 -180 42 83 -224 -34 109 -138 133 94 80 -177 -17 -60 120 12 25 -28 -356 141 162 13 -41 144 -184
8027 -184 148 24 -206 -145 -131 82 -263 -138 302 -296 108 -173 -39 51 -4 -140 -220 -220 -19 59 -377 108 143
8050 143 -91 19 -168 -105 103 -118 132 81 3 81 132 -42 118 -11 10 27 184 -53 -68 44 229 64 28
8073 28 50 49 -47 20 -102 -77 113 -85 -92 228 -72 -93 -78 251 -105 129 64 -27 82 -123 68 249 -52 35 -39
8098 -39 -137 109 112 5 48 -19 -106 49 89 -115 -64 137 30 93 -183 42 -99 338 268 -121 140 29 -184 -54
8122 -54 35 -369 17 -112 -245 -170 -180 152 216 -7 -175 69 -21 -86 -72 -18 -94 -175 153 -135 86 163 -146 14
8146 14 186 61 145 -57 -10 -5 -267 -77 -52 84 -35 -106 38 269 -70 -107 -14 -3 -41 -65 -87 -213 84 168 205
8171 205 -13 -130 -199 -18 -7 357 -151 -23 -3 4 124 70 -138 106 33 -50 55 -143 -6 6
8191F
##END NTUPLES=NMR FID
##END=
