##TITLE=1H_109-2025-Bay
 200.13MHz, CDCl3,
 8 sc
 
 8.9.2025
##JCAMPDX= 6.0         $$ Bruker NMR JCAMP-DX V2.0
##DATA TYPE= NMR FID
##DATA CLASS= NTUPLES
##ORIGIN= UXNMR, Bruker Analytische Messtechnik GmbH
##OWNER= pz
$$ XWIN-NMR		Version 3.5
$$ Mon Sep  8 15:41:24 2025 Russian Standard Time (UT+4h)  she@DPX200
##.OBSERVE FREQUENCY= 200.1313
##.OBSERVE NUCLEUS= ^1H
##.DELAY= (6, 6)
##.ACQUISITION MODE= SIMULTANEOUS
##.ACQUISITION SCHEME= undefined
##.AVERAGES= 8
##.DIGITISER RES= 18
##SPECTROMETER/DATA SYSTEM= spect
##.PULSE SEQUENCE= zg30
##.SOLVENT NAME= CDCl3
##.SHIFT REFERENCE= (INTERNAL, CDCl3, 0, 14.3821)
##AUDIT TRAIL= $$ (NUMBER, WHEN, WHO, WHERE, WHAT)
$$ ##TITLE= Audit trail, XWIN-NMR		Version 3.5
$$ ##JCAMPDX= 5.01
$$ ##ORIGIN= Bruker BioSpin GmbH
$$ ##OWNER= she
$$ F:/spectra/data/she/nmr/H-C/1/audita.txt
$$ ##AUDIT TRAIL=  $$ (NUMBER, WHEN, WHO, WHERE, WHAT)
(   1,<2025-09-08 15:40:08.18 +0400>,<she>,<DPX200>,
      <created by zg, POWCHK disabled, PULCHK disabled
       configuration hash MD5:
       00 E9 B6 7A A2 85 ED C7 34 08 36 98 17 FE 4E 26
       data hash MD5: 16K
       BF 3E DE 18 E4 39 A2 82 93 77 B7 D0 86 3E 87 69>)
$$ ##END=
$$ 
$$ hash MD5
$$ 4F 3C 9D C2 6D 20 C3 2C ED 4D 76 74 ED 76 09 CD
##$RELAX= 
##$RELAX= 
##$RELAX= 
##$RELAX= 
##$RELAX= 
##$RELAX= 
$$ Bruker specific parameters
$$ --------------------------
##$DU= <F:/spectra>
##$EXPNO= 1
##$NAME= <H-C>
##$PROCNO= 1
##$TYPE= <nmr>
##$USER= <she>
##$AMP= (0..31)
100 100 100 100 100 100 100 100 100 100 100 100 100 100 100 100 100 100 
100 100 100 100 100 100 100 100 100 100 100 100 100 100 
##$AQSEQ= 0
##$AQ_mod= 1
##$AUNM= <au_zg>
##$AUTOPOS= <>
##$BF1= 200.13
##$BF2= 200.13
##$BF3= 200.13
##$BF4= 200.13
##$BF5= 200.13
##$BF6= 200.13
##$BF7= 200.13
##$BF8= 200.13
##$BYTORDA= 1
##$CFDGTYP= 0
##$CFRGTYP= 5
##$CHEMSTR= <none>
##$CNST= (0..31)
1 1 145 1 1 1 1 1 1 1 1 1 1 1 1 1 1 1 1 1 1 1 1 1 1 1 1 1 1 1 1 1 
##$CPDPRG= <>
##$CPDPRG1= <>
##$CPDPRG2= <>
##$CPDPRG3= <>
##$CPDPRG4= <mlev>
##$CPDPRG5= <mlev>
##$CPDPRG6= <mlev>
##$CPDPRG7= <mlev>
##$CPDPRG8= <mlev>
##$CPDPRGB= <>
##$CPDPRGT= <>
##$D= (0..31)
0 0.7 0 0 0 0 0 0 0 0 0 0.03 0 0 0 0 0 0 0 0 0 0 0 0 0 0 0 0 0 0 0 0 
##$DATE= 1757331607
##$DBL= (0..7)
120 120 120 120 120 120 120 120 
##$DBP= (0..7)
150 150 150 150 150 150 150 150 
##$DBP07= 0
##$DBPNAM0= <>
##$DBPNAM1= <>
##$DBPNAM2= <>
##$DBPNAM3= <>
##$DBPNAM4= <>
##$DBPNAM5= <>
##$DBPNAM6= <>
##$DBPNAM7= <>
##$DBPOAL= (0..7)
0.5 0.5 0.5 0.5 0.5 0.5 0.5 0.5 
##$DBPOFFS= (0..7)
0 0 0 0 0 0 0 0 
##$DE= 6
##$DECBNUC= <off>
##$DECIM= 32
##$DECNUC= <off>
##$DECSTAT= 4
##$DIGMOD= 1
##$DIGTYP= 9
##$DL= (0..7)
0 120 120 120 120 120 120 120 
##$DP= (0..7)
150 150 150 150 150 150 150 150 
##$DP07= 0
##$DPNAME0= <>
##$DPNAME1= <>
##$DPNAME2= <>
##$DPNAME3= <>
##$DPNAME4= <>
##$DPNAME5= <>
##$DPNAME6= <>
##$DPNAME7= <>
##$DPOAL= (0..7)
0.5 0.5 0.5 0.5 0.5 0.5 0.5 0.5 
##$DPOFFS= (0..7)
0 0 0 0 0 0 0 0 
##$DQDMODE= 0
##$DR= 18
##$DS= 0
##$DSLIST= <SSSSSSSSSSSSSSS>
$$ [...]
##$SUBNAM0= <"">
##$SUBNAM1= <"">
##$SUBNAM2= <"">
##$SUBNAM3= <"">
##$SUBNAM4= <"">
##$SUBNAM5= <"">
##$SUBNAM6= <"">
##$SUBNAM7= <"">
##$SUBNAM8= <"">
##$SUBNAM9= <"">
##$SW= 18.0517328524113
##$SWIBOX= (0..15)
0 0 2 0 0 0 0 0 0 0 0 0 0 0 0 0 
##$SW_h= 3612.71676300578
##$TD= 16384
##$TD0= 1
##$TE= 0
##$TE2= 300
##$TE3= 300
##$TEG= 300
##$TL= (0..7)
0 120 120 120 120 120 120 120 
##$TP= (0..7)
150 150 150 150 150 150 150 150 
##$TP07= 0
##$TPNAME0= <>
##$TPNAME1= <>
##$TPNAME2= <>
##$TPNAME3= <>
##$TPNAME4= <>
##$TPNAME5= <>
##$TPNAME6= <>
##$TPNAME7= <>
##$TPOAL= (0..7)
0.5 0.5 0.5 0.5 0.5 0.5 0.5 0.5 
##$TPOFFS= (0..7)
0 0 0 0 0 0 0 0 
##$TUNHIN= 0
##$TUNHOUT= 0
##$TUNXOUT= 0
##$USERA1= <user>
##$USERA2= <user>
##$USERA3= <user>
##$USERA4= <user>
##$USERA5= <user>
##$V9= 5
##$VALIST= <valist>
##$VCLIST= <CCCCCCCCCCCCCCC>
##$VD= 0
##$VDLIST= <DDDDDDDDDDDDDDD>
##$VPLIST= <PPPPPPPPPPPPPPP>
##$VTLIST= <TTTTTTTTTTTTTTT>
##$WBST= 1024
##$WBSW= 4
##$XGAIN= (0..3)
0 0 0 0 
##$XL= 0
##$YL= 0
##$YMAX_a= 292009
##$YMIN_a= -672564
##$ZGOPTNS= <>
##$ZL1= 120
##$ZL2= 120
##$ZL3= 120
##$ZL4= 120
##$ABSF1= 10
##$ABSF2= 0
##$ABSG= 5
##$ABSL= 3
##$ALPHA= 0
##$AQORDER= 0
##$ASSFAC= 0
##$ASSFACI= 0
##$ASSFACX= 0
##$ASSWID= 0
##$AUNMP= <proc_1d>
##$AZFE= 0.1
##$AZFW= 0.1
##$BCFW= 1
##$BC_mod= 2
##$BYTORDP= 1
##$COROFFS= 0
##$CY= -3
##$DATMOD= 1
##$DC= 2
##$DFILT= <>
##$DTYPP= 0
##$F1P= 0
##$F2P= 0
##$FCOR= 0.5
##$FTSIZE= 0
##$FT_mod= 4
##$GAMMA= 1
##$GB= 0.15
##$INTBC= 1
##$INTSCL= 1
##$ISEN= 128
##$LB= 0.25
##$LEV0= 0
##$LPBIN= 0
##$MAXI= 10000
##$MC2= 0
##$MEAN= 0
##$ME_mod= 0
##$MI= 1.114404
##$NCOEF= 0
##$NC_proc= 0
##$NLEV= 6
##$NOISF1= 3.799351
##$NOISF2= 2.8
##$NSP= 1
##$NTH_PI= 0
##$NZP= 0
##$OFFSET= 14.38212
##$PC= 1
##$PHC0= -1560.312
##$PHC1= 8.392281
##$PH_mod= 1
##$PKNL= yes
##$PPARMOD= 0
##$PSCAL= 0
##$PSIGN= 0
##$REVERSE= no
##$SF= 200.129724274929
##$SI= 16384
##$SIGF1= 3
##$SIGF2= 2
##$SINO= 400
##$SIOLD= 16384
##$SREGLST= <1H.CDCl3>
##$SSB= 0
##$STSI= 0
##$STSR= 0
##$SW_p= 3205.1282051282
##$SYMM= 0
##$S_DEV= 0
##$TDeff= 0
##$TDoff= 0
##$TI= <>
##$TILT= no
##$TM1= 0
##$TM2= 0
##$TOPLEV= 0
##$USERP1= <user>
##$USERP2= <user>
##$USERP3= <user>
##$USERP4= <user>
##$USERP5= <user>
##$WDW= 1
##$XDIM= 8192
##$YMAX_p= 0
##$YMIN_p= 0
$$ End of Bruker specific parameters
$$ ---------------------------------
##NTUPLES= NMR FID
##VAR_NAME=  TIME,          FID/REAL,        FID/IMAG
##SYMBOL=    X,             R,               I
##VAR_TYPE=  INDEPENDENT,   DEPENDENT,       DEPENDENT
##VAR_FORM=  AFFN,          ASDF,            ASDF
##VAR_DIM=   8192,          8192,            8192
##UNITS=     SECONDS,       ARBITRARY UNITS, ARBITRARY UNITS
##FACTOR=    0.0002768,     1,               1
##FIRST=     0,             0,               0
##LAST=      2.2672688,     0,               0
##MIN=       0,             -672564,         0
##MAX=       2.2672688,     292009,          0
$$ Real data points
##PAGE= N=1
##DATA TABLE= (X++(R..R)), XYDATA
$$ [...]
$$ plain form
1843 1352 1791 938 1260 1757 297 -527 -549 -563 -738 -1480 -742 1196 526 -63 514 649 354 -361 -517 492
1863 492 -203 -1364 -302 -224 -460 -933 -568 -89 139 -850 -31 952 497 113 -93 535 814 -547 -640 562
1883 562 73 -656 -64 336 181 -368 -192 1313 1314 462 919 1038 912 313 -330 626 393 -1121 -1170 -456
1903 -456 -784 -1149 -1431 -940 45 -887 -545 814 568 333 501 944 1262 167 -963 2 -183 -930 -786
1922 -786 -252 205 137 -45 1167 1795 808 807 1204 913 -24 -507 -166 226 -866 -1083 -187 -247 -368 -782 -741
1943 -741 103 -564 -1158 -95 211 -41 27 647 1297 930 -226 409 615 -204 -348 -160 -45 -132 -777 -106
1963 -106 771 456 -71 471 922 741 201 -129 735 -296 -1487 -930 -579 -797 -863 -463 649 620 93 535
1983 535 769 335 -72 -230 202 429 -101 569 958 493 78 -268 -211 -303 -1073 -1168 116 -65 -450 91 313
$$ packed form
1843A352M39q53L22M97j460q24k2j4j75p42P38J938o70n89N77J35k95p15j56J009
1863D92o95j161J062P8k36m73L65M79K28r89Q19R83m55l84k06O28K79j361r3J202
1883E62m89p29N92M00j55n49J76J505Jq52M57J19j26n99o43R56k33j514m9P14
1903d56l28l65k82M91R85r32L42J359k46k35J68M43L18j095j130R65j85p47J44
1922g86N34M57o8j82J212O28r87jL97k91r37m83L41L92j092k17Q96o0j21m14M1
1943g41Q44o67n94J063L06k52O8O20O50l67j156O35K06q19j44J88J15q7o45O71
1963a06Q77l15n27N42M51j81n40l30Q64j031j191N57L51k18o6M00J112k9n27M42
1983E35K34m34m07j58M32K27n30O70L89m65m15l46N7r2p70r5J284j81l85N41K22
$$ plain form
2004 313 523 33 -396 253 292 -483 -36 -271 -526 -875 -1118 -879 -116 -677 -145 1162 1133 796 603 463
2024 463 817 -258 -371 564 131 448 596 735 886 232 -884 -634 -796 -1379 -911 -130 455 711 298
2043 298 793 745 -274 -652 -446 -577 -648 -877 -146 438 -619 -658 -31 227 268 295 519 1209 900 271 447
2064 447 217 -601 -978 -705 60 514 200 862 1540 688 331 257 -22 -168 -762 -443 270 -248 -679 -552
2084 -552 -477 -572 -771 -495 479 678 385 1021 1065 739 -192 -868 -849 -930 -1349 -717 139 -141 29 203 77 418
2106 418 -149 -117 775 863 901 1303 1192 835 -498 -994 -922 -1179 -1411 -628 339 988 1379 1232 1638 1013 -123
2127 -123 -306 -230 -566 -915 -1348 -1013 -765 -1234 -1365 -881 -386 -503 183 746 1446 810 349 700 134 -609
2147 -609 -640 -463 -35 52 -64 672 905 -96 -155 -272 23 131 190 1181 1573 935 719 668 84 -642 -1279
$$ packed form
2004C13K10m90m29O49L9p75M47k35k55l49k43K39P63n61N32J307k9l37j93j40
2024D63L54j075j13R35m33L17J48J39J51o54j116K50j62n83M68P81N85K56m13
2043B98M95m8j019l78K06j31p1k29P31N84j057l9O27K58M1K7K24O90l09o29J76
2064D47k30q18l77K73P65M54l14O62O78q52l57p4k79j46n94L19P13n18m31J27
2084e52P5r5j99K76R74J99k93O36M4l26r31o76J9q1m19O32Q56k80J70J74j26L41
2106D18n67L2Q92Q8L8M02j11l57j333m96P2k57k32P83R67O49L91j47M06o25j136
2127a23j83P6l36l49m33L35K48m69j31M84M95j17O86N63P00o36m61L51n66p43
2147f09l1J77M28Q7j16P36K33j001n9j17K95J08N9R91L92o38k16n1n84p26o37
$$ plain form
2168 -1279 -1723 -771 -527 -191 501 411 48 -242 -588 -269 -205 -684 136 531 788 944 685 346 -28 -936
2188 -936 -819 -408 -724 -591 34 134 277 -99 -80 410 367 83 776 950 936 273 -230 -368 -429 -1187 -728
2209 -728 -271 -98 470 606 1101 822 -173 -459 -205 -356 -502 -60 332 707 222 55 172 -637 -1225 -1045
2229 -1045 -689 -98 405 523 1061 1249 466 202 114 -249 -502 -863 -9 418 67 84 84 -185 -244 -184 -219 600
2251 600 341 150 485 185 -220 -496 -1124 -807 -769 -483 320 978 559 644 359 58 -332 -763 -426 42 -214
2272 -214 198 906 815 751 -271 -230 -66 -289 -386 121 166 365 240 -59 -219 -550 -586 -367 -222 114 399 476
2294 476 404 111 -472 -480 -486 -660 -189 254 1045 1031 763 520 315 -371 -489 -822 -750 -232 -230 127 669 735 311
2317 311 405 78 77 -40 -235 132 226 -364 -23 -487 -438 -406 -598 -240 281 157 378 535 262 34 -349 -379
$$ packed form
2168a279m44R52K44L36O92r0l63k90l46L19O4m79Q20L95K57J56k59l39l74r08
2188i36J17M11l16J33O25J00J43l76J9M90m3k84O93J74j4o63n03j38o1p58M59
2209g28M57J73N68J36M95k79r95k86K54j51j46M42L92L75m85j67J17q09n88J80
2229a045L56N91N03J18N38J88p83k64q8l63k53l61Q54M27l51J7%k69n9O0l5Q19
2251F00k59j91L35l00m05k76o28L17L8K86Q03O58m19Q5k85l01l90m31L37M68k56
2272b14M12P08r1o4j022M1J64k23r7N07M5J99j25k99j60l31l6K19J45L36K85P7
2294D76p2k93n83qoj74M71M43P91j4k68k43k05o86j18l33P2N18KL57N42O6m24
2317C11R4l27jj17j95L67R4n90L41m64M9L2j92L58N21j24K21J57k73k28l83l0
$$ plain form
2339 -379 -119 -124 37 621 505 494 374 -77 -531 -729 -768 -619 39 49 701 833 661 389 -176 -243 -303 -749
2361 -749 -601 -247 -142 272 -100 24 -131 -127 -284 414 107 374 360 238 466 334 -252 -268 5 -319 40
2382 40 453 339 467 72 -289 -159 -695 -761 -474 -422 -262 164 333 357 -3 -163 -334 -303 -377 -447 -339 175
2404 175 109 -223 49 362 62 27 268 687 715 433 689 671 142 -213 -136 -455 -328 -320 -320 -46 108 -58 -30
2427 -30 1 49 -72 -29 199 132 109 94 111 -178 -376 -486 -668 -325 -375 175 365 459 616 490 265 133 -337
2450 -337 -462 -234 -59 -2 32 197 153 -89 -164 -247 14 -336 40 -84 -85 231 -88 -30 43 -371 -237 203 152
2473 152 199 298 366 437 -1 -81 148 -92 44 -182 -219 -42 -159 -88 -161 -497 -166 -134 -35 176 227 146 258 272
2497 272 -148 -342 -389 -806 -600 -443 -94 100 334 551 700 410 414 246 149 290 90 -123 144 -62 -357
$$ packed form
2339c79K60nJ61N84j16j1j20m51m54j98l9J49O58J0O52J32j72k72n65o7o0m46
2361g49J48L54J05M14l72J24j55Mj57O98l07K67j4j22K28j32n86j6K73l24L59
2382D0M13j14J28l95l61J30n36o6K87N2J60M26J69K4l60j60j71L1p4p0J08N14
2404A75o6l32K72L13l00l5K41M19K8k82K56j8n29l55P7l19J27Q%K74J54j66K8
2427c0L1M8j21M3K28o7k3j5J7k89j98j10j82L43n0N50J90R4J57j26k25j32m70
2450c37j25K28J75N7L4J65m4k42p5q3K61l50L76j24jL16l19N8P3m14J34M40n1
2473A52M7R9O8P1m38q0K29k40J36k26l7J77j17P1p3l36L31L2R9K11N1q1J12J4
2497B72m20j94m7m17K06J57L49J94K34K17J49k90Mj68r7J41k00k13K67k06k95
$$ plain form
2518 -357 -162 -192 151 190 48 142 463 431 316 59 -354 -292 -472 -553 -343 -534 -204 -16 84 -121 -73 -89 -57
2541 -57 -42 -161 108 122 108 289 111 -138 249 19 -76 34 147 323 42 165 359 190 -26 172 66 212
2563 212 108 -55 -12 -233 -322 -186 -47 -151 -350 -151 -21 -12 -15 93 61 -215 -318 -495 -358 -77 -141 -28 229
2586 229 351 311 536 382 291 162 152 205 -14 -95 -74 -93 26 153 29 155 277 -72 -27 -19 -110 -77 -252 -249 -213
2611 -213 -151 90 117 -126 -48 -134 -245 76 -124 -146 42 29 -21 12 183 119 392 239 153 263 -320 91 -150
2634 -150 -34 -1 -23 288 107 -18 -8 87 23 18 1 -105 -116 -118 -188 86 -121 -113 -231 26 -187 -233 -234 171 -63 -6
2660 -6 230 132 -18 206 13 102 109 -104 60 22 -82 -156 171 209 162 178 102 124 103 -36 -247 -127 182 -194 -142
2685 -142 -32 -64 -155 -72 59 129 -75 -103 28 63 -135 -65 -41 23 200 143 -194 258 197 283 -38 -113 145 -274
$$ packed form
2518c57J95l0L43L9j42R4L21l2j15k57m13O2j80q1K10j91L30J88J00k05M8j6L2
2541e7J5j19K69J4j4J81j78k49L87k30r5J10J13J76k81J23J94j69k16J98j06J46
2563B12j04j63M3k21q9J36J39j04j99J99J30RlJ08l2k76j03j77J37K81o4J13K57
2586B29J22m0K25j54r1j29j0N3k19q1K1j9J19J27j24J26J22l49M5Qr1L3j75LL6
2611b13O2K41K7k43P8q6j11L21k00k2J88j3n0L3J71o4K73j53q6J10n83M11k41
2634a50J16L3k2L11j81j25J0R5o4nj7j06j1kp0K74k07Qj18K57k13m6jM05k34N7
2660fK36r8j50K24j93Q9Pk13J64l8j04p4L27L8m7J6p6K2k1j39k11J20L09l76N2
2685a42J10l2r1Q3J31P0k04k8J31L5j98P0K4O4J77n7l37M52o1Q6l21p5K58m19
$$ plain form
2709 -274 -126 -130 -128 -106 -185 -373 -208 92 -92 -203 135 33 166 7 -215 9 116 -160 196 -133 -18 -14 39
2732 39 376 120 150 313 128 199 175 299 -101 66 22 -85 -38 -334 -282 87 -116 46 -190 -74 -234 -115
2754 -115 -68 17 -79 -388 -9 -104 19 75 -218 226 203 143 356 185 113 185 175 7 73 -83 -140 145 -335 -135
2778 -135 34 -282 -44 -172 305 375 41 13 -63 -246 -328 -457 -222 -3 -47 -158 95 8 95 246 -2 153
2800 153 217 -130 86 147 18 -72 -34 -134 -91 7 45 310 122 162 140 113 147 -44 -37 -83 69 -134 -83 -156 -30
2825 -30 -84 -564 -156 -140 -34 120 130 -47 381 179 267 57 -19 -1 27 -91 -1 -83 94 324 100 218 -122
2848 -122 89 -29 155 39 114 48 -86 301 -63 -68 -143 -102 -237 207 -40 58 252 -16 87 24 82 -9 -178
2871 -178 -137 240 -37 -90 89 130 115 235 -61 176 159 120 -50 105 -152 -149 -350 -231 -59 -213 -133 150 229
$$ packed form
2709b74J48mKK2p9j88J65L00j84j11L38j02J33j59k22K24J07k76L56l29J15MN3
2732C9L37k56L0J63j85P1k4J24m00J67m4j07M7k96N2L69k03J62k36J16j60J19
2754a15M7Q5r6l09L79r5J23N6k93M44k3o0K13j71p2P2j0j68O6j56n7K85m80K00
2778a35J69l16K38j28M77P0l34k8p6j83q2j29K35K19m4j11K53q7Q7J51k48J55
2800A53O4l47K16O1j29r0L8j00M3R8L8K65j88M0k2k7L4j91Pm6J52k03N1p3J26
2825c0n4m80M08J6J06J54J0j77M28k02Q8k10p6J8K8j18R0q2J77K30k24J18l40
2848a22K11j18J84j16P5o6j34L87l64np5M1j35M44k47R8J94k68J03o3N8r1j69
2871a78M1L77k77n3J79M1j5J20k96K37j7l9j70J55k57Lk01J19J72j54Q0K83P9
$$ plain form
2894 229 44 -233 21 47 -167 20 178 146 -48 75 232 188 72 191 234 248 154 320 0 -124 109 -64
2916 -64 -80 -13 -69 -59 -95 -33 144 205 192 57 4 -137 -120 -145 -123 -191 87 17 -70 -15 -9 189 -101 -125 63 -86 46
2943 46 -10 49 -62 66 67 -51 70 98 87 226 350 61 90 286 -149 1 173 120 46 27 53 233 25 -26
2967 -26 86 -240 -72 -97 -138 25 69 -62 -115 -77 -191 111 -243 21 13 -155 -94 3 32 -61 137 195 142 -21 168
2992 168 215 287 181 -27 83 60 -29 -176 -144 -132 -33 -176 156 -60 -49 -26 -124 85 -49 -29 -87 -24 48 153 -161
3017 -161 105 21 -14 73 155 -87 -76 35 8 -4 -102 -14 -31 -132 24 -17 60 -125 -252 -133 31 -60 -100 -127 4
3042 4 -154 -83 73 248 331 232 87 -18 60 -278 -67 129 73 -5 255 111 7 6 73 -22 38 -79 -92 -125 -40
3067 -40 -146 -50 71 -29 40 -94 75 24 177 157 75 291 -52 71 65 34 -58 154 352 64 165 1 -44 275
$$ packed form
2894B29j85k77K54K6k14J87J58l2j94J23J57m4j16J19M3J4r4J66l20j24K33j73
2916f4j6O7n6J0l6O2J77O1j3j35n3j41J7k5K2o8K78p0q7N5OJ98k90k4J88j49J32
2943D6n6N9j11J28Jj18J21K8j1J39J24k89K9J96m35J50J72n3p4j9K6J80k08n1
2967b6J12l26J68k5m1J63M4j31n3L8j14L02l54K64qj68O1R7K9r3J98N8n3j63J89
2992A68M7P2j06k08J10k3q9j47L2J2R9j43L32k16J1K3r8K09j34K0n8O3P2J05l14
3017a61K66q4l5Q7Q2k42J1J11k7j2r8Q8j7j01J56m1P7j85j27J19J64r1m0k7J31
3042Dj58P1J56J75Q3r9j45j05P8l38K11J96n6p8K60j44j04jO7r5O0j17j3l3Q5
3067d0j06R6J21j00O9j34J69n1J53k0q2K16l43J23ol1r2K12J98k88J01j64m5L19
$$ plain form
3091 275 -40 -113 257 -62 -268 -85 25 -153 7 -276 -268 -74 -1 -47 -84 118 88 -225 126 -315 36 12 -179
3114 -179 138 24 100 -135 -1 79 95 159 64 268 111 329 184 -60 33 -276 -86 99 -277 -195 -185 -124 -202
3137 -202 -6 64 -29 -108 -250 -99 -56 116 -99 83 -260 122 110 -180 179 32 94 170 189 216 116 -111 -124
3160 -124 -148 -25 0 -29 27 141 -31 79 266 108 44 -96 -159 -74 27 -209 -140 -99 -16 -4 -222 -133 146 -246
3184 -246 -33 2 -80 13 -62 -71 -16 11 36 3 161 67 -86 35 99 126 -87 28 79 107 -26 -92 -110 65 -32 47
3210 47 -72 7 134 -78 98 16 205 20 183 5 -37 -150 208 161 76 -57 20 -153 -159 50 -165 -119 27
3233 27 11 54 -36 22 198 138 -99 -37 48 13 77 -179 -68 -71 152 -92 36 -3 -90 47 6 -110 -93 32 -48 -65
3259 -65 -190 141 116 89 108 -101 89 73 -140 -17 8 147 -117 -141 -11 -86 -102 111 -99 175 336 141 -147
$$ packed form
3091B75l15p3L70l19k06J83J10j78J60k83QJ94P3m6l7K02l0l13L51m41L51k4j91
3114a79L17j14P6k35J34Q0J6O4r5K04j57K18j45k44R3l09J90J85l76Q2J0O1p8
3137b02J96P0r3p9j42J51M3J72k15J82l43L82j2k90L59j47O2P6J9K7j00k27j3
3160a24k4J23K5k9N6J14j72J10J87j58o4j40o3Q5J01k36O9M1Q3J2k18Q9K79l92
3184b46K13L5q2R3p5rN5K7K5l3J58r4j53J21O4K7k13J15N1K8j33o6j8J75r7P9
3210D7j19P9J27k12J76q2J89j85J63j78m2j13L58m7q5j33P7j73oK09k15M6J46
3233B7j6M3r0N8J76o0k37O2Q5l5O4k56J11lK23k44J28l9q7J37m1j16J7J25q0j7
3259f5j25L31k5k7J9k09J90j6k13J23K5J39k64k4J30p5j6K13k10K74J61j95k88
$$ plain form
3282 -147 50 182 -30 81 -107 -162 30 32 211 -73 -133 27 42 -64 -3 43 -66 289 106 56 100 17 -39 180
3306 180 -78 80 93 -130 177 -69 -28 -256 -27 -179 -198 -28 38 265 -379 -83 -69 -91 127 -123 78 -75
3328 -75 -128 63 28 183 158 142 -40 -39 144 -6 16 -144 27 80 -127 -94 36 -69 221 107 -82 -81 -77 -65 -69 -255
3354 -255 239 -54 117 -145 131 64 8 109 -46 84 -111 254 -56 10 7 56 133 185 97 -130 22 63 155 95
3378 95 231 -64 9 -100 -37 -113 175 -196 -71 -87 -270 -42 35 99 -142 -71 27 72 161 95 141 186 -59 152 30
3403 30 -4 -123 -59 -148 -32 -237 124 36 192 215 176 -93 106 -40 -68 194 76 29 -128 -8 -242 -6 -127
3426 -127 -71 -49 122 -174 -67 169 119 -59 -77 -153 -178 73 -114 70 145 90 -18 -119 38 -22 118 295 60
3449 60 138 6 121 133 16 12 69 -146 132 -154 31 -122 123 -168 -48 -42 -126 -123 -154 139 79 20 -27 274 -367
$$ packed form
3282a47J97J32k12J11j88n5J92KJ79k84o0J60J5j06O1M6j09L55j83n0M4q3n6K19
3306A80k58J58J3k23L07k46M1k28K29j52j9J70O6K27o44K96J4k2K18k50K01j53
3328g5n3J91l5J55k5j6j82JJ83j50K2j60J71N3k07L3J30j05K90j14j89JMJ2mj86
3354b55M94k93J71k62K76o7n6J01j55J30j95L65l10O6lM9P7N2q8k27J52M1R2o0
3378I5J36k95P3j09O3p6K88l71J25j6j83K28P7O4k41P1R8M5Q9o6M6M5k45K11j22
3403C0l4j19O4q9J16k05L61q8J56K3l9k69J99j46k8K62j18m7j57J20k34K36j21
3426a27N6K2J71k96J07K36n0j78j8p6k5K51j87J84P5n5j08j01J57o0J40J77k35
3449F0P8j32J15J2j17mN7k15K78k86J85j53K45k91J20Oq4Ll1K93o0n9m7L01o41
$$ plain form
3474 -367 25 19 -118 43 93 -67 130 -78 191 0 416 97 261 10 199 159 -90 -8 -300 -220 -225 -213 -71
3497 -71 -75 -184 27 15 18 -227 -58 -144 110 -136 -173 174 11 144 78 210 47 3 126 19 61 -76 36 44
3521 44 -118 51 119 88 34 127 -55 -61 -29 -34 -356 -242 56 170 -225 -182 -15 83 163 49 -112 -140 -11 27 28 -23
3547 -23 -117 12 181 -63 -182 53 116 -53 17 -18 -106 76 -85 -275 -162 -17 -162 97 -228 12 65 -21 2
3570 2 -142 -20 -98 -9 -4 64 86 165 53 -153 216 66 -3 61 13 199 5 144 59 313 -34 -22 -76 341 85
3595 85 55 50 -185 -72 -240 -24 -283 41 -79 -71 -28 31 5 -129 46 20 12 -148 -128 -152 93 59 -9 146 29
3620 29 -40 149 51 -30 18 -119 -23 -142 25 -123 -8 -56 -240 14 176 -24 252 102 160 -111 86 208 115
3643 115 63 93 189 192 192 70 12 293 -42 115 -89 -93 45 -246 -137 21 312 58 -233 43 -147 -157 -96 -110
$$ packed form
3474c67L92oj37J61N0j60J97k08K69j91M16l19J64k51J89m0k49Q2k92Q0nJ2J42
3497g1mj09K11j2Lk45J69q6K54k46l7L47j63J33o6J32j63m4J23j07M2j37J12Q
3521D4j62J69O8l1n4R3j82oL2nl22J14K98J14l95M3J67R8Q0j14j61k8J29L8Jn1
3547b3r4J29J69k44j19K35O3j69P0l5q8J82j61j90J13J45j45K59l25K40N3q6K3
3570Bj44J22p8Q9NO8K2P9j12k06L69j50o9O4m8J86j94J39q5K54l47J2n4M17k56
3595H5l0nk35J13j68K16k59L24j20QM3N9k6j34J75k6qj60K0k4K45l4o8J55j17
3620B9o9J89r8q1M8j37R6j19J67j48J15m8j84K54J62k00K76j50N8k71J97J22r3
3643A15n2L0R6L%j22n8K81l35J57k04mJ38k91J09J58K91k54k91K76j90j0O1j4
$$ plain form
3667 -110 -70 -99 92 149 -131 17 85 184 347 -8 26 174 -167 -116 -27 -37 99 27 19 -279 -19 -218 -187 -180 40
3692 40 66 -137 94 190 -240 136 -6 -106 4 226 -30 -98 -227 70 159 -362 196 -101 -112 285 69 -100
3714 -100 73 57 107 65 68 33 57 -55 301 -4 24 -15 110 52 41 -87 80 37 -87 65 91 228 -31 138
3738 138 16 59 -158 -1 216 254 56 -14 -72 -34 131 -10 -11 -13 73 172 34 -118 -29 -218 6 123 17 -214
3762 -214 107 -135 -35 129 77 147 136 -184 23 -102 10 -94 -168 -18 40 46 23 67 -37 -119 -21 -79 -32 -165
3786 -165 -216 -174 -470 7 -82 -95 -118 -42 113 32 69 14 76 240 219 -1 39 228 -21 -104 22 67 292 -93 123
3811 123 220 44 120 16 139 4 -118 -134 -241 9 -107 -95 -34 -150 -1 -191 41 14 -123 -32 113 103 -68
3834 -68 31 151 -31 -120 -16 -9 -25 -353 -85 -93 205 139 180 154 202 -77 -68 143 -19 115 77 65 -95 -29 -169 2
$$ packed form
3667a10M0k9J91N7k80J48O8R9J63l55L4J48l41N1Q9j0J36p2qk98K60j99L1PK20
3692D0K6k03K31R6m30L76j42j00J10K22k56o8j29K97Q9n21N58k97j1L97k16j69
3714a00J73j6N0m2Ll5K4j12L56l05K8l9J25n8j1j28J67m3j24J52K6J37k59J69
3738A38j22M3k17J57K17L8j98p0n8L8J65j41jkQ6R9j38j52Q9j89K24J17j06k31
3762b14L21k42J00J64n2P0j1l20K07j25J12j04p4J50N8Ok3M4j04q2R8n8M7j33
3786a65n1M2k96M77q9j3k3P6J55q1L7n5O2J64k1k20M0J89k49q3J26M5K25l85K16
3811A23R7j76P6j04J23j35j22j6j07K50j16J2O1j16J49j90K32k7j37R1J45j0j71
3834f8R9J20j82q9J04Pj6l28K68qK98o6M1k6M8k79RK11j62J34l8j2j60O6j40J71
$$ plain form
3860 2 -131 -149 -120 -14 -196 -141 0 -70 -24 -122 -260 -324 -54 -224 -224 -23 138 3 -204 88 -37 143 -110 91
3884 91 54 268 -38 -75 300 220 82 -11 88 183 159 32 79 -5 188 119 25 82 -131 -117 -30 -350 -37 -250 -214
3909 -214 -286 -165 -276 -68 -5 -286 -99 -1 173 13 132 144 -189 -310 -166 -31 -25 -43 -15 69 -36 -135 399
3932 399 225 327 4 308 192 137 140 -33 -152 -143 -106 -77 -168 173 -219 -322 44 -193 -136 89 77 -149 29
3955 29 -6 109 39 -97 -129 21 49 140 -265 58 154 31 12 420 104 -72 213 94 255 105 109 -46 -47 -54 -208
3980 -208 -41 2 -121 -233 99 221 35 -100 -174 94 -84 -259 -98 -87 -325 -270 86 -61 7 -307 171 152
4002 152 -61 151 262 160 152 69 65 96 73 7 -5 49 1 4 21 0 11 25 -202 -2 33 -151 -27 -171 94 -154
4028 -154 -105 68 -123 -124 28 7 -118 -102 -55 116 106 117 57 17 115 -1 -5 277 -95 130 -101 -44 -150 107 -54
$$ packed form
3860Bj33j8K9J06j82N5J41p0M6r8j38o4K70j70%K01J61j35k07K92j25J80k53K01
3884I1l7K14l06l7L75q0j38r3R9R5k4j27M7q4J93o9r4N7k13J4Q7l20L13k13L6
3909b14p2J21j11K08O3k81J87R8J74j60J19J2l33j21J44J35Oj8K8Q4j05r9N34
3932C99j74J02l23L04j16n5Lj73j19RL7K9r1L41l92j03L66k37N7K25j2k26J78
3955B9l5J15p0j36l2J50K8R1m05L23R6j23j9M08l16j76K85j19J61j50Mj55jpj54
3980b08J67M3j23j12L32J22j86j35p4K68j78j75J61J1k38N5L56j47O8l14M78j9
4002A52k13K12J11j02qq3mL1k3o6j2N4m8LJ7k1J1J4k27K00L5j84J24j44K65k48
4028a54M9J73j91jJ52k1j25J6M7J71j0J1o0m0R8j16mK82l72K25k31N7j06K57j61
$$ plain form
4053 -54 224 218 74 110 151 -11 -117 45 -91 -98 54 -240 42 59 -149 -21 193 248 -67 35 27 150 150 -236
4077 -236 286 203 235 -231 -44 82 -36 -180 -202 -36 128 -280 -102 58 -159 -212 124 238 18 -7 -42 27
4099 27 -173 -94 4 -65 84 105 -95 126 243 126 -114 162 174 -140 75 13 -69 -4 -153 139 110 8 90 336
4123 336 6 9 67 -77 53 31 -94 -24 -94 -32 -33 -49 123 -167 109 71 -156 -22 44 -153 135 -56 63 431
4147 431 107 0 50 49 46 32 -223 167 69 -28 -54 91 3 244 -74 125 271 -78 -117 -72 101 -17 -49 -150
4171 -150 285 7 -117 120 -15 38 -50 -175 -23 -67 -294 -253 -19 -177 -80 -140 79 130 134 -210 290 -64 4
4194 4 75 -263 -219 -130 -128 211 141 -1 105 396 -72 -183 42 -152 29 -150 -51 9 -119 154 16 65 61 -172
4218 -172 -38 55 -71 -222 -89 -86 27 -125 51 -6 56 -179 -21 137 10 67 118 92 45 -135 148 -29 44
$$ packed form
4053e4K78oj44L6M1j62j06J62j36pJ52k94K82J7k08J28K14N5l15J02qJ23%l86
4077b36N22q3L2m66J87J26j18j44k2J66J64m08J78J60k17n3L36J14k20k5l5O9
4099B7k00P9R8o9J49K1k00K21J17j17k40K76J2l14K15o2q2O5j49K92k9j02Q2K46
4123C36l30LN8j44J30k2j25P0p0O2jj6J72k90K76l8k27J34O6j97K88j91J19L68
4147D31l24j07N0jlj4k55L90r8r7k6J45q8K41l18J99J46l49l9M5J73j18l2j01
4171a50M35k78j24K37j35N3q8j25J52m4k27M1K34j58R7o0K19N1Ml44N00l54O8
4194DP1l38M4Q9KL39p0j42J06K91m68j11K25j94J81j79R9O0j28K73j38M9mk33
4218a72J34R3j26j51J33LJ13j52J76n7O2k35J58J58j27N7N1k6m7j80K83j77P3
$$ plain form
4241 44 76 -100 -142 235 75 -69 41 -60 25 2 126 157 349 -13 231 -50 -46 -71 -138 -34 43 -267 16 68
4265 68 -10 89 -32 15 -94 -35 -74 343 82 -156 8 -142 85 66 132 167 -125 -81 201 37 188 -106 -135 67
4289 67 -134 31 -41 38 55 -4 60 5 98 -133 -3 329 197 -102 183 80 139 -9 -351 80 -176 -375 53
4312 53 36 -50 330 76 199 220 -166 -104 -33 -286 7 -206 110 118 -234 128 281 164 46 -28 123 -22 -214
4335 -214 -131 -91 -77 -268 45 115 21 -12 -209 57 211 135 109 -94 -116 104 -12 232 405 133 99 2 -74 -214
4359 -214 -362 -253 -47 -292 33 152 29 326 83 233 356 133 -379 -47 -56 -223 -74 -135 -129 -216 -82 79
4381 79 144 198 98 272 242 68 135 -133 140 -45 -138 84 -86 -207 183 57 125 22 -418 2 -11 -41 66
4404 66 36 384 310 -46 -88 172 -161 -289 -7 -6 -68 -285 -146 19 57 -64 -37 168 252 165 288 130 -32 -28
$$ packed form
4241D4L2j76m2L77j60j44J10j01Q5k3J24L1J92l62K44k81Mk5o7J04P7l10K83N2
4265F8p8R9j21M7j09N9l9M17k61k38J64j50K27j9O6L5k92M4K82j64J51k94k9K02
4289F7k01J65p2P9J7n9O4n5R3k31J30L32j32k99K85j03N9j48l42M31k56j99M28
4312E3j7q6L80k54J23K1l86O2P1k53K93k13L16Ql52L62J53j17j18p4J51j45j92
4335b14Q3M0J4j91L13P0r4l3j97K66J54p6k6k03k2K20j16K44J73k72l4r7p6j40
4359b14j48J09K06k45L25J19j23K97k43J50J23k23n12L32rj67J49o1Oq7J34J61
4381G9O5N4j00J74l0j74O7k68K73j85r3K22j70j21L90j26O8j03m40M20j3l0J07
4404F6l0L48p4l56m2K60l33j28K82Jo2k17J39J65L8j21K7K05Q4q7J23j58j62M
$$ plain form
4428 -28 -135 -161 -168 -175 -196 192 143 48 115 149 -131 -188 -97 -167 81 -158 -91 192 85 -177 26 202 -75 -150 -261
4453 -261 197 135 -114 136 216 -113 11 -58 344 93 73 47 198 241 133 -41 55 -58 -462 -245 39 -19 46
4476 46 -46 50 0 -158 -224 1 44 16 41 116 67 16 -221 1 -223 -236 -68 124 162 278 189 499 163 24 263
4501 263 283 -121 -52 -36 -299 -23 25 -143 -24 153 70 -259 47 66 -157 -159 314 21 -222 -110 -197 61 9
4524 9 -265 38 166 65 -163 80 -99 -258 -67 -112 366 195 77 183 -90 74 10 -101 -4 -111 -96 89
4546 89 76 308 115 -69 168 -4 57 -30 -145 -123 -122 72 -35 -28 56 35 206 69 -97 108 104 68 73 -169 0
4571 0 -21 21 -17 308 295 105 155 212 74 -108 -83 -80 -157 -88 -130 143 267 -14 265 251 131 41 -22 -104 39 -297
4597 -297 -73 -91 58 9 44 134 265 4 -79 72 -11 -306 31 105 -156 35 -119 -26 164 79 16 157 103 -154
$$ packed form
4428b8j07k6ppk1L88m9r5O7L4k80n7R1p0K48k39O7K83j07k62K03J76k77p5j11
4453b61M58o2k49K50Q0l29J24o9M02k51k0k6J51M3j08j74R6j13m04K17K84n8O5
4476D6r2R6n0j58o6K25M3k8K5P5m9n1k37K22k24j3J68J92L8J16q9L10l36j39K39
4501B63K0m04O9J6k63K76M8j68J19J77q3l29L06J9k23kM73k93k43J12q7K58n2
4524Ik74L03J28j01k28K43j79j59J91m5M78j71j18J06k73J64o4j11R7j07J5J85
4546H9j3K32j93j84K37j72O1q7j15K2JJ94j07PQ4k1J71j37j66K05ml6Nk42J69
4571@k1M2l8L25j3j90N0N7j38j82K5Lp7O9m2K73J24k81K79j4j20r0o3q2J43l36
4597b97K24j8J49m9L5R0J31k61q3J51q3k95L37P4k61J91j54R3J90q5o3J41n4k57
$$ plain form
4621 -154 -116 -372 123 -59 -190 145 17 36 -170 69 -84 -147 -218 26 -13 13 -47 -111 -22 194 -1 -3 291 -347
4645 -347 -118 -15 -227 13 -271 -336 -29 -24 -65 39 233 183 104 82 70 309 -230 -293 -145 -191 -313 72 -145
4668 -145 33 17 317 363 229 -37 81 56 207 -108 -249 254 299 -13 -117 17 11 96 -256 55 106 -186 -98
4691 -98 -27 -9 -49 -71 123 351 131 -96 73 17 -255 -198 -67 121 -14 -271 70 -111 23 -79 45 206
4713 206 72 -144 7 91 -116 -202 -78 15 -258 33 -92 353 -10 134 118 232 34 -90 -175 -7 -233 -301
4735 -301 184 208 -1 -122 276 245 -13 -181 47 -132 -88 36 -58 -44 -85 -93 101 117 -253 -3 315 -13 86
4758 86 -73 -140 108 -191 -259 38 20 -1 -65 -166 97 35 -165 -61 240 -186 -86 102 127 303 -133 157 311
4781 311 -83 -53 -5 -104 41 -133 -232 -77 141 -128 210 59 148 87 127 225 156 -190 -137 -5 8 -217 -85 96
$$ packed form
4621a54L8k56M95j82j31L35j28J9k06K39j53o3p1K44l9K6o0o4Q9K16j95kK94o38
4645c47K29J03k12K40k84o5L07Nm1J04J94n0p9k2j2K39n39o3J48m6j22L85k17
4668a45J78j6L00M6j34k66J18k5J51l15j41N03M5l12j04J34oQ5l52L11N1k92Q8
4691i8P1J8m0k2J94K28k20k27J69n6k72N7J31J88j35k57L41j81J34j02J24J61
4713B06j34k16J51Q4k07q6J24R3k73K91j25M45l63J44j6J14j98j24q5J68k26o8
4735c01M85K4k09j21L98l1k58j68K28j79M4J24r4J4m1qJ94J6l70K50L18l28R9
4758H6j59o7K48k99o8K97j8k1o4j01K63o2k00J04L01m26J00J88K5J76m36K90J54
4781C11l94L0M8r9J45j74r9J55K18k69L38j51Q9o1M0R8o9l46N3J32J3k25J32J81
$$ plain form
4805 96 -122 36 96 280 99 -128 -215 -65 317 -238 -132 -23 -80 95 129 427 297 -52 -55 32 -25 -336 -351
4828 -351 -82 -165 -145 -77 184 354 296 100 248 354 59 85 -155 -169 -477 -258 109 184 -102 -115 92 231 120
4851 120 -48 199 284 73 -36 -110 17 67 -308 146 85 -322 -257 279 250 18 75 -55 178 23 -92 180
4873 180 -33 149 -119 -175 -138 -144 -84 -102 2 132 -3 26 200 377 -61 22 205 -9 -79 44 -74 -75 -196 -231
4897 -231 172 -53 133 48 -11 196 40 8 234 100 -162 -210 90 35 -186 -220 54 296 -203 -29 181 167
4919 167 -205 -139 -76 41 -270 -371 57 116 -2 -2 135 129 160 46 302 -5 58 -119 -123 -244 -173 -245 59 10 -37
4944 -37 -44 471 223 74 33 240 173 -27 -287 -55 -17 -181 -39 -232 24 -49 -30 199 213 -61 -36 -60 179 -117
4968 -117 -68 -108 225 -104 41 107 216 113 -38 4 103 35 -159 -113 -78 -291 -134 27 80 -51 -323 -173 -21
$$ packed form
4805I6k18J58O0J84j81k27q7J50L82n55J06J09n7J75L4K98j30l49lQ7n7l11j5
4828c51K69q3K0O8K61J70n8j96J48J06k95K6k40j4l08K19L67P5k86j3K07J39j11
4851A20j68K47Q5k11j09p4J27N0l75M54o1m07O5N36k9k32N7j30K33j55j15K72
4873A80k13J82k68n6L7oO0j8J04J30j35K9J74J77m38Q3J83k14p0J23j18jj21l5
4897b31M03k25J86q5n9K07j56l2K26j34k62m8L00n5k21l4K74K42m99J74K10j4
4919A67l72O6O3J17l11j01M28N9j18%J37oL1j14K56l07O3j77mj21P1p2L04m9m7
4944c7pN15k48j49m1K07o7k00k60K32L8j64J42j93K56p3J9K29J4k74K5k4K39k96
4968a17M9m0L33l29J45O6J09j03j51M2R9o8j94M6L5k13J57J61N3j31k72J50J52
$$ plain form
4991 -21 -156 -204 -151 -12 50 -145 -63 270 229 12 -146 0 160 -76 136 217 -139 -114 115 267 153 231 296
5014 296 393 279 -18 -143 -103 -193 -590 -629 -322 -217 -340 -40 -19 161 15 24 48 228 -507 -297 68 -8 -95
5037 -95 76 -1 175 76 63 223 231 -159 -203 -72 264 -85 -158 -16 -5 25 177 65 -50 -43 -255 -129 213 -396
5061 -396 -225 124 130 -8 23 355 368 -12 -52 111 70 117 -163 -318 27 45 -151 156 127 -96 227 122 129 -224
5085 -224 -203 26 -250 -365 -238 -230 -203 -151 -214 152 295 80 -93 -123 17 -53 -146 89 67 112 -228 264 263 96
5109 96 -64 124 220 225 -31 -180 113 -73 -256 106 -199 44 -114 -267 24 26 8 120 128 107 -330 -259 192 12
5133 12 -51 11 -100 284 279 -11 -109 75 -181 27 86 58 163 389 265 159 -322 98 47 13 166 -189 199
5156 199 35 127 -17 164 174 34 32 183 -45 33 -76 -12 -19 -234 -182 -106 -85 -63 141 77 195 119 106 166 161 -154
$$ packed form
4991b1j35m8N3J39O2j95Q2L33m1k17j58J46J60k36K12Q1l56K5K29J52j14P8O5
5014B96R7j14k97j25M0r0l97l9L07J05j23L00K1J80j46RK4J80p35K10L65p6q7
5037i5J71p7J76r9j3J60Ql90m4J31L36l49p3J42J1L0J52j12j15Pk12J26L42o09
5061c96J71L49Oj38L1L32J3l80m0J63m1M7k80j55L45J8j96L07k9k23L23j05Pl53
5085b24K1K29k76j15J27QK7N2o3L66J43k15j73l0J40p0r3K35k2M5l40M92jj67
5109I6j60J88R6Nk56j49K93j86j83L62l05K43j58j53K91Kj8J12Qk1m37P1M51j80
5133A2o3O2j11L84nk90r8J84k56K08N9k8J05K26j24j06m81M20n1l4J53l55L88
5156A99j64R2j44J81J0j40kJ51k28P8j09O4pk15N2P6K1K2K04o4J18p6j3O0nl15
$$ plain form
5182 -154 -287 53 2 -83 -304 291 -111 -112 25 -21 215 79 -263 -93 153 -168 -112 -105 -157 -70 -298 -89 163
5205 163 199 218 83 209 -36 -254 -283 185 -130 -208 175 50 32 18 60 193 159 -85 113 70 29 -85 -267
5228 -267 -53 31 -151 118 42 4 -203 -167 140 106 -33 -99 73 16 -237 75 37 41 -154 8 29 -38 -42 -9 135
5253 135 -1 -31 16 290 158 75 175 177 232 111 62 -23 64 -108 -133 3 -51 160 -116 94 -4 -149 -135 160
5277 160 -130 -139 -112 -148 93 -146 -361 79 36 -189 -63 220 38 104 50 109 88 -132 -248 126 92 86 180 223 186
5302 186 232 252 110 133 -252 47 -108 -1 75 -106 53 61 24 -212 38 -50 53 30 -234 -60 -124 34 4 17
5326 17 105 212 -112 231 87 182 19 246 -91 -283 153 -37 227 -199 228 165 136 -161 -22 -33 10 -218
5348 -218 -177 -21 -88 -202 -47 -17 136 -6 40 104 129 -160 -44 -43 102 98 -219 291 232 40 -145 260 263 -69
$$ packed form
5182a54j33L40n1q5k21N95m02jJ37m6K36j36l42J70K46l21N6Pn2Q7k28K09K52
5205A63L6J9j35J26k45k18k9M68l15p8L83j25j8j4M2J33l4k44J98m3m1j14j82
5228b67K14Q4j82K69p6l8k07L6L07l4j39o6J72n7k53L12l8Mj95J62K1o7mL3J44
5253A35j36l0M7K74j32q3J00KN5j21m9q5Q7j72k5J36n4K11k76K10r8j45J4K95
5277A60k90rK7l6K41k39k15M40m3k25J26K83j82O6n4N9k1k20j16L74l4oR4M3l7
5302A86M6K0j42K3l85K99j55J07P6j81J59Ql7k36K50q8J03k3k64J74o4J58l0J3
5326A7Q8J07l24L43j44R5j63K27l37j92M36j90K64m26M27o3k9k97J39j1M3k28
5348b18M1J56o7j14J55L0J53j42M6O4K5k89J16JJ45ml17N10n9j92j85M05Ll32
$$ plain form
5372 -69 -76 20 216 -100 -151 191 -40 -165 -156 -15 1 -9 47 90 -236 -231 -92 109 109 -89 -82 -38 108 -149 57 54 220
5399 220 151 58 44 405 -104 -41 92 -19 4 -78 -43 251 73 -11 5 -69 -167 -39 -218 82 -69 -163 222 181
5423 181 106 -4 93 247 53 -198 -83 323 -197 -144 76 27 226 163 62 210 -7 -103 -140 -147 -180 -344 -326 93
5447 93 -172 -233 -233 88 -47 48 -63 171 -10 -326 -122 -5 -73 -164 -52 148 465 78 50 464 269 -67 256
5470 256 -147 -199 -215 -283 51 -115 -283 -252 103 -172 -158 -259 -56 71 -149 109 164 -292 -10 -130 -1 231
5492 231 32 120 54 82 40 -145 145 97 86 6 122 -48 142 142 79 62 23 -195 -130 -57 -363 -35 3 -122 -293
5517 -293 -214 -165 -37 84 282 153 33 -83 -17 -75 253 31 55 158 205 97 95 198 283 -24 -5 208 -81
5540 -81 -189 -165 52 -89 -192 -57 -140 266 -200 -207 50 -52 -148 -218 -160 -36 17 -92 129 238 64 158 125 90
$$ packed form
5372f9pR6J96l16n1L42k31j25RJ41J6j0N6M3l26NJ39K01%j98PM4J46k57K06lJ66
5399B20o9r3j4L61n09O3J33j11K3q2L5K94j78q4J6p4r8J28j79L00j51r4L85m1
5423A81p5j10R7J54j94k51J15M06n20N3K20m9J99o3j01J48k17r6l7pl3j64J8M19
5447I3k65o1%L21j35R5j11K34j81l16K04J17o8r1J12K00L17l87k8M14j95l36L23
5470B56m03n2j6o8L34j66j68L1L55k75J4j01K03J27k20K58N5m56K82j20J29K32
5492B31j99Q8o6K8m2j85K90m8j1q0J16j70J90%o3j7l9k18O5P3l06L28L8j25j71
5517b93P9M9J28J21J98j29j20j16O6n8L28k22K4J03M7j08kJ03Q5l07J9K13k89
5540h1j08K4K17j41j03J35q3M06m66pK57j02r6p0N8J24N3j09K21J09j74R4l3l5
$$ plain form
5564 90 31 -295 16 203 -250 -195 19 -36 214 149 131 335 -84 -234 -70 1 -96 -374 -116 83 -215 -147 -176
5587 -176 18 22 195 -64 -76 -15 22 35 -69 46 -44 -65 65 413 -40 12 246 -23 -215 -48 -260 115 58
5610 58 -259 272 31 26 266 0 125 -58 -110 -7 -79 -312 118 304 302 51 -168 -70 43 -16 -92 93 -69
5633 -69 -40 -154 -188 -4 -12 -297 205 108 231 149 56 105 17 -214 25 222 123 -87 28 -194 165 -36 -2 361
5657 361 -203 -113 -18 151 165 146 100 203 264 -7 -170 64 130 -22 -24 219 -119 -169 26 124 -60 -67 -237 -20
5681 -20 100 19 31 41 -24 -85 275 8 129 -162 -230 211 92 60 94 -42 225 34 -244 -67 51 -166 -57
5704 -57 57 -170 0 5 -35 162 -47 -227 147 49 -84 -162 60 333 188 165 203 -36 22 -57 101 35 102 -191
5728 -191 136 100 -74 -66 -52 -84 48 -34 -112 -23 -153 -158 36 185 -250 26 155 63 -403 -220 -75 -150 -187 -94 86
$$ packed form
5564I0n9l26L11J87m53N5K14n5K50o5j8K04m19j50J64P1r7k78K58J99k98O8k9
5587a76J94MJ73k59j2O1L7J3j04J15r0k1J30L48m53N2K34k69j92J67k12L75n7
5610E8l17N31k41nK40k66J25j83n2J03p2k33M30J86kk51k19R8J13n9p6J85j62
5633f9K9j14l4J84qk85N02r7J23q2r3M9q8k31K39J97r9k10J15k22L59k01L4L63
5657C61n64R0R5J69J4j9m6J03O1k71j63K34O6j52kK43l38n0J95R8j84pj70K17
5681b0J20q1J2J0o5o1L60k67J21k91o8M41j19l2L4j36K67j91k78J77J18k17J09
5704e7J14k27J70Nm0J97k09j80L74r8j33p8K22K73j45k3L8k39N8p9J58o6O7k93
5728a91L27l6j74QJ4l2J32q2p8Q9j30nJ94J49m35K76J29r2m66J83J45p5l7R3J80
$$ plain form
5753 86 331 21 18 234 230 33 -57 -209 19 -114 -12 -78 50 28 -166 95 -22 -15 -40 61 -48 -65 43 287
5777 287 5 -53 -19 38 112 16 90 -160 86 -249 -28 -124 110 61 -235 245 368 339 101 263 147 52 -183
5800 -183 -75 -151 -159 -187 49 -47 50 -72 129 71 104 -219 -81 151 -232 -132 -148 294 230 108 -76 307 444
5823 444 160 19 -17 39 -42 -208 79 -85 -284 -66 247 56 -86 -246 45 119 -73 17 -70 -253 -182 23
5845 23 4 63 -59 189 -14 -115 62 -27 -151 -26 -220 -184 82 64 275 -83 0 330 -31 -183 216 -58
5867 -58 -185 -172 -133 63 -39 -165 18 257 131 92 15 -57 -50 13 -18 128 -134 150 -58 -196 -6 -19 1 85
5891 85 -167 -256 -135 10 -87 16 -8 -157 59 -19 46 147 102 -188 -349 75 -15 -390 46 -40 5 216 -10
5914 -10 66 152 91 114 448 52 -2 -74 131 93 -200 -387 125 49 -106 -281 66 71 45 -41 -11 57 -274 -292 -318 -309
$$ packed form
5753H6K45l10lK16mj97r0j52K28j33J02o6J28k2j94K61j17Pk5J01j09j7J08K44
5777B87k82n8L4N7P4r6P4k50K46l35K21r6K34m9k96M80J23k9k38J62j16r5k35
5800a83J08p6qk8K36r6R7j22K01n8L3l23J38K32l83J00j6M42o4j22j84L83J37
5823D44k84j41l6N6q1j66K87j64j99K18L13j91j42j60K91P4j92R0q7j83P1K05
5845B3j9N9j22K48k03j01J77q9j24J25j94L6K66j8K11l58Q3L30l61j52L99k74
5867e8j27J3L9J96j02j26J83K39j26l9p7p2PO3l1J46k62K84k08j38J90j3K0Q4
5891H5k52q9J21J45r7J03k4j49K16p8O5J01m5k90j61M24r0l75M36q6M5K11k26
5914a0P6Q6o1K3L34l96n4p2K05l8k93j87N12p6j55j75L47Nk6q6L0O8l31j8k6R
$$ plain form
5940 -309 -221 -38 -52 -73 -93 -129 -87 -85 160 121 361 452 172 285 412 152 36 188 -3 -235 -60 -288 -80
5963 -80 7 -264 -130 -4 175 -103 124 1 -77 -292 -305 -225 -149 -105 -378 -212 -55 -8 -75 -59 268 69 175
5986 175 194 160 -32 -41 -5 168 92 52 245 -44 -158 -168 -60 95 33 -22 94 99 -67 -65 -76 51 -59 -206 85
6011 85 -78 -79 -119 -23 71 1 -73 241 112 46 -201 189 -28 87 74 -176 106 -194 -238 -40 -7 -355 -267 -139
6035 -139 119 100 -116 42 223 -70 164 184 79 35 -64 -32 267 -178 -40 -169 -17 -82 61 282 241 13
6057 13 11 105 130 6 -6 -63 135 8 -217 -162 -92 22 31 -78 76 32 6 -110 253 183 47 -52 -2 113 -221
6082 -221 -34 -124 -5 -164 10 204 -66 100 175 118 94 -8 -55 51 88 -159 -108 -123 180 -346 61 -82 -247
6105 -247 64 -57 251 -142 -36 108 188 210 209 -43 108 29 -41 -17 124 -19 -211 17 -25 62 -118 -77 61
$$ packed form
5940c09Q8J83j4k1k0l6M2KK45l9K40R1k80J13J27k60j16J52j91k32J75k28K08
5963h0Q7k71J34J26J79k78K27j23p8k15j3Q0P6M4k73J66J57M7o7J6L27j99J06
5986A75J9l4j92rL6J73p6m0J93k89j14j0J08J55o2n5J16Nj66Kj1J27j10j47K91
6011H5j63jm0R6R4p0p4L14j29o6k47L90k17J15j3k50K82l00m4J98L3l48Q8J28
6035a39K58j9k16J58J81k93K34K0j05m4r9L2K99m45J38j29J52o5J43K21m1k28
6057A3kR4K5j24j2n7J98j27k25N5P0J14Rj09J54m4k6j16L63p0j36r9N0J15l34
6082b21J87r0J19j59J74J94k70J66P5n7k4j02m7J06L7k47N1j5L03n26M07j43j65
6105b47L11j21L08l93J06J44Q0K2jk52J51p9p0K4J41j43j92K28m2Q7j80M1J38
$$ plain form
6128 61 212 -4 -47 -101 -122 164 -191 -13 -46 -128 -268 112 -17 -41 -1 -83 165 -142 -41 66 226 -76 -120
6151 -120 -44 39 -163 -42 -134 101 133 -55 118 -99 2 -118 -26 82 34 70 91 -6 34 -57 -266 -53 149 -239
6175 -239 12 39 72 104 87 20 172 84 -107 -3 -268 -31 1 -5 159 -58 -71 85 -116 10 -74 -118 -26 -21 91
6200 91 -22 8 33 211 219 151 -146 -81 93 -97 -15 -34 32 43 -97 42 124 292 -17 44 86 -46 76 -125 199
6225 199 105 -122 -125 0 -96 99 -149 -29 39 -231 14 33 101 -169 -178 158 119 -103 39 173 276 -30 237
6248 237 58 174 109 -33 -1 -98 -170 -138 92 58 -44 -148 -27 57 -37 -59 -116 8 -115 -34 49 7 95 -268 114
6273 114 130 -169 -138 73 -66 103 -106 59 238 -105 78 107 220 -103 -6 -12 -13 184 -146 -9 -83 31 162
6296 162 -7 19 70 -95 98 82 117 48 -111 -99 -9 93 -53 149 25 233 275 301 100 118 -104 55 -203
$$ packed form
6128F1J51k16m3n4k1K86l55J78l3q2j40L80j29k4M0q2K48l07J01J07J60l02m4
6151a20P6Q3k02J21r2K35L2j88J73k17J01j20R2J08m8L6K1r7M0r1k09K13K02l88
6175b39K51K7L3L2j7o7J52q8j91J04k65K37L2oJ64k17j3J56k01J26q4m4R2NJ12
6200I1j13L0K5J78Qo8k97O5J74j90Q2j9O6J1j40J39Q2J68l09O1M2j32J22k01L24
6225A99r4k27lJ25r6J95k48J20O8k70K45J9O8k70rL36l9k22J42J34J03l06K67
6248B37j79J16o5j42L2r7p2L2K30l4j02j04J21Q4r4k2n7J24j23Q1Q3m2Q8l63L82
6273A14J6k99L1K11j39J69k09J65J79l43J83K9J13l23R7ojJ97l30J37p4J14J31
6296A62j69K6N1j65J93j6L5o9j59J2R0J02j46K02j24K08M2K6k01J8k22J59k58
$$ plain form
6319 -203 -135 40 -134 155 -40 169 -206 -4 -289 -166 -34 -118 -60 -23 -64 146 -2 -77 -33 -142 -31 10 3
6342 3 -24 48 149 16 223 37 125 -57 290 83 -58 -29 -106 -25 3 244 273 176 39 -260 9 -153 -317 187
6366 187 -94 -87 -196 84 -17 -6 -35 -54 158 -137 -141 136 386 141 -7 -162 205 -54 81 -196 -45 74
6388 74 -14 -70 -45 -133 -169 -30 -5 -9 1 -152 211 -33 -355 69 28 35 -87 99 122 245 -156 -64 241 55 -169
6413 -169 -89 206 144 -10 -166 63 -40 -111 -99 -43 -195 -205 65 194 95 -70 -71 364 114 -90 95 91 68 -140
6437 -140 -88 -53 19 1 149 -52 16 4 85 188 166 12 -81 292 21 94 -76 61 154 7 -133 -12 -31 -124
6461 -124 -171 -15 -43 -48 -157 8 89 203 120 129 147 -253 2 27 71 -104 -128 11 73 -248 149 -8 244 166 -82
6486 -82 -144 76 -198 -255 67 57 -174 -133 -163 -62 -231 -263 100 213 3 100 21 133 5 -27 224 105 -37
$$ packed form
6319b03O8J75j74K89j95K09l75K02k85J23J32q4N8L7m1K10j48p5M4j09J11M1p
6342Ck7P2J01j33K07j86Q8j82L47k07j41K9p7Q1K8K41K9r7j37k99K69j62j64N04
6366A87k81Pj09K80j01J1k9j9K12k95mK77K50k45j48j55L67k59J35k77J51J19
6388G4q8n6K5q8l6J39K5mJ0j53L63k44l22M24m1Pj22J86K3J23m01R2L05j86k24
6413a69Q0K95o2j54j56K29j03p1J2N6j52j0K70J29r9j65jM35k50k04J85mk3k08
6437a40N2L5P2j8J48k01O8j2Q1J03k2j54r3L73k71P3j70J37R3j47j40J21j9r3
6461a24m7J56k8nj09J65Q1J14q3RJ8m00K55K5M4j75k4J39O2l21L97j57K52p8k48
6486h2o2K20k74n7L22j0k31M1l0J01j69l2L63J13k10R7p9J12j28l2K51j19j42
$$ plain form
6509 -37 -44 17 -197 11 46 -183 -77 180 170 16 194 -129 -64 35 34 113 -104 -85 20 -118 -73 -92 -88 0 -55 -42
6535 -42 15 -100 300 21 80 216 76 -67 -92 59 -116 -120 8 -114 -240 -123 -100 -65 210 -74 220 -66 -53
6558 -53 214 -27 146 -107 -7 -146 185 -128 -97 183 -55 89 18 100 27 -82 47 167 178 84 -112 -181 3
6581 3 -158 81 87 -38 -209 10 -204 199 -70 -412 -87 53 14 119 34 3 -222 30 -248 57 -116 -82 133
6604 133 54 123 -65 73 -40 35 260 146 116 110 81 13 -50 87 1 -76 61 117 138 -24 -52 218 14 -71 -70 -58
6630 -58 -151 -143 -20 -61 -96 83 -60 -137 -12 -133 -166 -238 -72 210 166 -140 -40 -19 -41 134 -157 181 -171 19
6654 19 -36 -123 -71 -44 65 58 185 11 -39 131 110 -71 155 -73 254 -73 -97 30 4 174 180 76 95 94 -34
6679 -34 -55 -65 33 -36 89 -176 -98 165 -82 -108 118 63 -21 35 114 123 -160 147 143 -61 -17 82 109 93 -148 164
$$ packed form
6509c7pO1k14K08L5k29J06K57j0j54J78l23O5R9jP9k17J9J05j38M5j9MQ8n5J3
6535d2N7j15M00k79N9J36j40j43k5J51j75mJ28j22j26J17K3L5K75k84K94k86J3
6558e3K67k41J73k53J00j39L31l13L1K80k38J44p1Q2p3j09J29J20J1r4j96o9J84
6581Cj61K39Oj25j71K19k14M03k69l42L25J40l9J05q5l1k25K52k78L05j73L4K15
6604A33p9O9j88J38j13P5K25j14l0ok9o8o3J37q6p7J37N6K1j62k8K70k04q5JJ2
6630e8r3QJ23m1l5J79j43p7J25j21l3p2J66K82m4l06J00K1k2J75k91L38l52J90
6654A9n5q7N2K7J09pJ27j74n0J70k1j81K26k28L27l27k4J27k6J70Oj04J9jj28
6679c4k1j0R8o9J25k65P8K63k47k6K26n5q4N6P9Rk83L07mk04M4R9K7j6k41L12
$$ plain form
6705 164 38 -142 2 -16 243 -86 12 83 -53 154 -7 -15 197 -3 228 -184 -109 234 18 92 72 119 -58
6728 -58 -150 -44 -9 26 264 73 100 -13 -28 -25 -22 -68 -283 60 -73 71 -117 170 -51 -104 -13 -32 110 -188 68
6753 68 -306 130 -42 43 112 42 9 57 84 94 28 141 -78 -54 55 28 -195 -30 17 -138 130 -8 -201 61
6777 61 -131 46 78 -138 -66 120 -117 -163 -87 154 35 101 119 -45 -114 -113 77 -134 2 -80 202 83 -150 58
6801 58 -64 -15 -239 -8 24 -80 -40 41 220 -366 77 27 45 165 -27 -16 134 36 -219 -47 85 -260 112
6824 112 -27 -155 -67 1 138 102 30 -70 -13 -52 13 -23 -161 77 -326 118 221 -76 -146 -48 -93 -8 -70 104
6848 104 -222 23 126 139 -90 114 87 -33 68 263 239 108 -118 127 179 -14 -24 -2 175 -128 55 -42
6870 -42 -42 -83 -179 62 -20 -110 151 -99 5 111 -74 117 -65 2 43 -80 47 -104 39 -12 22 45 31 48 212
$$ packed form
6705A64j26j80J44j8K59l29R8P1j36K07j61qK12k00K31m12P5L43k16P4k0M7j77
6728e8r2J06L5L5K38j91K7j13j5LLm6k15L43j33J44j88K87k21n3R1j9J42k98K56
6753F8l74M36j72Q5O9p0l3M8K7J0o6J13k19K4J09k7k23J65M7j55K68j38j93K62
6777F1j92J77L2k16P2J86k37m6P6K41j19O6J8j64o9JJ90k11J36q2K82j19k33K08
6801E8j22M9k24K31L2j04M0Q1J79n86M43n0J8J20j92J1J50r8k55J72J32l45L72
6824A12j39j28Q8O8J37l6p2j00N7l9O5l6j38K38m03M44J03k97p0R8m5Q5o2J74
6848A04l26K45J03J3k29K04k7j20J01J95k4j31k26K45N2j93j0K2J77l03J83r7
6870d2%m1r6K41q2r0K61k50J04J06j85J91j82O7M1j23J27j51J43n1L4K3j4J7J64
$$ plain form
6895 212 59 -36 -90 -8 87 -27 -41 -103 -58 119 28 -81 38 -64 106 23 -44 436 159 -19 -144 -121 34 28
6919 28 183 24 -16 -151 -118 -120 28 152 29 61 90 -58 122 75 17 -97 104 -102 77 2 10 -193 25 215
6943 215 16 342 15 123 117 -3 59 84 27 77 -132 252 149 156 93 -187 136 18 -10 119 89 -2 56 -44
6967 -44 -113 93 -104 24 111 264 -47 55 -34 86 -96 88 67 -119 43 118 -140 -34 215 -55 -61 -82 31
6990 31 18 -103 159 -88 -24 -90 91 54 7 59 5 -36 -54 97 -71 107 -125 136 -52 -102 -148 -9 -8 -31 90
7015 90 124 -54 -108 59 -119 28 -110 -5 -46 -56 -149 8 -44 -131 -77 -132 -99 -130 273 0 39 48 49 -204 -35 46
7041 46 111 15 105 22 -5 153 -117 -42 28 -131 -48 32 63 -135 -49 -141 -80 7 84 -200 199 45 56 -120 -123 -14
7067 -14 -62 -202 -42 -18 -347 185 -88 21 -6 -7 -87 -153 -112 14 171 19 -102 35 -208 29 -81 171 -77
$$ packed form
6895B12j53r5n4Q2R5j14j4o2M5J77r1j09J19j02J70q3o7M80k77j78j25K3J55o
6919B8J55j59m0j35L3kJ48J24j23L2K9j48J80m7n8j14K01k06J79p5Qk03K18J90
6943B15j99L26l27J08oj20O2K5n7N0k09L84j03Po3k80L23j18k8J29l0r1N8j00
6967d4o9K06j97J28Q7J53l11J02q9J20j82J84k1j86J62P5k58J06K49k70ok1J13
6990C1j3j21K62k47O4o6J81l7m7N2n4m1j8J51j68J78k32K61j88n0m6J39Jk3J21
7015I0L4j78n4J67j78J47j38J05m1j0r3J57n2q7N4n5L3l1M03k73L9RJk53J69Q1
7041D6O5r6R0q3k7J58k70P5P0j59Q3Q0L1j98Q6r2O1Q7P7k84L99j54J1j76lJ09
7067a4m8j40J60K4l29N32k73J09k7jq0o6M1J26J57j52j21J37k43K37j10K52k48
$$ plain form
7090 -77 -141 10 80 232 -63 135 70 111 -121 52 99 12 99 -55 61 8 67 -2 -92 5 -173 57 168 158 64
7115 64 -327 235 5 44 -144 28 89 279 132 -117 -140 16 166 32 -28 -173 -13 208 16 -135 60 90
7137 90 252 14 -40 3 -44 -89 -22 -1 145 -133 -55 -10 83 -44 -175 -39 18 -66 48 20 72 -53 38 -155 60
7162 60 76 19 -99 54 137 0 -44 68 -151 113 70 -71 -121 -45 54 -143 -133 120 -12 -82 -114 -66 -62 119 64
7187 64 41 -120 61 0 -9 -63 -105 11 6 43 59 47 -113 -32 -55 -19 -164 75 184 -207 -305 55 153 18 233 -41
7213 -41 133 39 37 61 -89 31 -32 -230 -113 217 -146 55 9 24 125 152 -150 -33 123 43 -50 -66 103 105 110
7238 110 52 132 -35 54 -160 164 258 127 -206 -112 83 -113 216 -80 23 152 155 -144 -144 22 -68 156 -135
7261 -135 40 228 -37 -75 37 -135 49 74 40 189 170 11 18 65 -66 -7 21 -130 -35 -21 -7 -263 9 -115
$$ packed form
7090g7o4J51P0J52k95J98o5M1k32J73M7q7Q7j54J16n3N9o9r0R7j78K30J11j0r4
7115F4l91N62k30L9j88J72O1J90j47k49k3J56J50j34o0j45J60K21j92j51J95L0
7137I0J62k38n4M3m7m5O7K1J46k78P8M5R3j27j31J36N7q4J14k8N2j25R1j93K15
7162F0J6n7j18J53Q3j37m4J12k19K64m3j41n0P6R9j97J0K53j32p0l2M8MJ81n5
7187F4k3j61J81o1rn4m2J16nL7J6j2j60Q1k3L6j45K39J09l91r8L60R8j35K15k74
7213d1J74r4kK4j50J20o3j98J17L30l63K01m6J5J01K7l02J17J56q0r3j6J69KN
7238A10n8Q0j67Q9k14L24R4j31l33R4J95j96L29k96J03J29Lk99%J66r0K24k91
7261a35J75J88k65l8J12j72J84K5l4J49j9j59PM7j31N9K8j51R5J4J4k56K72j24
$$ plain form
7285 -115 56 23 70 90 93 -104 -136 -23 68 107 70 -111 -80 106 80 -176 -37 -117 216 -2 -42 27 32 -6 -159 -72
7311 -72 -128 167 -237 39 66 146 -31 -85 79 171 -62 -67 -154 87 -247 168 180 33 1 -94 -159 -81 -224 25 -91
7336 -91 35 3 -212 102 -61 -2 22 86 -56 298 131 -156 -2 -94 -13 -286 -94 23 11 72 -22 129 138 -123
7360 -123 -127 62 -84 134 -12 139 49 -126 -75 -50 -15 -42 162 -22 -44 96 -48 -75 123 -83 -108 -28 58 -96
7384 -96 60 -235 -38 -133 -56 -113 -96 50 21 125 -156 11 48 -31 -118 41 -116 -20 60 -7 155 1 37 127 -97
7409 -97 74 -115 -138 -75 13 18 100 -35 -150 57 130 -90 92 -98 14 34 162 -189 -29 81 235 80 167
7432 167 100 -91 -139 14 -283 64 -123 -31 -37 -1 88 -152 132 -7 -6 -215 -179 -66 -40 84 -5 -98 25 232
7456 232 103 101 32 52 -140 -11 0 110 74 -80 6 -47 -193 13 83 -24 225 111 86 86 -92 -238 105 147
$$ packed form
7285a15J71l3M7K0Lj97l2J13R1L9l7j81L1J86k6k56J39q0L33k18m0O9Nl8j53Q7
7311g2n6K95m04K76K7Q0j77n4J64R2k33nq7K41l34M15J2j47l2r5o5P8j43K49j16
7336i1J26l2k15L14j63N9K4O4j42L54j67k87J54r2Q1k73J92J17j2O1r4J51Rk61
7360a23mJ89j46K18j46J51r0j75N1K5L5k7K04j84k2J40j44k7J98k06k5Q0Q6j54
7384i6J56k95J97r5P7n7J7J46k9J04k81J67L7p9q7J59j57R6Q0o7J62j54L6R0k24
7409i7J71j89k3O3Q8NQ2j35j15K07P3k20J82j90J12K0J28l51J60J10J54j55Q7
7432A67o7j91m8J53k97L47j87R2oL6Q9k40K84j39Jk09L6J13K6J24q9r3J23K07
7456B32j29ko9K0j92J29J1J10l6j54Q6n3j46K06P0j07K49j14k5%j78j46L43M2
$$ plain form
7480 147 -91 -60 106 78 -111 66 39 -119 -116 70 -57 114 64 -160 -181 -60 93 220 16 -11 107 26 -64
7503 -64 -87 13 -163 -26 -207 -263 70 132 152 255 97 -152 -66 100 -34 -52 -174 130 54 -59 13 -15 -215
7526 -215 -18 74 104 -49 -132 132 4 54 37 68 45 28 87 -50 54 24 -64 8 52 -70 31 131 -69 145
7550 145 10 59 -16 73 16 35 83 -133 149 99 65 164 -98 -42 118 -23 54 -107 -71 149 -138 -14 35 -77
7574 -77 -14 -9 23 24 40 56 34 -127 19 -79 62 -37 40 -123 131 -90 171 -43 284 -96 80 161 -23 46 64
7599 64 39 -49 38 -45 12 -29 50 3 65 100 -174 -92 13 44 118 -82 87 166 -40 38 -9 109 -143 37 10 158
7625 158 144 116 138 308 161 19 3 -112 47 -12 -46 -55 244 -29 58 95 -257 164 89 117 -117 -147 230 -10
7649 -10 82 42 144 -46 -79 -106 -122 137 -47 213 -122 -99 -105 -66 68 -8 -13 -8 -29 32 44 -194 68 -116 102 157
$$ packed form
7480A47k38L1J66k8j89J77k7j58LJ86j27J71n0k24k1J21J53J27k04k7J18q1r0
7503f4k3J00j76J37j81n6L33O2K0J03j58k49Q6J66j34j8j22L04p6j13P2k8k00
7526b15J97R2L0j53q3K64j28N0j7L1k3j7N9j37J04l0q8P2M4j22J01J00k00K14
7550A45j35M9p5Q9n7J9M8k16K82n0l4R9k62N6J60j41P7j61L6K20k87J24M9j12
7574g7O3NL2JJ6J6k2j61J46r8J41r9P7j63K54k21K61k14L27l80J76Q1j84O9J8
7599F4k5q8Q7q3N7m1P9m7O2L5k74Q2J05L1P4k00J69P9k06P8m7J18k52J80k7J48
7625A58j4k8K2J70j47j42j6j15J59n9l4rK99k73Q7L7l52M21p5K8k34l0L77k40
7649a0R2m0J02j90l3k7j6K59j84K60l35K3oL9J34p6nNk1O1J2k38K62j84K18N5
$$ plain form
7675 157 65 -52 -29 -232 -51 37 -218 91 45 2 5 -63 34 0 -185 -283 -4 130 59 -122 -99 -37 30 80 151 -92
7701 -92 146 101 6 0 -8 -25 -61 -198 -66 -124 193 48 134 -224 -66 126 154 53 -49 -8 25 -173 -42 191 -172
7726 -172 -64 -65 -162 -287 225 36 -189 -55 156 -65 177 -29 108 75 82 108 91 -8 31 34 97 63 -65 -55 -94
7751 -94 31 -22 177 -154 135 140 -43 128 22 56 97 36 -48 -115 223 -62 109 157 115 -67 -225 127 -150 -22
7775 -22 144 -21 47 13 -87 -94 45 37 -80 -22 -41 75 -35 -177 -224 44 -79 28 -36 -74 -66 -89 -18 -104 51 -17
7801 -17 25 -126 119 259 90 7 -196 113 -71 -33 -89 106 24 -97 163 100 50 -125 -59 -22 -147 39 219
7824 219 57 -128 112 -143 94 85 264 149 -109 250 -156 -36 -149 8 197 -155 -44 -68 -63 38 -34 -54
7846 -54 -72 25 78 89 -168 148 -45 -16 -68 -11 35 -27 -15 -94 -29 197 92 -89 191 -34 -149 -10 24 -148 -77
$$ packed form
7675A57r2j17K3k03J81Q8k55L09m6m3Lo8R7l4j85r8K79J34p1j81K3O2O7N0P1k43
7701i2K38m5r5oqj7l6j37J32n8L17j45Q6l58J58J92K8j01j02M1L3j98J31K33l63
7726a72J08jr7j25N12j89k25J34K11k21K42k06J37l3PK6j7r9L9LO3l4j28J0l9
7751i4J25n3J99l31K89Nj83J71j06L4M1o1q4o7L38k85J71M8m2j82j58L52k77J28
7775b2J66j65O8l4j00pJ39qj17N8j9J16j10j42m7K68j23J07o4l8Qk3P1q6J55o8
7801a7M2j51K45J40j69q3k03L09j84L8n6J95q2j21K60o3n0j75O6L7j25J86J80
7824B19j62j85K40k55K37rJ79j15k58L59m06J20j13J57J89l52J11k4NJ01p2k0
7846e4j8R7N3J1k57L16j93K9n2N7M6o2J2p9O5K26j05j81K80k25j15J39L4j72P1
$$ plain form
7871 -77 -9 20 -32 -251 88 180 -58 42 131 81 66 -47 -114 49 -125 -66 120 -318 138 10 52 175 2 176
7895 176 14 -218 -20 -39 60 210 55 18 -76 -8 -84 -88 63 -12 8 118 108 -215 -150 10 237 71 3 -78 52
7920 52 32 114 -139 31 181 -126 -23 79 265 -65 -118 123 31 -13 90 34 88 -98 25 193 -42 -64 -107
7943 -107 146 213 122 -40 28 -109 86 101 -32 9 -147 53 -70 -51 161 -86 -69 -50 108 -280 -29 47 -69
7966 -69 147 -34 78 15 16 -92 70 -10 71 -39 90 211 79 -92 167 47 77 118 38 -44 23 -70 4 97 65
7991 65 8 -98 -67 116 -98 -33 195 92 -52 16 -20 -53 -277 -59 102 37 38 -29 -102 -103 76 34 -42 115 42 -9
8017 -9 -61 57 -6 159 -65 -90 -14 56 131 59 111 3 175 130 -65 -35 -90 135 202 -161 -43 149 9 32 20
8042 20 -74 12 280 -269 -94 -231 104 -74 44 114 -106 -97 148 69 -130 -118 0 113 -24 159 135 6 -69
$$ packed form
7871g7O8K9n2k19L39R2k38J00Q9n0j5j13o7J63j74N9J86m38M56j28M2J23j73J74
7895A76j62k32J98j9R9J50j55l7r4O8p6mJ51p5K0J10j0l23O5J60K27j66o8q1J30
7920E2k0Q2k53J70J50l07J03J02J86l30n3K41r2m4J03n6N4j86J23J68k35k2m3
7943a07K53O7r1j62O8j37J95J5j33M1j56K00j23J9K12k47J7J9J58l88K51P6j16
7966f9K16j81J12o3Jj08J62q0Q1j10J29J21j32j71K59j20L0M1q0q2O7r3P4R3l2
7991F5n7j06L1J83k14O5K28j03j44O8l6l3k24K18J61o5Jo7p3jJ79m2p6J57p3n1
8017in2J18o3J65k24k5P6P0P5p2N2j08J72m5j95L0n5K25O7l63J18J92j40K3j2
8042B0r4Q6K68n49J75j37L35j78J18P0k20RK45p9j99J2J18J13j37J83k4j29p5
$$ plain form
8065 -69 172 163 -196 -7 -75 -84 -38 -13 -28 63 -15 -18 12 88 246 55 9 -121 44 -93 -156 88 49 55 139 -12 28
8092 28 39 -183 69 43 139 -35 -37 247 -39 -12 182 136 92 -43 0 22 196 27 -51 104 88 65 165 19 -28
8117 -28 -112 116 -17 98 -68 -154 64 20 101 -11 -23 -33 100 -78 -441 102 47 -152 100 171 62 81 112 107
8141 107 28 138 -150 87 4 140 -63 68 -49 35 55 242 166 -36 -39 91 -105 -192 289 82 -112 36 -93
8164 -93 -111 85 69 27 -108 38 -73 -6 65 -108 -163 -104 178 -161 -90 114 -84 114 56 140 -156 -54 108 -85
8188 -85 -89 -250 75
$$ packed form
8065f9K41rl59J89o8rM6K5j5R1p8lL0P6J58j91m6j30J65j37o3K44l9OQ4j51M0
8092B8J1k22K52k6R6j74kK84k86K7J94m6m4j35M3K2J74j69p8J55j6k3J00j46m7
8117b8q4K28j33J15j66q6K18m4Q1j12j2j0J33j78l63N43n5j99K52P1j09J9L1n
8141A07p9J10k88K37q3J36k03J31j17Q4K0J87p6k02lJ30j96q7M81k07j94J48j29
8164i3j8J96j6m2j35J46j11O7P1j73n5N9K82l39P1K04j98J98n8Q4k96J02J62j93
8188h5mj61L25
8191G5
$$ Imaginary data points
##PAGE= N=2
##DATA TABLE= (X++(I..I)), XYDATA
$$ plain form
0 0 0 0 0 0 0 0 1 0 8 -8 8 -8 16 -16 24 -26 33 -41 49 -64 73 -89 105 -124 145 -170 198 -230 264 -304 345
31 345 -394 448 -508 574 -646 725 -813 908 -1013 1127 -1251 1391 -1538 1703 -1878 2074
47 2074 -2286 2519 -2778 3058 -3369 3713 -4101 4531 -5016 5569 -6205 6945 -7817 8868
61 8868 -10156 11784 -13917 16841 -21128 28036 -41068 74533 -358323 -672564 -260790 -190617
73 -190617 -55009 -423 139289 187055 209571 172995 117433 -29651 -81511 -27698 141657
84 141657 201629 87001 5946 95430 146834 179276 226130 240743 163628 59634 57721 153062
96 153062 91016 -86591 -169300 -138555 -66075 4002 19865 -5033 -118611 -269592 -303236
107 -303236 -242224 -215626 -251989 -267402 -111068 119358 221679 268124 292009 169402 1898
$$ packed form
0@%%%%%%JjQj6J6j6K4l2M0n0N9p4R0j13J37j62J94k29K69l15L68m28M94n68O49
31C45p39Q42r56J082j220J371j538J721j921K140k378K642k929L241l581L952
47B074m360M805n297N836o427P082p814Q632r547J0585j1774J3150j4762J6685
61H868j9024K1940k5701L0758l7969M9164o9104J15601m32856l14241M11774P0173
73a90617J35608N4586J39712M7766K2516l6576n5562j47084n1860N3813J69355
84A41657N9972j14628q1055Q9484N1404L2442M6854J4613p7115j03994j913R5341
96A53062o2046j77607q2709L0745P2480P0077J5863k4898j13578j50981l3644
107c03236O1012K6598l6363j5413J56334K30426J02321M6445K3885j22607j67504
$$ plain form
118 1898 -40671 19086 42240 -39641 -89275 -15770 62657 98496 102650 54803 -6061 -63774
130 -63774 -62979 66991 157997 81103 -18088 -34296 -7850 -18578 -72676 -78731 -74576 -117154 -64887
143 -64887 87604 150606 71654 -50601 -91830 -52042 -37520 -21170 32199 46321 41620 69555
155 69555 120467 152915 55911 -122296 -173824 -121765 -98311 -85611 -51059 -22971 -43161 -56820
167 -56820 36456 120067 67050 5065 26202 85663 130260 104181 45106 -9097 -99297 -150164
179 -150164 -84984 6755 37749 10515 22160 118012 150492 76739 17092 -43040 -132485 -168426
191 -168426 -105632 7822 42085 -12992 -7771 46349 43176 11615 -24074 -53614 -60656 -64303
203 -64303 -11554 86879 91538 10794 -33815 -10788 25353 4790 -17545 22196 24360 -9006
$$ packed form
118A898m2569N9757K3154q1881m9634P3505P8427L5839M154m7847o0864n7713
130f3774P95J29970R1006p6894r9191j6208K6446j0728n4098o055M155m2578N2267
143f4887J52491O3002p8952j22255m1229L9788J4522J6350N3369J4122m701K7935
155F9555N0912L2448r7004j78207n1528N2059K3454J2700L4552K8088k0190j3659
167e6820R3276Q3611n3017o1985K1137N9461M4597k6079n9075n4203r0200n0867
179a50164O5180R1739L0994k7234J1645R5852L2480p3753n9647o0132q9445l5941
191a68426O2794J13454L4263n5077N221N4120l173l1561l5689k9540p042l647
203f4303N2749R8433M659q0744m4609K3027L6141k0563k2335L9741K164l3366
$$ plain form
215 -9006 33003 82953 47505 -40369 -96922 -59106 -231 5843 19810 39276 18799 -9500
227 -9500 -20138 2133 12050 -56321 -93724 -21135 47975 58140 49357 43214 27545 -28634 -53805
240 -53805 3444 18933 -33795 -42968 -2041 35301 28701 -15924 -31084 -35642 -61123 -37823 33265
253 33265 80754 71073 26094 30223 62579 14500 -52125 -56386 -56366 -68153 -46898 19268 76815
266 76815 48024 -3218 13449 29676 6935 -12803 -16510 -997 -277 -19367 5627 31458 -10966
279 -10966 -59339 -53168 -8451 14568 -6893 5660 43790 18805 -13508 6578 19461 -5756
291 -5756 -39084 -22710 37581 50892 25567 23860 13901 -21048 -56569 -67466 -35035 -20274 -41898
304 -41898 -10010 58857 79077 59325 43627 48138 28819 -29444 -38362 -5683 -22534 -53047
$$ packed form
215i006M2009M9950l5448q7874n6553L7816N8875O074J3967J9466k0477k8299
227i500j0638K2271R917o8371l7403P2589O9110J0165q783o143j5669n6179k5171
240e3805N7249J5489n2728r173M0927L7342o600m4625j5160m558k5481K3300P1088
253C3265M7489r681m4979M129L2356m8079o6625m261K0j1787K1255O6166N7547
266G6815k8791n1242J6667J6227k2741j9738l707J5513P20j9090K4994K5831m2424
279a0966m8373O171M4717K3019k1461J2553L8130k4985l2313K0086J2883k5217
291e756l3328J6374O0291J3311k5325j707r959l4949l5521j0897L2431J4761k1624
304d1898L1888O8867K0220j9752j5698M511j9319n8263q918L2679j6851l0513
$$ plain form
316 -53047 -41228 -11781 3661 -12280 -14327 22992 32123 12133 16180 28096 19066 -23272 -60150
329 -60150 -36655 -17846 -42781 -27334 26938 52358 44662 36824 53044 44813 -16920 -46791 -29060
342 -29060 -29871 -37387 -21844 14371 48788 36524 16266 34042 31946 -5412 -29519 -25601 -12517
355 -12517 -31269 -53870 -18041 8684 -19990 -28444 -587 17897 12499 1826 23567 40465
367 40465 9164 -8230 9557 13913 -518 -19464 -9829 25686 21050 -1013 14773 23431 -2122
380 -2122 -24279 -14985 11339 -3840 -37169 -15139 15054 3586 -4715 3068 8114 -5162 -27652
393 -27652 -10635 18008 1042 -23422 -18816 411 11415 -890 1319 29139 19152 -6180 10699
406 10699 29497 8766 -32183 -45648 -19318 -13031 -25566 -1498 26770 26449 26621 39371 56814
$$ packed form
316e3047J1819K9447J5442j5941k047L7319R131j9990M047J1916r030m2338l6878
329f0150K3495J8809k4935J5447N4272K5420p696p838J6220q231o1733k9871J7731
342b9060q11p516J5543L6215L4417j2264k0258J7776k096l7358k4107L918J3084
355a2517j8752k2601L5829K6725k8674q454K7857J8484n398j0673K1741J6898
367D0465l1301j7394J7787M356j4431j8946R635L5515m636k2063J5786Q658k5553
380b122k2157R294K6324j5179l3329K2030L0193j1468q301P783N046j3276k2490
393b7652J7017K8643j6966k4464M606J9227J1004j2305K209K7820r987k5332J6879
406A0699J8798k0731m0949j3465K6330O287j2535K4068K8268l21J72J2750J7443
$$ plain form
419 56814 43322 -10447 -35683 -23071 -23655 -32082 -26572 -4334 13334 6017 20978 62321 51692
432 51692 992 -23818 -23811 -28053 -49465 -59775 -38645 -32997 -38531 -6187 34731 44317 25086 2894
446 2894 14229 28473 6788 -6738 3769 2849 -4304 5114 38551 55495 18604 -7171 14005
459 14005 21190 4486 -5964 -9105 -13205 -28776 -29526 3003 11588 -18837 -37736 -29343 -8622
472 -8622 -6523 -24674 -19602 -10552 -27062 -21900 13957 32519 17098 -5907 8478 38804 30037
485 30037 15144 21879 16320 3478 6392 24283 40011 15366 -21373 -17509 -1894 -7211 -21417
498 -21417 -30897 -25674 -27575 -35021 -6379 21049 -1997 -27923 -17995 8788 23452 16304 20231
511 20231 31285 16035 6803 21341 22303 -2587 -38061 -47454 -16085 2608 -2146 7829 20004
$$ packed form
419E6814j3492n3769k5236J2612n84q427N510K2238J7668p317J4961M1343j0629
432E1692n0700k4810Pm242k1412j0310K1130N648n534L2344M0918R586j9231k2192
446B894J1335J4244k1685j3526J0507r20p153R418L3437J6944l6891k5775K1176
459A4005P185j6704j0450l141m100j5571p50L2529Q585l0425j8899Q393K0721
472h622K099j8151N072R050j6510N162L5857J8562j5421k3005J4385L0326q767
485C0037j4893O735n559j2842K914J7891J5728k4645l6739L864J5615n317j4206
498b1417r480N223j901p446K8642K7428k3046k5926R928K6783J4664p148L927
511B0231J1054j5250r232J4538R62k4890l5474r393L1369J8693m754R975J2175
$$ plain form
524 20004 17289 11591 15294 26982 5819 -43161 -50058 -24419 -18471 -23829 -22729 -14287 -7823 -7116
538 -7116 16533 49098 42562 19020 16628 32625 47034 32246 9730 9605 1271 -15551 -6083
551 -6083 10751 1506 -31059 -50575 -30016 -15379 -29727 -30024 -17456 -13442 -6849 7697 25814
564 25814 22659 -14846 -36756 -21339 -8535 -9814 -12244 -1981 18845 25049 34822 63112 61179
577 61179 24875 4977 14979 30599 23303 3682 3611 -568 -19567 -20570 -12269 -19687 -42444 -60802
591 -60802 -44531 -12796 -9698 -15703 -8847 -2859 -1973 -318 14367 27807 5915 -15738 1752
604 1752 19529 12357 -1613 -7104 -324 2500 7491 33567 46956 28048 10358 9785 19044 14265
618 14265 -13974 -26590 -19948 -23655 -20866 -966 9971 -1686 -25564 -24456 50 -130 -14938
$$ packed form
524B0004k715n698L703J1688k1163m8980o897K5639N948n358J100Q442O464P07
538g116K3649L2565o536k3542k392J5997J4409j4788k2516j25q334j6822R468
551f083J6834r245l2565j9516K0559J4637j4348k97J2568M014O593J4546J8117
564B5814l155l7505k1910J5417J2804j279k430J0263K0826O204R773K8290j933
577F1179l6304j9898J0002J5620p296j9621p1m179j8999j003Q301p418k2757j8358
591f0802J6271L1735L098o005O856N988Q86J655J4685J3440k1892k1653J7490
604A752J7777p172j3970n491O780K824M991K6076J3389j8908j7690n73R259m779
618A4265k8239j2616O642l707K789J9900J0937j1657k3878J108K4506j80j4808
$$ plain form
631 -14938 -10337 -2758 -470 3274 11763 21220 7533 -17819 -12342 8197 13776 7096 -1635 2985
645 2985 6459 -5158 -1666 10850 -3145 -20875 -13381 10933 25308 12522 1507 6249 -2494
658 -2494 -13033 -5306 2827 992 -9040 -8146 16780 29334 13031 1190 -723 -4365 -9396 -10369
672 -10369 2408 5785 -14600 -16743 4306 9276 -3192 -14753 -12874 -5980 -10410 -7594 7061
685 7061 1786 -15759 -18826 -6725 9135 7532 -2433 8192 19304 14325 13739 17885 12101 -7908
699 -7908 -23699 -8990 10117 4848 3091 14731 19948 17212 11678 11447 9574 -10764 -24019 -11674
713 -11674 -456 -3469 -12306 -13985 -4282 -6131 -13980 -3732 2348 -9421 -15730 -5840 8481 4480
727 4480 -13649 -13495 -4554 -8482 -5227 8197 16746 14721 5279 9039 22021 13773 -2724 -4917
$$ packed form
631a4938M601P579K288L744Q489R457j3687k5352N477K0539N579o680q731M620
645B985L474j1617L492J2516j3995j7730P494K4314J4375j2786j1015M742q743
658b494j0539P727Q133j835j0032Q94K4926J2554j6303j1841j913l642n031r73
672a0369J2777L377k0385k143K1049M970j2468j1561J879O894m430K816J4655
685G061n275j7545l067J2101J5860j603r965J0625J1112m979n86M146n784k0009
699g908j5791J4709J9107n269j757J1640N217k736n534k31j873k0338j3255J2345
713a1674J1218l013q837j679R703j849p849J0248O080j1769o309R890J4321m001
727D480j8129J54Q941l928L255J3424Q549k025r442L760J2982q248j6497k193
$$ plain form
741 -4917 439 3805 2518 7225 20109 12885 -5061 -1689 6485 -980 -13246 -16005 -5578 -1074
755 -1074 -6967 -53 7752 -1504 -11446 -10584 -759 3526 -8413 -12196 -612 -138 -5723 -2508 4134
770 4134 4917 -4222 -3686 15555 18841 4460 1599 3929 96 -7775 -11177 -2065 1307 -7513 -2330
785 -2330 11106 12740 4433 -5531 -4187 581 -9065 -11219 2247 5043 -1307 -160 9618 15432 3451
800 3451 -7070 1366 3824 -2908 -385 5341 6721 -909 -9839 -2669 2443 -8296 -12607 -5286 901
815 901 1421 -2529 3828 11465 -156 -8069 1182 5090 -1215 -6337 -2023 7338 1729 -5032 2767
830 2767 5138 -1920 -4534 47 7867 4680 -6721 -3788 2440 -4642 -9359 -5321 1666 1155 -5891
845 -5891 1060 12810 5331 -4096 -750 2072 -221 -4803 -445 11551 9913 2938 8626 12225 6705
$$ packed form
741d917N356L366j287M707J2884p224j7946L372Q174p465j2266k759J0427M504
755a074n893O914P805r256r942Q62R825M285j1939l783J1584M74n585L215O642
770D134P83r139N36J9241L286j4381k861K330l833p871l402R112L372q820N183
785b330J3436J634q307r964J344M768r646k154J3466K796o350J147R778N814j1981
800C451j0521Q436K458o732K523N726J380p630q930P170N112j0739m311P321O187
815I01N20l950O357P637j1621p913R251L908o305n122M314R361n609o761P799
830B767K371p058k614M581P820l187j1401K933O228p082m717M038O987n11p046
845e891O951J1750p479r427L346K822k293m582M358J1996j638o975N688L599n520
$$ plain form
860 6705 -2645 -6440 30 -767 -10466 -5963 3635 654 -5401 -5672 791 -333 -12061 -11290 -883
875 -883 -3431 -8458 -4936 612 1640 -5089 -5704 4897 5770 -347 2606 8871 10252 4370 457 8596
891 8596 9830 -1611 -1440 5909 5583 16 -2494 3961 5614 -5393 -7203 1164 351 -4213 -4866 -294
907 -294 4164 -2705 -6785 1709 3390 -3180 -4107 753 5544 -334 -7816 -640 1379 -8560 -9915 -3785
923 -3785 -688 -2861 -5188 3071 9801 1878 -2083 1920 1985 -1153 -4744 -166 8942 4919 936 9764
939 9764 14386 9178 3207 3051 6655 442 -8099 -1864 2520 -4061 -6571 -2485 1532 -251 -7960
954 -7960 -5581 -324 -6162 -10955 -8181 -5181 -5897 -10911 -7062 4420 3740 -1730 4048 9170 7644
969 7644 3011 3554 10187 6792 -1449 4260 11027 8532 5034 3524 6585 5104 -4483 -4728 -113 -4521
$$ packed form
860F705r350l795O470p97r699M503R598k981o055k71O463j124j1728P71J0407
875h83k548n027L522N548J028o729o15J0601Q73o117K953O265J381n882l913Q139
891H596J234j1441J71P349l26n567k510O455J653j1007j810Q367q13m564o53M572
907b94M458o869m080Q494J681o570r27M860M791n878p482P176K019r939j355O130
923c785L097k173k327Q259O730p923l961M003O5l138l591M578R108m023l983Q828
939I764M622n208n971j56L604o213q541O235M384o581k510M086M017j783p709
954g960K379N257n838m793K774L000p16n014L849J1482o80n470N778N122j526
969G644m633N43O633l395q241N709O767k495l498j510L061j481r587k45M615m408
$$ plain form
985 -4521 -10312 -9741 -4004 -1463 -8779 -9140 28 -1470 -7095 -4479 482 910 -3799 -3848 5209 6070 -628
1002 -628 1171 6116 7037 4436 2537 7709 8859 -807 -2242 3641 2642 -2903 -6658 -2590 1170 -4950
1018 -4950 -6021 2480 1874 -3735 -3612 571 3880 -853 -4805 1767 3875 -1100 -1074 2298 4572 1130
1034 1130 -3865 1995 6418 -1262 -4824 -455 1172 -1675 -5606 -1351 3249 -3264 -6155 629 2384
1049 2384 -1111 -4677 -3713 1162 -1515 -5394 973 5013 1672 526 3230 9299 7720 76 3466
1064 3466 8364 2324 -1251 1106 2974 527 -5107 -2459 3458 -1681 -6614 -3837 -2070 -2744 -6521
1079 -6521 -6640 -788 -2648 -8475 -3578 2144 1188 -1922 -1898 4839 5320 -937 2678 7955 3993 652
1095 652 1488 5684 5970 -466 -537 5063 2237 -2069 -1607 709 1057 -4164 -5674 1066 354 -5878 -4683
$$ packed form
985d521n791N71N737K541p316l61R168j498n625K616M961M28m709m9R057Q61o698
1002f28J799M945R21k601j899N172J150r666j435N883r99n545l755M068L760o120
1018d950j071Q501o06n609J23M183L309m733l952O572K108m975K6L372K274l442
1034A130m995N860M423p680l562M369J627k847l931M255M600o513k891O784J755
1049B384l495l566R64M875k677l879O367M040l341j146K704O069j579p644L390
1064C466M898o040l575K357J868k447n634K648N917n139m933K777J767o74l777
1079f521j19N852j860n827M897N722r56l110K4O737M81o257L615N277l962l341
1095F52Q36M196K86o436p1N600k826m306M62K316L48n221j510O740p12o232J195
$$ plain form
1112 -4683 -323 553 -2782 -4371 1202 1982 -4595 -2787 2678 2151 -923 -2361 1577 4687 -169 -744
1128 -744 4807 4196 325 -819 2251 5368 -63 -3642 2164 2882 -2331 -3057 15 1725 -1977 -4946
1144 -4946 235 2045 -3587 -4293 -493 949 -627 -3564 -199 3968 -481 -2458 2597 4240 1608
1159 1608 -1765 131 5222 891 -2962 1876 3253 -564 -2658 -736 2880 335 -4480 -496 2041
1174 2041 -1415 -2984 -1502 1551 800 -4002 -1705 3518 -112 -3298 -386 2269 1550 -2371 -1397 3951
1190 3951 1123 -2695 1184 3643 1925 -627 -645 3890 2948 -1949 517 3407 718 -1843 -2391 1148
1206 1148 1234 -4819 -3994 795 -1701 -4476 -3161 179 1187 -3065 -2664 3218 1573 -1826 346 2567
1222 2567 3264 644 -997 3898 4803 -78 1072 4177 3581 381 -2241 1354 2616 -3138 -3219 1204
$$ packed form
1112d683M360Q76l335j589N573P80o577J808N465n27l074j438L938L110m856n75
1128g44N551o11l871j144L070L117n431l579N806P18n213p26L072J710l702k969
1144d946N181J810n632p06L800J442j576k937L365M167m449j977N055J643k632
1159A608l373J896N091m331l853M838J377l817k094J922L616k545m815L984K537
1174B041l456j569J482L053p51m802K297N223l630l186K912K655p19l921R74N348
1190C951k828l818L879K459j718k552j8M535r42m897K466K890k689k561n48L539
1206A148Q6o053Q25M789k496k775J315L340J008m252M01N882j645l399K172K221
1222B567O97k620j641M895R05m881J150L105n96l200k622L595J262n754q1M423
$$ plain form
1238 1204 -47 -2957 -3656 -998 1109 -3331 -4668 -202 -568 -3178 -2860 -265 2375 46 -2413 2180
1254 2180 4093 52 -385 2379 3744 1390 -1718 2118 4773 -116 -743 2784 2944 379 -1855 -308
1270 -308 2761 -1400 -4026 -662 17 -2250 -3864 -2834 644 -1666 -5034 -1067 1290 -1496 -2143 187
1286 187 3117 1922 -1981 1101 3891 509 -819 1266 2848 2078 -1134 135 4025 1084 -2145
1301 -2145 -180 1048 -340 -3073 -2816 1709 504 -2961 231 2860 1122 -872 -862 2103 1054 -3566
1317 -3566 -1980 1119 -822 -1961 -955 1848 2576 -1027 -1087 2635 811 -2468 -1830 -129 511 -2458
1333 -2458 -2387 2957 2839 -555 852 2443 1361 -868 -2523 738 1404 -2256 -921 2290 2227 851
1349 851 -250 2123 3325 -1638 -2906 391 -197 -2422 -2339 228 2263 -705 -2086 2010 1945 -1267
$$ packed form
1238A204j251k910o99K658K107m440j337M466l66k610L18K595K640k329k459M593
1254B180J913m041m37K764J365k354l108L836K655m889o27L527J60k565k234J547
1270c08L069m161k626L364O79k267j614J030L478k310l368L967K357k786o47K330
1286A87K930j195l903L082K790l382j328K085J582p70l212J269L890k941l229
1301b145J965J228j388k733K57M525j205l465L192K629j738j994J0K965j049m620
1317c566J586L099j941j139J006K803P28l603o0L722j824l279O38J701O40k969
1333b458P1N344j18l394J407J591j082k229j655L261O66l660J335L211o3j376
1349H51j101K373J202m963j268L297n88k225Q3K567K035k968j381M096o5l212
$$ plain form
1365 -1267 -1390 -230 332 -1640 -3633 -584 1491 -1686 -1492 1166 2342 1327 -860 1202 3840 47
1381 47 -1774 1393 1760 -149 -1198 114 2689 -260 -2829 160 711 -1597 -2206 -1084 1178 81
1397 81 -2837 -346 2177 -612 -1886 -439 1222 768 -2031 -82 2931 -110 -2116 -241 612 -151
1413 -151 -1949 -355 3503 2266 -119 2002 3008 1609 -601 -1336 1118 273 -2880 -908 2155 991
1429 991 -198 254 2073 1481 -3119 -2374 118 -1916 -3948 -3078 -1609 -829 -2814 -1913 1788 1424 -818
1446 -818 196 1540 1829 -391 -1570 1596 2109 -826 530 3691 3575 2375 1398 3190 3087 -1037
1462 -1037 -1508 919 365 -473 -254 1324 2853 -110 -1857 341 -799 -3767 -4485 -3395 -1802 -3200
1478 -3200 -4085 -493 969 -1803 -1574 -38 553 -90 -1544 908 2385 -340 -701 1344 1858 1037 334
$$ packed form
1365a267j23J160N62j972j993L049K075l177J94K658J176j015k187K062K638l793
1381D7j821L167L67j909j049J312K575k949k569K989N51k308o09J122K262j097
1397H1k918K491K523k789j274J447J661m54k799J949L013l041k006J875Q53p63
1413a51j798J594L858j237k385K121J006j399k210p35K454q45l153J972L063j164
1429I91j189M52J819n92m600P45K492k034k032Q70J469P80j985R01L701l64k242
1446h18J014J344K89k220j179L166N13k935J356L161j16j200r77J792j03m124
1462a037m71K427n54q38K19J578J529k963j747K198j140k968p18J090J593j398
1478c200q85L592J462k772K29J536N91o43j454K452J477k725l61K045N14q21p03
$$ plain form
1495 334 2092 4716 2601 1087 3007 2931 509 -978 -486 942 -607 -2443 508 1679 -650 -1288
1511 -1288 -787 93 -972 -2971 -1411 1146 -461 -1550 -64 621 98 -2186 -2043 543 -1137 -2899
1527 -2899 -401 851 351 -844 -914 1661 634 -1432 864 2553 2005 1297 807 2107 1209 -2072 -1611
1544 -1611 493 -294 -736 176 2102 2754 122 -190 2026 191 -1892 -1191 261 883 -85 -402 1568
1561 1568 1016 -1579 -1167 -112 -272 -1291 -1763 534 1336 -1321 -1154 117 -522 -1677 -1823 79 1607
1578 1607 -595 -414 2057 1218 -608 -1177 -387 414 -581 -1070 1908 2431 350 -71 437 930 -287 -1902
1596 -1902 230 1615 -85 15 1528 1634 353 -1278 -565 954 -507 -845 1113 1494 172 -924
1612 -924 -527 348 -1195 -2504 -585 1050 64 -590 -276 383 -754 -2970 -1273 556 -1016 -888 1020
$$ packed form
1495C34J758K624k115j514J920p6k422j487M92J428j549j836K951J171k329o38
1511a288N01Q80j065j999J560K557j607j089J486O85n23k284J43K586j680j762
1527b899K498J252n00j195p0K575j027k066K296J689n48p08m90J300q98l281M61
1544a611K104p87m42R12J926O52k632l12K216j835k083P01J452O22r68l17J970
1561A568n52k595M12J055j60j019m72K297Q02k657J67J271o39j155j46J902J528
1578A607k202J81K471q39j826n69P90Q01r95m89K978N23k081m21N08M93j217j615
1596a902K132J385j700J00J513J06j281j631P13J519j461l38J958L81j322j096
1612i24L97Q75j543j309J919J635r86o54L14O59j137k216J697J829j572J28J908
$$ plain form
1629 1020 2520 2357 284 342 799 -1234 -2153 -734 285 851 80 501 2923 1741 -858 75 528
1646 528 -75 -807 -470 1786 1238 -1014 -118 859 -614 -1609 -1502 -511 41 -1437 -917 1084 -183 -1340
1664 -1340 -1021 -122 966 -140 -656 1683 689 -1140 -722 -88 -364 -1259 -974 1804 2646 1292 1974 2500
1682 2500 1224 -151 -1428 -801 -261 -1584 -1124 1413 1589 511 -437 -365 -28 -1992 -2204 -142 378
1699 378 -708 19 1077 1383 -361 -2198 -1488 -1318 -2821 -1650 -337 732 762 172 1950 3206 1411
1716 1411 918 2004 2049 1092 143 495 1255 -918 -2289 -702 -107 -620 -730 -34 1187 506 -883 -214
1734 -214 -165 -1985 -2061 -1341 209 311 -860 -477 368 -1195 -1948 -1019 -203 158 -693 1193 3310 2801 1376
1753 1376 1626 1455 483 -588 -698 674 498 -771 513 1178 568 -649 -1229 -198 -85 -1367 -373
$$ packed form
1629A020J500j63k073N8M57k033r19J419J019N66p71M21K422j182k599R33M53
1646E28o03p32L37K256n48k252Q96R77j473r95J07R91N52j478N20K001j267j157
1664a340L19Q99J088j106n16K339r94j829M18O34k76q95K85K778Q42j354O82N26
1682B500j276j375j277O27N40j323M60K537J76j078r48P2L37j964k12K062N20
1699C78j086P27J058L06j744j837P10J70j503J171J313J069L0n90J778J256j795
1716A411m93J086M5r57r49L52P60k173j371J587N95n13j10O96J221o81j389O69
1734b14M9j820p6P20J550J02j171L83Q45j563p53R29Q16L61q51J886K117n09j425
1753A376K50j71r72j071j10J372j76j269J284O65o10j217n80J031J13j282R94
$$ plain form
1770 -373 958 -1 -686 -777 -470 -490 -1993 -2128 -272 -391 -112 728 1518 1415 229 -569 1265 906 -723
1789 -723 -243 443 554 148 -325 743 867 -880 -642 462 146 -743 -1360 -1051 -443 -1697 -1393 343
1807 343 708 707 1312 2097 2711 1023 -912 -279 -780 -2150 -1906 -605 564 555 323 2001 2449 467 -382
1826 -382 -338 -867 -1078 -1424 -365 1035 435 -49 858 689 -80 -1376 -1442 -569 -1304 -1900 -345 669 220
1845 220 596 1285 2373 2059 496 439 745 -1004 -1662 -1409 -1237 -1027 -1018 45 1996 1378 1102 1304 1127
1864 1127 463 -1080 -1685 -511 -1009 -1541 -51 1117 1282 1089 813 1254 663 -1071 -728 -630 -1369 -1594
1882 -1594 -1183 -106 420 -568 -267 1047 776 -18 49 147 226 -962 -1353 385 193 -317 280 1083 1232
1901 1232 1158 655 1314 783 -761 -580 -260 -318 -551 -843 217 1192 218 -32 755 223 -608 -1107 -826 -511
$$ packed form
1770c73J331r59o85r1L07k0j503j35J856j19K79Q40P90j03j186p98J834l59j629
1789g23M80O86J11m06m73J068J24j747K38J104l16q89o17L09O08j254L04J736
1807C43L65jO05P85O14j688j935O33n01j370K44J301J169rk32J678M48j982q49
1826c82M4n29k11l46J059J400o00m84R07j69p69j296o6Q73p35n96J555J014m49
1845B20L76O89J088l14j563n7L06j749o58K53J72K10RJ063J951o18k76K02j77
1864A127o64j543o05J174m98n32J490J168J65j93k76M41n91j734L43R8p39k25
1882a594M11J077N26r88L01J314k71p94O7R8P9j188l91J738j92n10N97Q03J49
1901A232p4n03O59n31j544J81L20n8k33k92J060R75r74k50P87n32q31m99K81L15
$$ plain form
1921 -511 -1676 -1707 13 248 462 1057 1268 1753 927 -46 266 200 -1085 -1394 -1053 -185 63 -196 1070
1940 1070 1777 773 379 677 431 -144 -957 -987 -228 -842 -1052 -45 263 -2 -112 -21 315 -109 -1078 -484
1960 -484 -47 -463 -380 315 1388 1378 704 1171 1647 279 -395 -803 -859 -1098 -1845 -1352 144 169 167 700 1053
1981 1053 873 -51 -455 118 -268 -1162 -712 -33 -120 -197 -310 328 390 -184 229 829 483 53 96 21 179
2002 179 -605 -468 563 498 269 537 890 674 -93 -841 -374 -843 -1649 -1094 -411 -81 94 83 460 511 -595
2023 -595 -603 16 -130 -242 -283 86 926 183 -91 334 -30 -169 -313 96 990 726 360 721 1011 408 8
2044 8 88 254 83 -625 66 174 -861 -1212 -917 -847 -535 -534 148 890 406 5 362 -196 -698 -1371 -1302 -297
2066 -297 -107 22 1032 1163 759 458 0 233 53 -779 197 965 752 1056 1141 1131 746 -423 -671 -282
$$ packed form
1921e11j165l1J720K35K14N95K11M85q26r73L12o6j285l09L41Q68K48k59J266
1940A070P07j004l94K98k46n75q13l0P59o14k10J007L08k65j10R1L36m24r69N94
1960d84M37m16Q3O95J073j0o74M67M76j368o74m08n6k39p47M93J496K5kN33L53
1981A053j80r24m04N73l86q94M50O79q7p7j13O38O2n74M13O00l46m30M3p5J58
2002A79p84J37J031o5k29K68L53k16p67p48M67m69q06N55O83L30J75j1L77N1j106
2023e95qO19j46j12m1L69Q40p43k74M25l64j39j44M09Q94k64l66L61K90o03m00
2044HQ0J66j71p08O91J08j035l51K95P0L12JO82P42m84m01L57n58n02o73O9J005
2066b97J90J29J010J31m04l01m58K33j80q32R76P68k13L04Q5j0l85j169k48L89
$$ plain form
2086 -282 -683 -1129 -505 -61 165 -291 -747 -351 -748 -1123 -253 -48 332 38 -263 81 247 -600 -437 177
2106 177 53 103 131 649 604 -456 -605 -404 -485 -1 609 1276 1967 1789 1571 1395 387 -683 -1355 -1473
2126 -1473 -1056 -817 -781 137 246 -112 -106 -118 -399 -488 -882 -459 248 -405 -134 141 -543 -802 -960 -700 306
2147 306 170 513 1594 1351 1059 457 -84 143 -258 -605 426 964 762 746 876 768 225 -601 -559 -633
2167 -633 -775 -286 -3 -22 -312 -817 -1070 -563 -721 -679 -292 -5 72 77 59 453 -160 -820 -521 291 146 638
2189 638 875 706 779 -341 -265 -50 -528 -242 391 1230 1643 1196 907 522 -366 -1471 -1405 -1172 -1099 -767 -229
2210 -229 905 1362 992 774 543 -292 -194 -496 -126 -94 -668 -618 -275 -620 -546 -493 -147 460 195 579 1065
2231 1065 805 7 -135 -668 -558 -313 -288 337 837 652 704 490 66 -498 -897 -646 92 229 530 684
$$ packed form
2086b82m01m46O24M44K26m56m56L96l97l75Q70K05L80k94l01L44J66q47J63O14
2106A77j24N0K8N18m5j060j49K01q1M84O10O67O91j78k18j76j008j070o72j18
2126a473M17K39L6R18J09l58Oj2k81q9l94M23P07o53K71K75o84k59j58K60J006
2147C06j36L43J081k43k92o02n41K27m01l47J031N38k02j6J30j08n43q26M2p4
2167f33j42M89K83j9k90n05k53N07j58M2L87K87P7Nj8L94o13o60K99Q12j45M92
2189F38K37j69P3j120P6K15m78K86O33Q39M13m47k89l85q88j105O6K33P3L32N38
2210b29J134M57l70k18k31q35R8l02L70L2n74N0L43l45P4N3L46O07k65L84M86
2231A065k60p98j42n33J10K45K5O25N00j85N2k14m24n64l99K51P38J37L01J54
$$ plain form
2251 684 705 741 -181 -413 -219 -751 -872 33 -108 401 613 132 118 -269 -962 -374 -24 -265 155 388 725
2272 725 411 -115 -243 -228 -574 -261 127 451 451 176 -3 167 -328 -909 -794 -847 -461 6 221 844 691
2293 691 -34 -13 8 -126 116 -86 413 557 92 330 113 -350 -695 -498 -140 192 272 371 929 312 113
2314 113 -361 -550 -588 -761 -450 231 308 204 226 -224 -368 -546 -605 -477 -81 -78 527 849 977 661 -39 -27
2336 -27 -1 -699 -599 -459 -242 -121 -162 -390 267 -149 -376 137 403 480 636 172 275 -132 -572 -602 -630 -793
2358 -793 -147 -21 451 612 545 518 444 -151 -289 -75 44 297 137 324 436 130 -148 -240 -616 -826 -642
2379 -642 -376 -319 233 -285 203 -185 -230 -411 -24 343 333 332 243 665 464 -219 -140 -263 -201 -192 141 630 184
2402 184 330 280 133 48 -380 -472 -10 103 325 509 598 166 17 -542 -465 -487 -863 -757 -338 174 414 565
$$ packed form
2251F84K1L6r22k32J94n32j21R05j41N09K12m81j4l87o93N88L50k41M20K33L37
2272G25l14n26j28J5l46L13L88L24%k75j79J70m95n81J15n3L86M67K15O23j53
2293F91p25K1K1j34K42k02M99J44m65K38k17m63l45J97L58L32Q0R9N58o17j99
2314A13m74j89l8j73L11O81P7j04K2m50j44j78n9J28L96LO05L22J28l16p00J2
2336b7K6o98J00J40K17J21m1k28O57m16k27N13K66P7J56m64J03m07m40l0k8j63
2358g93O46J26M72J61o7k7p4n95j38K14J19K53j60J87J12l06k78r2l76k10J84
2379f42K66N7N52n18M88l88m5j81L87L67j0jq9M22k01o83P9j23O2RL33M89m46
2402A84J46n0j47q5m28r2M62J13K22J84Q9m32j49n59P7k2l76J06M19N12K40J51
$$ plain form
2424 565 541 512 301 196 109 26 -31 -252 -264 -171 -375 -446 -332 42 -61 516 690 713 686 363 66 -99 -471
2447 -471 -527 -499 -284 -65 -58 25 361 162 230 288 44 10 157 -79 44 126 -60 -81 -324 -578 -27 -400 -15
2470 -15 127 -51 275 493 40 -160 47 124 45 -169 168 251 130 -119 -311 -34 -173 -221 -96 253 189 210
2492 210 510 259 222 -194 -350 -352 -387 -704 -586 -94 166 163 120 233 459 364 -143 102 -218 -291 -269 -353 -184 -344
2516 -344 -271 -70 32 64 419 261 310 246 -32 63 45 -323 -128 182 199 108 332 503 404 -143 -340 -257 -506
2539 -506 -354 -245 -166 80 21 62 312 -31 -49 -52 -137 -86 -54 -393 -144 -137 -7 126 -116 184 -39 260 139 373
2563 373 217 241 526 393 212 64 -177 264 -59 -193 -262 -210 -92 -259 -96 43 -33 56 121 329 208 55
2585 55 -104 -64 -329 -546 -478 -254 -271 -122 289 442 293 259 278 391 302 236 16 111 281 -34 -22 -55 92 -233
$$ packed form
2424E65k4k9k11j05q7q3n7k21j2R3k04p1J14L74j03N77J74K3k7l23k97j65l72
2447d71n6K8K15K19PQ3L36j99O8N8k44l4J47k36J23Q2j86k1k43k54N51l73L85
2470a5J42j78L26K18m53k00K07P7p9k14L37Q3j21k49j92K77j39m8J25L49o4K1
2492B10L00k51l7m16j56kl5l17J18M92K60lm3J13K26r5n07K45l20p3K2q4J69j60
2516c44P3K01J02L2L55j58M9o4k78R5j8l68J95L10J7r1K24J71r9n47j97Q3k49
2539e06J52J09P9K46n9M1K50l43j8lq5N1L2l39K49PJ30J33k42L00k23K99j21K34
2563C73j56K4K85j33j81j48k41M41l23j34o9N2J18j67J63J39p6Q9O5K08j21j53
2585E5j59M0k65k17O8K24j7J49M11J53j49l4J9J13q9o6k20R5J70l15J2l3J47l25
$$ plain form
2609 -233 -332 -232 -97 44 98 57 261 140 112 198 7 80 -51 -280 -199 -500 -247 -304 -286 -424 -55 -120 23
2632 23 145 352 362 267 152 114 37 -229 -9 -152 -236 70 99 219 -10 224 180 22 -139 175 105 -300 45
2655 45 -77 -175 -95 -89 57 -103 -104 -36 -110 -182 -183 -275 -81 21 -261 121 331 114 99 -36 -119 58 -67 -218 143
2680 143 -96 -208 128 3 428 137 188 428 205 19 -8 -134 -265 -133 -258 -62 -49 14 269 316 255 147
2702 147 123 26 1 -457 -377 -290 -417 -161 -230 31 279 195 138 193 42 106 113 86 208 -26 12 38 102 -75 193
2727 193 341 211 174 74 20 0 -63 -122 -163 67 85 105 -5 35 11 -103 -358 -264 -311 -180 -51 -66 52 -64
2751 -64 105 259 29 161 120 99 -332 -194 43 71 179 174 346 23 168 102 266 141 -164 -113 29 -291 -47
2774 -47 -336 -90 -253 -96 204 75 83 96 -117 -385 -403 -242 -367 -339 -213 -284 101 324 291 375 406 212 472
$$ packed form
2609b33r9J00J35J41N4m1K04j21k8Q6j91P3j31k29Q1l01K53n7J8j38L69o5J43
2632B3J22K07J0r5j15l8p7k66K20j43q4L06K9J20k29K34m4j58j61L14p0m05L45
2655D5j22r8Q0OJ46j60jO8p4p2jr2J94J02k82L82K10k17j5j35q3J77j25j51L61
2680A43k39j12L36j25M25k91N1K40k23j86k7j26j31J32j25J96J3O3K55M7o1j08
2702A47k4r7k5m58Q0Q7j27K56o9K61K48q4n7N5j51O4Pk7J22k34L8K6O4j77K68
2727A93J48j30l7j00n4k0o3n9m1K30J8K0j10M0k4j14k55R4m7J31J29j5J18j16
2751f4J69J54k30J32m1k1m31J38K37K8J08nJ72l23J45o6J64j25l05N1J42l20K44
2774d7k89K46j63J57L00j29QJ3k13k68j8J61j25K8J26p1L85K23l3Q4L1j94K60
$$ plain form
2797 472 55 -6 100 -38 -137 -216 -290 -105 48 150 109 195 244 238 -104 139 27 -113 -97 88 -328 91 10 -57
2821 -57 -55 -167 -32 -241 -34 -60 -4 -120 30 -46 -18 208 -35 -184 -201 -125 -258 61 -241 36 65 159 43 -84
2845 -84 122 -60 96 206 338 51 -114 -71 91 237 -63 -94 73 81 60 51 -40 -43 -78 -190 -280 -77 -290 -208 -165
2870 -165 -302 -55 -105 -108 17 46 98 115 -35 204 -61 -1 -32 -30 124 112 13 111 407 262 168 314 -153 11 211
2895 211 -57 -29 58 -175 -82 -131 -30 152 -151 -63 33 -25 -94 31 -32 -95 89 -111 10 -354 -290 -113 -14 -27
2919 -27 -161 34 127 139 -22 53 -35 -13 140 -206 90 189 -39 -157 361 -173 -119 299 -48 -67 -38 73 -135
2942 -135 191 -75 14 10 -173 36 -147 -53 -75 -98 -17 -201 160 -1 208 3 75 -128 141 117 89 -117 203
2965 203 -31 -70 -69 77 -34 106 143 92 72 271 17 -184 -42 -58 -79 -10 -151 -46 -25 -124 52 -203 -246 -15
$$ packed form
2797D72m17o1J06j38r9p9p4J85J53J02m1Q6M9ol42K43j12j40J6J85m16M19q1o7
2821e7Kj12J35k09K07k6N6j16J50p6K8K26k43j49j7P6j33L19l02K77K9R4j16j27
2845h4K06j82J56J10J32k87j65M3J62J46l00l1J67Qk1rr1ll5j12r0K03k13Q2M3
2870a65j37K47n0lJ25K9N2J7j50K39k65O0l1KJ54j2r9R8K96j45r4J46m67J64K00
2895B11k68K8Q7k33R3m9J01J82l03Q8R6n8o9J25o3o3J84k00J21l64O4J77R9j3
2919b7j34J95R3J2j61P5q8K2J53l46K96R9k28j18N18n34N4M18l47j9K9J11k08
2942a35L26k66Q9mj83K09j83R4k2k3Q1j84L61j61K09k05P2k03K69k4k8k06L20
2965B03k34l9JJ46j11J40L7n1k0J99k54k01J42j6k1O9j41J05K1r9J76k55m3K31
$$ plain form
2989 -15 71 46 -86 -9 -183 -21 -261 -38 86 -145 229 236 74 109 187 173 69 49 -190 130 -1 84 82 -69
3013 -69 125 134 54 -213 53 -131 -52 -72 -53 81 66 -92 -124 -3 -65 -60 -15 -84 54 13 -125 -146 -49 -12 -159 64
3039 64 161 -6 159 227 330 172 21 160 128 55 22 -143 260 316 283 -38 75 156 -83 -208 9 115 127
3062 127 -51 132 -89 -106 85 33 -240 3 29 -129 67 -23 -60 -321 -332 -136 4 -327 94 83 124 184 167
3085 167 -80 144 254 -115 47 51 62 182 -49 -64 251 102 -2 85 98 -145 109 141 -51 -53 -148 -122 -83 -113
3109 -113 -157 -322 -66 -78 -147 61 5 -165 14 74 51 -23 63 72 30 80 107 -144 -46 -14 -46 -93 11 133 -67 7
3135 7 94 -120 195 -52 -129 -52 57 -138 -161 -106 74 120 147 17 87 61 21 37 -46 37 183 52 104 58 47 -57
3161 -57 79 90 67 69 41 21 -52 -60 -60 -69 83 -154 -194 -442 -233 -120 -127 179 0 -14 236 -180 17 93 -106 -107 -15
$$ packed form
2989a5Q6k5j32P7j74J62k40K23J24k31L74Pj62L5P8j4j04k0k39L20j31Q5kj51
3013f9J94Rq0k67K66j84P9k0J9J34j5j58l2J21o2NM5o9J38m1j38k1R7L7j47K23
3039F4R7j67J65O8J03j58j51J39l2p3l3j65M03N6l3l21J13Q1k39j25K17J06J2
3062A27j78J83k21j7J91n2k73K43K6j58J96r0l7k61j1J96J40l31M21j1M1O0j7
3085A67k47K24J10l69J62MJ1J20k31j5L15j49j04Q7J3k43K54L2j92kr5K6L9l0
3109a13m4j65K56j2o9K08n6j70J79O0k3p4Q6Rm2N0K7k51R8L2l2m7J04J22k00P4
3135GQ7k14L15k47p7P7J09j95k3N5J80M6K7j30P0k6m0J6q3Q3J46j31N2m6j1j04
3161e7J36J1k3Kk8k0p3q%rJ52k37m0k48K09J13pL06j79j4K50m16J97P6j99jR2
$$ plain form
3188 -15 -11 -40 226 -4 240 7 184 76 78 -24 192 35 13 -45 13 186 -98 -171 -185 -19 -183 -40 -203 50
3212 50 38 48 -36 -190 -228 85 32 -141 -99 53 -33 232 97 204 -44 -257 92 -25 240 172 21 96 -4
3235 -4 -114 178 46 121 221 167 -16 -41 17 84 24 66 -25 184 -196 -80 -34 -180 114 -43 -252 -62 -246 -73
3259 -73 -59 -5 65 133 -198 -91 -189 133 12 -8 82 57 252 40 110 210 231 -69 -315 139 1 -180 42 161
3283 161 -185 -83 59 50 28 -23 -238 -57 -110 -103 -100 43 -114 -200 48 -33 -133 214 -183 39 22 -115 60 -249
3307 -249 -55 -68 -101 98 -90 200 123 -3 99 57 -37 -287 164 2 -98 -185 163 -235 61 -112 -187 -176 -22
3330 -22 -57 -59 115 -12 37 -52 185 76 103 119 246 -158 256 -148 -202 200 -5 -77 -19 163 23 118 -23 5
3354 5 88 -59 -191 4 -233 87 -79 143 -95 -170 4 55 -34 109 264 192 241 146 -96 78 -41 183 -4
$$ packed form
3188a5Mk9K66k30K44k33J77j08Kj02K16j57k2n8N8J73k84p3j4J66j64J43j63K53
3212E0j2J0q4j54l8L13n3j73M2J52q6K65j35J07k48k13L49j17K65o8j51P5j00
3235dj10K92j32P5J00n4j83k5N8O7o0M2r1K09l80J16M6j46K94j57k09J90j84J73
3259g3J4N4P0O8l31J07r8L22j21k0R0k5J95k12P0J00K1l00k46M54j38j81K22J19
3283A61l46J02J42rk2n1k15J81n3PLJ43j57q6K48q1j00L47l97K22j7j37J75l09
3307b49J94j3l3J99j88K90p7j26J02m2r4k50M51j62j00q7L48l98K96j73p5J1J54
3330b2l5kJ74j27M9q9K37j09K7J6J27m04M14m04n4M02k05p2N8J82j40R5j41K8
3354EQ3j47j32J95k37L20j66K22k38p5J74N1q9J43J55p2M9r5k42J74j19K24j87
$$ plain form
3377 -4 91 48 -109 21 173 3 -31 28 30 -171 27 48 -29 -40 54 -110 27 -295 -162 -73 -42 -29 88 -45 63
3402 63 87 122 321 159 145 113 184 -15 261 42 -154 -188 9 -11 4 -72 139 -328 -118 142 -218 133 171 -19
3426 -19 12 97 -98 6 7 -58 13 33 103 175 -69 -101 54 -19 -94 -30 -14 31 -43 -33 -57 -119 118 -80 -57 60 194
3453 194 128 135 75 102 -49 134 -117 17 83 -18 59 29 -28 -121 -59 -143 78 -230 34 -170 -46 -29 -126 20 -89
3478 -89 -198 -156 -42 -131 121 -223 -121 63 116 34 294 384 52 138 180 186 140 -28 74 202 66 97 -28 -149
3502 -149 16 30 -42 -173 -218 108 -50 -116 78 -281 -227 -67 -105 -31 -77 -9 -60 -222 55 137 13 41 211 102
3526 102 96 134 25 84 -236 -74 24 -81 -180 -84 -82 -166 -117 -50 10 -42 -26 29 9 -57 96 -1 -87 -202 -304 -190 -62
3553 -62 69 -144 88 -94 103 89 -2 382 187 134 43 -161 -154 -149 -352 -72 -122 -44 81 -227 -97 153 -134 -116
$$ packed form
3377dR5m3j57J30J52j70l4N9Kk01J98K1p7j1R4j64J37l22J33Q9L1J3J17j33J08
3402F3K4L5J99j62j4l2P1j99K76k19j96l4J97k0J5p6K11m67K10K60l60L51L8j90
3426a9L1Q5j95J04Jo5P1K0P0P2k44l2J55p3p5O4J6M5p4J0k4o2K37j98K3J17J34
3453A94o6Po0K7j51J83k51J34O6j01P7l0n7r3O2q4K21l08K64k04J24J7r7J46j09
3478h9j09M2J14q9K52l44J02J84N3q2K60R0l32Q6M2Om6j68J02J28j36L1j25j21
3502a49J65J4p2j31m5L26j58o6J94l59N4J60l8P4m6O8n1j62K77Q2j24K8J70j09
3526A02oL8j09N9l20J62R8j05r9R6Kq4M9O7O0n2J6N5k0o6J53r7q6j15j02J14J28
3553f2J31k13K32j82J97j4r1L84j95n3r1k04PNk03K80n0P8J25l08J30K50k87J8
$$ plain form
3577 -116 73 -56 60 25 10 -72 -47 -20 58 -56 142 109 -57 204 -128 146 184 32 57 -34 -137 21 154
3600 154 -94 -11 -200 -86 -120 -240 -86 -69 -164 57 -172 -233 -23 67 70 -8 79 -56 -83 32 -131 153 67 26
3624 26 -12 81 105 194 230 90 294 10 -74 2 74 64 -132 -68 153 102 -92 -89 -192 -96 -86 17 -68 38 2 -172
3650 -172 128 183 184 13 249 264 60 -57 159 97 -75 114 22 159 158 6 170 107 -10 137 -155 -57 -162
3673 -162 -213 134 -52 -36 -107 50 202 239 -108 -174 -21 -147 -238 -145 -141 353 30 -148 192 105 19 127 58 134
3697 134 25 -122 16 28 -64 6 -174 11 11 -96 -69 55 -204 25 -180 -90 -26 61 131 31 5 -50 157 54
3721 54 31 57 166 121 -134 -226 113 -27 -140 26 1 -66 113 -268 -104 21 -226 33 -3 -21 20 -6 37 104
3745 104 -73 -12 5 144 -38 25 -128 -62 132 -79 -73 148 9 -3 -25 87 73 -199 -129 4 -15 160 -212 7
$$ packed form
3577a16J89j29J16l5j5q2K5K7P8j14J98l3j66K61l32K74L8j52K5r1j03J58J33
3600A54k48Q3j89J14l4j20J54J7r5K21k29o1K10R0Lp8Q7j35k7J15j63K84q6m1
3624B6l8R3K4Q9L6j40K04k84q4P6P2j0j96O4K21n1j94Lj03R6J0J03q5J06l6j74
3650a72L00N5Jj71K36J5k04j17K16o2j72J89r2J37jj52J64o3j17J47k92R8j05
3673a62n1L47j86J6p1J57J52L7l47o6J53j26r1R3MM94l23j78L40q7q6J08o9P6
3697A34j09j47J38J2r2P0j80J85%j07K7J24k59K29k05R0O4Q7P0j00k6n5K07j03
3721E4k3K6J09m5k55r2L39j40j13J66k5o7J79l81J64J25k47K59l6j8M1k6M3O7
3745A04j77O1J7J39j82O3j53O6J94k11OK21j39j2k2J12j4k72P0J33j9J75l72K19
$$ plain form
3769 7 71 91 -33 36 52 -267 -124 -80 -96 -162 -122 -146 -45 -18 153 8 202 -87 158 168 -35 -88 46 45 239
3794 239 39 -45 34 232 -19 21 39 -64 53 105 -143 101 -77 -265 90 107 27 -49 -30 -157 38 -6 62 132
3818 132 -79 -133 -191 24 -61 -68 -89 -49 -178 38 177 187 179 36 307 119 190 229 173 179 -161 61 -66 13 -132
3843 -132 -200 10 -91 -25 -25 57 95 85 20 108 143 108 -38 19 27 -75 -156 -129 178 32 -186 105 197 28 -135 26
3869 26 209 113 -124 77 79 134 180 -39 53 -35 -423 -206 3 14 139 43 114 51 113 283 332 168 -10 -199 17
3894 17 62 -145 -52 -152 -121 -114 -84 132 -61 42 -58 5 -82 -307 26 -84 -77 -198 -264 80 52 128 5 31 99
3919 99 193 125 263 364 109 111 293 224 -126 -32 -247 -250 -91 -276 -207 -237 -14 -80 -96 -109 45 150 199 266 -139
3944 -139 20 200 -95 -17 -41 157 98 120 84 122 381 86 -93 342 73 -59 2 -169 62 -78 -59 -9 5
$$ packed form
3769GO4K0j24O9J6l19J43M4j6o6M0k4J01K7J71j45J94k89K45J0k03n3J34jJ94
3794B39k00q4P9J98k51M0J8j03J17N2k48K44j78j88L55J7q0p6J9j27J95m4O8P0
3818A32k11n4n8K15q5pk1M0j29K16J39J0qj43K71j88P1L9n6Ol40K22j27P9j45
3843a32o8K10j01O6%Q2L8j0o5Q8L5l5j46N7Qj02q1K7L07j46k18K91R2j69j63J61
3869B6J83r6k37K01KN5M6k19R2q8l88K17K09J1J25r6P1o3O2J70M9j64j78j89K16
3894A7M5k07R3j00L1PL0K16j93J03j00O3q7k25L33j10Pj21o6L44k8P6j23K6O8
3919I9R4o8J38J01k55KJ82o9l50R4k15lJ59j85O9l0K23o6j6j3J54J05M9O7m05
3944a39J59J80k95P8k4J98n9K2l6L8K59k95j79M35k69j32O1j71K31j40J9N0J4
$$ plain form
3967 5 -183 -189 -243 -20 -251 -142 -6 -94 -307 -169 22 120 125 18 193 43 76 -89 -33 -48 178 -45 271 229
3991 229 171 216 192 35 97 -50 -183 -173 -284 -280 -289 -31 -75 -232 -81 83 -47 55 52 165 131 -51 314 116
4015 116 130 -43 78 -53 142 -101 49 -76 167 -119 1 217 65 58 80 32 282 -287 -25 167 26 -11
4037 -11 -151 171 -104 -207 -44 -73 -12 -92 149 142 82 -45 -224 31 188 -93 -63 223 -46 72 -75 62 212
4060 212 2 -214 -175 56 -320 -172 -12 -87 -237 -264 -78 157 42 -165 126 74 63 -64 105 27 -41 268
4082 268 -114 -76 -192 100 23 74 47 47 110 26 -100 -27 -128 94 -158 -222 123 32 -8 41 -118 49 80 -159 60
4107 60 165 -123 89 -55 15 167 26 50 -18 -208 -94 57 118 137 293 -50 -14 76 13 -19 -123 -93 -53 -37
4131 -37 4 175 95 57 273 -138 24 -81 -32 195 -51 93 113 -150 60 146 -26 140 -142 -149 34 -22 8 -68
$$ packed form
3967Ej88on4K23k31J09J36q8k13J38J91R8Nj07J75j50L3j65N6j5K26k23L16m2
3991B29n8M5k4j57O2j47j33J0j11MrK58m4j57J51J64j30J02lJ13l4j82L65j98
4015A16J4j73J21j31J95k43J50j25K43k86J20K16j52pK2m8K50n69K62J92j41l7
4037a1j40L22k75j03J63k9O1q0K41po0j27j79K55J57k81L0K86k69J18j47J37J50
4060B12k10k16L9K31l76J48J60p5j50k7J86K35j15k07K91n2j1j27J69p8o8L09
4082B68l82L8j16K92p7N1k7%O3q4j26P3j01K22k52o4L45r1m0M9j59J67L1k39K19
4107F0J05k88K12j44P0J52j41K4o8j90J14J51O1J9J56l43L6R0o3l2j04L0M0J6
4131c7M1J71q0l8K16m11J62j05M9K27k46J44K0k63K10Q6j72J66k82pJ83n6L0p6
$$ plain form
4155 -68 -87 43 -224 -67 -92 97 -155 100 -61 -132 -172 35 -243 141 -39 -54 267 -51 113 -151 115 74
4177 74 11 -209 22 -222 -136 -46 66 10 -7 29 173 140 145 -8 184 189 -50 -128 -64 116 89 26 94 -168 -8 120
4203 120 16 62 136 88 117 -104 -96 -164 -58 111 115 -258 16 163 -102 -88 -56 108 73 -196 -215 -230 -31 156 -33
4228 -33 324 128 158 -97 213 92 -242 -213 -174 -54 -107 -20 15 41 -162 198 1 -17 18 -23 -176 -128 152 -173
4252 -173 -61 -220 -129 -411 -144 63 -303 6 76 274 -162 -66 29 397 -56 -19 11 312 -159 9 233 -38
4274 -38 -14 -228 12 43 -140 18 144 40 191 -10 -100 231 -115 -256 35 -217 -245 -72 -275 -108 -157 -134
4296 -134 55 77 -262 193 374 130 106 -207 74 60 -72 -142 -78 54 -27 95 49 158 -32 -226 222 -15
4318 -15 -211 -251 121 77 -74 -62 -30 0 -320 -50 -271 -123 -88 -267 -297 142 -128 -242 -95 123 388 157 214
$$ packed form
4155f8j9J30k67J57k5J89k52K55j61p1m0K07k78L84j80j5L21l18J64k64K66m1
4177G4o3k20K31k44Q6R0J12n6j7L6J44l3Nj53J92Nk39p8O4J80k7o3O8k62J60J28
4203A20j04M6P4m8K9k21Qo8J06J69Ml73K74J47k65J4L2J64l5k69j9j5J99J87j89
4228c3L57j96L0k55L10j21l34K9L9J20n3Q7L5K6k03L60j97j8L5m1j53M8K80l25
4252a73J12j59R1k82K67K07l66L09P0J98m36R6R5L68m53L7L0L01m71J68K24k71
4274c8K4k14K40L1j83J58J26j04J51k01r0L31l46j41K91k52k8J73k03J67m9K3
4296a34J89K2l39M55J81k44k4l13K81j4j32p0O4J32q1J22m6J09j90j94M48k37
4318a5j96m0L72m4j51J2L2L0l20K70k21J48L5j79l0M39k70j14J47K18K65k31N7
$$ plain form
4341 214 593 158 29 -130 -42 113 -314 136 286 134 160 375 385 192 14 32 -58 -98 -226 -110 -227 -373
4363 -373 -89 -191 -213 47 -63 0 3 -96 64 25 -3 267 52 -179 244 67 285 -78 73 91 -19 -83 73
4386 73 35 -134 246 32 187 63 72 -20 252 -226 -134 -130 -120 -212 -328 -293 67 127 78 185 68 117 157 -193 69
4411 69 178 -341 -61 152 -359 14 -16 36 16 -212 -60 266 -18 24 -24 -32 95 -193 -112 -128 -108 -223 -31 61
4435 61 -16 -249 -69 173 -53 13 266 468 316 220 77 154 104 -116 -32 163 -102 -416 -25 93 49 -356 155
4458 155 75 131 -203 193 57 -87 -126 -156 -159 -157 -268 -422 -298 -135 -16 -259 83 174 40 79 239 121 349
4481 349 109 208 274 -60 -307 142 -18 -135 -66 241 326 181 104 170 132 -157 -178 4 -185 10 -131 -29 -101
4504 -101 -175 -230 -44 20 -16 -390 -238 29 -149 -96 135 -30 -74 123 -204 197 -5 -280 120 102 -286 78
$$ packed form
4341B14L79m35j29j59Q8J55m27M50J50j52K6K15J0j93j78J8r0m0j28J16j17j46
4363c73K84j02k2K60j10O3Lr9J60l9k8K70k15k31M23j77K18l63J51J8j10o4J56
4386G3l8j69L80k14J55j24Rr2K72m78R2MJ0r2j16L5L60O0m9J07j17M9M0l50K62
4411F9J09n19K80K13n11L73l0N2k0k28J52L26k84M2m8qJ27k88Q1j6K0j15J92R2
4435F1p7k33J80K42k26O6K53K02j52r6j43P7n0k20Q4J95k65l14L91J18m4m05N11
4458A55q0N6l34L96j36j44l9l0lKj11j54J24J63J19k43L42R1j34L9J60j18K28
4481C49k40R9O6l34k47M49j60j17O9L07Q5j45p7O6l8k89k1J82j89J95j41J02p2
4504a01p4n5J86O4l6l74J52K67j78N3K31j65m4J97l27M01k02k75M00j8l88L64
$$ plain form
4526 78 133 50 1 -186 170 183 60 9 -128 77 45 -310 -209 133 1 -50 19 113 92 -94 -201 -167 -179 -352
4550 -352 -294 -114 -173 -167 148 296 447 27 173 242 -89 -156 -131 46 -152 -229 -218 -16 170 211 244 172 333 268
4574 268 145 155 6 -247 -131 -298 -105 -52 -273 -11 222 -159 -64 170 -35 -194 -230 -126 144 84 102 268
4596 268 80 51 219 113 24 33 -78 83 5 18 -19 19 63 -104 -90 142 110 24 118 106 -158 10 -324 -196 -63
4621 -63 56 143 -67 -35 4 -101 27 -81 -85 -485 85 127 -260 17 135 399 80 -117 144 220 -21 -2 -118
4644 -118 -202 -29 -270 -232 118 133 -90 185 95 -51 -37 -99 115 8 -197 -201 -278 -193 -393 44 111 237 -117 70
4668 70 151 16 -148 -14 -56 22 -162 14 236 58 -88 40 3 -99 -25 -226 109 -24 -62 136 183 -42 57
4691 57 -30 185 427 -56 -33 110 -19 -159 -81 -53 -59 -136 -248 53 -9 -64 292 256 102 -117 -333 98 24 -353
$$ packed form
4526G8N5q3m9j87L56J3j23n1j37K05l2l55J01L42j32n1O9R4k1j86j07L4j2j73
4550c52N8J80n9OL15J48J51m20J46O9l31o7K5J77j98p7J1K02J86M1L3p2J61o5
4574B68j23J0j49k53J16j67J93N3k21K62K33l81R5K34k05j59l6J04K70o0J8J66
4596B68j88k9J68j06q9Rj11J61p8J3l7L8M4j67J4K32l2q6R4j2k64J68l34J28J33
4621f3J19Q7k10L2L9j05J28j08mm00N70M2l87K77J18K64l19j97K61P6k41J9j16
4644a18q4J73k41L8L50J5k23K75r0j46J4o2K14j07k05mp7Q5k00M37O7J26l54J87
4668G0Q1j35j64J34m2P8j84J76K22j78j46J28l7j02P4k01L35j33l8J98M7k25R9
4691E7q7K15K42m83K3J43j29j40P8K8op7j12L01o2n5L56l6j54k19k16M31p4l77
$$ plain form
4715 -353 -41 -241 17 -223 -155 127 217 -161 -197 -7 191 128 49 19 -37 -140 -69 18 -47 37 77 96 158 119 -221
4740 -221 189 -69 -107 -157 -273 -10 -110 -11 78 474 154 171 5 137 12 -335 -177 -13 -48 -8 -58 78 119
4763 119 -109 240 152 -12 168 74 113 10 -305 2 184 -16 -171 -87 108 139 -118 -61 191 146 -227 -137 90
4786 90 -4 52 108 54 139 28 -218 -31 -198 -241 -169 -87 54 -83 -106 243 265 82 76 146 31 -168 -297 -170 -223
4811 -223 -514 -57 -84 -131 -74 169 242 339 3 100 58 -197 -271 -403 5 -63 -140 -120 202 171 70 248 73 58
4835 58 160 11 51 -1 -309 -426 -272 -11 39 -32 51 244 23 -119 174 39 -143 -139 -114 -64 -147 -272 -103 -45
4859 -45 124 -189 78 70 103 -94 29 118 -51 44 -63 -149 76 -4 123 76 -73 -233 -4 186 -35 -67 51
4882 51 256 -147 -25 99 63 -130 -6 -195 149 -196 -88 1 -43 141 51 3 192 -32 105 -115 41 107
$$ packed form
4715c53L12k00K58k40O8K82R0l78l6J90J98o3p9l0n6j03P1Q7o5Q4M0J9O2l9l40
4740b21M10k58l8n0j16K63j00R9Q9L96l20J7j66J32j25l47J58J64l5M0n0J36M1
4763A19k28L49q8j64J80r4L9j03l15L07J82k00j55Q4J95L1k57N7K52m5l73R0K27
4786I0r4N6N6n4Q5j11k46J87j67m3P2Q2J41j37k3L49K2j83oP0j15j99j29J27n3
4811b23k91M57k7m7N7K43P3R7l36R7m2k55p4j32M08o8p7K0L22l1j01J78j75j5
4835E8J02j49M0n2l08j17J54K61N0p1Q3J93k21j42K93j35j82MK5N0q3j25J69N8
4859d5J69l13K67qL3j97J23Q9j69R5j07q6K25q0J27m7j49j60K29J90k21l2J18
4882E1K05m03J22J24l6j93J24j89L44l45J08Q9m4J84r0m8J89k24J37k20J56O6
$$ plain form
4904 107 -334 -204 -189 7 -59 8 281 17 166 17 -39 39 -97 -90 1 -257 -222 -8 -154 -4 -173 -86 297
4927 297 329 21 112 248 -30 -74 36 -106 -227 -301 -376 58 32 -103 -24 383 58 95 -119 16 24 -209 -227 -260
4951 -260 -93 -253 60 13 380 -214 22 218 72 -66 7 215 77 -157 -63 242 95 -220 -277 -116 169
4972 169 146 -158 197 -4 -189 -269 216 291 -36 -94 -19 292 -92 -91 -233 -44 -85 -317 -268 70 -77 -272 60
4995 60 153 28 52 94 353 -94 -206 134 102 -6 -89 -111 133 162 26 -97 137 -7 -235 -227 19 59 -328 -128
5019 -128 250 200 13 103 227 43 24 -118 140 -136 -55 -16 93 -33 -52 -200 272 229 -24 64 345 -32 -66
5042 -66 -269 27 0 -6 -211 161 191 19 -27 2 203 78 -287 167 -72 -211 -23 175 -84 78 -135 68
5064 68 -42 51 -161 -238 -49 -19 -335 -332 121 -196 -393 174 194 0 52 8 407 148 -262 5 96 -95 -59 134
$$ packed form
4904A07m41J30J5J96o6O7K73k64J49j49n6P8j36PR1k58L5K14j46J50j69Q7L83
4927B97L2l08R1J36k78m4J10j42j21p4p5M34k6j35P9M07l25L7k14J35Qk33j8l3
4951b60J67j60L13m7L67n94K36J96j46j38P3K08j38k34R4L05j47l15n7J61K85
4972A69k3l04L55k01j85q0M85P5l27n8P5L11l84Jj42J89m1k32M9L38j47j95L32
4995F0R3j25K4M2K59m47j12L40l2j08q3k2K44K9j36j23K34j44k28QK46M0l87K00
5019a28L78n0j87R0J24j84j9j42K58k76Q1L9J09j26j9j48M72m3k53Q8K81l77l4
5042f6k03K96k7ok05L72L0j72m6K9K01j25l65M54k39j39J88J98k59J62k13K03
5064F8j10R3k12p7J89L0l16LM53l17j97N67K0j94N2m4L99k59m10K67R1j91L6J93
$$ plain form
5088 134 349 84 7 126 234 61 -77 120 51 -46 -431 -338 -90 -40 -271 -79 95 41 -97 75 254 97
5110 97 -171 -45 81 -387 -216 -269 -100 -102 -523 -96 23 124 52 -75 148 158 -166 42 187 61 -140 177
5132 177 101 192 101 -52 204 52 -292 -240 128 192 56 -28 86 8 -194 -38 43 -67 53 -447 -203 -190 -164
5155 -164 -145 303 65 44 4 -136 264 23 51 -111 45 -235 -220 22 127 106 31 354 299 177 138 318 69
5178 69 -154 -249 -96 -133 -220 -61 45 78 108 -39 226 247 89 -33 20 -151 -289 -296 -376 -43 -12 -181 241 351
5202 351 100 -23 462 23 167 -126 -199 119 -297 -237 -63 52 23 -36 74 163 180 -60 -40 67 -172 -314
5224 -314 -157 -32 -46 -162 94 68 -88 -180 -104 99 192 -107 -40 235 -82 21 129 -189 -15 27 125 198 152
5247 152 -20 71 160 56 49 -58 210 101 -186 207 89 181 -174 -375 -109 -131 -407 -314 303 21 169 -84
$$ packed form
5088A34K15k65p7J19J08j73j38J97o9r7l85R3K48N0k31J92J74n4j38J72J79j57
5110I7k68J26J26m68J71n3J69km21M27J19J01p2j27K23J0l24K08J45j26k01L17
5132A77p6R1r1j53K56j52l44N2L68O4j36q4J14p8k02J56Q1j10J20n00K44J3K6
5155a64J9M48k38k1m0j40M00k41K8j62J56k80J5K42J05k1p5L23n5j22l9J80k49
5178F9k23r5J53l7q7J59J06L3L0j47K65K1j58j22N3j71j38pq0L33L1j69M22J10
5202C51k51j23M85m39J44k93p3L18m16O0J74J15k9n9J10Q9J7k40K0J07k39j42
5224c14J57J25j4j16K56k6j56r2P6K03R3k99O7K75l17J03J08l18J74M2R8P3m6
5247A52j72R1Q9j04pj07K68j09k87L93j18R2l55k01K66k2k76R3O17k82J48k53
$$ plain form
5269 -84 20 123 -105 -5 123 -90 -32 -343 22 -248 -38 24 -24 204 152 287 96 261 180 64 -55 134
5291 134 -156 -90 76 187 2 198 -8 259 69 67 90 195 -314 -219 -343 65 -95 -37 124 -178 199 167
5313 167 225 -104 -47 -299 -25 127 -184 -115 54 98 -74 0 98 216 -336 -54 184 -91 99 -71 87 320
5335 320 7 -290 172 280 189 92 -218 319 1 -199 -82 245 -72 -100 -174 86 321 76 181 60 -118
5356 -118 -82 -40 -57 -179 3 -147 105 36 3 77 354 143 -22 -63 5 -63 -140 50 195 59 -71 -39 89 371
5380 371 -42 -5 187 39 -213 35 -4 -13 -208 -293 18 -70 32 -112 -19 -79 -142 -354 52 -113 -168 3 16 82
5404 82 98 -151 -59 259 -145 58 403 98 126 -79 46 154 -53 -283 90 -20 -171 -275 19 285 41
5425 41 -203 -81 2 -209 -166 -175 142 -5 -197 236 255 -32 28 86 300 189 -17 -59 270 -195 -179 149 317
$$ packed form
5269h4J04J03k28J00J28k13N8l11L65k70K10O2m8K28n2J35j91J65q1j16j19J89
5291A34k90O6J66J11j85J96k06K67j90kK3J05n09R5j24M08j60N8J61l02L77l2
5313A67N8l29N7k52K74J52l11O9J69M4j72P4R8J18n52K82K38k75J90j70J58K33
5335C20l13k97M62J08r1r7l10N37l18k00J17L27l17k8p4K60K35k45J05j21j78
5356a18L6M2j7j22J82j50K52o9l3P4K77k11j65m1O8o8p7J90J45j36j30L2J28K82
5380C71m13L7J92j48k52K48l9rj95q5L11q8J02j44R3o0o3k12M06j65n5J71J3O6
5404H2J6k49R2L18m04K03L45l05K8k05J25J08k07k30L73j10j51j04K94K66k44
5425D1k44J22Q3k11M3rL17j47j92M33J9k87O0N8K14j11k06m2L29m65J6L28J68
$$ plain form
5448 317 116 -1 113 201 134 -192 -29 -100 -233 -324 -112 151 94 -284 111 180 -5 -56 93 31 152 -68 -146
5471 -146 220 -82 -157 -45 138 186 131 -270 213 -12 -489 -6 -92 -174 -22 71 50 190 -62 94 310 -5
5493 -5 76 122 177 11 -190 -131 6 63 -144 130 73 -10 157 -32 162 236 -239 -113 43 -27 -95 -156 -71 68 -34
5518 -34 18 133 -10 -100 -203 -197 31 9 -143 223 229 189 -9 153 303 -137 -328 -95 -25 -117 -195 20 74 89 -32
5543 -32 239 222 129 -1 145 19 -236 -558 -296 126 -328 170 -137 116 254 19 137 176 185 -66 125 107
5565 107 -115 -342 -196 125 -53 -37 77 30 -12 -156 126 -79 65 -163 -232 314 -81 -87 122 -70 180 -172
5587 -172 -264 85 -117 -216 26 -9 86 40 33 198 184 -54 132 107 90 48 -54 -176 77 -289 -160 132 -1 0
5611 0 -50 32 -145 -81 -200 -100 -53 -273 -101 -168 44 -113 -56 254 334 -10 30 253 99 -49 63 28 203 -196
$$ packed form
5448C17k01j17J14Q8o7l26J63p1j33r1K12K63n7l78L95O9j85n1J49o2J21k20p8
5471a46L66l02p5J12J83M8n5m01M83k25m77M83q6q2J52R3k1J40k52J56K16l15
5493eQ1M6N5j66k01N9J37N7k07K74n7q3J67j89J94P4m75J26J56p0o8o1Q5J39j02
5518c4N2J15j43r0j03OK28k2j52L66Om0j98J62J50m40j91K33P0r2p8K15N4J5j21
5543c2K71j7r3j30J46j26k55l22K62M22m54M98l07K53J38k35J18L9Rk51J91j8
5565A07k22k27J46L21j78J6J14m7m2j44K82k05J44k28o9N46l95oK09j92K50l52
5587a72r2L49k02r9K42l5R5m6pJ65j4k38J86k5j7m2j02j22K53l66J29K92j33J
5611@n0Q2j77O4j19J00M7k20J72o7K12j57N7L10Q0l44M0K23j54j48J12l5J75l99
$$ plain form
5635 -196 -153 -21 -29 129 155 148 161 -212 -161 -39 24 -45 -76 15 188 94 53 72 6 -22 90 -5 -216 -287 -90 -74 57
5662 57 3 -70 143 56 110 -29 -145 209 42 -157 97 140 1 -196 21 287 -121 -86 -64 -69 21 -122 -97 63
$$ packed form
5635a96M3J32qJ58K6pJ3l73N1J22O3o9l1R1J73r4m1J9o6k8J12r5k11p1J97J6J31
5662E7n4p3K13q7N4j39j16L54j67j99K54M3j39j97K17K66m08L5K2nR0j43K5J60
$$ [...]
8191a59
##END NTUPLES=NMR FID
##END=
