##TITLE=1H_108-2025-Bay
 200.13MHz, CDCl3,
 8 sc
 
 5.9.2025
##JCAMPDX= 6.0         $$ Bruker NMR JCAMP-DX V2.0
##DATA TYPE= NMR FID
##DATA CLASS= NTUPLES
##ORIGIN= UXNMR, Bruker Analytische Messtechnik GmbH
##OWNER= pz
$$ XWIN-NMR		Version 3.5
$$ Fri Sep  5 14:12:23 2025 Russian Standard Time (UT+4h)  she@DPX200
##.OBSERVE FREQUENCY= 200.1313
##.OBSERVE NUCLEUS= ^1H
##.DELAY= (6, 6)
##.ACQUISITION MODE= SIMULTANEOUS
##.ACQUISITION SCHEME= undefined
##.AVERAGES= 8
##.DIGITISER RES= 18
##SPECTROMETER/DATA SYSTEM= spect
##.PULSE SEQUENCE= zg30
##.SOLVENT NAME= CDCl3
##.SHIFT REFERENCE= (INTERNAL, CDCl3, 0, 14.3821)
##AUDIT TRAIL= $$ (NUMBER, WHEN, WHO, WHERE, WHAT)
$$ ##TITLE= Audit trail, XWIN-NMR		Version 3.5
$$ ##JCAMPDX= 5.01
$$ ##ORIGIN= Bruker BioSpin GmbH
$$ ##OWNER= she
$$ F:/spectra/data/she/nmr/H-C/1/audita.txt
$$ ##AUDIT TRAIL=  $$ (NUMBER, WHEN, WHO, WHERE, WHAT)
(   1,<2025-09-05 14:10:41.42 +0400>,<she>,<DPX200>,
      <created by zg, POWCHK disabled, PULCHK disabled
       configuration hash MD5:
       00 E9 B6 7A A2 85 ED C7 34 08 36 98 17 FE 4E 26
       data hash MD5: 16K
       EC 1A D0 EE 4B 9E 27 7B 52 26 AC 7A AF EE D7 69>)
$$ ##END=
$$ 
$$ hash MD5
$$ CE 55 58 E3 F7 E2 CC 5B 31 1D 60 74 0E 60 C8 B2
##$RELAX= 
##$RELAX= 
##$RELAX= 
##$RELAX= 
##$RELAX= 
##$RELAX= 
$$ Bruker specific parameters
$$ --------------------------
##$DU= <F:/spectra>
##$EXPNO= 1
##$NAME= <H-C>
##$PROCNO= 1
##$TYPE= <nmr>
##$USER= <she>
##$AMP= (0..31)
100 100 100 100 100 100 100 100 100 100 100 100 100 100 100 100 100 100 
100 100 100 100 100 100 100 100 100 100 100 100 100 100 
##$AQSEQ= 0
##$AQ_mod= 1
##$AUNM= <au_zg>
##$AUTOPOS= <>
##$BF1= 200.13
##$BF2= 200.13
##$BF3= 200.13
##$BF4= 200.13
##$BF5= 200.13
##$BF6= 200.13
##$BF7= 200.13
##$BF8= 200.13
##$BYTORDA= 1
##$CFDGTYP= 0
##$CFRGTYP= 5
##$CHEMSTR= <none>
##$CNST= (0..31)
1 1 145 1 1 1 1 1 1 1 1 1 1 1 1 1 1 1 1 1 1 1 1 1 1 1 1 1 1 1 1 1 
##$CPDPRG= <>
##$CPDPRG1= <>
##$CPDPRG2= <>
##$CPDPRG3= <>
##$CPDPRG4= <mlev>
##$CPDPRG5= <mlev>
##$CPDPRG6= <mlev>
##$CPDPRG7= <mlev>
##$CPDPRG8= <mlev>
##$CPDPRGB= <>
##$CPDPRGT= <>
##$D= (0..31)
0 0.7 0 0 0 0 0 0 0 0 0 0.03 0 0 0 0 0 0 0 0 0 0 0 0 0 0 0 0 0 0 0 0 
##$DATE= 1757067040
##$DBL= (0..7)
120 120 120 120 120 120 120 120 
##$DBP= (0..7)
150 150 150 150 150 150 150 150 
##$DBP07= 0
##$DBPNAM0= <>
##$DBPNAM1= <>
##$DBPNAM2= <>
##$DBPNAM3= <>
##$DBPNAM4= <>
##$DBPNAM5= <>
##$DBPNAM6= <>
##$DBPNAM7= <>
##$DBPOAL= (0..7)
0.5 0.5 0.5 0.5 0.5 0.5 0.5 0.5 
##$DBPOFFS= (0..7)
0 0 0 0 0 0 0 0 
##$DE= 6
##$DECBNUC= <off>
##$DECIM= 32
##$DECNUC= <off>
##$DECSTAT= 4
##$DIGMOD= 1
##$DIGTYP= 9
##$DL= (0..7)
0 120 120 120 120 120 120 120 
##$DP= (0..7)
150 150 150 150 150 150 150 150 
##$DP07= 0
##$DPNAME0= <>
##$DPNAME1= <>
##$DPNAME2= <>
##$DPNAME3= <>
##$DPNAME4= <>
##$DPNAME5= <>
##$DPNAME6= <>
##$DPNAME7= <>
##$DPOAL= (0..7)
0.5 0.5 0.5 0.5 0.5 0.5 0.5 0.5 
##$DPOFFS= (0..7)
0 0 0 0 0 0 0 0 
##$DQDMODE= 0
##$DR= 18
##$DS= 0
##$DSLIST= <SSSSSSSSSSSSSSS>
$$ [...]
##$SUBNAM0= <"">
##$SUBNAM1= <"">
##$SUBNAM2= <"">
##$SUBNAM3= <"">
##$SUBNAM4= <"">
##$SUBNAM5= <"">
##$SUBNAM6= <"">
##$SUBNAM7= <"">
##$SUBNAM8= <"">
##$SUBNAM9= <"">
##$SW= 18.0517328524113
##$SWIBOX= (0..15)
0 0 2 0 0 0 0 0 0 0 0 0 0 0 0 0 
##$SW_h= 3612.71676300578
##$TD= 16384
##$TD0= 1
##$TE= 0
##$TE2= 300
##$TE3= 300
##$TEG= 300
##$TL= (0..7)
0 120 120 120 120 120 120 120 
##$TP= (0..7)
150 150 150 150 150 150 150 150 
##$TP07= 0
##$TPNAME0= <>
##$TPNAME1= <>
##$TPNAME2= <>
##$TPNAME3= <>
##$TPNAME4= <>
##$TPNAME5= <>
##$TPNAME6= <>
##$TPNAME7= <>
##$TPOAL= (0..7)
0.5 0.5 0.5 0.5 0.5 0.5 0.5 0.5 
##$TPOFFS= (0..7)
0 0 0 0 0 0 0 0 
##$TUNHIN= 0
##$TUNHOUT= 0
##$TUNXOUT= 0
##$USERA1= <user>
##$USERA2= <user>
##$USERA3= <user>
##$USERA4= <user>
##$USERA5= <user>
##$V9= 5
##$VALIST= <valist>
##$VCLIST= <CCCCCCCCCCCCCCC>
##$VD= 0
##$VDLIST= <DDDDDDDDDDDDDDD>
##$VPLIST= <PPPPPPPPPPPPPPP>
##$VTLIST= <TTTTTTTTTTTTTTT>
##$WBST= 1024
##$WBSW= 4
##$XGAIN= (0..3)
0 0 0 0 
##$XL= 0
##$YL= 0
##$YMAX_a= 190352
##$YMIN_a= -428738
##$ZGOPTNS= <>
##$ZL1= 120
##$ZL2= 120
##$ZL3= 120
##$ZL4= 120
##$ABSF1= 10
##$ABSF2= 0
##$ABSG= 5
##$ABSL= 3
##$ALPHA= 0
##$AQORDER= 0
##$ASSFAC= 0
##$ASSFACI= 0
##$ASSFACX= 0
##$ASSWID= 0
##$AUNMP= <proc_1d>
##$AZFE= 0.1
##$AZFW= 0.1
##$BCFW= 1
##$BC_mod= 2
##$BYTORDP= 1
##$COROFFS= 0
##$CY= -3
##$DATMOD= 1
##$DC= 2
##$DFILT= <>
##$DTYPP= 0
##$F1P= 0
##$F2P= 0
##$FCOR= 0.5
##$FTSIZE= 0
##$FT_mod= 4
##$GAMMA= 1
##$GB= 0.15
##$INTBC= 1
##$INTSCL= 1
##$ISEN= 128
##$LB= 0.25
##$LEV0= 0
##$LPBIN= 0
##$MAXI= 10000
##$MC2= 0
##$MEAN= 0
##$ME_mod= 0
##$MI= 1.114404
##$NCOEF= 0
##$NC_proc= 0
##$NLEV= 6
##$NOISF1= 3.799351
##$NOISF2= 2.8
##$NSP= 1
##$NTH_PI= 0
##$NZP= 0
##$OFFSET= 14.38212
##$PC= 1
##$PHC0= -1559.924
##$PHC1= 9.19228
##$PH_mod= 1
##$PKNL= yes
##$PPARMOD= 0
##$PSCAL= 0
##$PSIGN= 0
##$REVERSE= no
##$SF= 200.129724274929
##$SI= 16384
##$SIGF1= 3
##$SIGF2= 2
##$SINO= 400
##$SIOLD= 16384
##$SREGLST= <1H.CDCl3>
##$SSB= 0
##$STSI= 0
##$STSR= 0
##$SW_p= 3205.1282051282
##$SYMM= 0
##$S_DEV= 0
##$TDeff= 0
##$TDoff= 0
##$TI= <>
##$TILT= no
##$TM1= 0
##$TM2= 0
##$TOPLEV= 0
##$USERP1= <user>
##$USERP2= <user>
##$USERP3= <user>
##$USERP4= <user>
##$USERP5= <user>
##$WDW= 1
##$XDIM= 8192
##$YMAX_p= 0
##$YMIN_p= 0
$$ End of Bruker specific parameters
$$ ---------------------------------
##NTUPLES= NMR FID
##VAR_NAME=  TIME,          FID/REAL,        FID/IMAG
##SYMBOL=    X,             R,               I
##VAR_TYPE=  INDEPENDENT,   DEPENDENT,       DEPENDENT
##VAR_FORM=  AFFN,          ASDF,            ASDF
##VAR_DIM=   8192,          8192,            8192
##UNITS=     SECONDS,       ARBITRARY UNITS, ARBITRARY UNITS
##FACTOR=    0.0002768,     1,               1
##FIRST=     0,             0,               0
##LAST=      2.2672688,     0,               0
##MIN=       0,             -428738,         0
##MAX=       2.2672688,     190352,          0
$$ Real data points
##PAGE= N=1
##DATA TABLE= (X++(R..R)), XYDATA
0 0 0 0 0 0 0 0 0 0 0 0 0 0 5 -8 8 -8 8 -16 16 -16 24 -24 32 -39 43 -48 58 -68 77 -90 101 -117 132 -149 170
35 170 -190 214 -239 267 -296 331 -367 408 -451 499 -550 608 -672 738 -814 897 -989 1089
53 1089 -1203 1329 -1471 1635 -1824 2042 -2302 2614 -2999 3487 -4130 5018 -6329 8464 -12555
68 -12555 23271 -116579 -266604 -142652 -92384 43797 143302 90031 -7374 43914 158463
79 158463 186766 48562 -50790 -61610 -85839 -57264 52709 71682 -4636 -96043 -75925 73111
91 73111 145836 87357 51744 36755 33051 50658 60704 51783 -55073 -226118 -218896 -63120
103 -63120 19680 10163 -6472 20918 49326 35048 77037 112380 -16855 -159180 -143359 -32283
115 -32283 65177 52765 -8120 2263 9638 -7868 29937 60136 3907 -108181 -138452 2641
127 2641 115614 66702 24896 39265 35318 38956 66250 97507 49863 -100268 -157063 -65555
139 -65555 -5068 -22830 -59596 -59429 -1615 40020 80909 150484 115391 -23218 -103964 -77803
151 -77803 -16873 -35875 -107771 -90123 -39786 -27768 39316 115876 92371 3207 -55531 -5806
163 -5806 77554 66878 29213 24404 14101 16903 31703 44904 33459 -63711 -135870 -63270 23515
176 23515 30178 7151 -10937 -10872 -23334 -26096 31142 30981 -63013 -94150 -32973 37904 59139
189 59139 19508 -319 -1896 -37824 -26958 33328 38175 -12240 -60098 -25795 68573 73598 22348
202 22348 28457 28927 615 5437 44303 62701 -11021 -101359 -70609 -8988 -17048 -32358 -28481
215 -28481 -10125 6772 8978 55682 95270 23659 -60574 -57573 -10762 10710 -23365 -36670
227 -36670 3242 -3456 -19919 32280 61574 16725 -43218 -47685 16564 43086 7828 7828 16535
240 16535 -6321 -10504 7529 31973 20971 -40924 -42848 19855 33109 5282 -14843 -23321 -28933
253 -28933 -47574 -24313 39228 30302 -10956 10716 49434 59076 32793 -4161 -13393 -39322 -72131
266 -72131 -41023 -6 -5966 -24039 -22716 21347 53665 22799 12021 30393 6998 -18526
278 -18526 -5226 21637 17222 -34855 -46259 6227 16101 -5076 6237 18563 11844 -10060 -15097
291 -15097 18022 8878 -46310 -49678 -10685 14751 15544 10760 39827 52039 4587 -6508 23707
304 23707 6338 -41728 -62220 -33700 177 -16824 -18503 27595 35406 12381 14506 30588 37279
317 37279 2646 -35448 -14154 -103 -30064 -37956 -15947 6066 5318 -3052 33069 62151 23531
330 23531 -2902 9256 2587 -24067 -46037 -33694 -5672 -15283 -14720 26496 42227 27886 13375
343 13375 5500 7304 -18435 -50630 -30399 -9508 -21514 -16980 7749 31455 29238 8753 25601
356 25601 37466 -1734 -19772 -1710 2869 -8737 -22459 -10047 14088 -355 -8400 18935
368 18935 24766 6546 -6576 56 21538 4251 -30586 -16427 -866 -19370 -25478 -8396 9457
381 9457 -4044 -30248 -3873 29791 8643 -10477 -1606 7212 4233 -9983 2120 28052 7809
394 7809 -14784 7786 33962 32715 6906 -6531 9947 -2249 -33048 -18915 -675 -16306
406 -16306 -29574 -11358 32155 44959 16227 12773 21087 -1114 -21676 -25549 -25209 -33265 -55441
419 -55441 -41491 10209 28553 19600 21012 25945 24647 7180 -3391 7858 -12517 -47625 -33018
432 -33018 2134 17549 16264 12905 26037 27937 10680 17994 25338 -1364 -25635 -26475 -4273
445 -4273 15338 -95 -8975 5102 -1270 -10302 -356 7029 -4178 -34728 -38544 755 12566
458 12566 -6392 -5409 -435 -4612 -7041 1343 23261 16416 -19151 -16829 13236 22855 12335 -4402
472 -4402 -4401 1242 -13117 -4561 28398 24141 -1594 -3971 20805 41895 21132 -6075 -2752 -13364
486 -13364 -34489 -25395 -7540 -6752 -25528 -35570 -1716 29397 17535 4255 1377 -5031 -11458
499 -11458 -14818 1683 13468 -14388 -26704 6100 29927 28165 12878 1093 -1673 -17099 -22196
512 -22196 2309 5473 -14797 -15278 5984 37067 44947 24031 15341 7484 -13872 -16433 -5676
525 -5676 -7108 -22885 -38739 -17860 18631 19394 10964 12759 3190 -6373 -3792 8600 14387 -13085
539 -13085 -36619 -20098 -3225 -4568 -9547 -16342 -15011 -16262 -13610 16073 33991 13382 -1252
552 -1252 9561 29228 32859 13657 7298 8243 -11216 -13083 11096 18192 1037 -19889 -13710 15216
566 15216 18066 2981 2015 -3851 -15937 -18104 -6829 9565 -3994 -35521 -28540 -2826 341
579 341 -9104 -16968 -18192 -21108 -26896 -3904 26212 19763 6617 16021 36457 48314 34968 17416
593 17416 12287 -4354 -17364 -4546 7682 3186 -13425 -18677 5340 19035 5680 391 -3071
606 -3071 -15893 -19109 -9998 3941 -46 -26226 -29630 -11107 -4914 -4244 -4044 -6587 -5562 -6503 5556
621 5556 28521 22442 142 -2644 6487 15867 13049 4721 8080 936 -12112 1697 17715 8937
635 8937 -8811 -17269 -3708 9335 1559 1110 5311 -6417 -12091 -2835 11310 14460 -7396 -19754
649 -19754 -2877 4572 -2875 -4770 -5064 -7400 -14653 -9890 17809 25329 4547 -1040 8062 12114
663 12114 5783 -7339 -9285 -11663 -25907 -20103 3183 9702 1536 -7464 30 16460 10693 392
677 392 4725 222 -10403 -7095 6080 16678 5203 -10706 68 12123 8371 8177 7427 2203
691 2203 -4017 -9543 1404 9853 -5063 -14585 -7755 1263 7330 4906 4609 6469 -7304 -14808 -2492
706 -2492 -1071 -12397 -20016 -15709 -1330 3092 1136 9759 9091 -3533 -3002 4601 9122 1872 -12226
721 -12226 -7273 4897 2920 3877 10712 10531 5037 -240 9403 22428 9170 -6697 -2571 642
735 642 -3261 -6332 -4147 2088 -5241 -13034 1335 10750 1231 -9289 -11896 -4609 -2572 -11048 -4817
750 -4817 4666 -2661 -6467 2770 12543 10417 -5937 -8651 3374 356 -5450 448 3549 166 -5288
765 -5288 -2263 12518 11865 -823 1388 7303 7119 4140 -172 2208 -878 -14523 -11393 1165 -411
780 -411 -4728 -3206 4376 10086 3238 1606 7085 -2277 -11365 -7090 -1823 809 -3405 -5366 5095
795 5095 7298 1687 4986 5818 -559 -7175 -9230 -408 2097 -8477 -6091 3198 2260 976 3551
810 3551 8111 7705 -3581 -4045 5926 1645 -6680 -5124 -917 3018 -785 -1945 7986 5981 -5220
825 -5220 -4268 1007 1140 -5674 -10411 -489 5667 -2512 364 9207 6667 -744 -4541 1530 6653 -3146
841 -3146 -6333 3451 4749 612 -349 2423 5979 -1984 -9619 -725 2265 -4890 -6042 -1853 2593
856 2593 -648 -7896 -1394 3036 -5708 -6235 622 3781 3186 -596 3355 9863 3231 -627 4345 3475
872 3475 -435 -3163 -1638 5325 2019 -3147 3847 6078 926 -524 441 2924 -1624 -9276 -3968
887 -3968 -1023 -8242 -7969 -3048 -1200 -2131 -6027 -2161 3858 -2819 -5212 1064 2792 1431 -228 3556
903 3556 11910 7484 1223 8131 9415 2556 -817 436 4796 1468 -5652 949 5863 -1639 -5068
918 -5068 -2887 27 -1450 -9148 -6428 1690 -3399 -7398 -1959 1357 -342 -7241 -7907 1497 -1277
933 -1277 -7631 -1098 3921 2806 516 1331 8639 7603 -1653 943 5979 2757 579 821 5202 7733
949 7733 1109 2055 8996 5032 -1119 -1277 -208 605 -5348 -7455 -875 -2700 -7287 -2865 213 -993
965 -993 -4580 -7414 -2840 -2265 -7838 -4905 -933 -2343 -2034 -497 4831 7709 850 504 6069 3023
981 3023 -142 775 2846 4471 249 706 9064 6857 621 2720 4839 4247 583 -2382 2265 1231
997 1231 -6460 -4305 568 -1324 -5465 -8640 -3787 -219 -6868 -6629 74 -1421 -5476 -4916 351 4371
1013 4371 -1759 -4291 4004 4831 686 1664 4043 6199 2306 -1919 4406 6748 -110 -1085 2230 4840
1029 4840 3207 -1515 2104 5806 -1154 -3286 1369 1234 -1986 -5923 -4582 304 -3056 -5158 119
1044 119 128 -2543 -3144 -1938 1850 -705 -6380 -1970 791 -2732 -1835 630 2542 2508 -795 3373 7261
1061 7261 1847 493 3330 3046 2149 -120 1062 4113 -444 -2894 2092 2083 -1151 -2748 -2798 602 -1440
1078 -1440 -5257 -156 1908 -3066 -3647 -618 2789 1466 -3866 -467 3888 -1399 -2735 1153 1743
1093 1743 427 -3152 -826 5179 1453 -2927 1366 3089 1748 -959 -1323 3560 1110 -4916 -772
1108 -772 2836 -37 -2938 -2896 1124 1687 -3731 -1397 2761 -598 -3032 -1299 1521 2977 -1262 -1596
1124 -1596 4091 2727 -527 1867 3293 3265 -127 -1774 3014 2040 -3095 -1586 438 -818 -1907 -3161
1140 -3161 -430 265 -4370 -2862 1067 -1173 -2343 -1962 -351 1699 -1204 -1003 3563 1551 -1274 894
1156 894 2287 3023 279 -1282 3070 2056 -2307 520 2460 1278 -727 -1515 1963 2464 -2557 -1154
1172 -1154 2406 187 -1745 -2141 113 1788 -3166 -3455 2257 590 -2696 -1843 77 2053 -848 -2903
1188 -2903 2625 2510 -2363 -1134 1431 2217 522 -2486 1634 3449 -1576 -1355 1972 1489 -324 -2935
1204 -2935 -1029 2500 -1871 -3498 902 1348 -754 -1172 -85 3012 759 -2398 1944 2616 -318 -156
1220 -156 526 2218 1827 -1603 1009 2773 -1118 -1808 -68 -75 -180 -2826 -1354 1630 -1703 -2671 1181
1237 1181 857 -635 -1459 -1060 1348 -912 -3045 790 1088 -1592 -1066 -137 1256 578 -2105 857 2762
1254 2762 -894 -676 1498 2542 2194 -614 1350 4418 542 -1489 1747 1719 474 -1360 -588 2320
1270 2320 -521 -3792 -352 835 -1564 -3082 -2857 164 -648 -4357 -1061 2319 -452 -1555 -575 1489
1286 1489 1580 -1990 -899 3111 762 -1160 799 2302 2911 426 -122 3437 1770 -1969 -203 978
1302 978 805 -129 -1321 1878 2284 -1870 -466 1219 -639 -1885 -2709 -1480 -360 -3253 -2392 1296
1318 1296 -152 -1256 -855 -69 731 -1306 -2077 1339 755 -1121 1041 2179 2336 1782 574 2659 2249
1335 2249 -1796 -457 1187 -590 -1023 -1162 655 1486 -1750 -791 1945 1 -1604 -1203 -153 784
1351 784 -1516 -1648 2417 1096 -1566 -413 716 641 -1319 -3104 154 673 -2970 -1360 1187 1100 380
1368 380 -876 1202 2817 -1244 -1419 1639 1173 113 -345 974 3063 363 -1619 1632 1802 -561
1384 -561 -1148 -468 1353 189 -1963 490 1825 -1370 -1728 -916 -721 -783 -2720 -1432 1005 -1315 -1481
1401 -1481 484 275 62 -1437 -1117 950 -373 -1742 1173 1255 772 1068 1525 2763 1667 -253 1834
1418 1834 2232 252 339 1258 1338 1114 -462 743 1846 -1444 -2234 -983 -1483 -2086 -3394 -2082 226
1435 226 -1693 -2475 616 914 -495 -1048 -753 844 -702 -2716 254 1609 157 389 1420 2626
1451 2626 1938 -1138 309 2102 -322 -1554 14 1446 1652 251 809 3581 1416 -1104 -16 163
1467 163 -281 -1617 -2195 437 -166 -2420 -565 602 -202 -810 -1498 -18 677 -1993 -1021 881 -63
1484 -63 -601 -250 335 1606 -327 -569 1669 558 -918 -233 -159 205 -455 -796 1065 1398 -561 578
1502 578 938 75 -9 -820 213 312 -1468 -464 1429 -4 -292 118 471 895 -818 -649 1463 4
1520 4 -1039 2 -39 84 -1086 -1644 780 822 -1145 536 1558 1267 417 -557 915 934 -1937 -1778 224
1539 224 -357 -1003 -1226 110 862 -1353 -1874 404 214 -590 -357 579 1913 709 -600 1763 1804 -161
1557 -161 -209 177 972 373 -882 352 1605 -661 -981 -46 148 -28 -1038 -221 1425 -17 -1129 43
1575 43 -368 -802 -1141 -1323 59 -465 -1547 410 953 273 185 24 202 391 -629 368 1486 -250 174
1594 174 988 574 561 -129 300 1527 -185 -566 968 288 -359 -995 -932 97 -929 -1759 -55 85 -903
1613 -903 -806 -321 386 -306 -1664 12 1663 307 423 1243 1501 1129 -665 418 1680 62 -1021
1630 -1021 407 1178 913 68 -183 1287 -430 -2215 -1031 -392 -605 -945 -579 1234 1206 -1043 -532 75
1648 75 -1129 -1563 -1481 -417 237 -986 -349 1915 1385 811 825 637 848 137 -269 1397 977 -217 717
1667 717 1141 1143 916 -62 436 -91 -1700 -1296 -831 -1447 -1430 -1421 -658 808 81 341 924 -254 -662 -482 -762
1688 -762 -678 -1273 -985 1190 1231 1218 1905 1670 949 24 -273 574 4 -1308 -176 831 635 713 201 531
1708 531 259 -1751 -1257 108 -573 -854 -446 -10 908 -372 -976 266 -439 -1440 -886 -244 270 -170
1726 -170 -1146 672 1163 145 435 622 821 575 -252 703 1792 50 -547 269 287 133 -563 -729 373
1745 373 -895 -1538 -295 -94 -227 -389 -262 1118 917 -330 285 226 -697 -462 -453 -132 17 -362 22 1319
1765 1319 419 61 -82 -652 -712 -868 -461 805 300 384 1283 1138 764 320 -282 -338 -929 -1634 -73 489
1785 489 27 279 485 824 607 -712 -285 113 -1004 -912 66 373 580 -42 64 1302 -80 -609 -154
1804 -154 -481 -951 -954 -359 1154 831 -138 578 1217 613 33 -459 -231 -465 -1748 -825 652 352 266 839
1824 839 980 1367 197 -487 65 -1043 -1915 -1276 -795 -37 -285 -524 1093 1363 164 253 -115 -542 -662
1843 -662 -936 185 800 243 583 1574 1309 1384 661 23 93 -635 -653 -163 -248 -656 -223 -90 365 340 -48
1864 -48 333 149 -1173 -418 -547 -721 -891 -997 -563 208 -540 445 788 447 351 19 555 819 -263 -443
1884 -443 365 -57 204 540 751 1119 766 310 1070 807 -235 -156 -451 -388 -901 -1151 -189 243 -676 -338
1904 -338 576 245 -110 -973 -798 -243 -1008 -1275 -167 -25 31 579 988 1756 1210 0 484 90 -776 -594
1924 -594 -1015 -530 -244 -196 369 1412 987 913 883 554 414 -688 -958 -336 -889 -982 -219 -162 334 76 -142
1945 -142 412 -11 -683 -299 -385 -697 -269 -4 510 872 212 1002 805 48 338 104 -377 -282 -987 -760 120
1966 120 -575 -168 359 230 485 315 79 637 -136 -780 -49 -505 -672 -509 -285 464 634 4 554 1114
1986 1114 -84 -141 -269 -34 166 -636 -266 643 196 13 105 142 33 -850 -1117 -234 -391 -799 -155 250
2006 250 273 136 -238 489 433 -507 -274 -70 -367 -341 -357 -195 416 -198 -123 469 711 567 456 172 519 200
2028 200 -141 265 175 -105 -29 -211 159 209 -610 -249 -308 -747 -415 -157 -163 243 19 320 362 -420 -346 -475 -686
2051 -686 -385 -127 -2 446 168 127 846 246 -14 306 -78 -29 36 -105 774 666 125 430 638 182 136
2072 136 -286 25 417 -263 -452 74 -186 -504 -583 -694 -126 -519 -786 66 -136 -146 -269 -199 181 -129 -619
2093 -619 334 507 238 593 160 481 509 -155 132 671 263 292 199 352 496 -203 -366 253 -205 -117 272
2114 272 106 236 -86 -578 -523 -737 -1331 -961 -960 -618 217 302 496 431 -204 -111 -15 -671 -129 -262 -22 464
2136 464 629 708 1216 485 55 219 -99 62 6 -16 474 553 -70 877 482 192 -133 -262 -219 -268 -738 -562
2158 -562 -332 -1023 -465 -44 280 216 -14 -81 289 -65 -536 -541 -855 -737 -717 -786 115 320 23 332 526 472
2180 472 372 197 363 636 285 702 1037 671 394 -311 -175 -41 -520 -837 -103 -162 -56 216 350 370 -171
2201 -171 -646 -534 -613 -553 -401 -661 -273 69 -239 186 143 -563 -103 -144 170 332 220 384 437 490 391 730
2223 730 354 191 175 166 365 444 86 -55 -345 -356 -349 -124 -5 -52 -288 -20 -14 -532 -255 -380 -661 -342 -307 38
2247 38 661 184 129 232 -10 -300 -92 -150 -8 -159 -64 452 264 -157 -320 -263 43 157 -89 194 391 1
2269 1 -115 -20 -128 -235 -721 -345 259 162 450 718 533 493 86 9 43 -179 -359 -407 -11 432 670 287 507
2292 507 325 -335 -2 -113 -649 -667 -743 -527 119 5 -158 167 -37 428 316 42 93 -42 -583 -300 -282
2313 -282 -50 87 225 506 776 711 974 632 -145 -57 -383 -491 -409 -393 -204 283 4 477 510 -287 -514 -570
2335 -570 -789 -456 -708 -313 168 -228 48 426 411 453 -54 -337 48 -20 -671 -115 -360 -359 -452 -293 134 379
2357 379 165 421 652 364 425 -165 -116 154 -339 -484 210 174 236 200 -88 266 -130 -558 -362 -337 -428 -230
2379 -230 317 376 307 357 137 458 -15 -70 -368 -492 -205 -382 -355 -116 111 -1 276 145 264 540 206 262
2401 262 -42 -427 -342 -413 -547 -210 -20 13 220 223 258 198 -86 -140 -175 -421 -165 -191 44 241 68 55 339 189
2425 189 36 -24 -332 79 4 -67 210 214 -23 188 -20 80 -85 -411 -135 31 -217 -222 -272 -203 15 -192 15
2448 15 223 146 168 254 217 -107 -194 -341 64 113 -131 155 266 218 345 82 383 35 -325 -166 -332 -259 -23
2471 -23 -52 173 501 145 214 378 167 -82 -135 -196 -261 -494 -340 -392 -214 -125 -10 184 18 362 282 7 58
2494 58 -53 99 -146 183 201 282 451 391 470 375 279 -177 127 -237 -211 -212 -32 -59 342 -184 -36 59 -169 -200
2518 -200 -606 -482 -234 -38 -4 -101 263 153 374 -70 107 -109 -423 -236 -106 -356 78 -8 354 579 482
2539 482 419 691 192 165 237 8 -85 -101 -265 -277 -151 -248 -38 31 24 107 13 -201 230 -240 -290 -94 -132 68 -118
2564 -118 -216 198 -113 -324 -161 -162 90 108 120 338 282 178 230 173 42 271 233 -50 232 51 -10 39 -197 -40
2588 -40 14 266 144 240 -149 58 -68 -302 -8 -104 -502 -318 -488 -309 -172 -289 3 -27 -52 222 209 148 273
2611 273 -13 34 75 -127 122 147 -11 320 95 77 402 39 -61 220 -164 -191 -194 -27 82 30 9 295 72
2634 72 -42 -172 -384 -232 -154 -325 -112 83 129 9 119 162 427 140 -130 85 44 91 -8 267 92 170 80
2657 80 381 109 -34 96 -310 -299 -48 -367 -204 -82 -34 -46 47 15 41 -257 -180 -27 -137 148 151 -133 71
2680 71 190 -58 161 44 166 -83 -3 29 -254 -26 80 134 0 -267 145 -179 197 89 -122 51 -180
2701 -180 56 -217 -350 -73 -73 -92 -33 -17 120 209 45 145 210 -127 74 21 143 388 248 -93 159 199 -97
2724 -97 148 97 28 105 -178 -27 118 -253 -174 -173 -419 -134 -218 -201 176 137 -124 65 -134 -5 -67 -173 97 -32
2748 -32 -31 285 23 138 241 39 154 243 58 -7 88 -55 117 24 -42 57 -115 -100 73 28 177 127 52 6 -36
2773 -36 -189 -118 -384 26 -64 -39 -35 47 -93 107 -77 -123 125 -5 69 -44 124 -77 -12 90 -16 55 -126 -61
2797 -61 24 30 -60 -142 82 215 -47 -162 69 -73 -74 -39 2 -56 242 -38 -32 106 140 -185 137 215 54 -73 -122
2822 -122 -85 110 -219 -88 -121 -227 18 -106 -122 -120 62 -107 -153 186 -35 -165 -121 118 -127 -207 -83 150 175
2845 175 -7 -142 276 240 246 57 151 154 264 13 70 150 22 65 28 -53 34 -49 -103 30 -88 -267 -143 -183 -107
2870 -107 -142 -288 -44 -30 -54 175 -1 44 18 50 81 360 217 251 69 319 204 171 118 203 153 -88 78 101
2894 101 49 86 -110 34 12 -87 330 -87 248 103 -77 -131 -89 -106 -180 -140 -259 -144 26 -152 39 43 -55 -117
2918 -117 -207 -43 194 -64 119 161 83 46 -118 61 71 76 72 355 52 -21 -96 46 327 -19 -73 18 214 57
2942 57 -143 -154 70 4 -59 -20 86 106 111 -107 25 91 -229 -120 135 -223 -87 52 -162 124 142 -68 22 17
2966 17 3 61 122 75 118 363 49 200 191 249 -88 46 213 23 16 -77 58 40 -13 -180 -179 55 -213 -148 -24 -174
2992 -174 76 57 -135 -122 -97 -86 115 -52 -1 -72 -140 -74 224 70 199 94 95 124 65 26 75 -73 317 296 100
3017 100 380 210 -65 72 -23 -183 150 -163 -205 -169 26 -46 112 -188 -22 28 -104 32 -145 -349 -110 -118
3039 -118 8 -37 -22 -26 99 -182 244 28 -96 -170 -59 165 270 63 123 303 192 221 53 158 110 18 87
3062 87 134 -84 -139 -38 -128 25 102 -129 -232 -200 -24 -179 -382 -131 -173 -167 -68 124 107 -64 52 172 153 10
3086 10 41 180 -15 -11 62 93 -68 85 -1 -40 205 -52 232 29 154 -91 -183 -59 -147 -196 -151 -102 85 -160
3110 -160 145 -279 -19 63 -252 -61 -285 -35 -60 -27 -71 -83 77 -53 -12 -44 64 104 202 333 111 -104 22
3133 22 -45 -92 -108 -135 -145 62 -145 178 -122 22 161 10 -116 20 -149 122 -42 -63 95 269 -107 -384
3155 -384 -179 -151 59 55 -56 95 -81 116 176 -109 55 -34 -18 99 -70 94 78 -68 11 -60 52 -146 113
3178 113 1 246 104 13 47 75 -11 148 -71 15 195 -56 29 229 27 244 114 4 162 11 -140 200
3200 200 25 45 95 -233 -50 -83 4 77 19 -81 59 111 -4 133 -83 17 221 -231 41 3 -245 241 199
3223 199 143 129 -106 -210 88 -250 -252 -55 -1 77 -123 -34 137 224 -115 283 119 -105 154 -19 -57 122 -144
3246 -144 20 172 -23 317 224 -115 226 -103 -125 -47 29 -119 -85 -14 -44 33 -68 81 91 -96 102 214 53
3269 53 44 -22 -125 -55 -125 -62 -30 67 252 1 102 -17 160 -216 72 -71 -10 55 4 79 137 0 102 49 -92
3294 -92 -21 -181 -166 90 -102 -51 -155 -169 93 -148 5 145 -28 -11 -22 -311 30 144 -163 54 60 -2 283
3317 283 221 -80 74 34 -31 -183 -45 38 -50 -89 -31 -32 -79 86 131 -13 34 -47 -72 272 -165 -105 -52 -158 -79 -102
3343 -102 21 322 1 -133 306 -101 48 -58 -32 -51 -155 -48 107 -73 -231 191 -198 48 134 23 -160
3364 -160 -82 -105 -14 -1 -143 -45 139 115 228 79 249 185 -120 -38 -2 -145 96 158 -109 45 -258 35 -126
3387 -126 120 275 -180 -220 124 124 52 -49 -13 -273 68 135 -69 2 -184 -80 113 -243 24 131 -22 112
3409 112 74 74 158 324 124 140 -2 163 369 -71 -41 32 -16 -276 73 20 1 -162 -170 13 -87 -218 -415 -151
3433 -151 78 37 -90 36 85 -42 -46 83 7 220 -16 -116 -35 -21 80 117 -69 195 22 -15 104 -136 -164
3456 -164 -117 -52 97 -179 -89 39 -188 -208 4 -156 -135 146 -97 77 72 58 52 -65 -125 14 22 -18 102 33 69
3481 69 99 68 131 113 36 -90 46 104 70 -68 -44 75 105 -72 -20 -72 -161 -343 -254 21 38 -175 -9 85 -42
3506 -42 59 17 23 196 226 -57 206 -162 172 -12 -177 -89 -97 -239 -167 1 -63 28 -32 126 63 -81 -14 16 -142
3531 -142 121 23 -79 45 -254 100 -44 117 -152 152 107 97 20 10 89 -138 -8 -305 -187 116 -138 -15
3553 -15 203 59 20 -188 -31 -126 45 53 -25 -11 118 -109 177 3 225 336 -57 96 86 89 3 -132 -52 -18
3577 -18 326 -103 41 167 81 -156 -275 -43 -103 -127 -194 -125 -55 -28 -139 23 92 6 -57 99 -26 51 -233 -10
3601 -10 264 -7 -156 -85 44 72 188 9 39 -34 -111 169 -234 74 -72 -248 -81 7 -236 -148 72 19 124
3624 124 -150 -107 31 -50 -301 -185 1 260 9 -28 113 -172 -108 -25 -79 -186 114 81 6 121 -160 36 -13
3647 -13 41 278 -68 -101 190 -49 -177 22 -73 -186 26 -99 2 175 -91 138 -126 165 200 132 43 -68
3669 -68 -114 -44 -64 147 96 77 -33 167 -62 -170 -29 -51 -37 1 70 37 155 66 -195 94 126 -183 -18 -131
3693 -131 18 -111 6 -48 -133 0 205 46 -55 -2 -175 95 62 -100 -111 -157 -35 -55 23 -82 -14 104 45
3716 45 -110 -167 -76 109 -112 49 24 151 35 -74 -121 -25 45 42 44 -24 -150 -210 -7 28 -40 -16 40 85 148 116 -264
3743 -264 106 69 -43 33 112 -195 -107 6 65 -150 -3 -96 25 -172 37 82 -23 36 -56 112 22 183 -20
3766 -20 212 -155 27 -12 -249 -96 96 44 71 44 -410 -69 -55 80 129 30 112 87 -98 66 -177 55 143 -145
3790 -145 -17 101 -110 30 -35 36 177 -88 -87 65 -12 67 -27 203 46 185 -101 211 126 178 50 -267 -13
3813 -13 -180 71 153 294 -227 31 143 -32 -74 56 -33 -42 -46 -111 189 -84 -38 -65 -112 96 -3 49 102 114 -50
3838 -50 -63 -22 196 298 182 -1 165 -8 -121 174 -5 28 -38 53 114 -15 -3 191 -91 -298 65 -88 0
3861 0 -65 -179 -136 -290 -102 -149 -52 41 38 -2 -69 280 -189 25 364 -39 38 -147 0 136 189 84 4 38 -139
3886 -139 48 55 -45 -55 36 127 23 -191 7 -178 85 -6 -49 -80 -30 -149 125 56 -38 69 -2 -109 187 193 -18
3911 -18 181 -154 -89 59 -202 -20 -169 -57 181 114 107 -90 -78 82 -42 -256 81 -99 -168 75 77 77 325 37
3935 37 1 -93 -7 -196 -7 92 170 161 -89 -179 -35 -3 136 -126 -128 98 -197 -151 -166 -95 61 -54 -15 -36 68 258
3961 258 -11 -1 -50 -47 -164 -76 34 170 -222 135 -262 6 -24 72 13 -39 -47 -116 114 -139 49 -344 -101 51
3985 51 -117 61 -107 -18 309 -68 82 -10 -12 28 -24 -97 211 137 -129 33 -135 -40 265 239 -126 76 13 48
4009 48 -109 7 -38 172 -55 82 -53 -95 -131 35 66 -50 78 -6 27 81 -2 -92 41 -4 -162 -16 109 -97
4033 -97 189 -146 -44 22 84 -57 -88 -96 -151 -5 65 -98 283 -50 92 127 70 -100 -107 -178 49 -21 225 -33 -98
4058 -98 -28 4 92 -108 -119 -8 50 -83 65 -120 -125 -42 239 0 142 225 101 -25 -36 47 -50 -312 -77 -171 -112
4083 -112 65 -19 -33 -34 170 55 -30 294 -217 -322 -278 0 60 29 13 -30 2 88 31 63 -181 -291 -336 44 -181
4108 -181 3 -58 -98 138 213 -32 -90 165 -119 237 -157 77 348 -83 28 -168 -60 -67 9 -251 27 30 -121
4131 -121 -56 37 -25 -11 66 -153 35 292 81 144 161 89 -32 -79 -77 219 -15 -284 -189 53 358 45 198 274
4155 274 32 -12 -17 -186 38 -14 -14 120 50 18 -53 47 169 -2 78 39 -222 -38 33 149 -265 -131 105 -46
4179 -46 232 91 -39 133 -54 -288 170 -87 108 35 -125 83 77 8 -58 38 -11 -89 -93 -260 -44 -46 38 -4 -109
4204 -109 219 77 72 248 -128 -145 -67 150 49 20 -139 44 77 9 247 -100 -33 58 -249 -96 -42 100 255
4227 255 8 -70 248 53 115 223 64 39 -122 -68 49 22 28 -199 98 -128 204 -13 -57 366 -38 -26 24
4250 24 -68 -69 127 -40 58 -98 80 147 -57 -9 -160 -84 -27 -99 -68 -24 231 141 -72 35 119 69 -62 -60 -8 53
4276 53 11 146 -108 -114 217 -274 323 62 -193 -90 -141 -14 -32 -97 -169 78 138 110 28 151 224 206 146 -16 -45
4301 -45 -155 -210 -9 162 -17 80 -3 23 -22 202 65 1 166 -94 83 -107 226 42 5 161 169 -138 -169 -27
4325 -27 -36 -266 -281 -277 -77 -65 76 320 80 118 281 -154 78 184 -71 -57 -124 -203 87 42 13 257 215 78 -13
4350 -13 -159 -32 -34 -101 -10 -11 -267 196 -140 119 -131 96 -131 116 0 -257 -14 -58 11 -103 -3 17 -17 -2
4374 -2 189 185 18 141 -124 -52 238 -124 7 191 -28 174 178 115 40 3 45 200 -365 -242 -36 -284 -246 57
4398 57 29 -34 -47 -88 199 216 2 128 -139 -30 66 -111 155 -37 -75 75 141 -56 128 33 101 -79 21 -219
4422 -219 -30 -158 9 231 43 -19 -79 15 -21 -156 -180 83 93 276 241 38 109 -63 -21 -13 -44 -27 39 111 -177
4447 -177 -113 -103 -103 77 -95 -177 229 84 13 44 88 20 -10 145 -62 -210 -110 -81 -71 -36 -52 -137 117 219 -82
4472 -82 318 181 118 214 -88 166 -36 -130 -183 27 -142 -41 -165 -27 -65 -90 43 26 -41 -42 104 -302 -165 -62
4496 -62 26 49 11 63 -53 -52 87 185 -123 -86 -192 0 -53 85 83 226 -65 223 51 81 -23 -113 -99 31 187
4521 187 -349 -290 146 60 61 28 163 257 -73 138 126 -44 -20 -78 -229 3 64 -10 -52 65 45 -101 17 10 109
4546 109 -183 -189 -190 -274 -54 -215 28 198 -62 -52 257 275 -52 88 -100 254 178 -4 135 189 297 -68 50
4569 50 84 -38 -153 -92 -6 -179 -111 -22 -100 73 118 154 191 66 -63 29 64 -42 -119 65 -62 -112 -233 167 -25
4594 -25 34 106 63 -12 -244 -180 -58 68 -329 25 -118 110 -128 -2 327 77 106 5 164 -142 -148 -77 -42 52
4618 52 -89 -170 50 -130 25 -99 -117 -43 4 -201 -97 4 -220 -45 -36 167 123 122 186 256 55 -93 15 82
4642 82 -161 -111 -252 2 19 151 89 394 135 -19 -85 311 160 -104 8 66 -12 133 38 -110 -30 -92 32
4665 32 -30 -174 49 -362 -195 100 -9 97 46 -124 150 191 -105 50 -34 -156 91 183 169 110 -131 -276 -36
4688 -36 -93 -5 236 110 94 29 -218 -36 22 -75 45 -57 -47 76 -92 -102 77 -12 -35 154 74 50 82 -116 -36
4713 -36 24 -415 -260 -173 -41 -55 -173 190 303 246 365 52 -153 -246 -77 -248 -92 94 -163 -70 -83 57 -135
4736 -135 -144 85 115 -258 -6 73 221 -73 -184 -137 -3 232 273 56 -137 252 -153 -49 -284 -325 -165 -22
4758 -22 87 -30 98 -36 119 243 37 101 -105 27 37 -241 -150 11 44 101 135 81 100 -144 -173 -30 -223
4781 -223 -277 -36 -156 -146 -116 13 153 39 134 113 44 -51 50 -4 -219 -172 20 34 99 -105 177 246 6 -17
4805 -17 85 29 -70 -73 -135 -174 -186 -56 47 138 -25 215 -33 10 154 -15 24 72 -167 -142 -220 -75 222 -96 100
4830 100 -53 138 99 28 81 27 -68 -194 151 -50 -185 -106 -16 181 65 -156 30 -112 -127 22 -54 -216 161
4853 161 -70 83 66 7 288 -60 54 138 -25 229 -100 246 -94 253 -4 4 269 1 -14 -118 76 26
4875 26 -35 39 -64 90 295 79 44 206 130 -35 123 -46 -59 74 23 -112 -155 -314 -146 -49 -91 -129 83 21
4899 21 192 153 22 62 -112 -132 -104 0 -91 -172 18 -134 56 -195 134 105 109 336 -157 -197 68 -180 -209 93
4923 93 -11 -84 55 21 128 239 284 25 4 -34 90 -261 -67 -34 -173 -42 0 143 180 -59 -103 -6 132 -12
4947 -12 -79 -244 -54 -17 -208 -21 32 72 262 -202 16 61 -34 -39 -154 99 -171 145 3 132 260 35 259
4970 259 84 139 85 -197 65 -44 -84 -97 -214 -58 -162 -205 31 6 -63 -151 48 -178 -23 -224 -193 -196 -124 -390
4994 -390 20 90 101 143 155 22 74 178 -77 21 -59 -296 116 60 187 163 74 126 155 14 187 -30 -45 -254
5018 -254 -109 -49 11 -118 -51 73 47 111 147 -134 -243 -138 -226 -44 -262 72 22 10 246 304 145 104 172 286
5042 286 -17 -151 -11 -293 -134 -13 -132 -71 109 93 82 65 247 341 128 -36 -151 -72 -484 165 -13 -49
5064 -49 134 -29 -273 124 17 -199 52 -189 -69 -36 -119 58 -62 -190 254 109 0 145 17 -45 -128 -152
5086 -152 -254 51 -25 17 -95 50 354 101 261 362 154 46 10 30 290 36 -2 -62 168 120 -140 -9
5108 -9 1 -60 -343 -100 -220 -126 -192 -163 -44 57 9 -75 -25 -72 26 142 -148 -84 -7 3 10 59 -47 108 -7 -121
5134 -121 230 204 -42 -5 8 -169 173 -98 -81 -118 -171 -105 3 34 122 235 79 -126 6 -255 -298 -37 -166
5157 -166 -261 -100 -39 -34 148 50 85 103 238 48 179 61 -113 -46 5 5 -88 -44 47 284 -54 2 86 29 167 -85
5183 -85 61 -31 14 11 140 -256 9 158 -83 191 116 30 30 86 46 73 -37 -222 188 -150 -91 78 58 84 56
5208 56 -78 42 71 -255 -116 -43 -33 55 -80 66 184 20 126 305 -247 -49 -84 -246 -221 232 -8 -17 -216
5231 -216 -146 308 -49 21 -44 -18 61 -319 -131 -206 -196 -71 -97 -45 169 -47 -116 13 -188 -260 73 -65 -327 -221
5255 -221 -231 4 112 37 128 338 275 124 -142 -103 -135 -110 -191 -206 -89 16 103 2 160 353 -128 124 -39
5278 -39 -37 -7 -186 -37 4 140 -309 -147 142 154 157 -105 109 50 -227 -20 -207 -177 -209 -76 -31 90 -72 320
5302 320 144 -132 63 -57 -318 93 -78 -190 -1 -93 8 107 96 39 35 -81 -76 -472 -1 14 -78 42 215
5325 215 -106 -3 -32 45 160 92 168 116 25 -206 -127 -125 -66 -8 -312 179 97 204 78 164 268 141 -89 -158 317
5350 317 -144 -122 77 2 118 184 -117 108 68 49 234 151 8 -163 139 28 75 -100 141 226 -78 82 -95
5373 -95 -163 14 -118 -81 -24 -190 -74 8 40 5 169 -115 128 130 38 118 15 -238 -20 166 113 15 165 105 198
5398 198 29 -14 160 -76 12 127 -89 9 -168 -48 121 7 60 65 -52 63 -228 -308 9 -68 23 -30 -219
5421 -219 -78 -86 -167 93 276 -105 82 -220 -107 214 -85 13 -80 -64 36 140 -22 98 68 -74 177 228 -110
5444 -110 86 -254 -139 34 -43 -137 243 206 78 98 47 -61 -94 23 155 24 108 -37 -90 -120 -198 -95 -80 -71
5468 -71 -225 -19 -85 -56 183 -46 -171 -199 -115 -103 62 -169 116 214 70 130 132 119 -64 -154 -24 -148 0 -34
5492 -34 98 -56 146 -39 -26 56 87 147 72 -6 2 -80 77 39 38 -128 147 253 -78 165 193 -294 -16 -270 -204
5517 -204 -4 -188 13 3 97 333 95 19 -11 -91 17 -87 -138 -28 -59 -98 78 63 -40 397 191 -80 216
5540 216 -327 -27 38 -35 -150 -36 -123 56 -108 21 154 160 -37 -136 -108 -197 -246 -101 -24 -53 -95 130 -54 7
5564 7 273 72 -49 122 150 111 20 -3 -149 -120 -60 320 225 198 178 153 141 156 12 -44 -83 -367 142 -95 -163 40
5590 40 124 6 173 144 40 129 -309 192 142 -61 -213 60 289 -10 -118 224 338 95 -219 -29 -39 -33 -15
5613 -15 212 208 88 -97 214 263 -52 255 -83 70 -181 -313 -15 -100 -212 96 -145 -71 56 -57 37 -44 224
5636 224 -32 -69 56 -206 -302 27 -1 -31 115 337 86 -11 86 -74 -24 -129 -94 -90 -198 -148 20 24 -87 -85 -62
5661 -62 -60 101 -108 -113 -23 -142 -51 -61 -315 192 39 -95 86 142 -27 -66 -135 113 88 -54 -46 82 194 91 12
5686 12 49 235 -70 -214 48 195 26 -143 -278 163 -90 -234 18 59 -26 -57 -49 -61 60 -148 52 141 -14
5709 -14 -256 -178 -52 189 42 158 83 -181 -189 13 89 -34 -105 -55 209 77 -230 110 121 1 115 -73 -266
5732 -266 113 186 -38 -76 -169 17 -118 -42 54 -189 -241 -143 -110 22 -43 -31 -2 -130 -115 -3 -6 -42 242 -122 -113 -186
5758 -186 -35 -113 13 59 62 -229 -179 -20 92 183 -39 -90 101 0 -16 -47 168 -182 -48 -96 141 -157 195
5781 195 -45 46 145 -85 -110 -101 162 -18 -174 53 -120 -101 45 -133 259 64 8 -171 13 -34 -31 -95 151 118
5805 118 -108 -193 -70 -83 -113 -32 -53 79 83 -226 107 -21 -19 70 88 -60 -78 -135 66 -252 -103 123 -19 -111 172
5830 172 239 -187 26 -38 -113 135 -44 -88 129 -45 210 38 40 -1 -85 9 160 -200 -5 -41 21 73 105 -18
5854 -18 -106 178 125 -90 -72 -6 -26 -116 61 268 59 192 96 -22 191 -64 81 109 44 -53 -137 -251 -234 -197 -51
5879 -51 115 282 -34 113 180 -82 -23 -128 -196 55 -10 -206 172 89 11 138 133 443 -11 16 129 -114 137
5902 137 49 -194 -134 366 -60 57 118 -108 205 82 -153 93 28 -95 12 -73 -33 -56 -168 -6 161 6
5924 6 177 163 -256 143 68 -162 -122 170 -254 100 -107 7 134 120 69 53 -205 -94 -247 -229 -91 -42 -151
5947 -151 -209 -61 107 118 -56 201 110 -161 32 -95 -39 32 -144 -6 202 -61 72 67 -231 -202 -176 -21 72
5970 72 -137 -50 32 220 -37 92 77 63 -162 34 -194 61 -217 -117 -99 -289 -28 -289 -36 116 -3 168
5992 168 -97 -14 188 -67 -125 64 44 -13 -221 -72 38 134 117 74 30 -160 228 -8 136 157 39 -57 102
6015 102 160 253 -23 -216 -131 184 -39 -23 55 -80 -221 -96 93 -56 -29 -172 -69 -124 -109 -131 -239 -2 -69
6038 -69 -139 -49 -103 -161 102 123 187 54 130 -30 64 -77 14 -159 -135 -10 -71 -60 249 -90 172 75 -42 226 -70
6063 -70 -182 78 264 146 168 48 86 -44 -121 10 -68 8 65 20 -117 89 62 58 114 9 90 -129 -76 -60 7
6088 7 -180 -76 -188 -96 -78 167 -39 49 160 -52 17 73 49 -116 -150 33 200 -126 132 63 -25 27 80 63 65
6113 65 141 64 147 -134 -33 41 -34 -24 80 -62 61 141 -3 102 -169 48 129 154 168 50 50 156 28 -77
6137 -77 170 -81 27 30 -250 -103 -72 -97 -69 33 -131 -178 -68 255 25 -111 73 -315 -155 127 32 -76 94
6160 94 -16 203 61 26 46 -35 -8 -22 170 14 -12 108 -71 185 -32 -41 57 -111 -18 -299 -84 -3 60 -166
6184 -166 -52 148 41 -146 -13 -122 -133 141 -115 -107 112 28 -4 48 308 -71 39 16 -13 29 12 -156 -37
6207 -37 -198 -14 -1 -143 -195 24 47 -61 -30 -216 -54 50 103 -130 -73 -102 -68 18 -56 6 184 15 106 35 -101
6232 -101 247 111 112 -20 103 -35 179 83 39 45 24 41 20 -39 39 32 -18 -30 6 -177 -215 -49 7 124 -26 -148
6258 -148 -290 -262 177 -79 6 -16 13 113 139 24 81 12 -170 57 -28 -200 2 -160 71 157 36 84 -158
6281 -158 156 -212 25 -6 267 70 55 -41 -29 72 27 -95 27 23 -209 -106 -96 -144 -140 -164 6 181 -229 36
6305 36 -83 68 -100 -68 -5 -48 -16 95 75 17 43 178 -68 170 83 48 36 -162 -47 149 64 142 21 21 -57
6330 -57 73 -102 35 83 -52 83 -38 66 299 -123 145 -109 -111 -115 -38 -148 -97 -1 237 -2 64 -205 107
6353 107 180 -119 146 -60 -59 91 -65 6 -56 -158 179 -77 129 -153 -28 -138 73 -51 33 -34 98 -175
6375 -175 -125 -193 -91 -65 35 93 -35 -79 20 22 -23 9 128 85 19 -125 79 -9 -247 153 165 104 -51 125 -20
6400 -20 -199 -125 -56 169 -73 33 16 48 126 166 34 42 -73 57 -175 -24 16 -119 -21 13 253 -39 -16 -7 -166
6425 -166 -116 -54 -20 50 -172 12 -102 -11 -30 -168 52 111 113 -44 106 192 -33 87 -49 112 -58 -30 -23 -191
6449 -191 50 -130 -98 15 -133 255 76 164 -210 -221 -113 182 101 98 93 112 43 -36 -67 69 -125 -144 -81 66 140
6474 140 114 -17 -21 -161 129 151 -150 223 -163 215 -64 -48 185 20 -79 107 36 -54 -22 -184 -119 126 -73
6497 -73 47 -124 73 94 -137 -102 83 -11 31 -148 54 195 -115 28 -78 95 -81 -141 92 27 32 -197 105
6520 105 29 339 70 -260 -80 -61 85 -88 13 -55 134 174 9 -27 85 -73 -93 8 -57 52 -173 -257 -2
6543 -2 265 -12 45 -152 -27 -58 -27 -79 -54 -188 -226 99 53 -47 -50 132 -17 169 -31 116 -64 -8 103 -234
6567 -234 -37 -151 -50 6 30 126 -67 -263 -242 -203 -66 -54 -43 -87 274 86 123 122 -70 54 -11 -231 90 46
6591 46 -53 -76 -40 -110 82 56 35 -20 128 -213 138 -29 -153 156 35 -32 -70 81 -46 -144 -110 -26 -2 12 202
6616 202 10 4 -78 -51 -24 97 37 36 125 -73 46 48 114 6 -319 -103 70 32 -30 105 -185 69 -224 -192 -27
6641 -27 40 22 -206 23 -214 -132 191 202 -30 -42 -15 4 97 -191 75 198 -191 -18 82 -109 -80 -280 55
6664 55 64 -68 -83 -47 125 135 -57 46 184 -185 -48 -115 -135 160 -135 -100 -214 -89 52 11 119 -1 -92 62
6688 62 69 55 -23 -125 4 89 -21 66 221 -63 100 44 -51 -18 159 -29 -130 18 -32 -57 93 19 -25 -143 -50
6713 -50 -138 -9 179 -76 -163 -36 -39 -82 -156 -76 -121 -96 -252 -102 142 190 9 45 -211 -11 85 -163 56 -81
6737 -81 193 -63 -166 -96 -308 -29 77 25 30 139 -24 -270 78 -62 23 51 26 -31 207 139 -57 95 -47
6760 -47 29 -30 -60 58 -159 161 -89 -230 73 -83 89 117 -1 1 -18 17 -109 -25 -90 72 -71 -76 15 100 -6
6785 -6 57 52 -72 32 52 29 -109 32 -14 -85 27 51 -180 -133 54 -115 -45 68 -17 117 30 -68 -107 110 167 99
6811 99 43 -13 -11 -121 -49 65 -167 -99 -95 -92 -58 -146 -13 -136 -127 -103 -46 -41 104 -43 -110 74 -105 183 99 -5 95
6838 95 25 121 -53 2 46 38 -24 -4 130 -108 139 174 286 138 27 20 7 60 -143 -30 -44 -65 -76 65 106 -87
6864 -87 -54 -44 -165 -145 116 -19 32 -101 -68 -84 108 46 93 -123 -89 103 -110 52 -88 -78 -153 94 -9 13
6888 13 75 35 -92 6 15 -45 217 80 214 125 -61 -76 -149 18 88 -36 -44 -130 -24 0 264 103 7 -102 -188 148
6914 148 39 41 -54 -19 -181 -113 122 52 -10 -286 265 -18 -47 -104 -106 12 -123 160 147 2 -130 44 47 78 68
6939 68 31 -2 76 87 -12 11 117 144 290 -10 91 59 78 250 -29 -57 -58 26 -54 29 -5 -274 9 87 -28 20
6965 20 -38 -43 -61 -191 -10 -87 145 78 -4 31 -77 73 -11 98 134 143 65 -100 -132 7 -39 -80 -80 37 59 -183 -126
6992 -126 -135 -96 -78 -141 -102 20 59 -63 -53 115 65 149 78 13 64 -40 -12 -169 -161 -97 76 13 -150 -140 35 -116
7018 -116 78 194 -133 -13 82 -70 45 14 119 21 51 98 -66 136 -80 30 -61 23 -110 -230 68 107 97
7041 97 17 98 19 101 88 84 83 -123 -239 -119 -80 -34 163 4 13 131 56 1 -48 -117 33 15 -31 68 34 34 143 243
7069 243 136 50 162 -85 -8 -205 182 23 10 116 -110 -7 73 -9 -14 18 -107 160 -157 -198 -23 103 99 -135
7093 -135 178 -270 -3 -3 -72 -17 127 9 21 -37 36 102 -149 -36 245 115 100 15 -24 -73 -86 -65 -144 191 -195
7118 -195 99 25 -92 -115 -244 -12 87 -46 155 -18 79 40 16 -91 50 63 -132 -95 -224 73 -165 5 -44
7141 -44 -111 -140 -120 -168 -56 9 4 -94 64 -37 -188 88 -95 -155 105 -51 135 -144 22 117 220 60 -106 230
7165 230 -29 52 -136 -130 -168 -47 57 71 -82 158 55 5 170 -46 -45 126 -139 -5 71 -259 101 -67 85
7188 85 148 -63 -82 86 -68 -101 86 -116 84 -138 -169 55 -74 71 -18 109 15 -33 -126 167 -19 61 -137
7211 -137 -183 127 134 -145 142 115 -56 21 6 188 94 196 180 -138 78 108 -270 -96 -66 -14 -35 278 92 116
7235 116 -94 149 252 -98 -13 -90 210 -101 149 -115 118 -111 -26 97 -76 -20 -228 -204 68 -80 114 152
7257 152 -90 62 109 -16 131 2 -303 -97 -22 -106 -105 11 -12 65 -7 -31 -105 58 22 -137 -6 -211 247 -8
7281 -8 -10 -194 239 80 129 -13 -81 -37 -16 47 -171 103 74 14 -39 -61 -126 7 292 41 -65 20 255 0 1 109
7307 109 -178 -34 -68 28 -65 -26 44 -67 36 -68 44 41 18 -247 -29 12 60 -85 19 26 18 84 9 100 -180 16
7333 16 152 124 153 33 162 -315 -114 -13 -155 -227 10 -88 -13 -124 -104 13 201 -23 -9 -5 107 71 -120 -23
7357 -23 40 -205 135 -96 -99 49 76 94 -78 145 -53 -57 -58 58 -152 -49 -62 75 119 -122 137 -116 74 -16
7381 -16 131 44 147 -74 147 -22 -51 72 46 -33 79 -54 -55 -6 33 -96 -68 52 130 14 -75 -26 31 -106 -149
7406 -149 20 -27 25 -130 -65 -83 -30 -68 -129 -179 0 -5 -66 -237 -31 -184 -112 -98 128 -185 -71 -54 -109 -52 -2 89
7432 89 -35 -75 168 134 -162 -209 39 -176 -84 22 -267 123 -178 93 -30 75 1 -41 -148 -70 -40 -180 -128
7455 -128 114 237 -26 -71 -128 118 124 39 -80 -43 -4 -9 -116 -28 5 -61 9 -203 -49 26 -5 -56 -75 -111 210 150
7481 150 -66 -37 16 -2 0 -10 -13 -106 -129 84 -91 16 28 -107 134 112 -102 -188 -27 67 -125 -149 -3 -60 -7 -116
7507 -116 -27 -60 129 -218 -4 -8 -151 -52 42 -113 65 47 2 57 91 147 -53 -81 91 -145 76 -43 134 51
7531 51 -7 -52 -387 110 101 -7 130 -15 -280 185 -88 53 65 7 174 -49 26 -208 25 49 47 221 -20 -23
7555 -23 -24 -152 -49 -79 -126 45 117 19 -35 118 131 41 -147 -16 70 -99 -25 135 69 -21 -117 86 -131 22 9
7580 9 66 -9 -219 -40 -106 109 -119 -277 -388 86 63 -4 22 -45 -2 -35 92 -87 -95 122 74 9 -119 -7 -149
7605 -149 -19 12 128 -46 -99 -45 -8 -2 39 -19 -33 27 15 -22 -28 74 -76 -47 -122 -25 -15 -45 14 -96 -39 16 14 -4
7633 -4 -1 -18 -73 123 69 48 -54 177 124 49 -65 78 182 109 -50 1 -64 -268 -73 41 -208 34 17 46 70
7658 70 -74 99 70 -103 -100 -51 36 -12 20 212 -61 -157 -86 -233 -5 -48 104 -186 -133 87 66 -126 -119 -46 -48 27
7684 27 -20 94 33 -23 -31 173 -119 -3 132 93 136 -8 -41 -181 -168 -121 56 -36 62 -74 -138 7 41 -170 -47
7709 -47 68 62 -6 112 -33 -154 -117 136 -65 -37 117 10 -5 112 -151 -65 160 179 31 85 105 -119 -4 -123
7733 -123 255 7 89 -70 -110 -74 160 83 62 74 130 176 -83 -37 -188 145 -19 -24 -52 -129 -163 -27 183 -155 8
7758 8 -307 -118 5 -116 14 -180 -64 -72 205 -5 -98 -8 124 92 54 140 10 -38 69 -27 33 16 -130 6
7782 6 -72 105 -143 -80 -47 102 -79 75 -78 46 30 -151 -12 140 -57 -43 85 -14 197 -43 -165 90 12
7805 12 -98 -25 -61 -71 40 172 12 82 120 -21 88 -40 -108 87 78 221 -102 -35 -146 124 -138 51 -139
7828 -139 -50 62 -140 10 -121 -49 8 15 32 19 -269 -238 105 -83 82 -19 -4 -137 84 -73 -48 -197 -92
7851 -92 -217 25 -28 -271 -43 -38 184 30 85 -73 -177 181 -47 -74 -166 -95 -113 -24 -128 2 88 -42 149 53
7875 53 5 -311 104 28 31 -85 -73 -126 68 -106 -30 40 -214 -60 59 -6 -213 68 89 78 -53 182 -287 -36
7899 -36 116 105 -158 254 36 -140 58 -20 133 -152 58 195 -59 -18 72 -19 -228 114 68 -129 -82 82 130
7922 130 -185 77 -33 -26 93 -92 -6 131 -76 -4 -145 -29 66 -45 -182 24 -18 47 131 -163 24 36 -115
7945 -115 40 34 -118 -23 141 -287 19 -55 -94 -199 -129 -65 151 -149 240 75 149 -110 -12 -12 -222 -164 17 114
7969 114 -71 11 38 84 -90 -15 -23 44 -19 -4 79 109 125 48 -92 -182 -135 -15 -9 -44 -224 -20 65 -61 -202 148
7995 148 -95 -48 -60 22 177 -222 82 102 -113 66 123 181 153 -159 100 114 -246 -44 91 -111 -5 37 -193
8018 -193 59 -182 -55 -88 6 33 159 -26 12 54 -104 108 157 -4 -18 -26 -82 -114 -38 100 41 -90 195 151 21
8043 21 124 -24 90 -71 -71 23 -186 -84 86 -22 150 -17 28 149 -180 -223 -99 -236 -73 -30 17 -214 156
8066 156 -84 117 89 216 -93 131 182 -16 -72 185 87 -116 -1 54 -128 -22 -91 -131 97 -33 175 -52
8088 -52 -63 5 123 -28 87 -167 -31 -226 114 -31 11 -148 -69 -44 -79 16 23 103 165 -166 113 -54 68 111
8112 111 -76 -109 56 19 129 -22 199 -14 86 46 64 -43 -93 99 21 -29 2 -22 -24 -154 77 -119 -88 -101
8136 -101 255 55 44 -60 -47 50 10 -53 108 60 -132 -63 16 -55 -95 184 -75 34 86 226 -43 -23 -67 142
8160 142 -31 45 -41 -99 -30 60 58 -178 180 125 -110 73 -143 -77 145 229 -128 169 173 -153 -23 104 -51 11
8184 11 -243 184 -170 -130 1 114 -96
8191i6
$$ Imaginary data points
##PAGE= N=2
##DATA TABLE= (X++(I..I)), XYDATA
0 0 0 0 0 0 0 0 0 0 0 -1 8 -8 8 -16 16 -18 24 -32 38 -42 51 -64 73 -89 105 -121 139 -163 187 -215 245 -280
32 -280 317 -359 405 -458 514 -576 643 -717 799 -887 985 -1090 1204 -1331 1470 -1620 1786
49 1786 -1968 2165 -2388 2631 -2904 3209 -3553 3946 -4395 4918 -5536 6278 -7189 8341
63 8341 -9848 11912 -14932 19791 -28930 52273 -249224 -428738 -108932 -88307 -50325 -46067
75 -46067 74664 134217 149365 138135 97873 -59762 -138768 -89552 78316 155269 64512 9799
87 9799 106979 150249 160771 179947 152959 42130 -80300 -70586 78089 92794 -23590 -67544
99 -67544 -28124 27159 67658 61931 32282 -82173 -232792 -238916 -142564 -104090 -143619 -189196
111 -189196 -109294 41402 106449 153315 190352 89722 -42041 -51164 23485 56137 -26657
122 -26657 -97939 -54666 -2594 38922 97054 96144 38553 -26610 -28191 86486 151859 69675
134 69675 -9445 -25354 -19303 -8934 -11164 -1729 -31599 -120998 -96084 45190 101040 44692
146 44692 -31367 -57788 -42276 -49425 -27761 29722 -1390 -66337 -35823 56896 123033 73612
158 73612 -40624 -66081 -53352 -75378 -54994 -7915 -12073 -62749 -70742 46969 151478 102737
170 102737 38477 43665 45897 40464 36779 36792 10791 -87618 -135257 -46128 37373 34839 -4209
183 -4209 -14753 31120 44966 19791 39006 20680 -77006 -120590 -62950 24558 39632 -20352
195 -20352 -23958 10537 -6712 -5884 21387 2672 -42034 -68105 -17515 78659 84112 28130 10300
208 10300 5268 -377 -3996 627 18377 -20389 -68669 -7412 68657 56145 12103 -18674 -20736
221 -20736 -19668 -26561 12627 38177 -16601 -46848 -9178 34545 40750 -8710 -40434 -20644 -28298
234 -28298 -32922 12002 31200 -809 -39690 -23298 51467 61389 6822 7444 23052 187 -11256
247 -11256 398 10773 -26984 -89375 -62083 15278 31718 20012 22074 37120 45280 15234
259 15234 8659 34389 -8639 -74838 -63203 -6937 24276 1732 -14361 22923 25396 -9934
271 -9934 7326 31701 6614 -32693 -42361 2651 30221 -6689 -18835 5219 6685 1768 7553
284 7553 28993 35046 -16364 -41110 104 7270 -25816 -35882 -18856 4785 4238 12604 56547
297 56547 51762 -1131 -14964 -6574 -10535 -29451 -49807 -27993 -1316 -7977 13133 51771 51361
310 51361 26043 2497 10795 22225 -18655 -41837 -13472 -12894 -30805 -20658 6072 21639 -1407
323 -1407 -13560 25209 33624 1852 -4219 4030 2175 -16775 -35291 -8311 13586 -13422 -14881
336 -14881 20045 35991 22406 1030 14891 30490 -12115 -39099 -9910 -1745 -22672 -29154
348 -29154 -8294 19386 4035 -14098 18631 34801 9010 -7646 -4385 8238 -4115 -35846
360 -35846 -19691 6697 -13568 -21456 7676 35399 31748 2855 8133 31141 4243 -22648 -8313
373 -8313 -1816 -10388 -14654 3674 39104 31898 362 4217 8090 -9776 -27234 -35243 -24641 -27431
387 -27431 -43620 -13038 28538 21623 7267 10978 20774 17234 -4921 -3184 8906 -17148 -31761
400 -31761 -5527 14896 14701 -732 -3886 17651 15496 1278 14587 19130 171 -13917 -5186
413 -5186 24338 21351 -15301 -13533 6229 -2117 -8131 2160 11110 -2223 -30554 -17219 17254
426 17254 2993 -26883 -31219 -22714 -13383 -16334 -6998 22506 16523 -7152 9654 36453 33006
439 33006 -1177 -29086 -16815 -11504 -28146 -9565 21241 19451 13279 28268 62438 71905 30412
452 30412 163 -983 -15389 -30146 -30925 -24936 -20546 -34411 -28044 18576 35504 9187 -10346
465 -10346 -15738 -15450 -23712 -30356 -12903 -13862 -35884 -19669 18147 32878 22633 467 -3652 1667
479 1667 -9807 -5133 11951 6170 -1924 9281 39304 66675 50399 22422 22320 13206 -5252
492 -5252 -6269 -6231 -18800 -43766 -50642 -14115 8600 -7667 -12885 -7586 -5355 -752 3044 14633
506 14633 11031 -25185 -36642 -11510 1011 -8522 -25224 -23542 -3634 -1871 5487 35579 35003
519 35003 6384 -1965 16100 35814 21932 -7859 -5003 2418 -4425 6103 22406 21816 2799
532 2799 -17880 -1823 24789 9295 -16867 -21291 -18077 -13206 -8477 7029 22749 210 -21775
545 -21775 -3334 11515 -795 -25249 -41645 -36162 -30882 -24421 4996 22831 12514 7829 19522
558 19522 38913 38534 6494 -11807 -10231 -16543 -11454 7883 15998 8030 -6066 4818 33517
571 33517 29962 8971 2115 -4482 -7873 -2778 6367 12744 -5877 -31037 -21523 -3547 -5094 -15159
585 -15159 -25054 -22464 -17413 -16883 3195 20950 4718 -10660 331 21049 27875 10447 472
598 472 5193 -4538 -8565 9383 16625 4384 -12333 -10373 16836 24478 5737 -944 -1254 -7170
612 -7170 -7730 -333 14331 7937 -21123 -20845 3079 4724 -8068 -18085 -17541 -11751 -13298 632
626 632 25352 19345 -95 122 12353 21002 8343 -10944 -9005 -8476 -14906 -2598 11289 8899
640 8899 -5832 -14206 4740 21219 9050 1356 3905 -1683 -3092 1854 8182 6037 -15849 -24519
654 -24519 -6575 2651 1102 -1491 -4673 -2306 -4488 -4111 11255 9701 -9704 -11528 1712 13267
668 13267 12853 2784 3936 2712 -10055 -5050 7506 1373 -11460 -16857 -4149 13426 9484 5215
682 5215 11965 8202 2621 7210 14985 16165 -3826 -22491 -11358 -2479 -11383 -14248 -10717 -5921
696 -5921 -7163 -6062 12419 20046 -506 -11822 -4737 509 -1358 -9703 -7649 1867 -2909 -2015 14703
711 14703 19768 8450 -4370 -2828 11598 8508 -3850 1059 4072 -2996 -2671 5621 13289 5526
725 5526 -11169 -5906 5922 1380 -3361 -5241 -7323 -8630 -13154 -5483 8705 2488 -6055 346
739 346 7880 9797 1831 -4511 -2111 -9964 -17182 -4140 4419 563 -2087 1486 12665 15013 5242
754 5242 5346 4644 -6076 -8199 -2246 3732 2773 -7514 -4772 8054 6004 986 4327 3568 -1455
769 -1455 -8694 -5908 6283 -115 -12624 -5620 3149 3293 1896 2208 8365 4616 -7362 -2513 5201
784 5201 -2254 -10424 -10723 -1190 5875 -1620 -210 10090 4195 -4049 -177 6518 6419 -4891 -8860
799 -8860 4228 5552 -3259 -847 1964 -263 -5646 -7769 3277 6984 -4080 -4275 3473 3727 -232
814 -232 -5093 -1520 2137 -6970 -6099 6573 7511 1949 1043 3999 7401 132 -5779 90 -1824 -8203
830 -8203 -4728 1122 4780 2170 -3251 3397 6566 -1560 -1890 1136 -890 -3928 -6216 970 7020
845 7020 -814 -1653 7089 5989 1298 275 1420 2758 -6116 -10091 -1130 -937 -6589 -4783 -248 4287
861 4287 508 -4977 1673 3628 -6318 -6814 -107 2673 -174 -4286 3510 10508 1576 -1286 6147
876 6147 5769 619 -2853 1323 8961 3347 -2348 5120 7023 1073 -2593 -1632 4060 443 -8401 -1684
892 -1684 3775 -3583 -7154 -4993 -2368 -4919 -12874 -9021 -446 -4774 -6405 322 3911 4461 585
907 585 1105 8344 3821 -2600 2328 5214 3607 1683 1782 8324 7928 784 4741 7812 1310 -2250
923 -2250 -2458 167 -162 -6917 -3591 2342 -2437 -3405 467 913 -414 -6757 -7677 -1365 -4809 -9398
939 -9398 -3713 -281 -688 -1926 -493 6363 3774 -4399 478 4808 691 -1399 580 5533 6084 158
955 158 3692 10379 4555 -641 845 4240 5012 -1793 -3335 3803 401 -5940 -2735 402 -669 -6783
971 -6783 -8970 -426 540 -6637 -3874 1225 -474 -3296 -4284 1358 3452 -4581 -4215 2964 2796 205
987 205 -621 2405 6187 681 -1244 5993 5291 -468 -217 2795 6206 2836 -944 4471 4334 -1832
1003 -1832 -787 1159 -331 -3669 -8049 -4314 -594 -5032 -4441 50 -650 -1725 -2194 363 3370 -2485
1019 -2485 -4939 1144 1023 -1704 -588 1399 3644 514 -1355 4950 4797 -1437 -1144 1595 2657 1030
1035 1030 -2315 1899 3890 -2397 -1851 3418 3248 -11 -3475 -598 4455 -1287 -3698 2044 1093 -2846
1051 -2846 -3277 -718 3455 -1171 -6220 -284 2010 -2718 -3071 -1659 1124 -492 -5218 -236 4989
1066 4989 -327 -2313 1701 4140 3658 -889 409 5293 490 -3105 1942 3009 1041 -1835 -1747 3478
1082 3478 2511 -2128 1490 2828 -472 -1795 -1924 1349 1054 -4841 -3072 1253 -1889 -3242 -1580 -480
1098 -480 -126 -3987 -2352 2408 -1092 -3425 -21 1206 1534 538 364 4570 2593 -1272 2897 4267
1114 4267 1622 -195 -825 2299 2152 -2918 -252 3149 -1100 -2791 -1008 1251 969 -3871 -2851 2389
1130 2389 -1190 -3604 -382 877 729 -1914 -2257 3502 1824 -3631 -763 2053 697 -1399 -2846
1145 -2846 1859 2251 -3836 -1563 3617 1533 -1056 -1356 1456 3580 -1485 -1740 3301 1080 -2101 -1238
1161 -1238 531 2380 -1194 -3345 1711 2192 -2084 -1217 1147 1970 138 -2505 1993 3379 -1410 -506
1177 -506 2414 1827 731 -1029 443 2676 -1648 -2387 1152 -150 -2224 -2469 -1994 214 -2088 -3862
1193 -3862 374 -134 -3296 -2143 -379 765 -457 -2319 1768 3144 -1183 514 3268 2521 1537 120
1209 120 2178 4328 -50 -130 3931 2509 579 -26 1022 3334 -716 -3125 1569 1342 -2585 -2631 -1355
1226 -1355 -4 -2680 -5720 -1923 -365 -5183 -5183 -2468 -1140 -1361 -3932 -724 3260 34 -1288 2731
1242 2731 3650 2972 1015 1939 5966 3459 290 3957 5054 2460 804 479 2561 1099 -3171 -925
1258 -925 766 -2041 -2798 -2254 -1087 -685 -4088 -3190 -86 -2618 -3988 -2120 -1025 -376 -2079 -1288 2175
1275 2175 472 -1763 1275 1834 701 460 176 2745 2406 -225 2364 3711 1283 636 755 1438 1386
1292 1386 -1788 -416 2320 -879 -1909 -192 310 103 -2588 -2431 1031 -1715 -3807 -666 732 213
1308 213 -530 -340 2767 1945 -2029 255 2283 419 -946 -1291 1580 2172 -1774 -520 3082 591
1324 591 -1766 -1614 -212 231 -2960 -2957 1437 637 -1532 221 1473 1991 118 -1992 1227 1330 -2450
1341 -2450 -1430 773 979 656 -816 1389 2968 -719 -851 1613 722 -226 -761 487 2607 574
1357 574 -570 2611 1430 -710 -663 -1224 -511 -1871 -3490 -714 9 -2460 -1528 -385 -558 -878 -2088
1374 -2088 -338 916 -1882 -1226 1514 580 450 328 1409 2729 36 -302 2959 2009 315 874 1658
1391 1658 2604 947 -618 2249 2150 -1248 -955 76 -78 -964 -2671 -182 1388 -2049 -2303 -199 -498
1408 -498 -1721 -3464 -2299 179 -2335 -3372 136 914 427 -4 132 2629 1064 -1535 1348 2941
1424 2941 1153 1154 1967 3823 3341 511 1398 2693 -291 -1809 -1161 -796 -494 -2220 -1809 744 -708
1441 -708 -2218 -667 -498 -856 -1866 -2281 -40 -557 -2208 -183 1099 -74 306 -107 1114 1029 -1110
1458 -1110 421 1684 214 320 1223 1467 2114 581 1219 3238 716 -472 441 197 -352 -1118 -1201 793
1476 793 -216 -2265 7 266 -1354 -1925 -1865 -375 -589 -2607 -459 1424 -64 -487 -155 594 1041
1493 1041 -1497 -1061 1926 749 -382 652 1612 1756 -17 -749 1880 1377 -1161 -167 1332 958 26
1510 26 -984 862 962 -1309 -803 909 304 -92 -734 124 1530 -1216 -1816 197 -537 -1568 -1444 -1048
1528 -1048 275 -632 -1688 599 652 -671 -49 697 771 618 -203 1287 1733 -416 -227 178 -268 -99
1546 -99 -682 16 1094 -706 -403 1158 455 42 472 438 1346 333 -115 1570 764 -765 -416 -282 -317
1565 -317 -839 -1616 236 799 -971 -408 680 290 -409 -1143 -134 986 -996 -1133 500 357 -585 -965
1583 -965 -321 890 -978 -1786 822 1322 191 -85 -121 638 -36 -1712 -73 890 -368 -145 899 1690
1601 1690 1706 -291 196 1705 -140 -584 434 1081 1096 259 449 2021 820 -1240 -582 -605 -1155 -1432
1619 -1432 -1801 -511 -422 -1796 -611 716 -443 -373 -996 -588 -372 -1613 -973 143 -829 -866 108 458
1637 458 1003 901 608 1851 1251 392 1475 1304 593 1007 1003 2499 2168 633 1370 1413 -105 -856 -758 -799
1657 -799 -1185 -2438 -1601 99 -1097 -1837 -1455 -1328 -1587 -2400 -1806 86 -381 -1322 164 904 963 90 -655
1676 -655 852 941 -489 931 2580 2333 1829 1432 2338 2296 43 -38 922 144 -93 159 602 1292 -370
1695 -370 -1367 97 -412 -1730 -1972 -2319 -1886 -1937 -2547 -735 -377 -1140 -599 61 373 372 -552 -334 324 -576
1715 -576 -11 1167 1384 2088 2116 2509 3160 1551 560 629 -520 -1108 -739 -568 86 107 -300 1205 1223 -450
1735 -450 -342 -1153 -1475 -1601 -1894 -791 15 -926 -510 290 -78 -93 -771 -628 6 -959 -522 1158 1004 372
1755 372 456 688 1538 762 -441 543 615 -358 252 607 797 196 -966 -100 970 -337 -413 -285 -101 -210
1775 -210 -887 -498 907 -79 -889 105 169 223 -237 -565 435 187 -829 601 1049 455 84 -19 393
1794 393 344 -1365 -1342 -406 -677 -400 63 616 1227 173 -28 843 26 -713 -394 -800 -522 -198 89 1089
1814 1089 822 206 362 222 -410 18 -553 -154 -147 -456 450 1128 510 197 251 289 275 -532 -178 215 -430
1835 -430 -475 99 233 21 -622 -962 109 -455 -1100 -341 -154 -88 -12 109 1476 1117 -7 114 661 -32
1855 -32 -336 -625 30 192 -615 -107 1228 715 161 200 107 522 -270 -921 84 160 -452 52 444 1045 441
1876 441 -827 -243 126 -1113 -1022 -955 -698 -155 -453 571 1370 374 -102 454 58 85 -380 -843 -110 -151
1896 -151 -567 775 662 423 595 330 458 105 -545 31 -73 -732 -466 -95 -58 124 -234 -170 789 -52
1916 -52 7 245 -371 -521 -416 -231 267 -376 -484 445 312 230 485 343 568 -82 -738 104 152 -658 -320
1937 -320 -204 231 286 -51 367 1125 352 -7 343 -47 -280 -880 -736 397 55 -508 324 235 257 -42 -106
1958 -106 419 227 -714 -161 280 -10 109 259 375 638 -77 138 645 -54 -446 -626 -763 -430 -863 -899
1978 -899 377 469 -67 410 402 487 197 -162 -66 334 -321 -175 88 -85 163 168 130 267 -319 259 318 -339 82
2001 82 116 119 130 -258 -333 252 -277 -201 385 138 -34 -48 -557 25 -458 -948 -340 -103 -398 4 213 403 474
2024 474 -283 -187 461 -152 -153 39 113 665 333 429 1189 510 -204 -108 -49 0 -302 -685 101 330 -262 361 -40
2047 -40 185 -219 -646 102 332 -264 -236 -68 -176 -148 -546 -548 -3 -399 -657 -150 -68 -48 -19 -301 297 466 108
2070 108 465 772 121 155 -321 -146 132 -365 60 665 633 1086 1302 788 474 -176 -477 -400 -1100 -1141 -699
2091 -699 -743 -134 260 -80 432 -38 -677 -310 -419 -700 -470 -502 5 64 36 506 729 -183 -82 130 198 465
2113 465 19 186 734 425 559 880 624 374 -74 285 946 87 -590 -310 -330 -811 -419 -376 155 174 -647
2134 -647 -177 121 -502 -278 -846 -320 29 -335 -69 757 434 120 123 -72 304 202 -228 -19 206 -192 294
2155 294 -20 -160 -141 -769 21 488 172 426 598 584 533 398 -233 -375 -1057 -1063 -539 -390 239 255 230 374
2177 374 396 206 369 -273 -651 -105 -133 47 350 261 323 107 -210 200 240 -417 -133 -253 -79 214 -90 -186
2199 -186 258 -216 224 432 379 304 -565 -644 -72 -536 -642 -297 -253 312 373 309 635 417 -319 -362 -374 -162 -79
2222 -79 -209 121 666 298 301 356 211 -458 -600 -273 222 32 60 543 181 106 220 -76 -177 -259 -809 -267
2244 -267 -21 -63 143 0 69 196 -207 -161 249 -127 -3 224 89 273 134 -143 87 -212 -87 384 74
2265 74 -120 -116 -283 -219 -172 -366 0 54 161 565 398 584 317 -107 -179 -247 -175 -372 179 -100 356 259 261 122
2289 122 -446 -587 -403 -457 -327 -350 -230 284 162 -142 307 178 -203 -182 -156 285 198 33 195 313 -283 -501
2311 -501 -21 193 305 -137 154 651 444 -2 83 -374 -376 -396 -421 206 129 -29 -42 3 -183 66 -525 -453 -299
2334 -299 -468 -441 96 185 263 47 79 648 222 291 336 197 9 257 -200 180 -118 -402 34 -71 202 481
2356 481 199 56 237 -165 -304 -550 -668 -519 -120 -230 69 345 66 88 -89 -68 -164 -103 -415 -188 125
2377 125 301 346 189 355 -69 -159 -61 -115 -15 -196 -107 -11 -34 -72 114 289 97 107 311 160 290 -245 -319
2400 -319 -261 -420 -496 -217 -227 292 317 89 679 212 -124 17 -322 -20 120 -369 -23 248 177 78 360 -115
2422 -115 60 -324 -383 -247 -269 -50 -28 88 232 281 146 236 -43 48 -8 -36 -36 233 8 -30 171 34 -4 -54
2446 -54 -138 100 -98 -90 -348 -399 -257 -408 -378 -44 281 159 285 143 -123 -60 -327 -599 -203 -393 -115 33
2468 33 333 405 315 341 412 375 107 339 -73 -102 -90 -99 -19 64 -45 -300 -103 -218 -202 -159 -298 242 -94 -138 -128
2493 -128 -274 75 -24 -145 83 -30 -64 -34 113 -15 13 -129 156 415 69 305 576 178 387 265 -31
2514 -31 -1 -70 -149 -63 -167 1 -243 -178 180 -9 7 -11 -133 -332 -195 -143 -239 -137 -188 -147 69 -77 149 303
2538 303 27 151 112 -73 -73 -22 -137 149 -202 15 313 392 693 318 425 272 -111 -249 -231 -156 -340 7
2560 7 -161 83 426 42 96 178 -134 -210 -401 -306 -141 -276 1 -19 -70 396 33 -9 138 -34 -144 -79 -8 -338
2584 -338 -25 265 283 256 248 412 634 269 167 -131 -35 -266 -293 -183 173 -36 52 131 -38 108 -26 -391 115
2607 115 -357 -615 -158 -73 -94 107 -61 26 36 -34 -32 -62 -167 -89 -51 -32 173 -14 292 417 357 205 367 392
2631 392 181 47 -2 -117 -46 -32 98 -194 -227 -113 -111 68 -57 -265 47 -117 -105 -298 -103 -275 -215 -135 -36
2654 -36 249 60 76 139 260 150 80 -99 209 -198 -29 199 202 215 138 311 156 246 -109 -5 40 -297 89
2677 89 -216 -124 285 -202 122 300 -79 214 -52 -371 -114 -216 -579 -63 -97 -165 13 -142 141 -104 -222
2698 -222 -222 117 -155 -8 -143 38 454 178 192 433 135 239 43 -143 129 -30 -129 -84 -145 99 87 129 -50
2721 -50 181 -232 -267 -23 -305 -301 -180 -179 -154 -68 -71 156 -17 182 40 -166 68 -15 -105 -22 -159 101 186 -55 257
2746 257 273 -5 178 288 80 147 -146 -36 -196 -254 0 -127 -67 19 -124 -158 31 -34 -42 20 -35 -50 124 31
2770 31 -105 105 68 84 107 -105 139 -107 -125 69 39 -64 291 -166 152 -116 138 250 33 58 -1 -110 1
2793 1 -3 65 46 189 16 -126 242 138 338 -84 -74 128 41 -194 8 -43 -33 129 -176 1 -77 -82 -30 -177 -15
2818 -15 35 -58 69 -136 -17 -214 -47 -122 -60 -85 -19 246 136 35 200 66 -162 210 203 32 250 96 -2
2841 -2 82 -35 278 -146 89 47 -44 32 32 -136 -172 38 -257 -353 -40 69 -210 -80 -96 297 123 -236 74 -44
2865 -44 -209 71 57 149 193 -148 -76 150 174 198 -13 -52 191 113 -1 307 29 -91 -96 30 288 -278 -158 -248
2889 -248 -83 -100 68 -19 -139 -22 -268 -41 126 -233 -90 -80 -145 190 -14 -53 193 273 -116 171 180 47 241
2912 241 -129 -1 7 27 255 -86 -23 -27 -213 -169 18 -208 -201 -356 -69 135 -24 -165 -249 -127 -241 -28 37 17
2936 17 -210 -164 22 22 -24 113 290 -11 92 1 55 2 39 -54 247 8 -63 222 51 -81 -139 -34 -112 -137 33
2961 33 184 -158 -136 41 -288 -224 -306 -102 -152 -67 -135 89 -18 212 70 -52 224 106 71 118 -61 -18 -6 205
2985 205 169 12 24 46 119 156 -77 -112 -2 128 12 62 -120 46 -108 21 3 45 181 -411 -211 -89 -254
3008 -254 -125 -127 -47 199 -80 -133 156 8 2 162 104 197 290 299 16 324 212 280 16 187 279 -57 -6 44 -127
3033 -127 -52 -105 -174 -6 -145 -207 5 -26 43 -147 -233 -98 133 -213 -27 -139 109 -21 -86 -141 188 73 -204
3056 -204 -46 133 109 128 87 23 230 137 301 110 74 127 96 151 49 19 -264 -63 -258 -132 -117 -113 -42 -41 -30 -147
3082 -147 -403 33 24 -121 -108 25 -119 -137 -32 27 53 114 107 272 207 193 62 66 25 66 130 59 254 -145 108 10
3108 10 -86 127 -130 19 -220 -171 -162 -356 -104 -44 -204 -122 9 -40 -65 1 -42 -55 -104 -208 133 147 -173 -75 -129
3133 -129 98 -15 -20 -49 339 334 -280 -108 143 66 188 98 -96 20 -164 29 79 10 176 -135 75 -71 -106
3156 -106 52 -48 -51 36 108 -183 38 -282 47 -60 -69 154 -22 -205 148 -76 -4 180 -168 264 16 -283
3178 -283 31 184 -203 -72 28 -338 -57 99 -166 -22 -83 -154 24 14 9 36 -92 -189 156 -134 159 -59
3200 -59 -95 102 181 -102 -68 23 -53 -54 -103 186 7 37 -319 -113 109 44 -103 104 195 -93 149 266 -127 2
3224 2 55 -109 116 80 -6 264 -63 -20 57 -31 110 98 -214 -104 -74 -60 23 30 117 186 23 107 66 200 17 36
3250 36 -86 262 45 -35 58 -94 -179 7 -19 53 38 -106 88 -125 -137 85 -137 126 -3 104 16 -113 89
3273 89 134 142 110 -170 53 -103 26 -70 -169 -274 70 24 112 14 44 18 68 42 -153 -203 -66 52 -153 -58 -106 -249
3299 -249 81 111 142 447 80 72 119 176 16 113 123 131 134 -12 334 180 -63 34 -95 -17 -17 -148 -59 -262 -170 -9
3325 -9 -199 103 57 215 -183 145 -162 -181 -46 -76 -200 -284 -151 79 70 103 146 64 234 75 -155 -23 25 54
3349 54 28 -89 12 -11 -137 -82 179 -271 -55 -120 -115 -174 -111 -173 109 -206 -29 45 112 150 112 -143 63 49 -54
3374 -54 61 10 243 179 249 65 63 188 169 101 -97 -72 -42 -181 -101 -173 -219 -19 -81 -121 139 -200 81 36 -145
3399 -145 -19 -12 -187 137 46 84 76 158 2 59 -46 203 55 -229 160 110 -97 -104 -272 46 134 95 82 210 182
3424 182 231 -30 17 203 27 29 91 -47 -179 -135 -131 -131 -311 -167 5 -235 -304 -25 -207 -51 -26 131 44 145
3448 145 -141 349 33 59 199 -64 -92 86 -48 -25 104 201 45 352 204 162 217 45 32 80 172 100 98 -182
3472 -182 33 -57 62 -141 -111 -158 -72 44 5 -239 92 -58 -132 -54 35 47 61 74 5 137 202 232 129 220 125
3497 125 178 -44 319 61 11 40 328 31 208 74 10 469 -94 -122 338 -5 6 243 -24 224 -6 -84
3519 -84 -49 -161 -79 65 -228 -112 61 -188 -56 -72 -16 25 180 -157 167 94 -24 307 134 -91 153 -3
3541 -3 -37 237 63 4 27 -44 -54 -17 -157 139 11 -49 123 -219 -64 57 -181 -213 -8 -116 -31 44 -264 -162
3565 -162 142 36 279 -20 -214 -22 17 -37 -225 13 139 -34 36 209 -58 165 120 -45 117 57 -55 215
3587 215 -119 -64 14 -109 -111 -11 -46 51 16 -26 -65 -43 -219 63 89 100 21 47 67 -125 43 60 71 -52 -129 15
3613 15 -177 64 104 -30 166 87 41 31 -28 -7 -93 -66 -123 -91 -116 156 120 44 122 154 -26 60 20 -139 -257 -108
3639 -108 37 -149 -324 -50 99 30 -1 -127 31 157 243 38 42 9 78 13 112 177 -127 -126 50 -222 170 91
3663 91 -206 -52 -178 -245 198 72 117 219 39 -65 40 90 -132 -152 -113 -138 -38 -78 25 248 -109 145 286
3686 286 98 116 -188 18 -43 11 176 -161 115 -18 -129 224 169 -84 -341 101 91 -30 -234 -247 120 -55
3708 -55 -164 -53 7 62 27 65 18 230 -166 75 -48 -250 5 -104 0 47 -52 -142 14 -408 -58 -78 -37 171
3732 171 -38 30 64 137 4 127 -31 -54 -27 -25 -10 58 -16 -95 44 -154 -115 -190 46 42 -68 -162 -113 -118 144 137 -29
3759 -29 1 -36 165 18 17 155 -14 -122 155 -32 86 -85 -230 -230 100 166 -95 34 135 -35 -18 17 -31 37
3783 37 -51 133 161 81 33 130 63 -14 67 -61 69 -223 37 165 -150 59 120 -205 20 -166 22 75 -38 -207
3807 -207 153 76 -17 -133 95 47 -253 -232 26 -51 21 166 -122 82 -36 3 -55 91 -87 207 33 163 42
3830 42 -58 -97 -38 -101 -110 -65 70 -40 -70 9 10 37 -90 -66 -48 -85 -90 56 -96 84 -289 -188 -49 -67 51 91
3856 91 79 234 65 -125 -14 -19 197 -20 -136 131 53 -102 -152 0 120 51 -7 -141 118 25 -221 29 -228
3879 -228 68 -120 -346 -95 -280 -219 -81 -86 -198 110 88 205 52 221 116 -123 -19 192 36 115 107 92 57
3902 57 -42 6 -21 90 73 44 -91 -210 -22 -170 -202 -62 -313 -159 -24 -85 -187 -72 -72 -81 -17 -58 147 14 -20
3927 -20 8 185 257 -8 59 28 89 120 111 -16 64 80 -10 71 174 -165 -50 -62 -92 115 21 -252 14 -190 -477
3952 -477 -149 -165 -122 -106 -308 0 166 -28 -40 17 -31 273 -50 311 514 -181 113 67 80 58 203 35 23
3975 23 -151 176 22 -77 63 205 -52 -73 73 -215 -157 -149 -132 -319 112 133 131 115 -30 -27 91 77 -5 -5 139 164
4001 164 -92 296 -85 90 83 -95 138 78 -55 1 -88 -74 90 75 -274 -170 -98 -274 109 17 42 -134 -62 -85
4025 -85 96 -80 100 -13 85 114 -114 -96 243 -55 29 -92 -224 -34 -112 -231 -117 -128 -110 -1 30 -128 167
4048 167 24 -15 291 -147 -73 -164 -172 183 -108 -224 -6 157 -17 87 146 -3 31 -221 6 -64 -132 82 -209
4071 -209 119 103 192 -59 -42 -165 -1 22 36 89 28 -134 -57 36 -142 135 -19 -294 35 -264 -6 30 -63 1
4095 1 -99 -174 259 109 47 3 -117 123 -225 -157 121 -18 -87 -42 33 61 -49 74 47 164 185 -56 -140 -153 -1
4120 -1 56 115 169 33 -209 83 -4 43 -8 -136 -197 10 26 -145 34 105 -92 -1 136 141 -9 -133 118 110 -28
4145 -28 -151 -141 -16 -291 -41 175 -226 35 -86 -9 -85 69 33 27 -132 -61 -15 51 234 28 60 60 -37 40 -33
4170 -33 91 -19 -99 54 89 118 -39 -93 127 -27 -66 -44 66 -62 -84 -62 -43 56 215 -110 132 35 -165 -22
4194 -22 91 230 -88 -152 -9 -128 -132 -198 -12 204 -156 31 -99 40 -178 -40 24 -13 -109 66 -18 73 -35
4217 -35 94 58 -34 84 -140 11 -125 210 -131 119 -263 169 56 -19 363 72 97 1 17 180 -38 -86 -211
4240 -211 105 -370 -85 -174 -94 -135 76 -28 -217 179 135 116 41 -105 301 -40 215 45 -33 175 -46 -16 162
4263 162 -40 13 -18 6 25 -151 -148 -130 -162 10 -45 -34 -147 -29 -74 90 169 -200 31 -56 95 205 49 -158
4287 -158 199 -20 -105 254 235 179 48 -71 34 50 -223 98 -21 -118 117 -229 48 68 -97 -57 -130 -22 -164
4310 -164 -204 -172 39 -385 -240 20 -105 -96 197 -22 198 -46 59 33 -36 -20 128 64 76 347 316 385 370 162
4334 162 -106 -68 -229 118 -219 57 152 -68 -33 -38 -230 45 27 -282 -148 -56 -375 -128 -106 -65 62 -37 24 -85
4358 -85 134 110 -116 -129 -9 4 -211 -174 112 182 332 111 246 320 211 207 19 -44 -130 -36 -235 -23 -46 -128 -76
4383 -76 -69 282 76 -133 61 -21 -209 -339 73 -118 254 153 164 173 79 -114 72 -153 -1 131 15 107 163
4406 163 60 208 275 17 150 -56 246 268 257 29 212 -211 -8 -177 -128 -88 -124 -27 42 -142 -24 -58 -191
4429 -191 138 30 -242 94 -70 -154 142 16 74 45 -93 -105 123 -149 -16 -104 87 -64 43 173 -61 -138
4451 -138 -210 49 121 144 311 17 135 -27 -38 -10 -28 -129 26 45 -71 24 -172 -1 88 -112 80 50 22 25
4475 25 -35 -32 -12 -144 -28 -83 73 -126 84 313 14 55 -241 163 112 -373 -84 -97 -50 100 104 -21 256 171
4499 171 -70 220 152 158 -30 -147 -90 -230 -15 -16 -66 155 -105 62 -57 1 -93 -61 -131 -90 -47 8 34 -30 18 62
4525 62 187 102 153 -146 -234 65 -2 -170 35 -136 -112 -151 -53 -40 40 24 -6 195 -144 -48 -213 146 213 22 25
4550 25 -2 247 81 167 -126 -108 -118 -299 -127 -153 12 -17 -223 -60 174 197 82 322 26 351 -227 -356 -78
4573 -78 31 -219 -74 130 29 119 -47 255 -155 -167 197 -231 -95 84 -151 95 228 60 -111 123 108
4594 108 227 -221 -204 28 -58 -107 -65 -179 -94 5 14 102 40 -86 -19 -50 -60 -98 -66 66 14 -136 25 95 179 229
4620 229 66 -90 3 -82 -18 15 -192 -39 32 60 -7 -54 -27 206 -40 99 145 -106 -182 203 -65 -126 131 -217
4644 -217 -115 -61 -134 -163 -178 186 -145 -95 -136 133 -49 -138 1 -46 -54 169 156 273 306 -92 -35 253 33 1 -33
4669 -33 -52 4 -42 69 -215 -199 113 35 -46 76 81 -215 -62 -147 50 -138 -39 129 124 -97 139 -85 143 -5
4693 -5 -242 -114 -158 -246 -32 -163 -86 94 117 57 282 130 17 -31 -25 6 -36 -9 -183 -165 -110 18 -112 -51 60
4718 60 108 61 101 -150 -76 -280 -191 130 57 -4 101 248 274 46 207 218 96 -30 63 -90 -267 -217 -67 -194
4742 -194 43 -33 -17 303 253 123 -44 -68 -40 -53 -161 -418 -63 4 -54 14 94 247 47 -115 157 -36 -90 -142
4766 -142 -168 69 -151 107 201 323 116 267 -99 105 44 -216 -231 -276 -151 -126 -281 121 56 -64 95 141 35
4789 35 -125 -30 -42 96 76 -266 208 125 297 120 249 146 183 186 -26 -39 -158 81 -10 -234 24 -67 -69 82
4813 82 115 64 136 163 25 -67 -214 -171 -100 -15 -143 -206 9 256 -54 96 -58 60 116 -72 -112 -35 87 -158
4837 -158 22 -1 154 -156 -265 108 210 -214 21 63 -109 -55 -184 -76 115 1 -110 -46 80 -57 -60 -124
4859 -124 15 78 70 312 107 77 -34 47 6 -34 102 24 114 -129 -115 -151 -146 17 -259 -109 144 -73 -44 39 22
4884 22 238 15 172 -3 -303 -215 -14 -107 -250 54 37 184 22 -66 119 123 28 93 -130 118 -133 -172 -3
4907 -3 -37 139 32 178 -23 206 90 168 209 -86 -111 -24 -83 -91 -119 -6 23 170 159 139 256 82 192 -358 -48
4932 -48 -181 -304 -92 127 -141 76 87 312 170 105 -122 -145 18 -341 -394 65 -49 -63 -106 171 207 169 121
4955 121 92 29 144 -22 51 -42 -280 -253 95 2 43 207 51 47 78 -308 -298 -226 -30 62 -15 109 39 -34 -136
4980 -136 235 85 69 89 -110 -153 -221 -135 52 -50 -41 161 94 234 92 108 221 33 1 -43 -58 -222 -2 -45
5004 -45 -10 6 -77 397 -12 -49 -70 -102 -78 -324 -159 -11 84 -134 -16 179 90 221 -20 124 481 26 -63 50
5028 50 7 -37 -278 -63 -122 70 -18 103 303 -5 68 -97 -13 149 -180 157 -71 131 112 258 94 302 -112
5051 -112 -39 204 29 -48 -40 -36 -85 -89 -101 114 89 25 202 102 118 -10 75 -308 16 -240 -121 37 -332 84 28
5076 28 -135 -134 303 -162 56 104 0 9 -132 -187 -236 30 79 169 8 187 -25 99 -110 -25 -139 8 -258 25
5100 25 -81 -295 -186 6 53 -74 -159 -166 82 11 -149 -63 -237 -105 -112 -38 234 231 -79 185 132 -52 -6 -365 -141
5125 -141 -111 -106 66 108 110 83 -70 195 216 -90 -157 53 -53 -206 -46 -218 44 -133 -52 131 -12 42 -29 -23 -36
5150 -36 -257 204 -107 -206 -112 -7 156 225 235 236 345 193 -51 -18 183 -128 -81 -315 -10 239 -88 32 220
5173 220 93 -27 212 84 224 154 33 -232 89 -79 -186 -102 9 89 -134 102 45 45 135 9 -312 -54
5195 -54 -87 -67 42 -58 -167 227 169 55 103 44 -80 -44 19 -8 61 -180 -46 -141 92 72 68 -3 185 -152 -121
5220 -121 49 16 155 70 -75 123 233 181 71 183 136 -129 -104 -137 -69 8 -97 104 -106 198 14 -98 57
5243 57 -32 -114 -127 96 -354 -142 -219 -12 165 -117 76 -22 -75 205 -18 136 52 192 -139 -40 -89 -15 -60 -157
5267 -157 17 11 140 295 -62 -1 17 -120 -195 37 -59 -336 -197 -59 75 128 174 -5 13 -52 -214 -176 -54 -303
5291 -303 -231 -108 159 61 69 22 229 72 23 43 -225 -79 22 -188 -171 52 -60 -10 184 110 39 15 96 35 -122
5316 -122 -267 -188 -73 -312 -88 104 30 169 129 50 11 -74 123 34 -163 -7 -147 -276 234 -38 3 265 269
5339 269 178 -71 74 -67 -174 -157 -34 -165 -110 -122 42 -193 150 47 245 194 8 254 -42 -224 -82 -20
5361 -20 -2 -56 -131 -229 -18 117 164 124 16 -246 -30 -32 -107 33 -213 -196 -40 -29 91 65 89 164 -55 -79 47
5386 47 -367 -86 45 -169 276 24 -133 86 157 -136 164 -17 70 121 -72 29 -110 34 54 -23 60 281
5408 281 181 -185 -209 -139 -3 -142 -18 45 -68 -39 166 14 28 130 -39 194 9 -127 -78 150 -37 -52
5430 -52 53 -93 173 -120 -63 18 152 235 94 -261 -116 116 13 -8 -118 -180 87 -130 7 29 -25 184 -72
5453 -72 173 111 43 -200 161 -52 -145 -54 -10 8 33 -22 232 250 -138 163 192 64 -113 -156 -185 -10 -76 95 1
5478 1 66 -196 -24 -101 80 -181 62 -141 53 146 90 -40 214 189 -46 91 207 66 -290 -120 -197 233 -28
5501 -28 -254 109 31 12 1 -201 -94 85 -153 -227 -139 -355 -98 -158 -138 56 187 53 80 -55 250 286 -49
5524 -49 185 -81 38 29 -51 55 185 277 113 164 29 207 42 -125 40 -295 -155 -287 -136 -227 24 -296
5546 -296 60 -35 -129 -42 62 -151 -169 -53 39 -24 132 149 168 230 37 196 195 133 71 -130 27 9 31 18 -119
5571 -119 51 127 -30 158 74 13 -100 28 -196 -112 -191 -113 -3 -91 -10 53 116 -54 -28 -64 -66 -54 -71 -154 -373 45
5597 45 163 83 125 129 -33 69 -97 103 151 30 -67 -22 -211 -167 141 46 -56 90 -221 -126 -104 -135 -22 -130
5621 -130 -304 154 62 -44 123 35 319 184 -176 42 177 -235 -22 -122 -142 -11 -234 -79 190 98 149 163
5643 163 205 86 -25 -89 21 -39 -194 60 -86 -145 174 -23 131 212 -52 -58 9 19 18 -106 56 133 54 36 393
5668 393 249 71 24 264 -49 -80 -72 -72 52 -168 74 -27 14 191 -19 201 9 39 134 -90 -143 157 -127
5691 -127 -280 100 -106 -136 26 -146 -100 87 189 -58 -53 -49 -88 -3 -124 123 -154 161 64 327 155 -143 -268
5714 -268 -1 -184 -190 -44 3 69 15 35 -36 227 -292 -119 -107 -119 67 22 -210 129 142 6 -119 49 116 146
5738 146 25 123 -133 43 210 104 -24 -72 -128 -8 -196 -183 -53 8 -34 338 90 -81 160 -61 -57 -20 -73
5761 -73 67 -43 -222 -25 -72 188 -101 75 -141 85 43 -255 -4 -104 18 157 -61 -100 113 -28 166
5782 166 47 79 73 -55 27 -18 -30 -254 85 -46 74 -11 148 15 34 37 146 148 -89 80 -376 -105 -207 -16
5806 -16 11 -95 -87 134 177 163 5 -105 -17 141 49 -93 75 9 40 101 -59 211 89 -46 -103 -32 -43 -64 -58 -329
5832 -329 -106 38 -99 -166 203 -56 -49 26 80 45 45 -95 -139 35 -110 -138 -18 114 108 19 -100 169 10 71 -307
5857 -307 -54 -281 -67 111 -10 29 71 84 112 122 74 -45 45 234 88 -102 -74 -83 -95 115 277 34 159 64
5881 64 244 85 123 -62 -188 -31 -59 -259 -70 22 4 183 -6 -104 213 -84 -37 -226 -21 -235 30 156
5903 156 123 277 191 42 -152 -183 158 8 -77 -201 -106 -8 11 51 69 236 -61 -41 76 -76 -131 -29 -132 -213
5927 -213 -76 -107 -24 52 117 70 -57 96 111 -224 -186 166 -39 116 10 -161 -170 -21 -55 371 -48 -26 41 87
5951 87 14 -148 29 -43 151 -308 128 94 35 152 -102 213 18 -42 -61 169 -117 114 -135 12 87 115 -31
5974 -31 184 61 110 152 41 -96 -48 -188 38 -226 -54 -95 -4 -69 84 20 -213 -31 -185 0 -131 25 -63
5997 -63 127 64 192 156 118 164 -12 98 -116 12 35 -40 145 -22 106 27 105 64 -237 -49 26 -121 -10 -22
6021 -22 142 -16 -120 -26 -177 61 84 -108 -146 321 -91 95 29 30 68 -15 -68 -118 -164 -126 61 -88 -113 184 7
6046 7 99 -207 192 -212 293 160 66 71 -64 94 -107 38 -136 16 -77 -22 -76 -87 101 190 -66 78 -55 21
6070 21 -45 131 -28 5 -118 77 -147 -56 -233 41 12 15 -67 24 -131 17 -34 -95 -103 -100 -96 -197 -51 -108 -50 62
6096 62 80 295 28 -127 -125 85 -20 -69 36 60 150 57 -92 143 120 -10 29 -127 122 -20 102 29 33 -84
6120 -84 115 -193 17 -31 -20 26 62 175 189 -82 70 7 -31 -43 -196 -74 112 32 -97 -90 33 -219 43 47 28
6145 28 53 -222 -57 -24 102 -92 13 78 70 -160 -128 49 44 188 -85 -40 109 103 -110 90 85 -95 -14 -36 -11 188
6171 188 -22 -98 -59 -320 32 16 60 -6 -96 -94 214 156 71 149 -42 113 4 -20 12 -162 -137 14 -177 -18 30
6196 30 -83 101 -6 32 133 -189 -73 -98 -152 -109 76 -358 144 40 -64 -50 -96 -146 -30 32 103 -105 59
6219 59 -43 -63 -267 -16 5 13 223 150 66 65 144 13 214 -84 75 99 19 46 116 19 21 -128 2 71 -37 5
6245 5 114 -160 -232 98 82 -33 158 60 -100 166 -92 46 54 75 19 -87 63 252 87 -61 43 12 221
6268 221 -1 97 -51 -60 146 24 171 33 -87 -41 -54 -16 -33 7 -73 -49 63 -113 -153 100 -15 4 69 -120
6292 -120 61 58 -219 -186 126 31 0 -40 66 -5 -337 -112 68 -78 -19 23 -141 8 82 -90 29 -51 72 -137
6316 -137 105 -194 -25 -127 -267 66 90 208 198 -50 177 20 76 -39 68 -30 -124 -38 -18 208 81 164 30
6339 30 43 214 -74 237 300 -129 198 59 -67 -4 -31 -75 175 1 -20 -28 -61 -7 28 -92 173 107 161 -294 -9
6364 -9 -17 -12 -60 -148 -51 49 -96 179 -107 82 150 -134 4 69 -47 -26 11 -105 98 -106 80 -56 -40 -59 110
6389 110 43 172 156 -82 -116 80 -6 -86 -79 29 223 -149 -68 -61 -34 -174 -88 65 12 -100 -2 -50 48 -345 -20
6414 -20 -77 15 -123 68 85 145 -122 147 -33 -77 10 -12 59 -78 -80 41 123 -162 -5 -278 -32 79 -52 -36
6438 -36 -3 -38 -26 -44 -177 68 230 -131 3 -66 56 -137 -149 46 -75 48 20 137 -102 -85 -296 -257 64
6461 64 55 -41 68 -69 -93 2 -146 69 -108 -103 -137 -178 -14 -27 79 -165 0 49 21 197 -40 -68 141 71 -70
6486 -70 -215 87 81 95 96 -91 165 -31 64 -74 136 10 -271 140 -71 51 70 -27 65 50 249 -4 1 -79 108
6511 108 3 -87 -200 65 -133 261 -144 116 -53 -81 20 -45 -144 55 205 -151 -161 -107 24 64 -60 21 291
6534 291 -38 53 53 -152 -129 -15 -32 13 -85 88 16 46 136 -79 106 92 78 59 -8 97 117 72 206 -21 73 181
6560 181 282 -75 118 -122 104 -141 201 -135 -85 181 35 -4 -24 48 -14 -11 -43 -292 73 6 30 -20 54 53 179
6585 179 106 -22 134 38 -12 -159 -144 -31 33 -21 -15 142 -64 49 140 -1 -15 164 66 -71 -76 189 -186 40
6609 40 83 -28 46 -84 -64 217 -104 189 240 -35 101 -41 120 -125 75 -184 18 264 -63 48 106 -53
6631 -53 -258 255 -89 44 328 205 78 27 106 -219 19 103 96 -168 -24 52 -88 -18 -28 28 79 99 -15 -126
6655 -126 -33 92 -94 -12 -58 64 32 31 -21 -9 170 -16 -94 -77 -80 17 0 107 -149 59 92 113 -193 220 206 -197
6681 -197 -64 146 80 8 -115 -158 121 131 98 113 -129 101 -275 -33 -61 -95 -15 178 99 -67 65 -72 -124 -217
6705 -217 -102 -361 26 45 62 -19 -34 -59 -143 76 33 -93 7 42 -156 -205 -25 -77 371 7 -139 145 -197
6728 -197 -176 60 -144 -29 -173 -206 -17 -59 91 -153 -4 -163 -66 -7 -117 61 13 5 -134 131 -187 134 116
6751 116 21 -68 141 151 -139 39 -100 27 63 47 15 31 -57 -23 11 232 -26 -122 -98 -3 -117 -23 -146 -34 106
6776 106 -56 192 -50 -14 54 -70 -104 -41 11 136 -149 8 75 -96 -40 130 24 129 -36 -36 34 -158 -55
6799 -55 26 -118 -161 4 68 188 21 -15 82 1 171 65 -42 -19 -129 -4 111 -212 42 7 11 -39 14 -51 -106
6824 -106 -41 179 27 16 17 65 -153 118 206 4 -68 258 -134 -68 -45 -1 -84 55 -75 160 52 -194 81 -164
6848 -164 64 -63 -8 -102 -198 -28 33 70 -49 112 19 1 -104 -58 -121 55 -8 -59 -22 -123 32 58 -179 -149 5
6873 5 -24 -176 -59 -114 151 154 -46 237 91 79 52 200 111 250 77 -49 -2 69 -12 -52 -6 -86 33 -76 -17
6898 -17 162 97 -154 -23 88 29 -52 16 -31 -104 121 -55 116 174 90 -124 -28 -365 91 -101 -153 203 44 205
6922 205 18 138 101 -82 -67 61 -23 65 -261 -162 232 142 -150 8 -183 -5 -41 115 -99 -102 -93 -26 70 99 -55
6947 -55 -41 -8 169 24 -13 -178 -113 -20 40 -19 111 216 -123 25 -32 -36 -173 -28 -4 -190 99 342 65 53
6971 53 -1 -109 -150 16 -4 -1 -82 -68 137 116 -59 81 -61 -36 166 -168 194 -11 164 -131 114 -64 18 -8
6995 -8 -23 99 -90 -159 157 3 -194 -160 -49 184 2 21 -44 -54 102 -5 23 108 263 122 -59 -79 -54 32
7019 32 -170 -143 114 -145 -99 87 79 10 11 119 7 -191 16 81 -227 -206 -25 56 -430 293 115 -84 27 -88
7043 -88 36 27 64 -186 -5 -6 37 103 3 -23 75 8 -55 93 -192 148 47 -209 -90 20 -180 71 -16 32 -10
7068 -10 -48 -171 29 -24 45 95 26 51 11 118 -201 -131 38 -5 -84 41 -142 -43 144 -100 -37 -36 -57 32 -105 -61
7094 -61 150 -26 -62 74 105 -96 -21 -72 -56 6 42 -44 17 118 18 -40 78 239 -15 5 -108 -141 -3 -60 -118
7119 -118 -95 23 272 -80 -253 -152 60 -200 -4 118 12 19 -98 -10 -142 10 37 283 158 -65 -168 14
7141 14 -74 -102 64 29 -133 28 153 -121 16 -62 56 60 147 92 91 -34 47 -156 20 -117 3 -68 -45 8 -43
7166 -43 55 -64 89 -93 -151 -42 -52 -30 -77 212 112 -2 35 -20 -187 120 73 -93 36 41 -34 -45 217 -136
7190 -136 223 -43 -59 4 291 218 36 34 -140 -212 -128 -63 10 -47 142 -204 -51 -39 -77 196 -24 -36 -168 132
7214 132 -5 17 -73 71 21 118 -201 -3 -94 120 171 93 -53 -250 44 -133 248 7 -92 31 -149 -41 50
7237 50 245 -72 60 81 -146 12 -27 92 39 83 -4 -51 23 27 -109 74 -49 94 -13 -133 31 94 -123 101
7261 101 -79 -114 -38 -15 -186 77 90 -84 -78 -82 -263 -1 256 -88 178 87 68 -62 38 -60 -39 -3 133 -88
7285 -88 24 192 -66 -142 -126 77 -86 42 -15 -70 6 60 -114 1 -10 40 76 256 -177 -110 244 12 68 -6
7309 -6 -33 21 51 236 -94 -150 -199 168 -21 -43 92 67 -26 -257 -154 -102 -96 74 -154 -139 104 -110 59 -12 233
7334 233 -94 -134 89 -198 51 18 -126 118 -88 -18 324 -47 -87 -26 40 129 76 119 92 115 7 10 -37 -60 168
7359 168 49 -39 30 71 41 144 32 -253 252 6 -103 -220 -78 50 -218 -57 125 -216 130 -131 -30
7380 -30 72 127 111 39 -279 -119 8 -30 -11 53 -7 -104 133 106 7 -42 -102 51 92 43 -61 93 49 112 -117 -35
7406 -35 67 30 261 -50 -229 27 39 69 -26 -61 26 -118 73 23 62 117 192 11 -125 -353 92 2 92 16 -19
7431 -19 16 45 -158 140 -170 -127 172 -106 120 -158 -176 252 255 17 27 109 -218 60 13 46 69 32 -109 -122 -274
7456 -274 14 51 66 -68 66 -135 204 66 51 14 -16 52 5 -304 70 24 51 16 -8 -25 -56 -38 -96 -151 60
7481 60 47 -148 98 105 16 -132 4 85 -148 23 -39 -83 49 14 165 150 24 -64 -92 -144 78 -313 -66 -178
7505 -178 -47 89 -11 -310 -17 -219 -46 124 -16 82 65 10 169 -50 43 263 10 -91 -80 226 -145 -146
7527 -146 -38 97 -15 -23 34 -149 99 -62 -28 70 -112 175 120 -70 3 -147 78 -119 -118 42 79 132 -56 -176
7551 -176 15 -134 -72 142 67 -70 33 -172 62 114 -240 164 91 -210 146 -21 4 62 -271 -77 104 -43
7573 -43 45 -179 210 -202 -85 -17 55 -31 269 89 102 -14 31 0 -214 16 -153 -118 -116 -229 46 -46 -9 127
7597 127 2 -187 79 14 8 19 -111 54 -232 187 102 12 127 28 -15 76 128 31 75 -118 101 -110 -171 -94 71
7622 71 137 109 -128 -81 -103 -50 -38 53 229 42 -17 87 -22 -87 76 -43 -59 -31 -73 -147 8 -134 73 53 7
7647 7 115 230 0 59 -44 -50 41 -123 61 26 136 121 -143 15 -8 -42 63 6 -100 65 -85 93 -43 -318
7671 -318 -91 156 59 73 -78 -32 36 -66 -182 192 -242 -46 95 -103 -40 -72 -136 143 -75 11 -181 -201 141
7694 141 38 -134 60 -122 14 213 -98 140 -119 -90 -38 8 -11 10 -134 18 76 -63 6 238 10 106 -31
7717 -31 -45 -85 -14 -15 -163 -10 -50 173 24 -114 -145 129 14 23 -3 54 212 117 -119 277 -32 39 98 -25 39
7742 39 -84 8 66 74 108 25 33 -256 -28 -237 -290 65 30 94 20 -216 158 50 265 -74 30 -110 106 91 125
7767 125 -147 180 -32 119 95 34 79 -235 -3 -24 -1 149 -72 -145 -22 -104 18 14 -23 -76 201 71 96 -47
7791 -47 -104 -82 37 243 -8 -130 -5 -186 -60 69 38 -152 220 163 -121 149 289 69 58 203 -98 43
7813 43 -167 -88 -11 -28 -64 -42 173 -58 -28 -57 -101 -240 -86 244 -53 23 83 -166 -40 -8 -131 -105 214 -67
7837 -67 -73 73 201 -59 -92 41 -71 126 55 -45 135 -63 17 -76 3 -91 -4 80 -101 36 -40 179 80 -63
7861 -63 -37 -155 -216 150 -49 -2 128 -155 -31 150 -23 -98 88 -255 -145 -118 -56 6 -100 69 -31 21 120
7884 120 6 -136 47 -133 36 -31 170 80 -106 -94 31 -14 200 103 -38 235 78 32 -141 46 -148 -70
7906 -70 63 -39 18 -68 32 9 -117 -1 -215 -55 -78 -116 -101 1 -25 -23 -100 82 -20 70 43 -6 87 200 -219
7931 -219 121 47 -159 42 -37 -122 -126 41 13 48 -85 -18 33 134 78 -187 100 -3 -84 -54 -32 -195 13 0 -65
7956 -65 -65 59 78 -31 -56 -37 -24 -286 251 -238 -237 317 -97 75 -114 75 106 106 -80 65 -59 -119 153 68 30
7981 30 5 -99 -104 -9 -122 -32 224 317 108 17 -42 94 145 216 -69 -89 5 -128 33 100 138 -155 87 15 13 65
8007 65 -65 -2 169 96 37 12 -2 -136 97 -74 80 -18 -328 -12 87 64 -106 137 -95 47 -32 -24 75 134 35
8032 35 103 22 -21 -153 115 -1 95 -22 -89 -34 144 116 -199 -1 134 -20 186 125 44 -19 169 33 -97 56
8056 56 252 21 162 82 -166 74 -124 -70 -41 -91 -181 129 144 39 111 -13 64 77 -10 37 90 -60 31 -35 -23
8081 -23 131 11 -45 -95 103 -62 -79 -12 28 56 -108 -119 21 -227 115 298 50 101 -102 80 119 -139 -157 -176
8105 -176 -198 -89 117 56 68 -70 -4 -122 -51 -144 -49 80 -42 -65 -103 10 86 -32 -38 43 -133 -51 -64 157 90
8130 90 42 19 -30 -7 227 140 86 107 182 -3 -76 133 -24 48 -26 -7 267 25 241 -18 -22 -79 -29 33 202 -23
8156 -23 83 58 110 93 92 -51 55 -94 -78 -115 -129 -258 -63 56 -91 -48 -21 97 46 6 15 114 38 319 -43 -233
8182 -233 -249 139 21 191 -121 36 -169 110 59
8191E9
##END NTUPLES=NMR FID
##END=
