##TITLE=1H_107-2025-Bay
 200.13MHz, CDCl3,
 8 sc
 
 3.9.2025
##JCAMPDX= 6.0         $$ Bruker NMR JCAMP-DX V2.0
##DATA TYPE= NMR FID
##DATA CLASS= NTUPLES
##ORIGIN= UXNMR, Bruker Analytische Messtechnik GmbH
##OWNER= pz
$$ XWIN-NMR		Version 3.5
$$ Wed Sep  3 14:12:01 2025 Russian Standard Time (UT+4h)  she@DPX200
##.OBSERVE FREQUENCY= 200.1313
##.OBSERVE NUCLEUS= ^1H
##.DELAY= (6, 6)
##.ACQUISITION MODE= SIMULTANEOUS
##.ACQUISITION SCHEME= undefined
##.AVERAGES= 8
##.DIGITISER RES= 18
##SPECTROMETER/DATA SYSTEM= spect
##.PULSE SEQUENCE= zg30
##.SOLVENT NAME= CDCl3
##.SHIFT REFERENCE= (INTERNAL, CDCl3, 0, 14.3821)
##AUDIT TRAIL= $$ (NUMBER, WHEN, WHO, WHERE, WHAT)
$$ ##TITLE= Audit trail, XWIN-NMR		Version 3.5
$$ ##JCAMPDX= 5.01
$$ ##ORIGIN= Bruker BioSpin GmbH
$$ ##OWNER= she
$$ F:/spectra/data/she/nmr/H-C/1/audita.txt
$$ ##AUDIT TRAIL=  $$ (NUMBER, WHEN, WHO, WHERE, WHAT)
(   1,<2025-09-03 14:10:44.79 +0400>,<she>,<DPX200>,
      <created by zg, POWCHK disabled, PULCHK disabled
       configuration hash MD5:
       00 E9 B6 7A A2 85 ED C7 34 08 36 98 17 FE 4E 26
       data hash MD5: 16K
       AD A4 35 5A 65 3F A9 6C 89 C8 13 CB B8 25 97 2B>)
$$ ##END=
$$ 
$$ hash MD5
$$ 2F B7 84 83 3C D6 37 6B 39 8A 2C 25 1F 6E 7F 2F
##$RELAX= 
##$RELAX= 
##$RELAX= 
##$RELAX= 
##$RELAX= 
##$RELAX= 
$$ Bruker specific parameters
$$ --------------------------
##$DU= <F:/spectra>
##$EXPNO= 1
##$NAME= <H-C>
##$PROCNO= 1
##$TYPE= <nmr>
##$USER= <she>
##$AMP= (0..31)
100 100 100 100 100 100 100 100 100 100 100 100 100 100 100 100 100 100 
100 100 100 100 100 100 100 100 100 100 100 100 100 100 
##$AQSEQ= 0
##$AQ_mod= 1
##$AUNM= <au_zg>
##$AUTOPOS= <>
##$BF1= 200.13
##$BF2= 200.13
##$BF3= 200.13
##$BF4= 200.13
##$BF5= 200.13
##$BF6= 200.13
##$BF7= 200.13
##$BF8= 200.13
##$BYTORDA= 1
##$CFDGTYP= 0
##$CFRGTYP= 5
##$CHEMSTR= <none>
##$CNST= (0..31)
1 1 145 1 1 1 1 1 1 1 1 1 1 1 1 1 1 1 1 1 1 1 1 1 1 1 1 1 1 1 1 1 
##$CPDPRG= <>
##$CPDPRG1= <>
##$CPDPRG2= <>
##$CPDPRG3= <>
##$CPDPRG4= <mlev>
##$CPDPRG5= <mlev>
##$CPDPRG6= <mlev>
##$CPDPRG7= <mlev>
##$CPDPRG8= <mlev>
##$CPDPRGB= <>
##$CPDPRGT= <>
##$D= (0..31)
0 0.7 0 0 0 0 0 0 0 0 0 0.03 0 0 0 0 0 0 0 0 0 0 0 0 0 0 0 0 0 0 0 0 
##$DATE= 1756894244
##$DBL= (0..7)
120 120 120 120 120 120 120 120 
##$DBP= (0..7)
150 150 150 150 150 150 150 150 
##$DBP07= 0
##$DBPNAM0= <>
##$DBPNAM1= <>
##$DBPNAM2= <>
##$DBPNAM3= <>
##$DBPNAM4= <>
##$DBPNAM5= <>
##$DBPNAM6= <>
##$DBPNAM7= <>
##$DBPOAL= (0..7)
0.5 0.5 0.5 0.5 0.5 0.5 0.5 0.5 
##$DBPOFFS= (0..7)
0 0 0 0 0 0 0 0 
##$DE= 6
##$DECBNUC= <off>
##$DECIM= 32
##$DECNUC= <off>
##$DECSTAT= 4
##$DIGMOD= 1
##$DIGTYP= 9
##$DL= (0..7)
0 120 120 120 120 120 120 120 
##$DP= (0..7)
150 150 150 150 150 150 150 150 
##$DP07= 0
##$DPNAME0= <>
##$DPNAME1= <>
##$DPNAME2= <>
##$DPNAME3= <>
##$DPNAME4= <>
##$DPNAME5= <>
##$DPNAME6= <>
##$DPNAME7= <>
##$DPOAL= (0..7)
0.5 0.5 0.5 0.5 0.5 0.5 0.5 0.5 
##$DPOFFS= (0..7)
0 0 0 0 0 0 0 0 
##$DQDMODE= 0
##$DR= 18
##$DS= 0
##$DSLIST= <SSSSSSSSSSSSSSS>
$$ [...]
##$SUBNAM0= <"">
##$SUBNAM1= <"">
##$SUBNAM2= <"">
##$SUBNAM3= <"">
##$SUBNAM4= <"">
##$SUBNAM5= <"">
##$SUBNAM6= <"">
##$SUBNAM7= <"">
##$SUBNAM8= <"">
##$SUBNAM9= <"">
##$SW= 18.0517328524113
##$SWIBOX= (0..15)
0 0 2 0 0 0 0 0 0 0 0 0 0 0 0 0 
##$SW_h= 3612.71676300578
##$TD= 16384
##$TD0= 1
##$TE= 0
##$TE2= 300
##$TE3= 300
##$TEG= 300
##$TL= (0..7)
0 120 120 120 120 120 120 120 
##$TP= (0..7)
150 150 150 150 150 150 150 150 
##$TP07= 0
##$TPNAME0= <>
##$TPNAME1= <>
##$TPNAME2= <>
##$TPNAME3= <>
##$TPNAME4= <>
##$TPNAME5= <>
##$TPNAME6= <>
##$TPNAME7= <>
##$TPOAL= (0..7)
0.5 0.5 0.5 0.5 0.5 0.5 0.5 0.5 
##$TPOFFS= (0..7)
0 0 0 0 0 0 0 0 
##$TUNHIN= 0
##$TUNHOUT= 0
##$TUNXOUT= 0
##$USERA1= <user>
##$USERA2= <user>
##$USERA3= <user>
##$USERA4= <user>
##$USERA5= <user>
##$V9= 5
##$VALIST= <valist>
##$VCLIST= <CCCCCCCCCCCCCCC>
##$VD= 0
##$VDLIST= <DDDDDDDDDDDDDDD>
##$VPLIST= <PPPPPPPPPPPPPPP>
##$VTLIST= <TTTTTTTTTTTTTTT>
##$WBST= 1024
##$WBSW= 4
##$XGAIN= (0..3)
0 0 0 0 
##$XL= 0
##$YL= 0
##$YMAX_a= 400224
##$YMIN_a= -651929
##$ZGOPTNS= <>
##$ZL1= 120
##$ZL2= 120
##$ZL3= 120
##$ZL4= 120
##$ABSF1= 10
##$ABSF2= 0
##$ABSG= 5
##$ABSL= 3
##$ALPHA= 0
##$AQORDER= 0
##$ASSFAC= 0
##$ASSFACI= 0
##$ASSFACX= 0
##$ASSWID= 0
##$AUNMP= <proc_1d>
##$AZFE= 0.1
##$AZFW= 0.1
##$BCFW= 1
##$BC_mod= 2
##$BYTORDP= 1
##$COROFFS= 0
##$CY= -3
##$DATMOD= 1
##$DC= 2
##$DFILT= <>
##$DTYPP= 0
##$F1P= 0
##$F2P= 0
##$FCOR= 0.5
##$FTSIZE= 0
##$FT_mod= 4
##$GAMMA= 1
##$GB= 0.15
##$INTBC= 1
##$INTSCL= 1
##$ISEN= 128
##$LB= 0.25
##$LEV0= 0
##$LPBIN= 0
##$MAXI= 10000
##$MC2= 0
##$MEAN= 0
##$ME_mod= 0
##$MI= 1.114404
##$NCOEF= 0
##$NC_proc= 0
##$NLEV= 6
##$NOISF1= 3.799351
##$NOISF2= 2.8
##$NSP= 1
##$NTH_PI= 0
##$NZP= 0
##$OFFSET= 14.38212
##$PC= 1
##$PHC0= -1562.087
##$PHC1= 11.59228
##$PH_mod= 1
##$PKNL= yes
##$PPARMOD= 0
##$PSCAL= 0
##$PSIGN= 0
##$REVERSE= no
##$SF= 200.129724274929
##$SI= 16384
##$SIGF1= 3
##$SIGF2= 2
##$SINO= 400
##$SIOLD= 16384
##$SREGLST= <1H.CDCl3>
##$SSB= 0
##$STSI= 0
##$STSR= 0
##$SW_p= 3205.1282051282
##$SYMM= 0
##$S_DEV= 0
##$TDeff= 0
##$TDoff= 0
##$TI= <>
##$TILT= no
##$TM1= 0
##$TM2= 0
##$TOPLEV= 0
##$USERP1= <user>
##$USERP2= <user>
##$USERP3= <user>
##$USERP4= <user>
##$USERP5= <user>
##$WDW= 1
##$XDIM= 8192
##$YMAX_p= 0
##$YMIN_p= 0
$$ End of Bruker specific parameters
$$ ---------------------------------
##NTUPLES= NMR FID
##VAR_NAME=  TIME,          FID/REAL,        FID/IMAG
##SYMBOL=    X,             R,               I
##VAR_TYPE=  INDEPENDENT,   DEPENDENT,       DEPENDENT
##VAR_FORM=  AFFN,          ASDF,            ASDF
##VAR_DIM=   8192,          8192,            8192
##UNITS=     SECONDS,       ARBITRARY UNITS, ARBITRARY UNITS
##FACTOR=    0.0002768,     1,               1
##FIRST=     0,             0,               0
##LAST=      2.2672688,     0,               0
##MIN=       0,             -651929,         0
##MAX=       2.2672688,     400224,          0
$$ Real data points
##PAGE= N=1
##DATA TABLE= (X++(R..R)), XYDATA
$$ plain form
0 0 0 0 0 0 0 0 0 0 0 0 0 -8 8 -8 8 -8 16 -16 24 -24 32 -37 40 -48 56 -69 80 -92 107 -120 140 -157 180 -205
34 -205 229 -258 289 -323 361 -403 447 -497 552 -612 676 -749 824 -907 1002 -1103 1213 -1339
52 -1339 1477 -1631 1801 -1995 2218 -2472 2771 -3121 3545 -4070 4733 -5612 6825 -8621 11565
67 11565 -17249 32368 -165430 -440654 -293283 -146755 27693 101601 165891 256540 317931
78 317931 227931 73439 -78023 -74400 34402 100910 103143 102037 101325 120537 41295 -135745
90 -135745 -258993 -251986 -137169 1172 44166 64492 113534 131450 83193 -51476 -201527
101 -201527 -215349 -128218 -38062 13856 15923 42686 103679 98777 38625 -20876 -18458 95006
113 95006 207459 224235 191763 129865 62267 -18262 -162814 -287754 -300540 -213537 -66136
$$ packed form
0@%%%%%%%%%%%qJ6j6J6j6K4l2M0m8N6o9P7q8J04j25J49j72J99k27K60k97L37l85
34b05M34m87N47o12O84p64Q50r44J049j164J288j425J573j731J909k105K316k552
52a339K816l108L432l796M213m690N243n892O666p615Q803j0345J2437j5446K0186
67A1565k8814M9617j97798k75224J47371J46528J74448P3908O4290R0649O1391
78C17931r0000j54492j51462L623J08802O6508K233j106p12J9212p9242j77040
90a35745j23248P007J14817J38341M2994K0326M9042J7916m8257j34669j50051
101b01527j3822Q7131R0156N1918K067K6763O0993m902o0152n9501K418J13464
113I5006J12453J6776l2472o1898o7598q0529j44552j24940j2786Q7003J47401
$$ plain form
124 -66136 40120 69143 94335 99494 56766 -21511 -133987 -190105 -141905 -69468 -7530 22530
136 22530 23491 51514 68106 43732 29965 36721 89629 177683 205517 173158 111590 22579 -52251
149 -52251 -122437 -183875 -169179 -97700 -1750 93449 119104 93734 51083 -31355 -112513 -166016
161 -166016 -188841 -139843 -54899 21010 87948 104350 80796 47359 -11875 -49047 -40974 -20591
173 -20591 25517 70423 81842 84267 51630 -9751 -49107 -69595 -49186 5777 38700 66869
185 66869 86524 63349 18366 -57085 -139408 -156095 -124631 -66043 6643 50912 92640 128016
197 128016 104091 46540 -20244 -66908 -44001 -3319 11910 25453 29166 36236 34211 -24544
209 -24544 -87360 -102265 -71863 -529 45853 46509 58566 69959 55583 12249 -66205 -104889
$$ packed form
124f6136J06256K9023K5192N159m2728p8277j12476n6118M8200P2437O1938L0060
136B2530R61K8023J6592k4374j3767O756N2908Q8054K7834l2359o1568q9011p4830
149e2251p0186o1438J4696P1479R5950R5199K5655k5370m2651q2438q1158n3503
161a66016k2825M8998Q4944P5909O6938J6402k3554l3437n9234l7172Q073K0383
173b0591M6108M4906J1419K425l2637o1381l9356k0488K0409N4963L2923K8169
185F6869J9655k3175m4983p5451q2323j6687L1464N8588P2686M4269M1728L5376
197A28016k3925n7551o6784m6664K2907M0682J5229J3543L713P070k025n8755
209b4544o2816j4905L0402P1334M6382O56J2057J1393j4376m3334p8454l8684
$$ plain form
221 -104889 -64321 -6887 33528 33684 10273 20524 24138 -19662 -71264 -98997 -56706 41039
233 41039 98359 105841 97330 84813 80179 31344 -69253 -132575 -128675 -74651 -13583 -10041 -22872
246 -22872 330 25954 30161 -4608 -48702 -22420 48516 94841 96378 52316 21645 28279 3803
259 3803 -56548 -108112 -113132 -44254 28856 39874 24819 16177 30325 47842 11084 -40544 -38783
272 -38783 4878 58285 62722 6772 -30837 -33069 -35425 -53928 -95074 -98288 -27782 46888 80800
285 80800 70027 39089 43985 57207 27101 -18676 -46268 -27197 25905 34905 -2282 -36031
297 -36031 -48508 -29649 -19679 -44180 -42544 1688 58318 95804 74018 27680 11336 3467 -10985
310 -10985 -39313 -70722 -50717 1805 28649 25948 -2041 -20901 -4974 -1399 -17583 -25496 -17325
$$ packed form
221a04889M0568N7434M0415J56k3411J0251L614m3800n1602k7733M2291R7745
233D1039N7320P482q511j2517m634m8835j00597o3322L900N4024O1068L542j2831
246b2872K3202K5624M207l4769m4094K6282P0936M6325J537m4062l0671O634k4476
259C803o0351n1564n020O8878P3110J1018j5055q642J4148J7517l6758n1628J761
272c8783M3661N3407M437n5950l7609k232k356j8503m1146l214P0506P4670L3912
285H0800j0773l0938M896J3222l0106m5777k7592J9071N3102R000l7187l3749
297c6031j2477J8859R970k4501J636M4232N6630L7486k1786m6338j6344p869j4452
310a0985k8328l1409K0005N2522K6844k701k7989j8860J5927L575j6184p913Q171
$$ plain form
323 -17325 20928 51762 34113 4036 -16442 -23761 -14644 -24701 -40267 -22375 8943 38627
335 38627 46893 20525 4012 4385 -333 -3050 -12489 -14191 14167 33192 31238 21284 924 -3500
349 -3500 2317 -8057 -14508 -16398 -17488 -7039 -13723 -33161 -38350 -41606 -33114 -12518 200 23276
363 23276 49276 56884 57719 41373 12429 -4501 -25160 -39651 -32829 -24913 -8715 10820 15132
376 15132 24508 32205 24256 17523 3584 -8830 -5903 -14454 -28874 -35876 -42998 -34707 -21470 -21498
390 -21498 -9816 12671 36102 58219 52488 31773 22935 11383 -588 -16761 -41018 -38421 -13737
403 -13737 3134 13828 12045 13250 32352 35673 16800 -7262 -28548 -25524 -17083 -33502 -50031
416 -50031 -51800 -35964 -5842 2828 -4435 6148 28015 51428 55298 28765 16111 26274 33784
$$ packed form
323a7325L8253L0834j7649l0077k0478p319R117j0057j5566J7892L1318K9684
335C8627Q266k6368j6513L73m718k717r439j702K8358J9025j954r954k0360m424
349c500N817j0374o451j890j090J0449o684j9438n189l256Q492K0596J2718K3076
363B3276K6000P608Q35j6346k8944j6930k0659j4491O822P916J6198J9535M312
376A5132R376P697p949o733j3939j2414K927q551j4420p002p122Q291J3237k8
390b1498J1682K2487K3431K2117n731k0715q838j1552j1971j6173k4257K597K4684
403a3737J6871J0694j783J205J9102L321j8873k4062k1286L024Q441j6419j6529
416e0031j769J5836L0122Q670p263J0583K1867K3413L870k6533j2654J0163P510
$$ plain form
429 33784 29812 3234 -19538 -7950 6208 1293 -17707 -38247 -27628 -964 1211 -11157 -20697
442 -20697 -12132 16652 20704 -6243 -27050 -30987 -16787 -10817 -35892 -53040 -39236 -8256 23294
455 23294 28541 24759 49448 81483 94479 78523 39267 19521 22285 11044 -17482 -50981 -64340
468 -64340 -39963 -20512 -26944 -37722 -38508 -15242 9705 -206 -20821 -25594 -13376 5278 -2263
481 -2263 -29080 -31043 -10488 16229 29482 17027 16219 39275 54079 49626 23691 -831 7095
494 7095 22508 21874 13042 4382 16840 38727 29135 -2185 -32499 -50136 -47538 -53831 -75667 -81569
508 -81569 -67029 -37880 -11286 -9008 -5559 16760 40044 56516 52108 33842 32386 35821 26861
521 26861 8873 -15269 -20186 -1105 12505 19189 23190 26683 40598 41735 18305 -6060 -24578
$$ packed form
429C3784l972k6578k2772J1588J4158m915j9000k0540J0619K6664K175j2368r540
442b0697Q565K8784M052k6947k0807l937J4200N970k5075j7148J3804L0980L1550
455B3294N247l782K4689L2035J2996j5956l9256j9746K764j1241k8526l3499j3359
468f4340K4377J9451o432j0778p86K3266K4947r911k0615m773J2218J8654p541
481b263k6817j963K0555K6717J3253j2455q08K3056J4804m453k5935k4522P926
494G095J5413o34q832q660J2458K1887r592l1320l0314j7637K598o293k1836n902
508h1569J4540K9149K6594K278L449K2319K3284J6472m408j8266j456L435q960
521B6861j7988k4142m917J9081J3610O684M001L493J3915J137k3430k4365j8518
$$ plain form
534 -24578 -30971 -28372 -37907 -47020 -43226 -36998 -27880 -27876 -38864 -35192 -22264 -8684 7066 14342 23454
549 23454 40690 46254 44017 37380 26583 27614 28983 22102 17967 9861 831 -3511 -16154 -26311
563 -26311 -25532 -22960 -11778 420 6087 14638 14172 2047 -9985 -27571 -40807 -42725 -44495 -36992
577 -36992 -19323 -4653 10829 18725 17673 23312 26983 26755 27710 22667 22464 27691 21294 9854 -1922
592 -1922 -11952 -8575 -6324 -10510 -8236 -3717 3744 7954 -5966 -21582 -25840 -24468 -15612 -11577
606 -11577 -11810 105 14330 19097 13276 -5420 -15484 -8848 -5053 -3928 -3465 646 19755 32304
620 32304 24420 10877 -1219 -392 8523 3298 -5846 -5309 804 10704 6251 -13841 -21292 -13950 -1615
635 -1615 7007 583 -2135 9815 16699 10930 -8155 -27834 -23542 -8314 -2768 -1867 -1965 8132 25396
$$ packed form
534b4578o393K599r535r113L794O228R118Mj0988L672J2928J3580J5750P276R112
549B3454J7236N564k237o637j0797J031J369o881m135q106r030m342j2643j0157
563b6311P79K572J1182J2198N667Q551m66j2125j2032j7586j3236j918j770P503
577c6992J7669J4670J5482P896j052N639L671k28R55n043k03N227o397j1440j1776
592a922j0030L377K251m186K274M519P461M210j3920j5616m258J372Q856M035
606a1577k33J1915J4225M767n821j8696j0064O636L795J125M63M111J9109J2549
620C2304p884j3543j2096Q27Q915n225r144N37O113R900m453k0092p451P342J2335
635a615Q622o424k718J1950O884n769j9085j9679M292J5228N546R01r8J0097J7264
$$ plain form
650 25396 22102 1815 -16009 -22010 -10396 -2202 -10027 -12049 -3026 11515 21246 9693 -5475
663 -5475 -2121 9222 19157 15901 2533 3260 12147 10678 -1377 -20045 -24768 -6581 8046 10240
677 10240 7470 5550 14942 18817 2417 -16876 -26712 -20777 -5296 -4597 -12744 -10491 -2595 5746
691 5746 2339 -15382 -21097 -10430 2437 10881 6198 1875 11099 16260 10644 -1067 -11757 -3974
705 -3974 12570 17285 14532 9772 9655 16135 10652 -4774 -13192 -12842 -1024 8498 3924 402 2511
720 2511 3889 3351 -7858 -19542 -15934 -7294 -628 570 -7195 -8300 -4647 -8458 -13729 -19009 -17568
735 -17568 -3685 6443 8977 10529 9071 11416 12359 3328 -2422 -2016 1897 11067 13423 9742 10667
750 10667 9231 6728 4708 -1450 -506 5326 6886 8180 4785 -2641 -5587 -11845 -19388 -20214 -20295 -15023
$$ packed form
650B5396l294k0287j7824o001J1614Q194p825k022R023J4541R731j1553j5168
663e475L354J1343R935l256j3368P27Q887j469j2055j8668m723J8187J4627K194
677A0240k770j920R392L875j6400j9293r836N935J5481O99q147K253P896Q341
691E746l407j7721n715J0667J2867Q444m683m323R224N161n616j1711j0690P783
705c974J6544M715k753m760j17O480n483j5426q418L50J1818R522m574l522K109
720B511J378n38j1209j1684L608Q640O666J198p765j105L653l811n271n280J441
735a7568J3883J0128K534J552j458K345R43r031n750M06L913R170K356l681R25
750A0667j436k503k020o158R44N832J560J294l395p426k946o258p543q26q1N272
$$ plain form
766 -15023 -6615 -3920 408 3124 -289 -1310 -4710 -6956 -1289 2409 5069 9794 9620 10448 9695 1915
782 1915 -1391 -908 804 6601 7243 5824 9580 9059 5692 -407 -10600 -12344 -8123 -7385 -6028 -6672
798 -6672 -6296 279 228 -5505 -7939 -8018 61 8697 6929 5189 6768 8053 10648 3892 -5414 -3743
814 -3743 2154 8940 11636 5595 4833 8791 5882 -1353 -13009 -20240 -13659 -7272 -7717 -9650 -11712
829 -11712 -4862 3284 -95 -5910 -6833 -1325 9637 10876 3119 1161 3873 8477 8448 -1448 -5172
844 -5172 2993 11936 17020 11513 3148 5332 7706 2551 -7020 -16778 -14060 -2706 -332 -3839 -8140
859 -8140 -7601 1655 3420 -5530 -10953 -9392 -235 7989 3115 -2447 -233 5304 9799 4976 -4114
874 -4114 -1612 6067 10359 7663 -2693 -6261 -279 1314 -2224 -8149 -10006 -77 7323 4264 -1376
$$ packed form
766a5023Q408K695M328K716l413j021l400k246N667L698K660M725j74Q28p53p780
782A915l306M83J712N797O42j419L756n21l367o099j0193j744M221P38J357o44
798f672L76O575n1n733k434p9Q079Q636j768j740J579J285K595o756r306J671
814c743N897O786K696o041p62L958k909p235j1656p231O581O387m45j933k062
829a1712O850Q146l379n815r23N508J0962J239p757j958K712M604k9r896l724
844e172Q165Q943N084n507q365K184K374n155r571r758K718J1354K374l507m301
859h140N39R256J765q950n423J561R157Q224m874n562K214N537M495m823r090
874d114K502P679M292k696j0356l568N982J593l538n925j857R929P400l059n640
$$ plain form
889 -1376 -5707 -3160 2256 -2748 -9404 -9150 -2415 8608 11221 4919 4479 8019 11865 11972 3103 -1928
905 -1928 2289 5236 4441 -2105 -9752 -7081 -2985 -4705 -7855 -12053 -9131 -590 -399 -4735 -7861 -8928
921 -8928 -3305 -682 -4372 -3395 851 7134 13091 9862 5702 7121 7651 8856 6623 965 2781 6353
937 6353 6828 6126 1254 -1601 461 -2053 -5748 -8250 -11299 -8302 -6363 -9596 -10030 -9317 -7589 -2331
953 -2331 -1713 -1372 2495 3939 5860 6573 3369 3944 4721 3422 4887 4737 5152 8504 8035 6764 6412
970 6412 3013 1447 -561 -5125 -5281 -5265 -6960 -6568 -8754 -9127 -6308 -6853 -6782 -5754 -5697 -1727 965 -589
988 -589 1027 2653 4792 8008 5997 4659 7837 9143 10838 8610 3046 3009 3748 1656 -631 -4626
1004 -4626 -5014 -465 -432 -2741 -4895 -6479 -2732 -1330 -5940 -8720 -8967 -5806 -729 -2706 -5688 -3160
$$ packed form
889a376m331K547N416n004o656K54O735J1023K613o302m40L540L846J07q869n031
905a928M217K947p95o546p647K671M096j720l150m198K922Q541J91m336l126j067
921h928N623K623l690R77M246O283N957l229m160J419N30J205k233n658J816L572
937F353M75p02m872k855K062k514l695k502l049K997J939l233m34P13J728N258
953b331O18L41L867J444J921P13l204N75P77j299J465j50M15L352m69j271l52
970F412l399j566k008m564j56J6j695L92k186l73K819n45P1J028N7L970K692j554
988e89J616J626K139L216k011j338L178J306J695k228n564l7P39k092k287l995
1004d626l88M549L3k309k154j584L747J402m610k780k47L161N077j977k982K528
$$ plain form
1020 -3160 765 5232 5344 868 2167 6370 8358 7613 1322 -1305 3391 5300 3579 -34 -3618
1035 -3618 632 5173 2728 -1212 -4555 -2947 2197 21 -5615 -6891 -4809 656 2022 -4275 -5786
1050 -5786 -2380 1832 4170 -756 -4340 -44 4155 5444 2394 -2882 -19 5765 5133 1803 -2844
1065 -2844 -2842 3701 4168 -329 -4094 -5010 32 3500 -1438 -4538 -3711 36 4423 940 -4383 -2594
1081 -2594 1175 4017 2721 -3545 -3228 1829 3724 3246 -1424 -3762 1384 3909 1643 -1394 -3874
1096 -3874 -225 4007 1419 -1993 -3252 -1245 3993 2915 -2002 -2514 -1058 2409 3108 -1964 -3693
1111 -3693 -929 1063 2092 -1274 -4393 -822 1875 1650 134 -3510 -1742 2455 2096 421 -1385
1126 -1385 -1615 2635 3064 198 -417 -622 1474 3234 114 -1635 -408 330 1939 665 -2448 -1162
$$ packed form
1020c160L925M467J12m476J299M203J988p45o291k627M696J909j721l613l584
1035c618M250M541k445l940l343J608N144k176n636j276K082N465J366o297j511
1050e786L406M212K338m926l584M296M199J289l050n276K863N784o32l330m647
1065b844KO543M67m497l765r16N042L468m938l100Q27L747M387l483n323J789
1081b594L769K842j296o266L17N057J895m78m670k338N146K525k266l037k480
1096c874L649M232k588l412j259K007N238j078m917n12J456L467O99n072j729
1111c693K764J992J029l366l119L571K697k25j516l644J768M197l59j675j806
1126a385k30M250M29k866o15k05K096J760l120j749J227P38J609j274l113J286
$$ plain form
1142 -1162 -185 81 474 -2110 -1841 734 174 -111 -704 -1939 619 1077 -565 -224 -1130 -320 1237 -184
1160 -184 -498 661 105 1109 810 -365 1340 1149 257 1085 -420 -39 1261 -599 -443 -229 -974 46
1178 46 -907 -2341 -565 -224 -276 58 -1719 -759 1263 490 467 -137 -655 2018 2013 175 389 202 1839
1197 1839 2893 -283 -1340 -378 171 1816 -480 -3321 -1783 -428 85 -264 -3206 -2482 903 824 230
1214 230 -1773 -2109 2097 3309 1105 -176 -926 1570 4462 1786 -866 -628 559 2893 1149 -2837
1230 -2837 -2247 -563 1304 1155 -2970 -3592 58 1326 1220 -1495 -3890 -566 1811 488 -1535 -3543
1246 -3543 -1357 2870 1830 -641 -1298 -15 4253 4399 162 -984 -14 2629 3690 -489 -2916 -693
1262 -693 1397 2344 -360 -3859 -1750 1159 956 -875 -4676 -3745 591 1076 -857 -2674 -2562 1710
$$ packed form
1142a162R77K66L93k584K69K575n60k85n93j235K558M58j642L41r06Q10J557j421
1160a84l14J159n56J004k99j175J705j91q92Q28j505L81J300j860J56K14p45J020
1178D6r53j434J776L41n2L34j777R60K022p73k3o04n18K673nj838K14j87J637
1197A839J054l176j057R62N49J645k296k841J538J355N13l49k942P24L385p9n94
1214B30k003l36M206J212k204j281p50K496K892k676k652K38J187K334j744l986
1230b837N90J684J867j49m125o22L650J268j06k715k395L324K377j323k023k008
1246c543K186M227j040k471o57J283M268J46m237j146R70K643J061m179k427K223
1262f93K090R47k704l499K109K909k03j831l801R31M336M85j933j817J12M272
$$ plain form
1278 1710 3838 1268 -152 -318 2127 4671 1516 -1584 -908 803 3063 1933 -2191 -1542 919 1941
1294 1941 1516 -2302 -3607 -972 -12 -1096 -2989 -4266 -1165 1325 402 -824 -1562 160 3394 2376
1310 2376 -48 -362 -188 2214 2455 -533 -659 805 2230 3476 895 -779 818 1262 899 -969
1326 -969 -3537 -2491 -585 -489 -367 -1469 -1144 1635 1083 -413 -991 -1742 -470 -22 -2139 -2076 -1656 -424
1344 -424 1564 901 431 1924 2006 2632 2469 259 300 296 -850 -961 -1744 -1928 239 378 262 1046 403 1057
1364 1057 1102 -733 -235 -193 -492 492 135 335 1867 1212 638 521 -850 -254 -339 -2173 -1982 -1796 -1886 -897
1384 -897 -1704 -1762 201 631 1226 1022 -654 -109 546 -842 -1401 -2479 -1899 803 1435 1664 2694 3007
1402 3007 4775 4819 1743 483 -181 -218 476 -1556 -2965 -1742 -806 129 -33 -2105 -1078 764 644
$$ packed form
1278A710K128k570j420j66K445K544l155l100O76J711K260j130m124O49K461J022
1294A941m25l818j305K635R60j084j893j277L101K490r23j226p38J722L234j018
1310B376k424l14J74K402K41k988j26J464J425J246k581j674J597M44l63j868
1326i69k568J046J906R6J22j102L25K779n52j496n78p51J272M48k117O3M20J232
1344d24J988o63m70J493Q2O26j63k210M1mj146j11p83j84K167J39j16P84o43O54
1364A057M5j835M98M2k99R84l57K00J532o55n74j17j371N96q5j834J91J86r0R89
1384h97q07n8J963M30N95k04j676N45O55j388n59j078N80K702O32K29J030L13
1402C007J768M4l076j260o64l7O94k032j409J223R36R35j62k072J027J842j20
$$ plain form
1419 644 46 -1871 -2292 -114 -30 -1581 -2302 -2710 297 2364 1255 385 96 766 2178 356 -1924
1436 -1924 -1365 365 2856 3050 666 904 2268 2536 1199 -2370 -4433 -2541 -1516 -1510 -2406 -3394 -988
1453 -988 1889 1457 687 -32 1323 4211 3555 823 -560 -885 576 914 -1697 -2329 -232 2270 3909
1470 3909 2142 -44 607 1020 26 -2456 -5337 -4237 -1450 -787 -1023 -2401 -2317 199 578 -1169 -2027
1487 -2027 -2057 221 2355 962 9 578 1827 3556 2733 892 1654 3142 4095 3681 588 -451 319
1504 319 -57 -475 -1724 -1961 846 2265 1399 47 -2058 -2068 -1569 -3476 -4657 -5074 -3979 -1050 -404
1521 -404 -1383 -676 -170 662 1496 -251 -5 1663 2229 3093 1954 -19 1100 1331 1535 1810 1227 2182
1539 2182 3417 2609 1405 -196 -1678 -1364 -1862 -2616 -1695 -941 365 1587 365 -436 -752 -2005 -1846
$$ packed form
1419F44n98j917m21K178Q4j551p21m08L007K067j109q70k89O70J412j822k280
1436a924N59J730K491J94k384K38J364K68j337l569k063J892J025Oq96r88K406
1453i88K877m32p70p19J355K888o56k732j383l25J461L38k611o32K097K502J639
1470C909j767k186O51M13r94k482k881J100K787O63k36j378Q4K516L79j747q58
1487b027l0K278K134j393r53N69J249J729q23j841P62J488R53m14l093j039P70
1504C19l76m18j249k37K807J419q66j352k105j0M99j907j181m17J095K929O46
1521d04r79P07N06Q32Q34j747K46J668N66Q64j139j973J119K31K04K75n83R55
1539B182J235q08j204j601j482L14m98p54R21P54J306J222j222q01l16j253J59
$$ plain form
1556 -1846 -2347 -2323 -875 -241 66 483 -283 -285 259 -415 -70 847 1161 2077 1849 860 1095 316 -391 -294 -701
1577 -701 395 1950 1639 1307 532 -497 -634 -1399 -2407 -1642 -793 512 1704 978 792 839 -232 -438
1595 -438 -1625 -2252 -708 419 784 922 -182 -98 611 -297 -448 -566 132 2139 2077 469 -203 -1064 -939
1614 -939 -795 -2177 -2130 -618 998 2465 1953 285 483 321 111 -464 -1561 -857 1161 1316 801 -788
1632 -788 -1868 -739 -530 -1476 -1513 -735 1335 3127 2094 624 50 -379 221 -711 -2334 -1347 449 1431
1650 1431 1436 -586 -1283 -518 -171 3 -719 -670 1647 3093 2178 799 -1210 -895 156 -910 -1530 -1419
1668 -1419 -239 1637 1538 -345 -1523 -1588 -725 -53 -643 -710 936 2155 2196 496 -1945 -1889 -1431 -1270 -1327
1687 -1327 -1428 147 2576 2983 2198 1274 258 1263 1508 223 -181 -301 496 867 -736 -2385 -2246
$$ packed form
1556a846n01K4J448O34L07M17p66kN44o74L45R17L14R16k28r89K35p79p07R7m07
1577g01J096J555l11l32p75j029j37p65j008P65Q49J305J192p26j86M7j071k06
1595d38j187o27J544J127L65J38j104Q4P09r08j51j18O98K007o2j608o72q61J25
1614i39J44j382M7J512J616J467n12j668J98j62k10n75j097P04K018J55n15j589
1632g88j080J129K09r46l7P78K070J792j033j470n74m29O00r32j623R87J796R82
1650A431Nk022o97P65L47J74p22M9K317J446r15j379k009L15J051j066o20J11
1668a419J180J876r9j883j178o5Q63O72n90o7J646J219M1j700k441N6M58J61n7
1687a327j01J575K429M07p85r24j016J005K45j285m04j20P97L71j603j649J39
$$ plain form
1704 -2246 -1342 113 781 229 1353 2290 2046 978 -1459 -2688 -2413 -2226 -1907 -1709 -1358 455 1433 584
1722 584 -233 -938 -556 640 569 662 1188 1555 2280 1872 263 152 -78 229 889 480 236 818 615 -86
1742 -86 -679 -1624 -1131 -280 -34 733 770 733 755 -620 -2174 -2631 -3043 -2542 -1355 -910 550 1468 1584 1914
1762 1914 938 369 314 -138 -112 263 202 752 824 80 205 208 355 988 661 1016 1244 795 173 -705 -1927
1783 -1927 -1604 -1319 -1083 -169 103 787 1654 685 -420 -1226 -2008 -1610 -1549 -1349 -154 1125 1982 2633 1634
1802 1634 793 999 604 258 -442 -1479 -790 -328 -778 -971 -1115 -535 1036 1164 975 1209 1065 1405 492
1821 492 -1402 -2259 -2393 -1747 -425 -230 228 1588 2328 2510 1320 -500 -530 -630 -898 -1347 -1851 -1217 520
1840 520 1075 640 461 388 1531 1805 492 -256 -896 -1098 -544 -1741 -2786 -1786 -820 806 1200 613
$$ packed form
1704b246R04J455O68n52J124R37k44j068k437j229K75J87L19J98L51J813R78q49
1722E84q17p05L82J196p1R3N26L67P25m08j609j11k30L07O60m09k44N82k03p01
1742h6n93r45M93Q51K46P67L7l7K2j375j554m57m12N01J187M45J460R18J16L30
1762A914r76n69n5m52K6L75o1N50P2p44J25LJ47O33l27L55K28m49o22q78j222
1783a927L23K85K36R14K72O84Q67r69j105q06p82L98O1K00J195J279Q57O51r99
1802A634q41K06l95l46p00j037O89M62m50j93j44N80J571J28j89K34j44L40r13
1821D92j894q57j34O46J322J95M58J360P40J82j190j820l0j00k68m49n04O34J737
1840E20N55m35j79p3J143K74j313p48o40k02N54j197j045J000R66J626L94n87
$$ plain form
1858 613 1201 1976 1821 1071 -484 -1301 -607 -161 -119 -215 -687 586 1323 612 -274 -794 -534 294 85 -448
1878 -448 -454 -72 1002 1167 91 -117 -79 -58 29 -1209 -1971 -1118 -813 -514 -312 -631 678 2135 2525 2367
1898 2367 1393 989 1139 15 -1406 -2373 -2384 -1636 -842 -976 -348 670 1462 2491 1931 1003 894 382 -59
1917 -59 -734 -1968 -1827 -1184 -975 -659 -761 -527 461 813 319 305 -278 250 912 264 439 774 876 1252
1937 1252 734 -116 110 -377 -367 -641 -1412 -1399 -1036 -682 -76 373 430 1481 1830 1566 1301 342 -195 -745
1957 -745 -2057 -2184 -1969 -1747 -599 -25 349 1341 1363 1516 1497 924 649 717 86 -263 -368 -664 -225 -580
1977 -580 -866 -480 -299 272 510 49 256 304 -382 -507 -894 -1080 -122 402 444 769 210 492 285 -898
1997 -898 -1035 -1245 -1092 122 408 641 1296 1546 1856 1514 518 132 306 36 113 -511 -1173 -904 -1089 -1426
$$ packed form
1858F13N88P75j55p50j555q17O94M46M2r6m72J273P37p11q86n20K60Q28k09n33
1878d48oL82J074J65j076k08L8K1Q7j238p62Q53L05K99K02l19J309J457L90j58
1898B367r74m04J50j124j421r67j1P48P94j34O28J018P92J029n60r28j09n12m41
1917e9o75j234J41O43K09L16j02K34R88L52m94j4n83N28O62o48J75L35J02L76
1937A252n18q50K26m87J0k74p71J3L63L54O06M49N7J051L49k64k65r59n37n50
1957g45j312j27K15K22J148N74L74R92K2J53j9n73k75O8o31l49j05k96M39l55
1977e80k86L86J81N71K38m61K07M8o86j25l87j86R58N24M2L25n59K82k07j183
1997h98j37k10J53J214K86K33O55K50L10l42r96l86J74k70P7o24o62K69j85l37
$$ plain form
2017 -1426 -1681 -1492 -248 871 1089 1137 881 738 847 -120 -1168 -1369 -1036 -56 789 218 248 534 398
2036 398 112 -556 -1054 -242 617 1221 1077 192 486 588 -91 -632 -1373 -1082 162 653 411 37 -410 -398
2056 -398 -416 -1465 -1411 -691 134 1602 1474 866 877 873 697 191 -737 -440 592 665 482 -363 -1078 -1087 -1232 -1784
2078 -1784 -1722 -1084 428 2107 1954 1808 1233 486 294 -692 -1745 -1524 -1215 -361 222 -609 -756 -124 -184
2097 -184 163 304 756 2063 2678 2461 1628 73 -786 -1424 -2368 -2538 -2183 -1399 287 857 712 902 634
2116 634 446 972 258 535 1043 1241 1078 102 -1521 -1981 -2583 -2731 -2235 -1715 -257 1422 1847 1835 1372
2135 1372 338 423 -208 -693 -472 -286 373 875 88 -327 -480 -1060 -472 34 374 1463 1936 1931 1829 539
2155 539 -286 -633 -1164 -815 -117 172 839 712 -378 -1116 -2203 -2886 -3057 -2851 -1720 -116 890 1703
$$ packed form
2017a426k55J89J244J119K18M8k56j43J09r67j048k01L33R80Q45n71L0K86j36
2036C98k86o68m98Q12Q59O04j44q85K94J02o79n41p41K91J244M91k42l74m47J2
2056c98j8j049N4P20Q25J468j28o08J1mj76n06r28K97J032P3j83q45p15rj45n52
2078a784O2O38J512J679j53j46n75p47j92r86j053K21L09Q54N83q31j47O32o0
2097a84L47J41M52J307O15k17q33j555q59o38r44j70L55P84J686N70j45J90k68
2116F34j88N26p14K77N08J98j63r76j623m60o02j48M96N20J458J679M25j2m63
2135A372j034Q5o31m85K21J86O59N02p87m15j53n80N88N06L40J089M73nj02j290
2155E39q25l47n31L49O98K89O67j27j090p38j087o83j71K06J131J604J006Q13
$$ plain form
2173 1703 1978 1409 1392 658 -42 180 4 335 693 132 -50 -549 -951 -579 -25 555 1893 2757 3167 2918
2193 2918 1247 59 -1157 -2649 -3425 -3189 -2735 -1165 -65 147 357 -136 -72 -77 -697 -497 175 946 1531
2212 1531 1156 243 -109 -797 -1001 -794 -729 198 1367 1727 1729 1008 26 -30 -536 -740 -394 167 970 1547 1009
2233 1009 -76 -1155 -2166 -1865 -2077 -1799 -642 818 1766 2177 1200 454 -45 -590 -711 -921 -841 623
2251 623 1173 994 673 -514 -607 -443 -538 -402 299 572 1127 670 -370 -1247 -1679 -1569 -693 -323 538 1781
2271 1781 2356 2291 1395 -376 -1105 -1660 -1803 -1308 -784 206 1678 1582 1062 420 -485 -485 -298 -398 -54 136
2291 136 611 670 -441 -1050 -1338 -1370 -766 -16 304 1036 1218 1294 482 -805 -1422 -1008 -601 181 1169 1518
2311 1518 2206 1873 882 -416 -1559 -2298 -1727 -1398 -926 125 474 1292 1004 231 -203 -596 -627 -196 -257
$$ packed form
2173A703K75n69j7p34p00K22j76L31L58n61j82m99m02L72N54N80J338Q64M10k49
2193B918j671j188j216j492p76K36M54J570J100K12K10m93O4no20K00O72P71N85
2212A531l75r13l52o88k04K07O5R27J169L60Kp21r82n6n06k04L46N61Q03N77n38
2233A009j085j079j011L01k12K78J157J460R48M11r77p46m99n45j21k10Q0J464
2251F23N50j79l21j187r3J64r5J36P01K73N55m57j040q77m32J10Q76L70Q61J243
2271A781N75o5q96j771p29n55j43M95N24R90J472r6n20o42r05%J87j00L44J90
2291A36M75N9j111o09k88l2O04P50L20P32J82P6q12j287o17M14M07P82R88L49
2311A518O88l33r91j298j143p39N71L29M72J051L49Q18k88p73m34l93l1M31o1
$$ plain form
2330 -257 -98 106 -263 -509 -1162 -1595 -1003 182 834 1919 2443 2293 2110 906 -135 -1020 -1765 -1193 -525
2349 -525 106 938 1295 1060 493 -638 -1378 -1501 -1656 -1224 -515 -274 266 230 -208 -152 -688 -619 -155 84 271
2370 271 751 290 92 -483 -1191 -886 -610 -36 1242 2180 2699 3047 2196 1459 256 -869 -1207 -1378 -1381 -761
2390 -761 -565 -308 -118 -882 -951 -964 -767 -381 31 239 700 920 207 -335 -1360 -1698 -1358 -985 -505 426
2410 426 770 1442 1579 865 878 480 641 1123 1115 1020 1218 761 -26 -678 -1997 -2109 -1684 -1269 -309 68 690
2431 690 1522 1156 330 -439 -1341 -1069 -898 -835 -601 -314 -120 364 193 -328 -74 412 1069 1539 1021 1144
2451 1144 964 398 -172 -1346 -1544 -1040 -654 173 585 396 846 767 -136 -593 -1312 -1598 -919 -431 -428 228
2471 228 432 960 881 308 120 391 469 969 606 182 13 -309 -484 -922 -1365 -920 103 525 969 1085
$$ packed form
2330b57J59K04l69k46o53m33N92J185O52J085N24j50j83j204j041q85p45N72O68
2349e25O31Q32L57k35n67j131p40j23j55M32P09K41N40l6m38N6n36O9M64K39J87
2370B71M80m61j98n75p08L05K76N74J278R38N19L48q51p37j203j125l38j71lO20
2390g61J96K57J90p64o9j3J97L86M12K08M61K20p13n42j025l38L40L73M80R31
2410D26L44O72J37p14J3l98J61M82qr5J98m57p87o52j319j12M25M15R60L77O22
2431F90Q32l66q26p69r02K72J71O3K34K87J94M84j71n21K54M86O57M70n18J23
2451A144j80n66n70j174j98N04L86Q27M12j89M50p9r03m57p19k86O79M88LO56
2471B28K04N28p9n73j88K71P8N00l63m24j69l22j75m38m43M45J023M22M44J16
$$ plain form
2491 1085 770 890 379 -636 -933 -1565 -1116 -437 -294 -97 114 233 464 311 36 354 573 868 984
2510 984 464 138 -12 -626 -784 -1093 -884 -102 300 644 942 743 690 437 -132 -563 -916 -1027 -396 -313 -629
2531 -629 -275 -339 -60 108 37 443 968 909 1323 759 195 -91 -651 -1005 -1216 -1345 -965 -86 11 303 549
2552 549 540 529 296 103 41 28 -146 174 -95 -264 -146 -428 -180 -93 107 691 854 798 1160 628 391 218
2574 218 -466 -652 -687 -748 -509 -759 -730 -493 -466 -475 -419 -449 -170 516 257 705 493 391 582 313 -250 -186 -242
2597 -242 -69 311 77 300 561 504 559 214 163 419 318 144 -170 -395 -389 -364 -652 -629 -758 -673 -369 -311 -404
2620 -404 -154 -167 174 306 37 222 681 658 1080 899 385 602 479 278 -30 -653 -691 -310 -223 -381 -378 -72
2642 -72 167 496 108 141 -166 -87 40 -543 -620 -707 -644 -85 -77 -299 84 299 500 714 249 7 456 265 449
$$ packed form
2491A085l15J20n11j015k97o32M49O79J43J97K11J19K31j53k75L18K19K95J16
2510I84n20l26j50o14j58l09K09P82M02L44K98j99n3k53n69m31l53j11O31Q3l16
2531f29L54o4K79J68p1M06N25n9M14n64n64k86n60l54k11j29L80Q79R7K92K46
2552E49rj1k33j93o2j3j74L20k69j69J18k82K48Q7K00N84J63n6L62n32k37j73
2574B18o84j86l5o1K39k50K9K37K7rN6l0K79O86k59M48k12j02J91k69n63O4n6
2597b42J73L80k34K23K61n7N5l45n1K56j01j74l14k25OK5k88K3j29Q5L04N8r3
2620d04K50j3L41J32k69J85M59k3M22j81n14K17j23k01l08o23l8L81Q7j58LL06
2642g2K39L29l88L3l07P9J27n83p7q7O3N59Qk22L83K15K01K14m65k42M49j91J84
$$ plain form
2665 449 308 -105 319 257 253 146 -194 19 90 -311 -439 -587 -687 -213 -281 -314 108 107 518 792 367 -48 59
2688 59 -192 -216 -540 -879 -647 -178 85 327 313 577 996 863 938 282 41 49 -340 -815 -907 -746 -747 -193 -115
2711 -115 -31 506 454 996 672 218 55 -221 -390 -207 -531 -461 13 38 308 517 59 -3 106 -203 -164 -348
2733 -348 -240 4 -279 -385 -167 -87 2 174 165 410 384 415 406 -26 -408 -191 -492 -520 -423 -223 199 327 230 582
2757 582 275 203 175 95 127 290 137 -171 -74 -503 -551 -920 -955 -622 -536 -144 379 361 486 519 459 504 197 -148
2781 -148 -267 -379 -387 -209 -547 -272 -122 39 431 636 745 1225 1235 735 612 -40 -500 -729 -1069 -1090 -771
2802 -771 -721 51 198 259 512 237 207 204 -20 -334 -256 -359 -340 -501 -684 -500 -255 -49 458 337 527 1048
2824 1048 609 587 85 -214 -275 -165 -438 -162 -4 350 820 475 2 165 -460 -131 -423 -799 -388 -486 -348
$$ packed form
2665D49j41m13M24o2mj07l40K13P1m01j28j48j00M74o8l3M22jM11K74m25m15J07
2688E9k51k4l24l39K32M69K63K42j4K64M19j33P5o56k41Ql89m75r2J61jN54P8
2711a15Q4N37n2N42l24m54j63k76j69J83l24P0M74K5K70K09m58o2J09l09L9j84
2733c48J08K44k83j06K18Q0Q9J72rK45k6L1rm32l82K17l01k8R7K00M22J28r7L52
2757E82l07p2k8q0L2J63j53l08R7m29m8l69l5L33Q6L92N23j8J25L3o0M5l07l45
2781a48j19j12qJ78l38K75J50J61L92K05J09M80J0n00j23o52m60k29l40k1L19
2802g71N0P72J47O1K53k75l0lk24l14P8j03J9j61j83J84K45K06N07j21J90N21
2824A048m39k2n02k99o1J10k73K76J58L54M70l45m73J63o25L29k92l76M11r8J38
$$ plain form
2845 -348 -209 -377 -323 151 124 215 459 372 743 786 155 59 -329 -382 -124 -432 -189 -44 25 465 454 60 39
2868 39 6 -42 29 -225 -102 170 35 -168 -285 -697 -444 -158 -122 110 286 460 954 478 222 139 -179 177
2890 177 146 6 66 56 200 289 -140 -254 -239 -161 6 -31 -216 -25 -215 -282 -362 -680 -580 -322 -309 -156 216
2913 216 347 449 541 254 37 -97 -204 234 134 -21 182 177 397 360 -36 139 107 184 57 85 -110 -5
2935 -5 -260 -619 -554 -553 -588 18 -234 511 352 326 537 311 98 -70 -241 -173 -65 -223 -157 109 -122 -21 -50
2958 -50 -360 -14 14 158 345 398 287 261 -206 -175 -14 -270 -183 -330 -233 180 10 38 129 -11 363 228 174
2981 174 373 489 299 441 113 -367 -255 -355 -343 -254 -387 30 -21 -69 231 -127 -189 65 17 63 302 -112
3003 -112 40 260 -78 -41 -244 -290 38 69 130 214 223 361 169 55 -155 -222 -381 -244 -309 -496 -148 -240 -43
$$ packed form
2845c48J39j68N4M74k7R1K44q7L71M3o31r6l88n3K58l08K43J45O9M40j1l94k1
2868C9l3m8P1k54J23K72j35k03j17m12K53K86L6K32J76J74M94m76k56q3l18L56
2890A77l1j40O0j0J44Q9m29j14J5P8J67l7j85J91j90o7q0l18J00K58J3J53L72
2913B16J31J02R2k87k17j34j07M38j00j55K03nK20l7l96J75l2P7j27K8j95J05
2935ek55l59O5Jl5O06k52P45j59k6K11k26k13j68j71O8J08j58O6K66k31J01k9
2958e0l10L46K8J44J87N3j11k6m67L1J61k56Q7j47R7M13j70K8R1j40L74j35n4
2981A74J99J16j90J42l28m80J12j00J2Q9j33M17n1m8L00l58o2K54m8M6K39m14
3003a12J52K20l38L7k03m6L28L1O1Q4RJ38j92j14k10o7j59J37o5j87L48r2J97
$$ plain form
3026 -43 -74 -427 -113 226 332 259 400 384 614 383 176 85 -114 111 132 103 56 175 63 208 6 -362 -409
3049 -409 -165 -209 -239 -565 -465 -229 -336 -261 -327 -459 11 -113 58 111 37 158 330 285 131 151 297 555 750
3072 750 558 428 609 351 558 79 -16 -127 -173 -72 -364 -759 -514 -333 -405 -347 -497 -348 -129 -345 -240
3093 -240 -138 -354 -31 -63 -168 -22 -87 182 497 322 296 555 334 280 282 -123 193 91 149 264 -169 -353
3115 -353 -57 -13 -290 -160 -263 18 -27 -37 34 -122 -131 -28 -162 -260 -32 -300 -71 167 9 317 382 294 389
3138 389 219 117 464 310 -15 -9 -178 -297 -17 -363 -319 -184 -230 -21 12 -136 -82 -209 -18 -122 -185 -250 71
3161 71 -370 22 119 103 524 242 489 413 387 343 393 14 257 140 -128 10 -296 -96 1 -121 73 -200 -213
3184 -213 -6 -8 -170 -296 -290 -358 -333 -216 -359 -249 -258 -64 59 -65 -39 90 93 50 -3 228 326 235 69 344 163
$$ packed form
3026d3l1l53L14L39J06p3J41j6K30k31k07r1j99K25K1k9m7J19j12J45k02l68m7
3049d09K44m4l0l26J00K36j07P5o6j32M70j24J71N3p4J21J72m5j54K0J46K58J95
3072G50j92j30J81k58K07m79r5j11m6J01k92l95K45J81p2N8j50J49K19k16J05
3093b40J02k16L23l2j05J46o5K69L15j75k6K59k21n4Km05L16j02N8J15m33j84
3115c53K96M4k77J30j03K81m5j0P1j56rJ03j34r8K28k68K29K38j58L08O5q8R5
3138C89j70j02L47j54l25Oj69j19K80l46M4J35m6K09L3j48N4j27J91j04o3o5L21
3161G1m41L92R7j6M21k82K47p6k6m4N0l79K43j17k68J38l06K00R7j22J94k73j3
3184b13K07kj62j26Oo8K5J17j43J10rJ94J23j24K6J29Lm3n3K31R8r1j66K75j81
$$ plain form
3209 163 129 306 157 445 142 59 223 -68 -179 -284 -285 -223 -202 -380 -313 -102 -235 70 -127 -426 14 24 -139
3232 -139 14 -238 9 -107 -138 55 -45 37 355 111 54 46 148 70 328 -46 -104 -111 -88 161 -110 -249 -207 194
3256 194 73 44 -279 -16 46 26 -38 10 -114 177 151 75 53 -184 134 173 -124 62 155 -8 191 119 -103 57
3280 57 64 209 66 -94 -151 -48 -24 20 -353 -173 130 18 76 158 39 281 88 128 350 -17 -15 121 14 75
3304 75 -3 118 72 -75 -95 -241 -140 -274 -156 -173 -352 8 -246 38 -17 -250 -6 15 152 236 63 -185 215
3327 215 226 45 147 32 115 22 28 177 275 95 116 -41 -6 74 -89 -5 12 -129 -197 -105 -276 -28 -47 -151 -21
3352 -21 -71 -74 96 -36 -18 90 285 275 59 184 241 0 -33 28 -69 -37 -6 -54 -57 -5 -188 -52 46 -185 -85 -204
3378 -204 -94 -104 -247 40 -179 -225 -277 14 -140 93 138 14 173 102 177 168 19 81 112 -155 4 -96 -12 -32
$$ packed form
3209A63l4J77j49K88l03q3J64k91j11j05jO2K1j78O7K11j33L05j97k99M40J0j63
3232a39J53k52K47j16l1J93j00Q2L18k44n7qJ02p8K58l74n8pK3K49k71j39M2M01
3256A94j21k9l23K63O2k0o4M8j24K91k6p6k2k37L18L9k97J86R3j63J99p2k22J60
3280E7PJ45j43j60n7J03K4M4l73J80L03j12N8Q2j19K42j93M0K22l67KJ36j07O1
3304G5p8J21m6j47k0j46J01j34J18j7j79L60k54K84n5k33K44K1J37Q4j73k48M00
3327B15J1j81J02j15Q3r3OJ49R8j80K1j57L5Q0j63Q4J7j41o8R2j71K48j9j04J30
3352b1n0lJ70j32J8J08J95j0k16J25N7k41l3O1r7L2L1m8lN2j83J36R8k31J00j19
3378b04J10j0j43K87k19m6n2K91j54K33M5j24J59p1P5rj49O2L1k67J59j00Q4k0
$$ plain form
3402 -32 77 -237 39 -107 14 -26 -156 -181 178 117 83 -89 -104 120 75 7 -90 -239 -73 12 -156 76 88 -80
3426 -80 160 76 115 179 -147 73 75 -71 -140 -25 -51 22 -43 -72 -96 -26 -1 91 -234 198 200 274 21 105 35 149 85
3453 85 -27 -162 -227 -141 -138 -165 -144 -96 -75 30 63 -133 13 -131 -102 -88 -271 -374 -77 -71 -61 -89 -90 46 112 124 216
3480 216 292 326 155 115 260 157 -9 64 -220 -224 -113 -198 -41 10 -192 -265 68 146 -77 1 -91 70 123 -41
3504 -41 116 9 -307 3 31 -180 -57 -66 4 184 28 103 272 202 327 163 168 190 148 0 -89 -47 -134 -234 -149
3529 -149 153 -393 -196 93 -152 32 -114 -134 4 -145 -126 -120 -49 -183 108 145 75 346 88 224 209 62 255
3552 255 58 15 92 -79 -105 68 -10 72 168 -193 -202 -113 6 -113 -27 -96 119 10 41 128 -222 120 52 85 -41
3577 -41 -10 -132 101 61 31 24 164 226 102 142 69 114 181 -35 -5 -38 -30 -234 -37 23 -133 -318 53 -108 -81 43
$$ packed form
3402c2J09l14K76j46J21m0j30k5L59o1l4j72j5K24m5o8r7j49J66Q5j68K32J2j68
3426h0K40q4L9O4l26K20Kj46o9J15k6P3o5k9k4P0K5R2l25M32KP4k53Q4p0J14o4
3453H5j12j35o5Q6Lk7K1M8K1J05L3j96J46j44K9J4j83j03K97OJ0k8jJ36O6J2R2
3480B16P6L4j71m0J45j03j66P3k84mJ11q5J57N1k02p3L33P8k23P8r2J61N3j64
3504d1J57j07l16L10K8k11J23rP0J80j56P5J69p0J25j64NK2m2j48q9M2q7j00Q5
3529a49L02n46J97K89k45J84j46k0J38j49J9OP1j34K91L7p0K71k58J36j5j47J93
3552B55j97m3P7j71k6J73p8Q2R6l61rQ9J19j19Q6o9K15j09L1Q7l50L42o8L3j26
3577d1L1j22K33m0l0pJ40O2j24M0p3M5O7k16L0l3Qk04J97O0j56j85L71j61K7J24
$$ plain form
3603 43 -3 -78 -76 -70 -37 -40 22 133 113 -1 89 112 246 -38 54 104 171 23 123 -8 59 -78 173 12 -124 48
3629 48 66 -91 -184 -109 -242 -395 -148 -41 -95 10 -107 64 22 111 -79 -121 -116 -54 -56 44 -72 -34 60 41 -77
3654 -77 326 89 116 85 42 -78 -114 -20 -77 -38 -20 -82 -15 -69 110 108 -49 22 -70 -240 -223 -248 17 75 139 202 136
3681 136 18 153 -7 203 31 -18 -29 -35 83 -56 -112 20 -23 36 95 -106 -210 157 -73 -131 -12 -84 -146 -100
3705 -100 -139 81 217 155 72 89 -178 117 27 -197 94 -93 75 -8 123 170 144 269 11 224 -86 -71 56
3728 56 -30 -62 -37 -50 131 72 -51 -8 -39 178 68 -52 -74 121 -211 57 -48 -25 -26 84 31 -90 -38 -61 15
3753 15 32 -158 -15 -2 -19 -79 -100 5 39 58 28 -66 124 25 -109 71 -74 10 -147 75 165 106 142 29 -19
3778 -19 60 68 83 86 -78 -46 -87 78 -75 -27 -137 -81 111 -80 -6 9 96 -139 64 -109 -196 -112 22 -154 -18
$$ packed form
3603D3m6p5KOL3lO2J11k0j14R0K3J34k84R2N0O7j48J00j31O7j37K51j61j36J72
3629D8J8j57r3P5j33j53K47J07n4J05j17J71m2Q9j90m2NO2kJ00j16L8R4j9j18
3654g7M03k37K7l1m3j20l6R4n7L9J8o2O7n4J79kj57P1r2j70J7k5K65N8O4O3o6
3681A36j18J35j60K10j72m9j1oJ18j39n6J32m3N9N9k01j04L67k30n8J19p2o2M6
3705a00l9K20J36o2q3J7k67K95r0k24K91j87J68q3J31M7k6J25k58K13l10J5J27
3728E6q6l2K5j3J81n9j23M3l1K17j10j20k2J95l32K68j05K3jJ10n3j21N2k3P6
3753A5J7j90J43J3j7o0k1J05L4J9l0r4J90r9j34J80j45Q4j57K22R0n9L6j13m8
3778a9P9QJ5Lj64L2m1J65j53M8j10N6J92j91P4J5Q7k35K03j73q7Q4J34j76J36
$$ plain form
3803 -18 66 -94 -5 47 8 99 -50 -53 -97 229 -5 331 218 -123 146 37 12 42 120 11 -28 68 -15 106 43
3828 43 -211 53 -24 -159 -55 -27 -39 -19 -89 -115 -113 17 -105 -36 -138 66 17 143 125 -172 252 137 302 -145
3852 -145 227 94 45 99 -63 78 49 -43 -109 5 134 -75 -35 127 48 -85 38 61 -106 -96 168 -88 68
3875 68 -77 -38 -119 -93 -41 -147 -146 90 110 -9 121 13 106 20 54 -69 -157 -87 -47 59 -9 -33 142 10 150
3900 150 148 -141 106 178 74 -146 -39 -7 -38 -30 43 -154 -55 -58 -274 -77 -166 -70 -141 -101 -91 -106 148 128 119 32 36 -6
3928 -6 -24 146 -12 -84 214 135 -159 210 -69 -42 9 111 99 16 -57 -97 62 -68 193 89 127 119 -87 -146 -18
3953 -18 -69 -230 38 -22 113 -57 -148 17 83 50 -78 52 -15 -87 89 35 -186 136 35 54 135 103 -123 -51
3977 -51 -116 -20 -222 -181 31 88 -12 18 -33 -14 129 16 -10 -17 -48 159 49 -63 -11 130 -31 48 53 -227 103
$$ packed form
3803a8Q4j60Q9N2l9R1j49lm4L26k34L36j13l41K69j09k5L0P8j09l9R6q3J21o3
3828D3k54K64p7j35J04K8j2K0p0k6KJ30j22O9j02K04m9J26j8k97M24j15J65m47
3852a45L72j33m9N4j62J41k9r2o6J14J29k09M0J62p9j33J23K3j67J0K64k56J56
3875F8j45L9q1K6N2j06JK36K0j19J30j08R3q6L4j23q8P0M0J06o8k4J75j32J40
3900A50kk89K47P2j04k20J07L2l1QP3j97R9lk16J97q9R6p1M0J0j5K54k0rq7Mm2
3928fj8J70j58p2K98p9k94L69k79K7N1J02j2q3p3m0J59j30K61j04L8qk06n9J28
3953a8n1j61K68o0J35j70r1J65O6l3j28J30o7p2J76n4k21L22j01J9Q1l2k26P2
3977e1o5R6k02M1K12N7j00L0n1J9J43j13k6pl1K07j10j12N2J41j61P9Nk80L30
$$ plain form
4002 103 55 11 191 4 78 -104 -8 -64 29 18 73 -41 -129 -68 -81 31 58 -62 -90 110 -32 -17 -141 -18 -19
4027 -19 42 93 -99 2 -47 146 86 17 -18 57 -101 -14 -23 -32 24 6 57 58 -105 -37 18 -66 -17 16 -21 140 -110 73
4055 73 47 -36 21 -12 130 12 101 -98 14 43 169 -21 39 -78 -14 -114 -20 54 137 34 -149 58 -2 -94 -56
4080 -56 -100 62 -16 -67 190 -43 -68 168 -49 26 7 -72 -76 -12 -121 -76 -64 -3 186 69 146 -10 -28 99 19 -40
4106 -40 84 48 52 -146 -44 55 98 37 57 -111 -205 -22 -116 8 115 -82 -39 -98 -85 225 -62 56 95 108 159
4131 159 146 58 162 -199 39 5 -72 78 10 94 115 8 -112 70 -2 -76 74 -28 164 42 -99 106 25
4154 25 -30 38 -57 134 -31 -72 55 -29 -9 -123 -157 10 22 -47 -146 -9 -86 -48 40 61 24 -25 -34 92 -28 107
4180 107 16 5 75 -14 -78 98 -66 26 87 0 -114 -36 97 -38 3 27 118 -12 102 45 -38 166 76 11 -88 -119
$$ packed form
4002A03m8m4J80j87P4j82R6n6R3j1N5j14q8O1j3J12K7j20k8K00j42J5j24J23j
4027a9O1N1j92J01m9J93o0o9l5P5j58Q7rrN6j8N1Jj63O8N5q4M9L3l7J61k50J83
4055G3k6q3N7l3J42j18Q9j99J12K9J26j90O0j17O4j00R4P4Q3j03j83K07o0r2L8
4080e6m4J62p8n1K57k33k5K36k17P5j9p9mO4j09M5J2O1J89j17P7j56j8J27q0n9
4106d0J24l6Mj98J02R9M3o1K0j68r4J83r4J24J07j97M3n9J3L10k87J18L9J3N1
4131A59j3q8J04l61K38l4p7J50o8Q4K1j07j20J82p2p4J50j02J92j22j41K05q1
4154B5n5O8r5J91j65m1J27q4K0j14l4J67J2o9r9J37p7L8Q8K1l7m9rJ26j20J35
4180A07r1j1P0q9o4J76j64R2O1q7j14P8J33j35M1K4R1j30J14n7q3K04r0o5r9l1
$$ plain form
4206 -119 -55 69 28 -40 -242 -61 -25 138 -67 22 -111 -131 18 -15 -46 84 162 61 99 -13 23 130 -16 -27
4230 -27 -24 -102 -167 -34 24 -129 95 210 -254 27 187 -203 16 71 -43 -58 -96 -13 1 146 -27 -31 -26 -74 -102 2
4256 2 131 -162 -1 119 49 23 28 73 2 -72 22 -67 197 -9 -87 -159 100 88 -52 -70 -62 -116 67 28 -78 44
4282 44 -10 -144 -95 113 85 -160 -49 58 -68 -56 -2 96 -37 61 64 -27 206 -37 92 69 26 26 2 1 -44 129
4308 129 -142 58 28 -5 96 129 -20 121 76 147 -46 -28 -30 -36 -72 88 -45 60 11 67 -20 -38 115 0 186
4333 186 21 146 143 19 -1 106 -142 77 -1 -116 181 -63 97 90 36 -16 140 43 341 2 -62 102 -15
4356 -15 88 -108 -91 -68 -36 -115 38 4 51 -154 -20 -22 7 99 -37 -21 19 130 20 -264 -218 -59 29 -25 -52 32
4382 32 34 53 41 126 229 50 -88 -40 -174 119 -79 111 64 -69 -64 -15 -141 -67 -121 3 72 167 143 -78 66
$$ packed form
4206a19O4J24m1o8k02J81L6J63k05Q9j33k0J49l3l1J30P8j01L8j12L6J07j46j1
4230b7Lp8o5J33N8j53K24J15m64K81J60l90K19N5j14j5l8Q3J4J45j73mNm8k8J04
4256BJ29k93J61J20p0k6NM5p1p4R4q9K64k06p8p2K59j2j40j8Qn4J83l9j06J22
4282D4n4j34M9K08k8k45J11J07j26J2N4R8j33R8Lr1K33k43J29k3m3%k4jm5J73
4308A29k71K00l0l3J01L3j49J41m5P1j93J8kol6J60j33J05m9N6q7j8J53j15J86
4333A86j65J25lj24k0J07k48K19p8j15K97k44J60pn4n2J56r7K98l39o4J64j17
4356a5J03j96J7K3L2p9J53l4M7k05J34kK9R2j36J6M0J11j10k84M6J59Q8n4k7Q4
4382C2KJ9j2Q5J03j79j38M8j34K93j98J90m7j33NM9j26P4n4J24O9R5k4k21J44
$$ plain form
4407 66 0 -79 35 -97 -106 67 141 -111 -35 100 116 5 -251 -63 -69 -2 -11 -24 -74 -69 -72 -18 60 -87 -69 -57 22 64
4435 64 -24 -43 -118 -139 -90 8 -156 98 30 -20 79 55 197 90 128 -97 56 -125 49 45 27 2 15 213 163 157 67
4462 67 31 -61 47 67 -60 -46 -210 -264 72 16 -179 101 41 88 -38 -72 -91 -3 -35 9 138 33 33 217 -64
4487 -64 85 -97 63 136 -68 145 -135 -53 -76 113 -248 -19 120 -164 -5 30 78 131 -21 -19 -4 -174 4
4510 4 -134 -180 -58 -21 -11 151 -56 74 150 -1 178 120 108 18 5 -77 35 -203 -100 7 -156 -31 -69 22
4534 22 169 -52 103 168 1 -17 140 -74 0 -13 95 103 -142 -228 -118 -99 -81 143 -18 168 187 127 102 34 -137
4559 -137 -16 22 -16 -63 34 -77 130 69 -10 60 -49 -48 63 37 -25 -155 -101 -125 -201 -94 58 23 135 114 80 38
4585 38 227 -181 63 -178 -113 25 -50 -86 -66 127 -64 9 -139 -167 132 105 118 114 8 -16 -185 -92 78 -157
$$ packed form
4407F6o6p9J14j32rJ73P4k52P6J35J6j11k56J88oO7rj3n0NlN4P8j47J8J2P9M2
4435F4q8j9p5k1M9R8j64K54o8n0R9k4J42j07L8k25J53j81J74mj8k5J3J98n0or0
4462F7l6r2J08K0j27J4j64n4L36n6j95K80o0M7j26l4j9Q8l2M4J29j05%J84k81
4487f4J49j82J60P3k04K13k80Q2k3J89l61K29J39k84J59L5M8N3j52KJ5j70J78
4510Dj38m6J22L7J0J62k07J30P6j51J79n8j2r0j3q2J12k38J03J07j63J25l8R1
4534B2J47k21J55O5j67j8J57k14P4j3J08Qk45q6J10J9J8K24j61J86J9o0k5o8j71
4559a37J21L8l8m7R7j11K07o1p9P0j09JJ11k6o2j30N4k4p6J07J52l5J12k1l4m2
4585C8J89m08K44k41O5J38p5l6K0J93j91P3j48k8K99k7J3mj06k4j69R3J70k35
$$ plain form
4609 -157 -11 -2 -94 36 -54 26 -20 -40 -53 -57 46 -111 70 114 121 -19 -63 40 -66 21 53 -20 190 82 -56 -7
4635 -7 100 35 -69 -128 -114 272 96 -95 -58 -50 -206 78 -161 37 -235 -113 121 -57 5 49 -34 29 -50 44 96
4660 96 -65 68 59 -78 -34 -93 -75 99 -168 -143 36 160 140 113 150 4 46 47 86 67 -33 -94 -167 -163 -107 -100 -73 17
4688 17 102 39 115 143 59 259 64 -31 141 -23 35 -68 -79 -13 120 -5 34 -41 51 -74 87 107 -34 -86 -122
4713 -122 65 -148 -132 -69 -63 113 1 -135 -36 -8 87 -33 9 -117 163 -77 274 -38 117 131 -3 -16 -156
4736 -156 7 -131 -8 -132 -40 -128 158 237 -79 -10 -26 -99 -56 -151 -104 -124 -89 20 60 140 -278 262 51 -34 134
4761 134 182 164 88 38 74 -69 -112 -28 -157 37 -62 60 104 103 -74 166 39 80 55 -21 24 -45 -160 -121 -5 4
4787 4 91 88 214 128 122 142 224 61 102 -69 -110 -235 41 -160 45 -35 52 135 313 264 237 77 194 59 -289 -133
$$ packed form
4609a57J46Rr2J30r0Q0m6k0j3mJ03j57J81M4Pj40m4J03j06Q7L2p3K10j08j38M9
4635gJ07o5j04n9J4L86j76j91L7Qj56K84k39J98k72J22K34j78O2M4q3O3p9R4N2
4660I6j61J33rj37M4n9J8J74k67K5J79J24k0k7L7j46M2JL9j9j00o1p3MN6PK7R0
4688A7Q5o3P6K8q4K00j95r5J72j64N8j03j1O6J33j25L9p5R2j25J61K0j41n2l6
4713a22J87k13J6O3OJ76j12j36R9K8R5j20M2j26K80k40L51l12J55J4j34j3j40
4736a56J63j38J23j24R2q8K86P9l16O9j6p3M3r5M7k0L5J09M0Q0m18N40k11q5J68
4761A34M8j8p6n0L6j43m3Q4j29J94r9J22M4jj77K40j27M1k5p6M5o9j15L9J16R
4787DQ7lJ26q6oK0Q2j63M1j71m1j25K76k01K05q0Q7Q3J78m9k7j60J17j35l48J56
$$ plain form
4813 -133 -27 -238 -72 -35 -104 33 -63 -123 139 124 184 110 99 -39 82 -142 -87 -81 -186 -382 -141 78 25 64
4837 64 -27 98 -64 20 -26 -149 -4 -165 -42 132 -112 50 -10 52 95 -91 22 55 -26 -59 125 -218 -61
4860 -61 84 -40 55 58 181 199 3 41 -37 -199 105 55 -120 -199 -99 -117 -4 -51 71 -82 77 51 263 134
4884 134 32 70 -29 128 -121 -159 -149 13 -273 -64 -39 -29 176 246 131 185 67 -28 75 -107 -106 -65 66 -95
4908 -95 -191 -70 88 -41 153 91 276 80 65 -58 -165 17 -122 -204 -256 -169 109 -201 -40 -50 91 287 195
4931 195 92 86 -20 -62 -13 -96 -42 23 -87 -138 21 -17 23 258 170 37 -57 31 56 -3 -78 -82 -12 -140 9 21 259
4958 259 70 20 238 -17 -181 -20 -62 -104 -121 -151 -42 -48 95 60 27 -77 9 86 14 104 90 8 98 -104 29
4983 29 -114 -87 206 -131 -9 97 -75 29 -18 -112 161 -90 -48 -80 -188 -71 88 -121 -147 59 -238 128
$$ packed form
4813a33J06k11J66L7o9J37r6o0K62j5O0p4j1j38J21k24N5Oj05j96K41K19n3L9
4837F4r1J25j62Q4m6j23J45j61J23J74k44J62o0O2M3j86J13L3q1l3J84l43J57
4860f1J45j24R5LJ23J8j96L8p8j62L04n0j75p9J00j8J13m7J22j53J59k6K12j29
4884A34j02L8r9J57k49l8J0J62k86K09K5J0K05P0j15N4j18r5J03j82JM1J31j61
4908i5r6J21J58j29J94o2J85j96j5j23j07J82j39q2n2Q7K78l10J61j0J41J96r2
4931A95j03oj06m2M9q3N4O5j10n1J59l8M0K35q8j33r4Q8K5n9p5mP0j28J49J2K38
4958B59j89n0K18k55j64J61m2m2j7l0J09oJ43l5l3j04Q6P7p2R0j4q2R0k02J33
4983B9j43K7K93l37J22J06j72J04m7r4K73k51M2l2j08J17J59k09k6K06k97L66
$$ plain form
5005 128 -53 -23 181 180 137 130 -24 -18 -49 -59 -138 13 -22 158 -60 -3 -29 -96 34 78 -49 82 61 -52 30 72
5031 72 85 -48 53 -50 -21 8 -23 -81 -137 64 -98 72 -137 -55 -2 180 -19 42 156 -15 -67 -192 106 -96
5055 -96 39 42 94 111 18 -2 -46 -170 34 -155 39 15 -129 46 -22 55 43 -97 -140 256 16 90 19 6 -38 -20
5081 -20 -112 23 -111 -6 125 41 -50 99 44 138 -145 -20 16 -17 -184 73 -165 16 69 -157 -18 112 -14
5104 -14 -30 46 117 143 -26 -20 -66 23 -26 42 -241 -52 34 -221 83 187 41 90 45 -60 -59 -169 -170 -168 -273 -68 -160
5131 -160 104 27 31 25 101 207 174 237 153 160 -83 -6 84 -120 -140 14 34 31 131 58 57 57 -11 15 2 -5 -21 -222 -133 -37
5161 -37 -185 -39 -189 -117 49 -40 -114 366 -98 -58 52 97 4 -120 -113 80 40 80 51 118 167 101 -9 -21 87
5186 87 190 149 -150 -46 -148 -155 -143 110 -135 -4 150 -157 67 -48 -44 32 -32 -22 48 -34 -43 47 94 9 12 111 54
$$ packed form
5005A28j81L0K04jm3pj54Ol1j0p9J51l5J80k18N7k6o7J30M4j27J31k1j13Q2M2
5031G2J3j33J01j03K9K9l1n8n6K01j62J70k09Q2N3J82j99O1J14j71n2j25K98k02
5055i6J35LN2J7r3k0m4j24K04j89J94k4j44J75o8P7j2j40m3L96k40P4p1j3m4J8
5081b0r2J35j34J05J31q4r1J49n5R4k83J25L6l3j67K57k38J81N3k26J39J30j26
5104a4j6P6P1K6j69Om6Q9m9O8k83J89Q6k55L04J04j46M9m5j05Jj10jKj05K05r2
5131a60K64p7MoP6J06l3O3q4Pk43P7R0k04k0J54K0lJ00p3j%o8K6j3pj6k01Q9R6
5161c7j48J46j50P2J66q9p4M80m64M0J10M5r3j24PJ93m0M0k9O7M9o6j10j2J08
5186H7J03m1k99J04j02pJ2K53k45J31J54l07K24j15MP6o4J0P0q2rR0M7q5LR9n7
$$ plain form
5213 54 53 -73 139 167 47 16 -77 -24 61 -149 36 50 -175 29 -69 97 190 159 -60 -34 -30 155 36 37 -27 -81
5239 -81 -59 48 -94 -76 198 161 115 -93 -10 -83 100 -25 -106 15 -65 -26 102 -163 -30 -139 110 93 -180 -99
5263 -99 13 -118 -48 -160 -63 68 -26 45 121 65 -33 106 267 -5 96 4 -7 128 -72 37 -90 -154 -55 -166
5287 -166 267 35 -73 -155 -89 -17 -56 -32 -56 -39 -165 30 56 -100 -10 -55 -130 103 -37 -34 91 135 -57 213 123
5312 123 192 -130 -47 244 68 54 95 123 48 49 -25 62 -65 185 3 140 -65 -21 -111 142 15 53 29 72 -81
5337 -81 -140 14 -165 172 93 2 87 -93 -27 -34 176 -58 44 71 -56 -61 32 76 -30 82 107 28 2 -98 -38 -27
5363 -27 -107 -92 -119 13 2 107 -61 -123 -22 -104 18 26 -98 -117 50 62 64 24 176 52 94 89 -69 175 -32 -134
5389 -134 175 71 124 -46 10 72 -18 85 -15 8 -35 -80 -23 52 66 87 -14 -78 27 124 9 -15 -140 19 134
$$ packed form
5213E4jj26K12K8j20l1r3N3Q5k10J85J4k25K04r8J66R3l1k19K6MJ85j19Jo4n4
5239h1K2J07j42J8K74l7m6k08Q3p3J83j25q1J21q0L9J28k65J33j09K49j7k73Q1
5263i9J12j31P0j12R7J31r4P1P6n6r8J39J61k72J01r2j1J35k00J09j27o4R9j11
5287a66M33k32j08q2O6P2l9K4k4J7j26J95K6j56R0m5p5K33j40LJ25M4j92K70r0
5312A23O9l22Q3K91j76j4M1K8p5Jp4Q7j27K50j82J37k05M4r0K53j27L8k4M3j53
5337h1n9J54j79L37p9r1Q5j80O6pK10k34J02K7j27nR3M4j06J12K5p9k6j00O0J1
5363b7q0J5k7J32j1J05j68o2J01q2J22Qj24j9J67J2Km0J52j24M2nj58K44k07j02
5389a34L09j04N3j70N6O2r0J03j00K3m3m5N7P5J4K1j01o4J05R7j15k4j25J59J15
$$ plain form
5414 134 -52 119 83 74 -83 -30 51 -6 35 -297 88 134 -118 37 -11 73 -28 -172 142 -69 109 31 3 -111
5438 -111 13 47 -45 40 -27 -1 -7 59 95 -198 -143 47 120 4 38 -10 15 21 25 -101 25 -88 -23 -168 70 55 -123
5465 -123 -4 -24 -68 -67 96 33 32 74 -86 -135 -152 5 226 6 90 166 62 155 184 21 78 123 -46 69 -31
5490 -31 -214 205 -133 113 159 -25 -5 85 -116 -68 76 15 23 -334 -176 -71 -139 -111 -110 37 115 -81 43 178
5514 178 166 185 17 -122 160 75 43 -128 -27 106 -176 7 34 30 -84 136 -64 -200 -67 -242 -179 -188 -119 -6
5538 -6 -88 -56 44 -87 -33 66 -9 -170 134 -27 60 160 117 22 26 106 27 37 -78 96 -34 -127 85 9 50 30
5564 30 -138 47 -80 -16 -71 -92 -120 39 -99 -30 -18 -19 -139 50 -155 -32 -170 106 88 95 18 159 122 -19 203
5589 203 24 94 54 -61 128 99 -64 -181 -74 69 -50 -31 -86 4 4 -177 195 116 6 -82 -115 169 25 8
$$ packed form
5414A34j86J71l6rj57N3Q1n7M1l32L85M6k52J55m8Q4j01j44L14k11J78p8k8j14
5438a11J24L4r2Q5o7K6oO6L6k93N5J90P3j16L4m8K5OMj26J26j13O5j45K38j5j78
5465a23J19k0m4JJ63o3jM2j60m9j7J57K21k20Q4P6j04R3K9j63N7M5j69J15j00
5490c1j83M19l38K46M6j84K0R0k01M8J44o1Ql57J58J05o8K8JJ47P8j96J24J35
5514A78j2J9j68j39K82q5l2j71J01J33k82J83K7mj14K20k00j36J33j75O3rO9J13
5538fq2L2J00j31N4R9p5j61L04j61Q7J00m3r5MQ0p9J0j15J74j30r3K12p6M1k0
5564C0j68J85j27O4n5k1k8J59j38O9J2jj20J89k05J23j38K76j8Pp7J41l7j41K22
5589B03j79P0m0j15J89k9j63j17J07J43j19J9n5R0%j81L72p9j10q8l3K84j44j7
$$ plain form
5613 8 46 -47 66 -85 17 174 -27 177 163 142 -8 -17 4 -122 17 -26 -39 24 -58 29 -102 -105 30 -164 -38
5638 -38 98 -97 25 -11 72 -56 -131 -167 78 -150 -21 210 -19 24 -2 25 -93 236 -93 161 -69 -33 51
5661 51 -206 -58 38 49 44 -274 34 193 -117 -58 137 -116 -102 22 134 2 -27 -31 16 135 8 -144 -78 13
5685 13 88 2 18 95 27 115 -20 151 109 -67 -127 71 -191 67 -91 58 -56 57 -20 -43 127 36 -86 -103
5709 -103 -87 88 -23 -47 -55 -112 -56 -74 -151 -110 1 -100 -84 82 -34 89 144 114 25 -5 4 -51 -126 -22 -137 -66
5735 -66 -119 -99 -138 27 -140 -78 70 0 -24 96 16 32 -96 -95 -55 -93 -102 -189 97 -101 165 -37 72 21 82 87 178
5762 178 -72 103 2 -144 4 -154 -67 36 7 -77 -156 108 -38 19 -21 -175 0 47 -38 30 -40 -1 147 89
5786 89 -41 43 153 103 -17 69 -188 105 4 -14 66 -112 26 48 53 -43 127 -86 -128 -11 -252 -118 -74 -117
$$ packed form
5613HL8r3J13j51J02J57k01K04j4k1j50rK1j26J39m3j3O3q2Q7j31lJ35j94J26
5638c8J36j95J22l6Q3j28p5l6K45k28J29K31k29M3k6K7j18L29l29K54k30L6Q4
5661E1k57J48R6J1nl18L08J59l10N9J95k53J4J24J12j32k9mM7J19j27j52O6R1
5685A3P5q6J6P7o8Q8j35J71m2j76o0J98k62K58j58J49j14J13p7k3J70r1j22j7
5709a03J6J75j11k4qn7N6j8p7M1J11j01J6J66j16J23N5l0q9l0Rn5p5J04j15P1
5735f6n3K0l9J65j67O2J48p0k4J20q0J6j28JM0l8rq7K86j98K66k02J09n1O1NR1
5762A78k50J75j01j46J48j58Q7J03k9q4p9K64j46N7m0j54J75M7q5O8p0L9J48n8
5786H9j30Q4J10n0j20Q6k57K93j01j8Q0j78J38K2Nr6J70k13m2J17k41J34M4m3
$$ plain form
5810 -117 27 -5 38 -133 -55 -124 -53 -110 -5 -127 -195 -89 21 63 93 -108 134 94 74 37 0 -71 59 -53 -149
5835 -149 26 -39 81 42 -13 -45 -17 -27 -27 225 57 -84 -37 -2 -14 221 -26 -237 173 46 81 211 -1 -41
5859 -41 8 -72 104 -158 -71 -56 -68 76 -7 -126 -10 44 88 -120 -151 -140 36 -100 4 -86 -98 -82 -11 45 -132
5884 -132 -74 52 -48 -32 248 10 182 61 146 90 284 20 137 169 28 131 74 -105 3 4 -22 -8 -169
5907 -169 -228 -104 -127 -179 -100 -3 -110 -87 81 32 -87 81 34 -182 90 43 -17 76 17 177 223 226 85 181 86 -96
5933 -96 14 16 77 -26 -115 -16 -119 8 144 -154 -255 -154 -120 -216 -75 -77 -145 79 111 79 24 -12 -43 91 25 40
5959 40 25 186 -165 33 -40 -91 70 8 20 106 65 4 216 35 66 34 -96 -214 8 -45 -134 -133 -13 -26 -44 -197
5985 -197 -73 121 17 -48 48 149 157 17 -171 -196 -31 -114 24 153 89 100 154 34 113 -141 66 -115 -154 -69
$$ packed form
5810a17J44l2M3j71P8o9P1n7J05j22o8J06J10M2L0k01K42m0k0l7l7p1J30j12r6
5835a49J75o5J20l9n5l2K8j0%K52j68j41M7L5j2K35k47k11M10j27L5J30k12m0
5859d1M9q0J76k62Q7J5j2J44q3j19J16N4M4k08l1J1J76j36J04r0j2J6P1N6j77
5884a32N8J26j00J6K80k38J72j21Q5n6J94k64J17L2j41J03n7j79J08Jk6J4j61
5907a69n9J24k3n2P9R7j07K3J68m9j19J68m7k16K72m7o0R3n9J60M6Lj41R6r5j82
5933i6J10KO1j03q9R9j03J27J36k98j01J01L4r6J41ko8K24L2l2n5l6l1J34o6J5
5959D0j5J61l51J98p3n1J61o2J2Q6m1o1K12j81L1l2j30j18K22n3q9JJ20j3j8j53
5985a97J24J94j04o5R6J01Qj40j88k5J65q3J38J29o4J1N4j20P9k54K07j81l9Q5
$$ plain form
6009 -69 -3 9 -92 -66 -146 0 -151 -45 -33 -192 48 9 -68 52 41 100 77 158 181 4 -141 110 38 95 10
6034 10 -129 7 -80 6 26 -178 21 64 -32 -93 -94 79 12 88 -30 8 -138 35 13 33 -95 89 -32 101 -11
6059 -11 -41 32 121 83 -22 176 -93 168 -47 74 -42 -5 164 -46 -98 96 97 -75 90 10 -11 -13 19 97 116
6084 116 23 39 -224 -79 -42 -65 63 36 -59 -20 166 -98 146 114 187 25 -15 224 -28 -55 -162 -11 30 -239
6108 -239 -23 -45 69 16 26 28 -41 -135 -42 -88 76 -61 -14 -162 6 -120 51 -52 -68 64 -107 168 38 -39
6132 -39 9 130 -48 -106 61 24 -94 7 -44 -106 84 -74 64 72 -40 -26 37 47 -26 53 56 36 -59 -87 9 37 -134
6159 -134 79 -74 -101 -76 -24 -30 -138 -3 -106 -77 -51 85 -113 182 -114 54 31 -11 41 72 -152 6 -158 120
6183 120 -4 -161 -51 -92 -16 -45 52 -125 59 -96 -131 50 -31 -31 -49 45 192 95 25 101 50 111 -47 -219 -58
$$ packed form
6009f9O6J2j01K6q0J46j51J06J2j59K40l9p7J20j1N9k3Q1K3j77j45K51p2N7q5
6034A0j39J36q7Q6K0k04J99M3r6o1jJ73o7P6j18L8j46J73k2K0j28J84j21J33j12
6059a1l0P3Q9l8j05J98k69K61k15J21j16L7J69k10n2J94Jj72J65q0k1kL2P8J9
6084A16r3J6k63J45L7k3J28k7r5L9J86k64K44l2P3j62m0K39k52k7j07J51M1k69
6108b39K16k2J14n3J0Ko9r4R3m6J64j37M7j48J68j26J71j03j6J32j71K75j30p7
6132c9M8J21j78n8J67l7j18J01n1o2J90j58J38Qj12J4O3J0p3P9Lk0r5k8R6K8j71
6159a34K13j53k7K5N2oj08J35j03K9K6J36j98K95k96J68k3m2N2L1k24J58j64K78
6183A20j24j57J10m1P6k9R7j77J84j55l5J81q1%j8R4J47r7p0P6n1O1j58j72J61
$$ plain form
6208 -58 -137 138 11 164 52 14 -58 -17 33 11 -22 65 107 28 -33 -93 -128 45 -119 -72 -244 84 149 145 -21 -69
6234 -69 -57 139 128 -170 6 -11 -174 46 -30 -91 20 -87 -206 -73 74 257 -175 -105 94 -100 -10 145 10
6257 10 -8 -30 31 -49 156 -168 125 -74 75 127 179 3 34 -41 -140 132 -99 108 -98 -11 -184 147 29 -106
6281 -106 -38 -59 -61 -34 -10 -156 -47 -24 -112 86 22 -140 -46 43 -151 -48 180 39 166 8 -37 83 80 50 181
6306 181 78 162 169 71 -9 3 -34 11 59 72 -53 -183 -187 -2 -29 4 275 101 16 -44 -161 9 123 139 68 65 117
6333 117 26 -175 -49 12 -83 124 95 29 171 186 42 -9 -159 34 -179 -253 119 -104 2 -79 -250 -1 -76
6356 -76 -156 55 -65 72 142 -23 -122 -129 97 54 -44 -53 -97 28 16 -26 94 -76 12 -25 87 180 55 183 62
6381 62 46 -127 88 -120 -196 -68 -100 -45 -104 -6 161 -9 189 3 13 -201 -69 62 -38 -49 -63 257 133
$$ packed form
6208e8p9K75j27J53j12l8p2M1N0k2l3Q7M2p9o1o0l5J73j64M7j72L28O5mj66m8
6234f9J2J96j1k98J76j7j63K20p6o1J11j07j19J33J47J83m32P0J99j94R0J55j35
6257A0j8k2O1q0K05l24K93j99J49N2N2j76L1p5r9K72k31K07k06Q7j73L31j18j35
6281a06O8k1kK7K4j46J09K3q8J98o4j62R4Q9j94J03K28j41J27j58m5J20ll0J31
6306A81j03Q4Pr8q0J2l7M5M8J3j25j30mJ85k7L3K71j74q5o0j17J70J14J6p1lN2
6333A17r1k01J26O1r5K07k9o6J42J5j44n1j50J93k13p4L72k23J06q1j71K49p5
6356g6q0K11j20J37P0j65r9pK26m3r8rm4J25j2m2J20j70Q8l7J12R3j25J28j21
6381F2j6j73K15k08p6J28l2N5n9R8J67j70J98j86J0k14J32J31j00j1j4L20j24
$$ plain form
6404 133 -101 153 39 -151 -86 101 72 5 36 183 -1 64 48 -82 -249 -37 -8 -41 -107 55 185 -4 -4 131
6428 131 67 27 -16 -147 -175 58 52 -6 -27 -149 -91 -20 -46 117 -65 49 20 115 -32 -133 -32 16 -88 49 39
6453 39 -40 -43 116 -114 123 -27 -220 27 44 -15 15 53 245 230 38 72 -91 -57 63 20 -125 -32 -131 32 39
6478 39 145 131 -61 105 36 105 -51 -20 -65 -116 -46 105 -46 -54 -17 -127 39 94 19 -7 125 37 171 -67 26
6503 26 88 1 -39 62 -163 23 -135 68 74 -105 13 36 -143 -128 168 9 -156 74 185 -116 -212 -47 16
6526 16 -58 209 37 24 17 -6 228 95 -9 136 21 -16 144 102 -21 0 -71 27 2 43 13 63 -98 71 -1
6551 -1 -12 237 -166 4 -44 53 -30 40 146 6 -102 -4 -24 193 38 -45 -109 16 26 14 4 202 -257 127 191
6576 191 -41 -25 46 -43 -85 -84 -101 153 -40 -81 -54 60 151 -78 20 -50 -116 -81 -72 140 -202 178 -69 64 114 -95
$$ packed form
6404A33k34K54j14j90O5J87k9o7L1J47j84O5j6j30j67K12K9l3o6J62J30j89%J35
6428A31o4m0m3j31k8K33on8k1j22N8P1k6J63j82J14k9R5j47j01J01M8j04J37j0
6453C9p9lJ59k30K37j50j93K47J7n9L0L8J92j5j92L4j63L4J20m3j45R3r9J63P
6478C9J06j4j92J66o9O9j56L1m5n1P0J51j51qL7j10J66N5p5k6J32q8J34k38R3
6503B6O2q7m0J01k25J86j58K03Oj79J18K3j79J5K96j59j65K30J11l01r6J65O3
6526A6p4K67j72j3pk3K34j33j04J45j15l7J60m2j23K1p1R8k5M1l0N0j61J69p2
6551aj1K49m03J70m8R7q3P0J06j40j08R8k0K17j55q3o4J25J0j2j0J98m59L84O4
6576A91k32J6P1q9m2Jj7K54j93m1K7J14R1k29R8p0o6L5RK12l42L80k47J33N0k09
$$ plain form
6602 -95 192 -77 53 -36 -49 -28 -202 89 72 -14 -158 50 201 -109 0 22 -209 -36 -22 -170 113 -27 146
6625 146 64 38 -40 -123 -7 -143 99 -123 -152 -39 113 -132 11 -81 85 -164 43 -211 19 22 -35 100 -64
6648 -64 -84 3 120 -45 31 -97 -117 12 -1 -20 65 -66 69 -68 30 101 -114 -22 122 -122 -28 54 42 -17 48
6673 48 59 -137 36 71 -41 -69 -57 -24 -76 -24 13 81 28 -14 -73 -79 -11 -37 78 37 -139 28 -72 -6 115 -72
6699 -72 -118 200 -88 -3 -33 52 139 -82 -55 11 65 217 -14 51 -27 -41 -74 45 -9 76 -9 93 -65 92 -7 -120
6725 -120 -48 -130 -67 -32 51 -5 -139 -23 -50 -9 -10 -97 -149 54 52 120 -34 114 -92 102 70 60 91 -16 9 95 -226
6752 -226 112 -85 19 80 -19 130 -82 -40 -15 34 50 -50 28 -178 -33 31 14 -62 271 -5 63 25 -186 43
6776 43 62 37 -120 35 2 -6 -3 151 -125 -55 153 5 97 53 -110 134 -167 -129 -108 -55 -73 9 1 -8 -20 76 -159
$$ packed form
6602i5K87k69J30q9j3K1j74K91j7q6j44K08J51l10J09K2k31J73J4j48K83j40J73
6625A46q2k6p8q3J16j36K42k22k9J13J52k45J43r2J66k49K07k54K30Ln7J35j64
6648f4k0Q7J17j65P6j28k0J29j3j9Q5j31J35j37R8P1k15R2J44k44R4Q2j2n9O5
6673D8J1j96J73L5j12k8J2L3n2N2L7O8n3m2n9oO8k6J15m1j76J67j00O6J21j87
6699g2m6L18k88Q5l0Q5Q7k21K7O6N4J52k31O5p8j4l3J19n4Q5q5J02j58J57r9j13
6725a20P2q2O3L5Q3n6j34J16k7M1jq7n2K03kO8j54J48k06J94l2j0L1j07K5Q6l21
6752b26L38j97J04O1r9J49k12M2K5M9J6j00P8k06J45O4j7p6L33k76O8l8k11K29
6776D3J9k5j57J55l3qLJ54k76P0K08j48R2m4j63K44l01L8K1N3j8Q2qrj2R6k35
$$ plain form
6803 -159 -46 63 -40 8 -61 -36 39 -51 -84 135 7 67 -1 -67 34 154 0 -27 118 -57 89 65 -4 -123
6827 -123 2 92 -13 140 -98 15 42 -39 -19 -150 -48 -64 -40 41 80 51 107 -33 -2 -108 -43 338 94 134
6851 134 132 -71 53 29 87 108 -6 38 -113 -141 -6 -117 -73 -165 -129 131 53 25 69 114 4 -14 -124 138 113
6876 113 -144 -77 -155 40 -122 -7 -52 -97 17 196 -1 -20 87 29 -61 -104 -62 71 119 -141 -95 -22 -265 110
6900 110 81 -8 146 -11 -18 47 109 81 39 -74 -29 140 -152 -12 159 109 22 -45 27 94 -100 -52 29 -138 109
6925 109 -29 72 -200 99 109 -11 21 -63 -41 -41 -138 -7 131 -11 -33 6 6 26 18 65 72 60 -11 -123 -9 26 132
6952 132 21 69 112 -87 -201 -188 177 -44 58 -139 26 -44 -131 100 -74 -148 -142 12 -124 -104 -71 51 100 -20
6976 -20 155 -17 -14 37 19 -59 25 -27 -25 -132 142 -49 16 -35 34 36 -21 -67 1 -2 -40 113 -94 66 -246 -26 -30 -66
$$ packed form
6803a59J13J09j03M8o9K5P5r0l3K19j28O0o8o6J01J20j54k7J45j75J46k4o9j19
6827a23J25R0j05J53k38J13K7q1K0j31J02j6K4Q1L9k9N6j40L1j06O5L81k44M0
6851A34kk03J24k4N8K1j14M4j51k8J35j11M4r2L6K60p8k8M4M5j10j8j10K62k5
6876A13k57O7p8J95j62J15m5m5J14J79j97j9J07n8r0m3M2J33M8k60M6P3k43L75
6900A10k9q9J54j57pO5O2k8m2j13M5J69k92J40J71n0q7o7P2O7j94M8Q1j67K47
6925A09j38J01k72K99J0j20L2q4K2%r7J31J38j42k2L9%K0qM7Pj2p1j12J14L5J06
6952A32j11M8M3j99j14J3L65k21J02j97J65p0q7K31j74p4OJ54j36K0L3J22M9j20
6976b0J75j72LN1j8p8Q4n2Kj07K74j91O5n1O9Kn7m6O8ll8J53k07J60l12K20ml6
$$ plain form
7004 -66 126 92 1 51 22 -7 -87 -80 -72 -91 -27 -114 43 -11 -147 -13 108 -21 1 -37 36 29 -23 -82 -62 66 -52 -66
7032 -66 126 -106 -9 -125 -87 35 168 204 113 241 57 74 41 -218 -34 -79 -239 33 -23 40 63 -55 6 56
7056 56 -135 57 99 149 -106 -29 91 107 -74 -267 -3 210 87 69 -162 68 -252 57 83 121 -103 -133 52
7079 52 -83 -115 144 -97 -174 -63 -218 123 76 132 -158 88 -83 -23 8 85 -81 30 -176 -37 -95 -124 -111 129
7103 129 16 -110 -52 -131 -132 -83 128 -6 63 109 115 -33 45 14 -66 -20 -76 9 82 4 -57 10 40 86 -29 -70 -138 -99
7131 -99 84 74 -26 -72 -6 16 78 -22 97 18 36 56 7 -11 110 -18 -85 221 -151 -49 -129 -125 12 -47 -25 231
7157 231 -70 -154 -103 39 -208 146 -15 139 47 -3 9 -256 -44 72 -141 -10 104 0 170 22 -16 137
7179 137 49 12 27 -54 193 21 30 50 36 -116 62 -78 7 43 47 -56 55 38 104 86 -114 -15 -61 -98 -45 -132 -37
$$ packed form
7004f6J92l4r1N0k9k9q0PQj9O4q7J57n4j36J34J21j29K2l8P3pn2n9K0J28j18j4
7032f6J92k32R7j16L8J22J33L6r1J28j84J7l3k59J84m5j60K72n6O3K3j18O1N0
7056E6j91J92M2N0k55P7J20J6j81j93K64K13j23j8k31K30l20L09K6L8k24l0J85
7079E2j35l2K59k41p7J11j55L41m7N6k90K46j71O0L1P7j66J11k06J39n8k9J3K40
7103A29j13j26N8p9jM9K11j34O9M6Oj48P8l1q0M6n6Q5P3p8o1O7L0M6j15m1o8L9
7131i9J83j0j00m6O6K2O2j00J19p9J8K0m9j8J21j28o7L06l72J02q0MJ37n9K2K56
7157B31l01q4N1J42k47L54j61J54r2n0J2k65K12J16k13J31J14j04J70j48l8J53
7179A37q8l7J5q1K47j72RK0j4j52J78j40Q5L6Mj03J11j7O6j8k00R9m6l7N3q7R5
$$ plain form
7206 -37 32 -55 -53 -110 39 -34 -1 -127 259 -81 0 94 118 -274 82 -24 -37 -58 -62 63 -70 126 -117 18 48
7231 48 -31 -29 -118 -64 -67 -104 -29 -77 -6 136 -72 84 -41 8 97 116 180 -5 115 46 -48 31 -36 -37 59 216 12 10
7259 10 138 110 -6 58 -73 -2 2 108 42 -69 3 151 -8 -41 12 -71 192 13 15 202 26 96 -34 55 -137
7284 -137 -47 -239 162 -98 -100 -125 -146 10 -72 113 19 94 -52 -68 -202 -106 46 -32 55 52 -248 -40 19 11 181 -90
7310 -90 -22 -147 105 21 177 14 -174 182 -128 -143 -64 78 32 -18 -41 71 75 189 4 70 -68 44 19 -49
7334 -49 60 71 -42 -117 66 -58 -40 -61 -42 -166 -19 -37 -104 40 57 181 105 8 144 177 76 189 -20 -21 82
7359 82 154 -16 31 39 -19 -19 10 -88 -103 -73 32 -71 -62 143 80 -27 8 142 98 -69 -20 -61 -36 -60 54 187 -138
7386 -138 94 12 26 51 2 -46 -146 -15 -157 13 -11 175 111 -99 -57 5 62 -22 61 -233 35 -62 69 -93
$$ packed form
7206c7O9q7Kn7J49p3L3j26L86l40Q1R4K4l92L56j06j3k1mJ25j33J96k43J35L0
7231D8p9Kq9N4ll7P5m8P1J42k08J56j25M9Q9J9O4j85J20o9r4P9o7jR6J57k04k
7259A0J28k8j16O4j31P1MJ06o6j11P2J48j59l3N3q3K63j79KJ87j76P0j30Q9j92
7284a37R0j92M01k60kk5k1J56q2J85r4P5j46j6j34R6J52p8Q7ll00K08N9qJ70k71
7310i0O8j25K52q4J56j63j88L56l10j5P9J42m6n0k3J12MJ14j85O6j38J12k5o8
7334d9J09J1j13p5J83j24J8k1J9j24J47j8o7J44J7J24p6r7J36L3j01J13k09jJ03
7359H2P2j70M7Qn8%K9r8j5L0J05j03RK05o3j07L5J34m4j67M9m1K5k4J14J33l25
7386a38K32q2J4K5m9m8j00J31j42J70k4J86o4k10M2O2N7q4Q3k94K68r7J31j62
$$ plain form
7410 -93 -141 -150 -103 -54 97 -30 76 -5 150 35 32 -66 -119 42 -18 -62 -81 128 -170 -22 -36 -7 56 -56 49 22
7436 22 -62 -16 -12 12 -14 -81 52 62 23 44 -43 -62 -87 -44 92 -72 -53 54 -55 60 -11 -27 19 39 -108 120 24
7463 24 -4 35 -147 -43 -86 -25 146 271 86 -10 50 -25 -9 -130 27 -246 -46 -56 -3 -85 -78 -70 117 -90 20
7488 20 24 -44 153 -178 -21 -27 -95 84 -146 2 73 37 -90 34 36 -15 14 -66 -167 -77 -83 164 -15 93 -143 -51
7514 -51 -11 -107 37 -115 4 -38 -67 -80 -133 135 -86 -18 -116 -115 -127 136 -77 34 -33 15 -168 42 -53 -71 -12 -194
7540 -194 -182 13 57 145 17 65 -59 -89 40 7 84 -61 34 -85 63 -20 -99 -15 -75 65 87 -82 14 -43 -34 43
7566 43 20 -214 -21 -93 -22 33 -54 48 50 0 43 36 11 66 -59 -25 19 145 53 16 -45 261 70 -46 43 -169 84
7593 84 39 42 115 72 67 -26 -213 -34 34 -97 -106 182 79 144 25 44 177 -63 74 56 22 -84 -85 -71 121 -65
$$ packed form
7410i3m8rM7M9J51j27J06q1J55j15lr8n3J61o0m4j9K09k98J48j4K9O3j12J05k7
7436B2q4M6MK4k6o7J33J0l9K1q7j9k5M3J36j64J9J07j09J15p1j6M6K0j47K28r6
7463B4k8L9j82J04m3O1J71J25j85r6O0p5J6j21J57k73K00j0N3q2PQJ87k07J10
7488B0Mo8J97l31J57oo8J79k30J48P1l6j27J24Kn1K9q0j01R0oK47j79J08k36R2
7514e1M0r6J44j52J19m2k9j3n3K68k21O8r8Jj2K63k13J11o7M8j83K10r5j8N9j82
7540a94J2J95M4Q8j28M8j24l0J29l3P7j45R5j19J48q3p9Q4o0J40K2j69R6n7RP7
7566D3k3k34J93p2P1N5q7J02Kn0M3pk5N5j25L4M4J26r2l7o1L06j91j16Q9k12K53
7593H4m5LP3m3nr3j87J79O8j31rK88j03O5j19J9J33k40J37j8l4j06jJ4J92j86
$$ plain form
7619 -65 -22 -124 -59 61 71 -80 220 122 53 34 58 21 108 -15 -259 -118 9 59 5 1 -55 76 3 106 -67
7644 -67 66 -24 -47 16 -171 94 17 -94 -300 50 155 4 100 108 -30 -11 5 72 91 13 106 31 -25 174 4
7669 4 64 132 -1 -148 17 -4 29 -75 60 21 3 -113 2 18 -179 24 80 103 28 86 -11 141 -210 -64 34
7694 34 -134 -30 65 8 39 -141 12 32 -4 -97 -33 209 -36 -10 -58 122 -5 -75 12 -19 -24 25 64 42 98 -71
7720 -71 -70 109 -57 -42 92 23 -113 4 -116 -53 -78 -1 75 61 139 -23 -143 139 102 38 -123 -64 201 -96 95
7745 95 93 -60 -44 160 19 5 182 86 -125 20 108 17 33 12 114 -112 148 -115 -20 136 127 -95 24 -34 -84
7770 -84 -121 -161 105 -9 -27 44 24 38 13 20 -52 52 25 11 152 -36 -135 -182 24 29 -69 -85 207 -71 -29 24 -8
7797 -8 42 114 -59 -23 -115 45 -79 13 -19 -142 -157 -97 18 136 142 52 -130 8 41 28 113 48 48 24 53 -123 1
$$ packed form
7619f5M3j02O5J20J0j51L00r8o9j9K4l7Q7j23k44J41J27N0n4mn6J31p3J03j73
7644f7J33r0k3O3j87K65p7j11k06L50J05j51R6Qj38J9J6O7J9p8R3p5n6J99j70
7669DO0O8j33j47J65k1L3j04J35l9j8j16J15J6j97K03N6K3p5N8r7J52l51J46R8
7694C4j68J04R5n7L1j80J53K0l6r3O4K42k45K6m8J80j27p0Q7l1nM9L9k2N6j69
7720g1JJ79j66J5J34o9j36J17j20O3k5P7P6j4P8j62j20K82l7o4j61N9K65k97J91
7745I5kj53J6K04j41j4J77r6k11J45Q8r1J6k1J02k26K60k63R5J56rk22J19n8n0
7770h4l7m0K66j14j8P1k0J4k5Pp2J04k7j4J41j88r9m7K06Nr8j6K92k78M2N3l2
7797hN0P2j73L6r2J60j24R2l2j23j5O0J15J18Or0j82J38L3j3Q5o5%k4K9j76J24
$$ plain form
7824 1 -119 -26 54 104 2 -7 -74 22 49 -156 87 34 -90 -3 -37 67 -109 -165 99 -115 35 0 -31 -50 70 9
7850 9 -113 180 -62 128 110 157 8 45 -6 -67 -122 -161 42 -125 200 -61 139 -9 -159 23 154 11 -36
7873 -36 65 -95 -116 -29 -7 -164 76 -201 3 7 -81 181 113 5 248 10 -45 105 -19 47 119 -152 87 -58
7897 -58 19 -16 -22 141 63 5 -48 -46 -36 43 -38 33 -105 -75 26 55 32 -47 -31 21 -49 71 90 -119 299 1 207
7924 207 -91 -12 -116 -161 101 124 115 114 14 30 38 -88 -21 123 -15 -39 -111 -41 54 140 14 78 -28 -114 182 -74
7950 -74 -15 64 25 41 299 -34 -130 113 57 95 9 240 138 17 17 18 127 20 196 74 -35 -43 -5 36 -72 25
7976 25 -109 -24 95 152 138 39 99 7 218 -93 1 -120 -43 -69 -39 -134 -17 -84 -121 119 -86 81 20 -29 -86 32
8002 32 72 0 -41 -46 110 54 -64 191 45 94 51 -26 27 -66 8 83 -23 101 -39 -72 116 -88 -43 -112 28 -13
$$ packed form
7824Aj20R3Q0N0j02ro7R6K7k05K43n3j24Q7l4J04j76n6K64k14J50l5l1j9J20o1
7850Ij22K93k42J90j8M7j49L7n1o1n5l9K03j67L25k61K00j48j50J82J31j43m7
7873c6J01j60k1Q7K2j57K40k77K04Mq8K62o8j08K43k38n5J50j24O6P2k71K39j45
7897e8P7l5oJ63p8n8n3KJ0P9q1P1j38L0J01K9k3p9J6N2p0J20J9k09M18k98K06
7924B07k98P9j04m5K62K3rjj00J6Qj26O7J44j38k4p2P0R5Q6j26O4j06q6K96k56
7950g4N9P9l9J6K58l33r6K43n6L8q6K31j02j21%JJ09j07J76j22j09qL8M1j08R7
7976B5j34Q5J19N7j4r9O0r2K11l11R4j21P7k6L0r5J17o7l7K40k05J67o1m9n7J18
8002C2M0p2m1nJ56n6j18K55j46M9m3p7N3r3P4P5j06J24j40l3J88k04M5o9J40m1
$$ plain form
8028 -13 -68 116 44 -126 -27 51 128 86 -119 -176 -43 4 217 -77 -67 44 76 -97 59 0 -121 -2 93 7 -71
8053 -71 33 -82 -69 -18 33 -96 -6 95 -26 -80 99 -106 194 33 -69 43 -79 12 106 14 14 -65 81 194
8077 194 -271 -25 112 33 134 37 -152 59 190 50 -45 115 -144 53 77 -31 50 -107 -102 -20 -5 8 -179
8100 -179 -12 -24 -34 122 -10 -81 178 -9 -41 -13 -40 -78 77 -71 54 -79 -1 -154 -138 -35 -34 28 57 -211
8124 -211 19 90 43 72 34 137 -104 28 134 82 10 -9 -79 -5 -98 -4 111 -137 -46 139 -43 46 69 -86 -13
8149 -13 6 -102 120 68 90 -40 -209 55 47 -17 -3 31 -31 -58 96 40 138 101 -7 11 4 63 -76 123 -67 121
8175 121 -15 24 -89 82 115 105 -45 -42 16 -80 112 -162 -126 5 12 -28
$$ packed form
8028a3n5J84p2j70R9P8P7m2k05n7J33M7K13k94J0J11L2j73J56n9j21J19R5q6p8
8053g1J04j15J3N1N1j29R0J01j21n4J79k05L00j61j02J12j22R1R4r2%p9J46J13
8077A94m65K46J37p9J01r7j89K11J31j40r5J60k59J97K4j08Q1j57NQ2J5J3j87
8100a79J67j2j0J56j32p1K59j87l2K8k7l8J55j48J25j33P8j53J6J03JO2K9k68
8124b11K30P1m7K9l8J03k41J32J06n2p2j9p0P4r3R4J15k48R1J85j82Q9K3j55P3
8149a3J9j08K22n2K2j30j69K64qo4J4L4o2k7J54n6R8l7j08J8pN9j39J99j90J88
8175A21j36L9j13J71L3j0j50LN8r6J92k74L6J31Pm0
8191b8
$$ Imaginary data points
##PAGE= N=2
##DATA TABLE= (X++(I..I)), XYDATA
$$ plain form
0 0 0 0 0 0 0 0 0 0 8 -8 8 -8 8 -16 17 -24 32 -40 48 -56 65 -80 96 -113 129 -153 177 -208 238 -273 312
31 312 -356 404 -457 518 -581 655 -732 820 -912 1017 -1130 1253 -1386 1537 -1692 1871 -2063
48 -2063 2272 -2504 2759 -3040 3351 -3700 4087 -4526 5024 -5598 6266 -7055 8000 -9165
62 -9165 10634 -12559 15201 -19072 25321 -37135 67602 -328246 -651929 -314026 -209018
73 -209018 -46289 10434 162507 217538 174754 51064 18647 62838 187381 183134 110528
84 110528 49585 43160 51577 41302 -28964 7657 155565 322527 400224 337947 205524 122798
96 122798 19187 -118373 -259945 -342417 -278649 -131318 -59534 -67316 -124968 -166152 -164799 -202821
108 -202821 -267230 -261309 -169197 4378 151768 177460 159653 152522 142076 128956 73029 28066
$$ packed form
0@%%%%%%%%Qj6J6j6J6k4L3m1N6p2Q8j04J21j45J76k09K42k82L30l85M46n11N85
31C12o68P60q61R75j099J236j387J552j732J929k147K383k639K923l229L563l934
48b063M335m776N263n799O391p051P787q613R550j0622J1864j3321J5055j7165
62i165J9799k3193K7760l4273M4393o2456J04737l95848l23683L37903J05008
73b09018J62729N6723J52073N5031m2784j23690l2417M4191J24543m247p2606
84A10528o0943o425Q417j0275p0266L6621J47908J66962P7697o2277j32423q2726
96A22798j03611j37560j41572q2472O3768J47331P1784p782n7652m1184J353l8022
108b02821o4409N921R2112J73575J47390K5692j7807p131j0446j3120n5927m4963
$$ plain form
120 28066 76246 157892 204923 172526 59752 -24684 -60750 -98305 -113182 -100898 -34928 97578
132 97578 184083 172300 96532 -19272 -109991 -175067 -248118 -266387 -212531 -114506 5510 61387
144 61387 46672 28142 3989 -7350 -840 4977 57284 140423 190844 205273 156483 66622
156 66622 294 -62850 -111098 -111933 -92278 -42424 14058 23662 11317 -21155 -65585 -74106 -65190
169 -65190 -34223 35792 85720 106233 99417 38783 -32553 -98195 -158936 -159347 -107652 -28597 70394
182 70394 127727 146579 151345 110043 45854 -16772 -71993 -65747 -19695 10204 29180 18310
194 18310 -3680 -9787 -43422 -83239 -84712 -55360 16940 80831 77694 50948 19535 -16339 -44018
207 -44018 -91840 -118030 -68109 16012 97321 132787 100569 69286 46097 -7135 -68796 -123767
$$ packed form
120B8066M8180Q1646M7031l2397j12774q4436l6066l7555j4877J2284O5970J32506
132I7578Q6505j1783p5768j15804r0719o5076p3051j8269N3856R8025J20016N5877
144F1387j4715j8530k4153j1339O510N817N2307Q3139N0421J4429m8790q9861
156F6622o6328o3144m8248q35J9655M9854N6482R604j2345l2472m4430q521Q916
169f5190L0967P0015M9928K0513o816o0634p1336o5642o0741m11N1695P9055R8991
182G0394N7333J8852M766m1302o4189o2626n5221O246M6052K9899J8976j0870
194A8310k1990o107l3635l9817j473K9352P2300O3891l137k6746l1413l5874k7679
207d4018m7822k6190M9921Q4121Q1309L5466l2218l1283k3189n3232o1661n4971
$$ plain form
219 -123767 -126471 -49837 22342 46384 37917 13913 20488 29970 -9232 -44965 -39618 7738 76553
232 76553 83848 31726 -7052 -23931 -25236 -40419 -83369 -77012 -6643 63245 95645 60281 3786
245 3786 -2802 2334 -14558 -40852 -54756 -6332 69364 83758 41922 -20502 -58688 -48618 -55638
258 -55638 -90401 -90122 -40129 46463 107677 85217 38584 20767 22339 26193 -7376 -47803 -25938
271 -25938 23605 45948 17716 -53033 -87274 -64402 -44697 -40249 -39542 -7707 75029 131557 115231
284 115231 63068 11055 -2080 3205 -30011 -67160 -63964 -25410 24520 24674 -21398 -41995 -28130
297 -28130 1676 20211 3488 4746 44569 69944 58503 4955 -55370 -63800 -49626 -48569 -50291
310 -50291 -46893 -7588 50043 60535 34310 4773 -8263 12579 23708 6144 1765 14410
$$ packed form
219a23767k704P6634P2179K4042q467k4004O575R482l9202l5733N347M7356O8815
232G6553P295n2122l8778j6879j305j5183m2950O357P0369O9888L2400l5364n6495
245C786o588N136j6892k6294j3904M8424P5696J4394m1836o2424l8186J0070p020
258e5638l4763K79M9993Q6592O1214k2460m6633j7817J572L854l3569m0427K1865
271b5938M9543K2343k8232p0749l4241K2872J9705M448P07L1835Q2736N6528j6326
284A15231n2163n2013j3135N285l3216l7149L196L8554M9930J54m6072k0597J3865
297b8130K9806J8535j6723J258L9823K5375j1441n3548o0325q430J4174J057j722
310e0291L398L9305N7631J0492k6225k9537j3036K0842J1129j7564m379J2645
$$ plain form
322 14410 36149 45337 9513 -27967 -32134 -21598 -3324 -1418 -14216 -663 18295 14884 -6150
335 -6150 -43859 -59416 -38339 -20069 -3452 13463 27062 54603 63932 36748 7099 -19198
347 -19198 -29472 -20317 -22835 -22307 -6031 6701 22268 24141 6856 3933 6249 4761 11746 8074
361 8074 3871 8246 -3583 -18538 -30505 -45785 -41693 -30909 -23459 -973 15936 23698 33061
374 33061 27432 23177 27744 20272 15822 15543 11314 17236 11259 -10105 -21762 -31383 -34561 -28635 -33955
389 -33955 -28831 -5609 12279 25435 21116 4659 6627 10121 3155 -5338 -20290 -17916 2804
402 2804 7129 1254 -2495 405 23115 35372 22868 13736 11138 17704 22010 -4636 -33406 -38101
416 -38101 -29130 -13177 -11915 -23533 -11214 13155 24455 15584 -15802 -32628 -20930 -17137 -25935
$$ packed form
322A4410K1739R188l5824l7480m167J0536J8274J906j2798J3553J8958l411k1034
335f150l7709j5557K1077J8270J6617J6915J3599K7541R329k7184k9649k6297
347a9198j0274R155k518N28J6276J2732J5567J873j7285k923K316j488O985l672
361H074m203M375j1829j4955j1967j5280M092J0784P450K2486J6909P762R363
374C3061n629m255M567p472m450k79m229N922n977k1364j1657r621l178N926n320
389c3955N124K3222J7888J3156m319j6457J968L494o966q493j4952K374K0720
402B804M325n875l749K900K2710J2257j2504r132k598O566M306k6646k8770m695
416c8101Q971J5953J262j1618J2319K4369J1300q871l1386j6826J1698L793q798
$$ plain form
429 -25935 -37661 -36158 2473 42828 53025 51659 51286 64989 80012 56173 11611 -18518 -29969
442 -29969 -25081 -34737 -63622 -66932 -40071 -5805 14510 2743 -7446 9569 23849 18957 -9321
455 -9321 -42166 -39694 -21343 -21539 -32012 -40017 -19241 26882 50728 48071 43786 49974 72513 76318
469 76318 42249 9491 -2629 2875 9956 -11700 -37898 -35292 -20285 -11127 -25717 -55962 -56884
482 -56884 -33735 -17925 -16384 -29588 -27252 3435 21936 15257 87 -9267 8563 28486 20797
495 20797 7539 4538 19479 43301 40483 22672 21625 34477 52557 52539 24397 3419 -2574
508 -2574 -11485 -28002 -59190 -79636 -65986 -44493 -30353 -24756 -25767 -10506 8696 5258 -8843
521 -8843 -22282 -20655 951 12812 12311 17514 25958 42025 50326 36344 25987 27619 31658 35772
$$ packed form
429b5935j1726J503L8631M0355J0197j366l73J3703J5023k3839m4562l0129j1451
442b9969M888r656k8885l310K6861L4266K0315j1767j0189J7015J4280m892k8278
455i321l2845K472J8351j96j0473q005K0776M6123K3846k657m285O188K2539L805
469G6318l4069l2758j2120N504P081k1656k6198K606J5007R158j4590l0245r22
482e6884K3149J5810J541j3204K336L0687J8501o679j5170r354J7830J9923p689
495B0797j3258l001J4941K3822k818j7811j047J2852J8080j8k8142k0978n993
508b574q911j6517l1188k0446J3650K1493J4140N597j011J5261J9202l438j4101
521h843j3439J627K1606J1861n01N203Q444J6067Q301j3982j0357J632M039M114
$$ plain form
535 35772 23659 4464 -316 -4047 -10504 -19216 -33346 -31724 -17990 -12463 -11027 -16958 -25611 -24860
549 -24860 -30276 -40880 -41624 -36082 -16822 8169 21153 32349 40776 39933 38547 28195 13841 10539
563 10539 7532 6597 10160 7775 9202 11066 4538 2739 1977 -319 3801 1349 -5319 -8065 -18259
578 -18259 -30532 -39996 -49156 -43337 -27879 -15617 173 11981 20469 30347 25333 11066 2396
591 2396 -2482 3159 10587 9407 14239 22696 25896 24688 8748 -8631 -9664 -6830 -4459 -4587 -10490
606 -10490 -5581 3712 585 -8279 -19327 -20745 -5834 1553 -2187 -5197 -6710 -227 2679 -12128
620 -12128 -22485 -17973 -1860 20247 26519 22803 27849 32008 28635 12859 -14804 -25739 -16728
633 -16728 -9163 -6797 -12715 -14195 1521 10881 4290 -7028 -14198 -1982 15765 13725 3550 -3422
$$ packed form
535C5772j2113j9195m780l731o457q712j4130J622J3734N527J436n931q653P51
549b4860n416j0604p44N542J9260K4991J2984J1196Q427q43j386j0352j4354l302
563A0539l007r35L563k385J427J864o528j799p62k296M120k452o668k746j0194
578a8259j2273r464r160N819J5458J2262J5790J1808Q488R878n014j4267q670
591B396m878N641P428j180M832Q457L200j208j5940j7379j033K834K371j28n903
606a0490M909R293l127q864j1048j418J4911P387l740l010j513O483K906j4807
620a2128j0357M512J6113K2107O272l716N046M159l373j5776k7663j0935R011
633a6728P565K366n918j480J5716R360o591j1318p170J2216J7747k040j0175o972
$$ plain form
647 -3422 -2937 3430 -5555 -25653 -29687 -17502 3906 17409 10471 6567 14777 20238 17679 1603
661 1603 -12359 -2787 13587 19411 13874 411 -526 6725 -1047 -16811 -28667 -25525 -3436 10759
675 10759 6294 1095 153 6185 8113 -8440 -23365 -20956 -9071 4124 1821 -10819 -9360 -302
689 -302 4031 983 -9845 -7250 12061 24903 25640 15931 6343 10749 12222 1560 -7618 -9482 2640
704 2640 19468 19105 8340 1659 -1261 669 -5915 -20868 -23580 -15001 -3728 2583 -5602 -12843
718 -12843 -9171 -7385 -8367 -13701 -17545 -6880 6380 9646 6731 -1235 -3302 2991 1814 -683 2009
733 2009 8557 21970 28531 21666 15067 8774 4295 1887 -7391 -13031 -7914 -2530 2698 2337 -4923
748 -4923 -6238 -5685 -7683 -6502 -6673 -3345 5119 6163 3276 -539 -7953 -9919 -10592 -13534 -9030 -2820
$$ packed form
647c422M85O367q985k0098m034J2185K1408J3503o938l904Q210N461k559j6076
661A603j3962R572J6374N824n537j3463r37P251p772j5764j1856L142K2089J4195
675A0759m465n199r42O032J928j6553j4925K409J1885J3195k303j2640J459R058
689c02M333l048j0828K595J9311J2842P37r709r588M406J473j0662r178j864J2122
704B640J6828l63j0765o681k920J930o584j4953k712Q579J1273O311q185p241
718a2843L672J786r82n334l844J0665J3260L266k915p966k067O293j177k497K692
733B009O548J3413O561o865o599o293m479k408r278n640N117N384N228l61p260
748d923j315N53j998J181j71L328Q464J044k887l815p414j966o73k942M504O210
$$ plain form
764 -2820 2861 10355 10302 8143 7729 1716 -1944 -2983 -4643 171 3625 1872 2828 1229 -962 -822
780 -822 -4570 -4482 2111 5898 9598 9010 3554 3353 1816 -4122 -6952 -9916 -5838 4932 8037 7584
796 7584 6665 3273 4105 143 -10118 -12720 -10394 -4253 2202 -1519 -5175 -1944 -98 1025 -2786
811 -2786 -8817 -3260 5800 9143 8345 1553 -753 4825 3383 -2724 -6368 -5946 4461 11447 6127
826 6127 -212 -3641 -2094 1564 -4907 -12051 -8157 -354 8567 8310 -807 -2432 2093 3914 1571
841 1571 -6863 -8529 2935 11028 11192 5697 -515 4008 9722 4687 -2793 -7213 -3462 5669 2458
856 2458 -8079 -13469 -12649 -5761 -3858 -11665 -13034 -5072 3754 8549 883 -7216 -3657 1726 3921
871 3921 888 -3955 3356 15608 18236 13775 5140 2442 8982 8743 1237 -4367 -4899 3143 8299
$$ packed form
764b820N681P494n3k159m14o013l660j039j660M814L454j753R56j599k191J40
780h22l748Q8O593L787L700n88n456k01j537n938k830k964M078J0770L105m53
796G584r19l392Q32l962j0261k602K326O141O455l721l656L231J846J123l811
811b786o031N557R060L343p98o792k306N578j442o107l644M22J0407O986n320
826F127o339l429J547L658o471p144L894P803Q921k57r117j625M525J821k343
841A571q434j666J1464Q093J64n495o212M523N714n035p480m420L751R131l211
856B458j0537n390Q20O888J903p807j369P962Q826M795p666q099L559N383K195
871C921l033m843P311J2252K628m461q635k698O540k39p506n604n32Q042N156
$$ plain form
886 8299 1255 -5659 -6781 -3667 463 -5417 -14065 -13007 -7695 -3311 -5680 -14792 -14944 -6505 -472
901 -472 2983 1477 2512 13253 18978 16167 10061 3781 6178 9868 5201 172 -2018 598 7002
916 7002 5115 -3046 -6053 -6571 -4019 -3876 -10740 -12537 -8642 -5855 -3975 -7359 -10898 -5496 -783 1487
932 1487 2670 473 3804 9918 9482 8134 5904 5230 10206 11583 8557 8598 7748 8032 7131 -476 -6071
949 -6071 -8277 -10718 -9959 -11007 -13216 -9707 -7305 -6360 -4808 -6139 -5376 -2380 -3367 -2666 -1477 -1063 2266
966 2266 3435 3154 6034 7060 8550 11274 10453 11781 13246 10160 7837 4452 635 645 -2137 -6073
982 -6073 -6205 -7330 -6431 -5452 -9582 -10004 -8582 -8311 -6705 -7902 -8615 -3327 248 2093 2852 885 3797
999 3797 8580 7727 6176 4903 4938 9068 8464 3808 2140 1834 4284 5702 183 -2898 -1874 -728
$$ packed form
886H299p044o914j122L114M130n880q648J058N312M384k369r112j52Q439O033
901d72L455j506J035J0741N725k811o106o280K397L690m667n029k190K616O404
916G002j887q161l007n18K552J43o864j797L895K787J880l384l539N402M713K270
932A487J183k197L331O114m36j348k230o74M976J377l026M1q50K84r01p607n595
949f071k206k441P59j048k209L509K402R45J552j331P63K996r87P01J189M14L329
966B266J169k81K880J026J490K724q21J328J465l086k323l385l817J0k782l936
982f073j32j125Q99R79m130m22J422K71J606j197p13N288L575J845P59j967K912
999C797M783q53j551j273L5M130o04m656j668l06K450J418n519l081J024J146
$$ plain form
1015 -728 480 -4160 -10175 -8843 -6188 -5049 -5675 -9283 -6948 -147 1874 664 -2302 -2661 3734 6546
1031 6546 3246 866 158 4693 9760 6206 2272 1960 4100 8068 5210 -1744 -2095 576 2756 1492
1047 1492 -5973 -8144 -3275 -643 -1014 -5601 -9186 -3861 386 -1133 -4296 -7403 -3612 3390 2313
1062 2313 -1171 -2162 249 7212 8059 2127 -120 1626 5559 7413 1305 -2666 8 2814 4369
1077 4369 617 -4730 -1974 2601 3066 412 -4923 -4332 1514 1880 -1125 -4673 -5971 -344 2597 -1414
1093 -1414 -3604 -3788 -155 3979 494 -3592 -2634 -45 4030 2755 -2474 -1784 1891 3743 4071 -289
1109 -289 -1686 2550 3954 3011 -91 -2763 535 3605 1043 -1292 -3613 -2234 1997 717 -2729
1124 -2729 -2824 -2509 728 1634 -2313 -2546 -670 671 2064 -644 -2555 50 1193 1998 960 -1845
$$ packed form
1015g28J208m640o015J332K655J139o26l608K335O801K021j210k966l59O395K812
1031F546l300k380p08M535N067l554l934l12K140L968k858o954l51K671K180j264
1047A492p465k171M869K632l71m587l585N325M247j519l163l107L791P002j077
1062B313l484r91K411O963Q47n932k247J746L933J854o108l971K674K806J555
1077D369l752n347K756M575M65k654n335N91N846L66l005l548j298N627K941m011
1093a414k190j84L633M134l485m086R58K589M075j275n229O90L675J852L28m360
1109b89j397M236J404r43l102k672L298L070k562k335k321J379M231j280l446
1124b729r5L15L237R06l947k33J876J341J393k708j911K605J143Q05j038k805
$$ plain form
1140 -1845 11 2198 1515 1216 -498 -847 1997 1032 -581 -361 -1100 709 1481 -896 -564 -500 -584 897
1158 897 -602 -1663 -147 -751 -578 17 -1315 8 716 -623 278 334 0 1767 566 141 1497
1175 1497 536 779 694 -952 268 922 -425 -437 -1809 -1555 612 -494 -1431 -1032 -1579 541 950 -1632
1193 -1632 -928 172 908 2054 54 -1204 1510 2309 2515 1412 -1561 183 2179 1232 39 -2163
1209 -2163 -1915 1384 456 -1820 -2619 -2797 253 1478 -1847 -2608 -1783 380 3002 372 -2168 -58
1225 -58 1921 3400 2083 -1802 -461 2699 2771 1652 -1937 -2328 1740 2428 374 -1759 -2925 415
1241 415 3209 243 -2163 -2801 -924 2271 -111 -3726 -3199 -1210 1696 1715 -2344 -2482 926 3017
1257 3017 3572 -171 -2105 1499 3518 2477 323 -2366 238 3836 2348 -94 -2244 -1284 2748
$$ packed form
1140a845J856K187o83k99j714l49K844r65j613K20p39J809P72k377L32O4q4J481
1158H97j499j061J516o04J73N95j332J323P08j339R01N6l34J767j201m25J356
1175A497r61K43q5j646J220O54j347j2j372K54K167j106r37L99n47K120M09k582
1193a632P04J100P36J146k000j258K714P99K06j103k973J744J996r47j193k202
1209b163K48L299r28k276p99j78L050J225l325p61Q25K163K622k630k540K110
1225e8J979J479j317l885J341L160P2j119l589l91M068O88k054k133j166L340
1241D15K794k966k406o38J877L195k382l615N27J989K906J9m059j38L408K091
1257C017N55l743j934L604K019j041k154k689K604L598j488k442k150R60M032
$$ plain form
1272 2748 1788 -2323 -3639 -3444 -126 1225 -2483 -3603 -1810 940 2784 375 -2518 -369 2042
1287 2042 2709 1124 -2364 -1225 2310 2793 1675 -819 -1325 2451 3323 722 -1161 -2353 -505 1252
1303 1252 -1465 -3411 -2980 -1188 1910 962 -1737 -814 735 2346 2045 -1286 -1438 703 1454 1543 -173
1320 -173 -1240 1380 2646 1775 382 -1351 -411 1356 -539 -2335 -3045 -3009 -799 -687 -2005 -1334 -253
1337 -253 931 1976 -103 -1012 29 -386 179 -704 -2165 224 1724 2143 3195 2385 2824 3994 2667
1354 2667 1872 1106 66 431 -188 -1768 -1586 -2033 -1962 -1209 -2498 -2285 -1438 -2323 -2110 -2051 -2824 -1589 -1507
1373 -1507 -1811 -303 223 1695 3175 2079 2316 2667 1573 1617 353 -600 1063 1563 1626 2130 1190 2032
1391 2032 3157 1240 -120 -1104 -2231 -1159 -2358 -4080 -3623 -3419 -1986 -576 -1815 -987 1113 2215
$$ packed form
1272B748r60m111j316J95L318J351l708j120J793K750J844k409k893K149K411
1287B042O67j585l488J139L535M83j118k494n06L776Q72k601j883j192J848J757
1303A252k717j946M31J792L098r48k699R23J549J611l01l331j52K141P51Q9j716
1320a73j067K620J266q71j393j733R40J767j895j796p10L6K210J12j318O71J081
1337b53J184J045k079r09J041m15N65q83j461K389J500M19J052q10M39J170j327
1354B667p95p66j040L65o19j580J82m47P1P53j289K13Q47q85K13N9p73J235Q2
1373a507l04J508N26J472J480j096K37L51j094M4j264r53J663N00O3N04r40Q42
1391B032J125j917j360r84j127J072j199j722M57K04J433J410j239Q28K100J102
$$ plain form
1407 2215 3248 1457 -653 293 523 -288 -1051 -2479 -624 2271 2374 1876 1191 748 2731 2193 -921
1424 -921 -1980 -2096 -206 1027 -1130 -2276 -1428 -678 382 -1035 -3522 -2323 -557 342 -9 -2087
1440 -2087 -1392 1709 2706 2663 1695 1606 4344 5509 3333 964 -1175 -1042 314 -1781 -3283 -2558 -508
1457 -508 2616 2552 -267 -497 79 563 -171 -3551 -4856 -2817 -1454 -1210 -2394 -3822 -1186 1105 816
1474 816 351 -607 1135 3972 3101 987 -440 -632 1795 2334 668 533 1836 3506 4381 1399 -837
1491 -837 -530 -174 168 -911 -2472 -681 1525 1867 1138 -1621 -2542 -1196 -1867 -3179 -4103 -4425 -1617
1508 -1617 -396 -1396 -1691 -1459 -58 2298 1570 710 1399 1957 2729 1662 -1061 -1402 -798 -223 1020
1525 1020 616 1350 3894 4188 3315 1621 -550 -124 67 -884 -770 -1091 -296 1185 330 -1016 -1519 -2367
$$ packed form
1407B215J033j791k110R46K30q11p63j428J855K895J03m98o85m43J983n38l114
1424i21j059j16J890J233k157j146Q48P50J060j417k487J199J766Q99l51k078
1440b087O95L101R97m3r68q9K738J165k176k369k139J33J356k095j502P25K050
1457e08L124o4k819k30N76M84p34l380j305K039J363K44j184j428K636K291k89
1474H16m65r58J742K837q71k114j427j92K427N39j666j35J303J670Q75k982k236
1491h37L07L56L42j079j561J791K206L42p29k759r21J346o71j312r24l22K808
1508a617J221j000k95K32J401K356p28q60O89N58P72j067k723l41O04N75J243
1525A020m04P34K544K94q73j694k171M26J91r51J14l21P95J481q55j346n03q48
$$ plain form
1543 -2367 -1878 -1471 -2542 -1883 -718 -656 -85 -1243 -1800 -654 -39 507 1441 1490 2043 2345 671 141 -940
1562 -940 -1497 -455 -193 270 1777 2252 2351 2228 358 -19 -407 -1387 -949 -846 -232 1016 447 -430 -714
1581 -714 -1389 -868 -838 -1511 -304 689 728 1082 -87 -886 -304 -637 -531 -251 -307 1431 2170 1112 226 -1190
1601 -1190 -1699 -773 -1321 -1187 -50 1083 2476 2561 504 -234 -542 -486 -616 -1328 -1470 109 861 1030 -43
1620 -43 -1825 -1233 -199 -121 265 305 1402 3478 2691 452 -866 -1807 -761 -403 -1598 -1513 -546 421 1630
1639 1630 -97 -1774 -1174 -454 857 908 82 1348 2838 2464 1072 -1280 -2409 -1090 -647 -705 -617 -590
1657 -590 1101 2086 163 -1111 -1814 -1004 724 499 -334 517 1309 2009 985 -2091 -2817 -1905 -938 -259
1675 -259 -738 -764 1208 2127 1408 227 -1083 156 1805 1725 1401 957 1196 1986 686 -1729 -2646 -2572 -882
$$ packed form
1543b367M89M07j071O59J165O2N71j158n57J146O15N46R34M9N53L02j674n30j081
1562i40n57J042K62M63J507M75R9j23j870l77l88r80M38J03O14J248n69q77k84
1581g14o75N21L0o73J207R93L9L54j169p99N82l33J06K80n6J738P39j058q86j416
1601a190n09R26n48J34J137J133J393Q5k057p38l08N6j30p12j42J579P52J69j073
1620d3j782N92J034P8L86M0J097K076p87k239j318r41J046L58j195Q5R67R67J209
1639A630j727j677O00P20J311N1q26J266J490l74j392k352j129J319M43n8Q8K7
1657e90J691R85j923j274p03Q10J728k25q33Q51P92P00j024l076p26R12R67O79
1675b59m79k6J972R19p19j181j310J239J649q0l24m44K39P90j300k415r17P4J690
$$ plain form
1694 -882 553 179 318 1301 1747 1413 -921 -2737 -2269 -1461 -784 -515 -1211 -740 611 -34 -704 -1591 -1630
1713 -1630 64 1171 971 1212 1248 1887 2445 638 -113 77 745 1885 1563 605 553 -64 -786 -1508 -2825
1732 -2825 -2458 -748 224 1556 1722 1377 1694 899 -647 -1806 -2932 -3001 -1761 -1568 -1124 -357 -202 680
1750 680 520 -26 496 998 1393 1889 1197 767 509 -315 -833 -759 -837 490 1268 1556 2061 1408 621 -149
1770 -149 -1711 -1984 -1719 -1578 -318 509 1211 1986 1512 797 148 -1212 -1205 -1158 -1653 -1500 -1213 -899 -10 -409
1790 -409 -628 317 581 1638 1801 1158 1198 1086 -70 -882 -1866 -2193 -804 229 416 1210 1026 1808 1893
1809 1893 656 -522 -1167 -1045 -41 63 -390 43 432 690 570 -1135 -1552 -1130 -865 -544 -853 -930 198
1828 198 785 859 601 58 789 2017 1364 568 -511 -1171 -488 -1146 -2275 -2127 -1211 605 2152 1747 1691
$$ packed form
1694h82J435l74J39R83M46l34k334j816M68Q08O77K69o96M71J351o45o70q87l9
1713a630J694J107k00K41L6O39N58j807p51J90O68J140l22r58n2o17p22p22j317
1732b825L67J710R72J332J66l45L17p95j546j159j126o9J240J93M44P67J55Q82
1750F80j60n46N22N02L95M96o92m30k58q24n18P4p8J327P78K88N05o53p87p70
1770a49j562k73K65J41J260Q27P02P75m74p15o49j360PM7m95J53K87L14Q89l99
1790d09k19R45K64J057J63o43M0j12j156q12r84l27J389J033J87P94j84P82Q5
1809A893j237j178o45J22J004J04m53M33L89K58j20j705m17M22K65L21l09p7J128
1828A98N87P4k58n43P31J228o53p96j079o60O83o58j129J48R16J816J547m05n6
$$ plain form
1847 1691 1836 1571 1381 -532 -2284 -1881 -1310 -964 -530 -1194 -435 942 1104 856 44 -474 719 561
1865 561 -450 -960 -1092 -357 588 85 -10 598 1307 2443 1868 168 -542 -565 -759 -1151 -2348 -2017 -400
1884 -400 682 1011 1009 702 1448 1585 675 -566 -1590 -1367 -567 -1177 -1345 -902 -522 1114 1279 596 686 858
1904 858 945 815 -405 -1114 -814 -385 168 211 -321 729 1136 1190 755 -138 -445 -49 -816 -953 -1225 -1313 -64
1925 -64 586 392 606 663 738 1041 -20 -619 -951 -1411 -1060 -1035 -1135 -17 668 1181 1580 1253 1001 1464 600
1946 600 345 -358 -1041 -387 -419 -686 -327 -243 -128 258 -160 -95 286 139 160 -55 -692 -308 -383 -432 109 211
1968 211 366 879 368 -14 -146 -813 -763 -1194 -1269 -332 455 849 1982 1529 1509 1507 541 19 -704 -1161 -776
1989 -776 -681 -1125 -920 -1020 -754 -65 -507 -217 450 740 1330 985 121 129 -279 -590 -715 -1212 -688 442 561
$$ packed form
1847A691J45k65j90j913j752M03N71L46M34o64P59J377J62k48q12n18J193j58
1865E61j011n10j32P35R45n03r5O08P09J136n75j700p10k3j94l92j197L31J617
1884d00J082L29kl07P46J37r10j241j024K23Q00o10j68M43L80J636J65o83R0J72
1904H58Q7j30j220p09L00M29N53M3n32J050M07N4m35q93l07L96p67j37k72q8J249
1925f4O50j94K14N7P5L03j061n99l32m60L51K5j00J118O85N13L99l27k52M63q64
1946F00k55p03o83O54l2k67L59Q4J15L86m18O5L81j47K1k15o37L84p5m9N41J02
1968B11J55N13n11l82j32o67N0m31p5R37P87L94J133m53k0kr66n22p23m57L85
1989g76R5m44K05j00K66O89m42K90O67K90N90l45q64Qm08l11j25m97N24J130J19
$$ plain form
2010 561 727 512 -55 273 229 -426 -356 -152 632 1349 989 382 95 -540 -647 -1399 -2140 -1664 -561 30
2030 30 736 150 475 754 580 714 456 31 973 1131 457 -151 -1312 -1530 -1041 -1178 -1028 -270 730 2209
2050 2209 2439 1438 686 92 -572 -718 -1857 -1942 -935 -70 296 31 -840 -228 425 352 414 489 910 1842
2070 1842 1515 412 -602 -1643 -1222 -1062 -1472 -833 -137 1204 2091 1122 115 -374 -812 -599 -665 -1125
2088 -1125 -420 311 541 461 -740 -996 -277 66 437 945 1383 2362 2390 1324 194 -930 -1666 -1290 -1267
2107 -1267 -1069 -164 412 1123 903 -512 -1065 -1442 -1451 -904 -937 -537 340 756 325 -221 -796 -845 -179 -105 501
2128 501 969 1229 1877 985 260 -502 -819 -58 598 1065 1947 2337 1925 1323 4 -1440 -2085 -2451 -2468 -1694
2148 -1694 -1232 -264 300 47 -96 -556 -883 -388 -52 298 1045 791 533 42 -1097 -1412 -1609 -1193 -27
$$ packed form
2010E61J66k15n67L28m4o55P0K04P84P17l60o07k87o35j07p52p41M76J103N91
2030C0P06n86L25K79j74J34k58m25R42J58o74o08j161k18M89j37J50P58J000J479
2050B209K30j001p52n94o64j46j139q5J007Q65L66k65q71O12O53p3O2P5M21R32
2070A842l27j103j014j041M21J60m10O39O96J341Q87r69j007m89m38K13o6m60
2088a125P05P31K30q0j201k56P19L43L71N08M38R79K8j066j130j124p36L76K3
2107a267J98R05N76P11k20j415n53l77rN47l3M00Q77M16m31n46n75m9O66P4O06
2128E01M68K60O48q92p25p62l17P61O56M67Q82L90m12o02j319j444o45l66j7P74
2148a694M62R68N64k53j43m60l27M95L36L50P47k54k58m91j139l15j97M16J166
$$ plain form
2167 -27 801 1865 2874 2598 2159 1337 231 -237 -479 -506 -49 404 197 265 -779 -1602 -1934 -2155 -1329 -363
2187 -363 260 1642 2457 2221 1401 199 -1119 -1362 -2037 -2097 -1468 -876 23 274 -177 -152 -124 191 1117 1235
2207 1235 1616 2132 1985 1443 167 -1708 -2397 -2274 -1930 -826 45 1173 2445 2452 1709 646 -735 -1102
2225 -1102 -762 -1044 -522 62 579 1127 231 -641 -707 -1040 -465 -50 -115 307 694 362 -315 -1550 -1887 -1162
2245 -1162 -253 724 1597 1925 2329 2005 495 -692 -1969 -2199 -1412 -697 133 1109 1440 1898 1439 -337
2263 -337 -1112 -1180 -843 -357 -265 -14 718 701 270 -439 -1336 -925 -66 356 660 924 777 1038 185 -931 -1357
2284 -1357 -1261 -271 1002 1498 1532 1878 1299 511 -1156 -2557 -2430 -2065 -1025 112 636 1227 1586 999 516
2303 516 -388 -1100 -372 130 123 189 -256 -217 -330 -1265 -1422 -1002 -326 1072 1574 1537 1703 1143 331 -436 -1434
$$ packed form
2167b7Q28J064J009k76m39q22j106m68k42k7M57M53k07O8j044q23l32k21Q26R66
2187c63O23J382Q15k36q20j202j318k43o75o0O29N92Q99K51m51K5K8L15R26J18
2207A235L81N16j47n42j276j875o89J23L44J104Q71J128J272Pp43j063j381l67
2225a102L40k82N22N84N17N48q96q72o6l33N75M15o5M22L87l32o77j235l37P25
2245a162R09R77Q73L28M04l24j510j187j277k30P87P15Q30R76L31M58m59j776
2263c37p75o8L37M86R2K51P32j7m31p09q97M11Q59M22L04K64j47K61q53j116m26
2284a357R6R90J273M96L4L46n79p88j667j401J27L65J040J137N24N91L59n87m83
2303E16r04p12P28N02pO6m45L9j13r35j57M20O76J398N02l7J66n60q12p67r98
$$ plain form
2324 -1434 -1412 -455 42 985 1289 827 688 -179 -1263 -1669 -1969 -1290 165 608 1195 1508 1134 1099 295 -634
2344 -634 -743 -896 -396 20 -185 -293 -507 -943 -1128 -1138 -883 245 975 1473 2095 1559 856 64 -816 -1408
2364 -1408 -1121 -1102 20 590 956 1230 650 -122 -635 -1106 -769 -130 354 1334 1614 1523 1402 393 -552 -1034
2384 -1034 -1381 -1267 -791 -1016 -549 -222 -408 -332 -572 -713 339 991 1630 1650 1195 813 -131 -1554 -2247 -2743
2404 -2743 -2500 -1069 14 931 1974 2240 2250 1757 889 382 74 -173 -65 -242 -697 -362 -452 -706 -910
2423 -910 -976 -107 716 1054 1335 1196 333 96 -832 -1787 -2100 -1673 -917 62 498 619 755 548 382 -285
2443 -285 -894 -698 -175 282 854 208 431 628 329 153 56 10 951 1398 1336 1118 487 37 -358 -1333 -1781
2464 -1781 -1483 -1182 -266 63 -99 360 286 283 272 -302 -117 465 648 770 364 -599 -745 -828 -1237 -1144 -787 75
$$ packed form
2324a434K2R57M97R43L04m62j39q67j084m06l00O79J455M43N87L13l74l5q04r29
2344f34j09j53N00M16k05j08k14m36j85j0K55J128P30M98O22n36p03p92q80n92
2364a408K87J9J122N70L66K74n80p72n13m71L37O39M84R80K80r1j21j009r45m82
2384a034l47J14M76k25M67L27j86P6k40j41J052O52O39K0m55l82r44j423o93m96
2404b743K43J431J083R17J043K66J0m93q68n07l08k47J08j77m55L35r0k54k04
2423i10o6Q69Q23L38K81j39q63k37r28r55l13M27P56R79M36J21J36k07j66o67
2443b85o09J96N23M57N72o46K23J97k99j76r7m6R41M47o2k18o31m50l95r75m48
2464a781K98L01R16L29j62M59p4lj1n74J85N82J83J22m06r63j46q3m09R3L57Q62
$$ plain form
2486 75 1231 1521 1541 1236 1003 630 37 -882 -880 -931 -656 -321 -573 -719 -423 -611 -105 -36 -193 637 1079 1010
2508 1010 1086 280 -182 -194 -439 -585 -502 -334 330 709 538 198 -47 -220 -124 -545 -501 -165 84 596 606 73
2530 73 42 -147 -687 -374 -578 -421 -113 -192 16 -92 -480 -104 259 104 772 1016 1264 1776 1368 886 276
2551 276 -665 -735 -1078 -1520 -1454 -1188 -992 -574 -321 -88 340 351 722 1150 1095 1055 656 85 -279 -752 -1235 -1042
2573 -1042 -1307 -866 69 515 1188 1530 1361 1437 1161 559 389 -106 -504 -651 -1075 -1272 -1277 -1311 -1091 -631 -511
2594 -511 -74 579 810 997 869 445 539 137 -36 -11 -215 -12 108 81 141 -132 -1 295 112 84 -59 71
2616 71 668 481 58 13 -138 -538 -311 -1189 -1231 -881 -805 -640 -385 -583 91 592 662 953 823 892 1100 728
2638 728 257 5 -410 -214 -199 -468 -528 -269 151 540 366 93 299 210 171 -146 -605 -550 -482 -539 -294 -704
$$ packed form
2486G5J156K90K0l05k33l73n93r19Kn1K75L35k52j46K96j88N06O9j57Q30M42o9
2508A010P6q06m62j2k45j46Q3J68O64L79j71l40k45j73R6m21M4L36K49N12J0n33
2530G3l1j89n40L13k04J57L08p9K08j08l88L76L63j55O68K44K48N12m08m82o10
2551B76r41p0l43m42O6K66J96M18K53K33M28J1L71M28n5m0l99n71l64m73m83J93
2573a042k65M41R35M46O73L42j69P6k76o02j70m95l98j47m24j97nl4K20M60J20
2594e11M37O53K31J87j28m24R4m02j73K5k04K03J20k7O0k73J31K96j83k8j43J30
2616G1N97j87m23m5j51m00K27q78m2L50P6J65K55j98O74N01P0K91j30O9K08l72
2638G28m71k52m15J96J5k69o0K59M20L89j74k73K06q9l9l17m59N5O8n7K45m10
$$ plain form
2660 -704 -222 154 283 301 198 -248 267 248 -67 -45 -164 71 636 403 133 213 113 349 331 -260 -73 -73
2682 -73 -123 80 -402 -657 -172 35 -232 -129 -307 -105 425 83 -239 -275 -315 355 364 58 335 188 421 482
2704 482 74 -73 -347 -312 13 -323 -284 306 307 416 353 -197 -57 15 -234 -60 -389 -411 -21 -116 -1 130 -66
2727 -66 243 397 46 108 274 -224 -75 -432 -688 -322 -254 -86 389 459 730 898 470 289 5 -587 -611 -689
2749 -689 -639 -256 -248 150 835 498 644 668 349 196 83 -221 -291 -533 -929 -792 -864 -703 -139 93 690 936
2771 936 897 1122 611 11 -157 -713 -764 -1058 -892 -524 41 57 373 554 560 881 737 446 583 256 474 97
2793 97 -466 -521 -606 -678 -453 -244 -289 256 507 382 283 -123 -222 -191 -318 -119 -486 -330 -94 16 -22 -121 -408
2816 -408 -196 160 329 272 624 538 799 527 101 -30 -26 -136 235 69 -118 386 291 581 153 -265 -41 -87
$$ packed form
2660g04M82L76J29J8j03m46N15j9l15K2j19K35N65k33k70Q0j00K36j8n91J87%
2682g3n0K03m82k55M85K07k67J03j78K02N30l42l22l6m0O70Rl06K77j47K33O1
2704D82m08j47k74L5L25l36L9N90JJ09o3n50J40P2k49J74l29k2L90r5J15J31j96
2727f6L09J54l51O2J66m98J49l57k56L66O8J68M75P0K71J68m28j81k84n92k4p8
2749f89N0L83QL98O85l37J46K4l19j53j13l04p0k42l96J37p2J61N64K32N97K46
2771I36l9K25n11o00j68n56n1k94J66L68N65J6L16J81OL21j44k91J37l27K18l77
2793I7n63n5q5p2K25K09m5N45K51j25r9m06r9L1j27J99l67J56K36J10l8r9k87
2816d08K12L56J69n7L52q6K61k72m26j31Mj10L71j66j87N04r5K90m28m18K24m6
$$ plain form
2838 -87 -166 -333 -564 -574 -315 -689 -618 -705 -771 -168 6 121 324 343 379 563 -334 -570 -328 -139 281 336 523
2861 523 924 1142 1140 915 252 275 347 151 -213 -612 -704 -450 -451 -659 -550 -567 -199 322 258 292 312 174 249 -286
2885 -286 -852 -708 -677 -449 208 181 433 694 676 744 425 325 447 224 200 373 32 -53 121 -393 -399 -578 -485
2908 -485 -64 -62 -62 2 -151 -299 -126 -707 -610 -400 -180 85 225 227 347 425 273 342 127 187 572 431 355 456
2932 456 170 211 -35 -393 -414 -491 -339 73 -40 -196 24 -206 4 -176 -528 -181 -133 1 267 123 112 304
2954 304 -99 21 -82 -132 215 510 324 320 117 47 120 -182 -95 -28 -41 -17 108 -225 1 49 -258 -223 -389 -262
2978 -262 72 76 155 429 79 200 132 -148 -80 139 90 250 55 -56 263 -75 0 -208 -358 -210 -92 -362
$$ packed form
2838h7p9j67k31j0K59l74P1q7o6O03J74J15K03J9L6J84q97k36K42J89M20N5J87
2861E23M01K18kk25o63K3P2j96l64l99r2K54jk08J09j7L68N21o4L4K0j38P5n35
2885b86n66J44L1K28O57k7K52K61j8O8l19j00J22k23k4J73l41q5J74n14oj79R3
2908d85M21K%O4j53j48J73n81R7K10K20K65J40KJ20P8j52O9k15O0L85j41p6J01
2932D56k86M1k46l58k1p7J52M12j13j56K20k30K10j80l52L47M8J34K66j44j1J92
2954C04m03J20j03n0L47K95j86mk03p0P3l02Q7O7j3K4J25l33K26M8l07L5j66J27
2978b62L34MP9K74l50J21o8k80O8K19m9J60j95j11L19l38P5k08j50J48J18k70
$$ [...]
8191i7
##END NTUPLES=NMR FID
##END=
