##TITLE=1H_106-2025
 200.13MHz, CDCl3,
 8 sc
 
 3.9.2025
##JCAMPDX= 6.0         $$ Bruker NMR JCAMP-DX V2.0
##DATA TYPE= NMR FID
##DATA CLASS= NTUPLES
##ORIGIN= UXNMR, Bruker Analytische Messtechnik GmbH
##OWNER= pz
$$ XWIN-NMR		Version 3.5
$$ Wed Sep  3 14:04:28 2025 Russian Standard Time (UT+4h)  she@DPX200
##.OBSERVE FREQUENCY= 200.1313
##.OBSERVE NUCLEUS= ^1H
##.DELAY= (6, 6)
##.ACQUISITION MODE= SIMULTANEOUS
##.ACQUISITION SCHEME= undefined
##.AVERAGES= 8
##.DIGITISER RES= 18
##SPECTROMETER/DATA SYSTEM= spect
##.PULSE SEQUENCE= zg30
##.SOLVENT NAME= CDCl3
##.SHIFT REFERENCE= (INTERNAL, CDCl3, 0, 14.3821)
##AUDIT TRAIL= $$ (NUMBER, WHEN, WHO, WHERE, WHAT)
$$ ##TITLE= Audit trail, XWIN-NMR		Version 3.5
$$ ##JCAMPDX= 5.01
$$ ##ORIGIN= Bruker BioSpin GmbH
$$ ##OWNER= she
$$ F:/spectra/data/she/nmr/H-C/1/audita.txt
$$ ##AUDIT TRAIL=  $$ (NUMBER, WHEN, WHO, WHERE, WHAT)
(   1,<2025-09-03 14:02:57.31 +0400>,<she>,<DPX200>,
      <created by zg, POWCHK disabled, PULCHK disabled
       configuration hash MD5:
       00 E9 B6 7A A2 85 ED C7 34 08 36 98 17 FE 4E 26
       data hash MD5: 16K
       37 7F 8C D6 3E AC FA 5C 8E EF FF 72 DA 57 DC F1>)
$$ ##END=
$$ 
$$ hash MD5
$$ 0A 73 CB D8 DD 8D 28 53 5F 27 3E 88 E9 33 C6 9B
##$RELAX= 
##$RELAX= 
##$RELAX= 
##$RELAX= 
##$RELAX= 
##$RELAX= 
$$ Bruker specific parameters
$$ --------------------------
##$DU= <F:/spectra>
##$EXPNO= 1
##$NAME= <H-C>
##$PROCNO= 1
##$TYPE= <nmr>
##$USER= <she>
##$AMP= (0..31)
100 100 100 100 100 100 100 100 100 100 100 100 100 100 100 100 100 100 
100 100 100 100 100 100 100 100 100 100 100 100 100 100 
##$AQSEQ= 0
##$AQ_mod= 1
##$AUNM= <au_zg>
##$AUTOPOS= <>
##$BF1= 200.13
##$BF2= 200.13
##$BF3= 200.13
##$BF4= 200.13
##$BF5= 200.13
##$BF6= 200.13
##$BF7= 200.13
##$BF8= 200.13
##$BYTORDA= 1
##$CFDGTYP= 0
##$CFRGTYP= 5
##$CHEMSTR= <none>
##$CNST= (0..31)
1 1 145 1 1 1 1 1 1 1 1 1 1 1 1 1 1 1 1 1 1 1 1 1 1 1 1 1 1 1 1 1 
##$CPDPRG= <>
##$CPDPRG1= <>
##$CPDPRG2= <>
##$CPDPRG3= <>
##$CPDPRG4= <mlev>
##$CPDPRG5= <mlev>
##$CPDPRG6= <mlev>
##$CPDPRG7= <mlev>
##$CPDPRG8= <mlev>
##$CPDPRGB= <>
##$CPDPRGT= <>
##$D= (0..31)
0 0.7 0 0 0 0 0 0 0 0 0 0.03 0 0 0 0 0 0 0 0 0 0 0 0 0 0 0 0 0 0 0 0 
##$DATE= 1756893776
##$DBL= (0..7)
120 120 120 120 120 120 120 120 
##$DBP= (0..7)
150 150 150 150 150 150 150 150 
##$DBP07= 0
##$DBPNAM0= <>
##$DBPNAM1= <>
##$DBPNAM2= <>
##$DBPNAM3= <>
##$DBPNAM4= <>
##$DBPNAM5= <>
##$DBPNAM6= <>
##$DBPNAM7= <>
##$DBPOAL= (0..7)
0.5 0.5 0.5 0.5 0.5 0.5 0.5 0.5 
##$DBPOFFS= (0..7)
0 0 0 0 0 0 0 0 
##$DE= 6
##$DECBNUC= <off>
##$DECIM= 32
##$DECNUC= <off>
##$DECSTAT= 4
##$DIGMOD= 1
##$DIGTYP= 9
##$DL= (0..7)
0 120 120 120 120 120 120 120 
##$DP= (0..7)
150 150 150 150 150 150 150 150 
##$DP07= 0
##$DPNAME0= <>
##$DPNAME1= <>
##$DPNAME2= <>
##$DPNAME3= <>
##$DPNAME4= <>
##$DPNAME5= <>
##$DPNAME6= <>
##$DPNAME7= <>
##$DPOAL= (0..7)
0.5 0.5 0.5 0.5 0.5 0.5 0.5 0.5 
##$DPOFFS= (0..7)
0 0 0 0 0 0 0 0 
##$DQDMODE= 0
##$DR= 18
##$DS= 0
##$DSLIST= <SSSSSSSSSSSSSSS>
$$ [...]
##$SUBNAM0= <"">
##$SUBNAM1= <"">
##$SUBNAM2= <"">
##$SUBNAM3= <"">
##$SUBNAM4= <"">
##$SUBNAM5= <"">
##$SUBNAM6= <"">
##$SUBNAM7= <"">
##$SUBNAM8= <"">
##$SUBNAM9= <"">
##$SW= 18.0517328524113
##$SWIBOX= (0..15)
0 0 2 0 0 0 0 0 0 0 0 0 0 0 0 0 
##$SW_h= 3612.71676300578
##$TD= 16384
##$TD0= 1
##$TE= 0
##$TE2= 300
##$TE3= 300
##$TEG= 300
##$TL= (0..7)
0 120 120 120 120 120 120 120 
##$TP= (0..7)
150 150 150 150 150 150 150 150 
##$TP07= 0
##$TPNAME0= <>
##$TPNAME1= <>
##$TPNAME2= <>
##$TPNAME3= <>
##$TPNAME4= <>
##$TPNAME5= <>
##$TPNAME6= <>
##$TPNAME7= <>
##$TPOAL= (0..7)
0.5 0.5 0.5 0.5 0.5 0.5 0.5 0.5 
##$TPOFFS= (0..7)
0 0 0 0 0 0 0 0 
##$TUNHIN= 0
##$TUNHOUT= 0
##$TUNXOUT= 0
##$USERA1= <user>
##$USERA2= <user>
##$USERA3= <user>
##$USERA4= <user>
##$USERA5= <user>
##$V9= 5
##$VALIST= <valist>
##$VCLIST= <CCCCCCCCCCCCCCC>
##$VD= 0
##$VDLIST= <DDDDDDDDDDDDDDD>
##$VPLIST= <PPPPPPPPPPPPPPP>
##$VTLIST= <TTTTTTTTTTTTTTT>
##$WBST= 1024
##$WBSW= 4
##$XGAIN= (0..3)
0 0 0 0 
##$XL= 0
##$YL= 0
##$YMAX_a= 986164
##$YMIN_a= -1104955
##$ZGOPTNS= <>
##$ZL1= 120
##$ZL2= 120
##$ZL3= 120
##$ZL4= 120
##$ABSF1= 10
##$ABSF2= 0
##$ABSG= 5
##$ABSL= 3
##$ALPHA= 0
##$AQORDER= 0
##$ASSFAC= 0
##$ASSFACI= 0
##$ASSFACX= 0
##$ASSWID= 0
##$AUNMP= <proc_1d>
##$AZFE= 0.1
##$AZFW= 0.1
##$BCFW= 1
##$BC_mod= 2
##$BYTORDP= 1
##$COROFFS= 0
##$CY= -3
##$DATMOD= 1
##$DC= 2
##$DFILT= <>
##$DTYPP= 0
##$F1P= 0
##$F2P= 0
##$FCOR= 0.5
##$FTSIZE= 0
##$FT_mod= 4
##$GAMMA= 1
##$GB= 0.15
##$INTBC= 1
##$INTSCL= 1
##$ISEN= 128
##$LB= 0.25
##$LEV0= 0
##$LPBIN= 0
##$MAXI= 10000
##$MC2= 0
##$MEAN= 0
##$ME_mod= 0
##$MI= 1.114404
##$NCOEF= 0
##$NC_proc= 0
##$NLEV= 6
##$NOISF1= 3.799351
##$NOISF2= 2.8
##$NSP= 1
##$NTH_PI= 0
##$NZP= 0
##$OFFSET= 14.38212
##$PC= 1
##$PHC0= -1565.597
##$PHC1= 16.19228
##$PH_mod= 1
##$PKNL= yes
##$PPARMOD= 0
##$PSCAL= 0
##$PSIGN= 0
##$REVERSE= no
##$SF= 200.129724274929
##$SI= 16384
##$SIGF1= 3
##$SIGF2= 2
##$SINO= 400
##$SIOLD= 16384
##$SREGLST= <1H.CDCl3>
##$SSB= 0
##$STSI= 0
##$STSR= 0
##$SW_p= 3205.1282051282
##$SYMM= 0
##$S_DEV= 0
##$TDeff= 0
##$TDoff= 0
##$TI= <>
##$TILT= no
##$TM1= 0
##$TM2= 0
##$TOPLEV= 0
##$USERP1= <user>
##$USERP2= <user>
##$USERP3= <user>
##$USERP4= <user>
##$USERP5= <user>
##$WDW= 1
##$XDIM= 8192
##$YMAX_p= 0
##$YMIN_p= 0
$$ End of Bruker specific parameters
$$ ---------------------------------
##NTUPLES= NMR FID
##VAR_NAME=  TIME,          FID/REAL,        FID/IMAG
##SYMBOL=    X,             R,               I
##VAR_TYPE=  INDEPENDENT,   DEPENDENT,       DEPENDENT
##VAR_FORM=  AFFN,          ASDF,            ASDF
##VAR_DIM=   8192,          8192,            8192
##UNITS=     SECONDS,       ARBITRARY UNITS, ARBITRARY UNITS
##FACTOR=    0.0002768,     1,               1
##FIRST=     0,             0,               0
##LAST=      2.2672688,     0,               0
##MIN=       0,             -1104955,        0
##MAX=       2.2672688,     986164,          0
$$ Real data points
##PAGE= N=1
##DATA TABLE= (X++(R..R)), XYDATA
$$ [...]
1924b926M30K621J307r74j603J052K789N90j715k285J34J907j41k539j785P80
1940b358K450O71j704n40J628K398L71j914j613R29J173r33k168j617J403J831
1956Gk16j216k98J642K035m39j486k16J227R05p62j886o88J001O28n16j277L98
1974a157J697P91l45r79n1Q97M04r29q41qR73M61q34r40j26O11K86l08k99M74
1994b23P80K23n54q21J23K17n1N9k21J66M12L3j68k97l69N46L08M21P29m57j17
2015G39J0n01k45n72n39P93O70J78m99k87J82N28o31m39k2Q12R96j30j003o27
2035e87K98K11n06j057Q4J573R82l04j549l87J148N88l68p86O00J847Q75j179
2053A483j457n45R81J44j423j052O68J499Q30j334j704Q07J698Q80o50q83Q85
$$ y = [-2926, -2496, 125, 1432, 458, -1145, -93, 2696, 3286, 1571, -714, -580, 1327, 1186, -1353, -3138, -2358, 92, 763, -941, -1481, 147, 2545, 2916, 1002, -611, 318, 1491, 558, -1610, -3227, -1824, 7, -209, -1425, -1723, -81, 1954, 1515, 29, -187, 1040, 1945, 1183, -703, -1391, -390, 238, -278, -1555, -1157, 540, 1331, 986, 7, -44, 853, 1257, 328, -513, -521, 452, 913, 79, -861, -987, -376, -90, -398, -697, -223, 557, 780, 226, -595, -472, -255, -306, -247, -468, -302, 110, 143, -25, -322, -691, -145, 163, 584, 1313, 856, 739, 749, 248, 3, -569, -1108, -315, 355, 533, 34, -253, -71, 457, -174, -613, -635, 177, 1173, 1043, 40, -587, -289, -78, -584, -1641, -1557, 16, 998, 694, -855, -1242, -94, 494, 126, -660, -60, 1787, 2662, 1483, 26, -519, 462, 606, -817, -1869, -1201, 298, 1128, -206, -1910, -1103, 595, 1475, 825, -58, 827]
2070H27J871o04k203k377L66J522J00j169m41J593K065k8k140j055J267J954J29
2087A677j443o13J549J269j170k335j291J872J849k85j521m01J353J338k109k142
2103b403j81J906K193o05j332K53J324N32j954k632N35K250J132o81j408L85J799
2120A113K36j690j076R11K745R23j536j608K33Q94k70k195j190J708K148N03j380
2137D69j362L32O78q21j889q10J872J924K31j385n04J007J485m27j173M89J724
2154A840J210o05k291j207M27J78l47q71J024K345R02m35j847o99P49M6q77q52
2172a310L47R04M81j403j498j11P09R59K46L38J072J124K63p98j451l33P39M28
2190G06M8Q9L19K22o44j559q81j93O20Q28O58O30L84K88k46j016q66j08m0N71
$$ y = [827, 2698, 2094, -109, -2486, -2120, -598, -498, -1667, -2108, -515, 1550, 1522, -618, -1673, -406, 1548, 1677, 234, -379, 1170, 2439, 1269, -1066, -2357, -485, 1364, 1079, -442, -843, 510, 1848, -261, -2403, -2584, -678, 1515, 910, -422, -169, 1155, 1687, -267, -2899, -2364, -114, 1018, 337, -1071, -686, 1113, 1349, -341, -1417, -506, 2239, 3162, 1626, 18, 251, 1145, 875, -1320, -2510, -802, 1346, 1849, 469, -893, -561, 117, -704, -2593, -3403, -1531, 393, 624, -761, -1265, -258, 1227, 800, -373, 116, 1840, 3050, 2445, 154, -1053, -626, -448, -795, -1666, -642, 1703, 2605, 2170, 323, -376, 373, 419, -458, -1310, -963, -59, 422, -981, -2479, -2590, -1881, -922, -676, -338, 734, 1858, 2121, 1323, -128, -461, 278, 706, 754, 843, 1162, 1384, 740, -819, -1700, -1893, -1273, -445, 213, 843, 1227, 1515, 1269, 253, -613, -721, -761, -190]
2210a90K37j52k62o42l79j17q1P87J194J286R28R0j123r50r32p30o42j54O99J425
2230B92O16j84m86m20M64J73k12j74N02N82j30j491j393n20N27J076J48P63J290
2249A423J072K28j858j717l91N19l8l59j08J003J232j34j140j045O65J674L68
2266A394n75j55N72L45j271k141q02J076J628O73l43M8J371J25j627j982q52J262
2284a254J488l20p76J68J015O92j281j257N78J787J710n59j415o41M69l25j680
2301a601j665P77K638J562l61n86j4J545l45k254j069O79J953J35j500j595L70
2318a331R78j50j236J40K057K385J20j545j495M3J2j218j090k11J401K041n93
2335C08j088j56Q48J116m41m30K81J552O89j386k251j081O08M20J07j86J170K415
$$ y = [-190, 47, -105, -367, -1009, -1388, -1505, -1586, -799, 395, 1681, 2609, 2699, 1576, 626, -306, -1036, -1678, -1832, -1133, 292, 908, 724, 238, -182, 282, 455, 243, 69, 571, 1153, 1023, -468, -1861, -2381, -1854, -778, -630, 133, 1423, 2495, 2723, 865, -852, -1243, -724, -762, -1121, -1229, -226, 1006, 872, -268, -1313, -648, 1026, 1394, 819, 664, 1236, 1581, 310, -1831, -2633, -1557, 71, 744, 401, 449, 1820, 1945, 318, -1664, -2516, -1254, 234, -86, -862, -694, 321, 1013, -268, -1525, -947, 840, 2550, 1991, 576, -65, 404, 79, -1601, -3266, -2489, 149, 1711, 1350, 764, 750, 2295, 1950, -304, -1373, -694, 1259, 1394, -106, -1701, -1331, -353, -503, -1739, -1599, 458, 2843, 2963, 1418, -77, -34, -22, -1240, -2330, -2541, -1140, 901, 308, -780, -936, -88, 1028, 587, 157, 438, 1990, 2679, 1293, -958, -2039, -1431, -1011, -904, -1090, 80, 2495]
2353B495Q45j181j411r88M46L06j069p71K79Q45o8j182j210N28J363R67J22K52
2371E68R08L55m92j646j480j19R00O73K26M59Q62Q44l95j238o28p6J082K16m18
2390F01m04J88j02n24r91j28O37J125K64Q4m63j08o94p15o96j34R01J247Q90L81
2410A359M2m49k25o11o40l5J0M40L26l20m03k15J43M95J52M34O32N04p0o89j564
2431f84j040k65K72O21N78N09J181P20q7o23r65J8L85n81n62o08M30J80m61q29
2451a811J86R88J446N74m82J07R8j62j132j560m23R40J002L09l38K44J010M15
2469A411q41j021j00J082P48p61o85m4L45N69j133q69O77J375P45r27j278QM45
2488b54k21j145m44J172J776P26n03n87K14R86o74j393o85N73R74j99j422o70
$$ y = [2495, 3340, 2159, 748, -240, 206, 512, -557, -1328, -1049, -204, -272, -1454, -2664, -2136, -773, 194, 316, 568, 1476, 1831, 1339, -307, -1787, -1906, -1006, -333, -107, 352, 1214, 2058, 1663, 425, -203, -279, 803, 1019, 601, 197, 385, 283, -241, -1232, -1360, -723, 402, 666, 750, 287, 179, -515, -1230, -1926, -2060, -1159, 88, 978, 1359, 1401, 952, 727, 116, -524, -559, -549, -109, 217, -103, -506, -721, -578, -83, 69, 503, 1135, 1639, 1569, 880, -684, -1724, -1989, -1717, -1096, -518, -9, 1172, 1892, 1805, 1182, 217, 235, 620, 39, -523, -1131, -701, -521, -982, -1811, -1625, -637, 809, 1383, 901, 1008, 1106, 944, -188, -1748, -2171, -1231, -229, 80, -258, -14, 996, 1411, 570, -451, -551, 531, 1279, 518, -167, -211, 134, 703, -430, -1299, -622, 753, 1498, 571, -707, -699, -254, -475, -1620, -2064, -892, 884, 1610, 1107, 520, 734, 1720, 1046, -347, -1032, -459, 515, 316, -1106, -1776]
2506a776O70J031J50o95N5J467J105n04j520r12L81N14n39r48M90J134J252m66
2524H89j225r8M71P70n85r40M06J148L72p40j305L6J231O02n01p46K95R78j29
2543I29j355j200j9J142L88m04l15P49J108K59j383p55O83P74J31r05n11P40M66
2562E22j9q30n27M55Q89Kn68l13M51N16l90q05l3P27J001J41o84l28M20Pm84j073
2584i23n27P08L16k47k77J58P17N56j01r2R1O44L14o95o74l45l55l6j77m91K67
2605a169O14N55L15Q2K16L16J36j86j29l99J48k76k61m98p29L95M03k8J43K86
2625f6M03N61k31k49o8j53j4L5l39k79J35J36O8k87k07N73L14K02m19l59J87J84
2647A27q9m33k78o8O31L79k41j39J83P62P0o92l46O4L04o5p47m50M91O71K52m86
$$ y = [-1776, -1106, -75, 75, -620, -565, 902, 2007, 1503, -17, -929, -548, -34, -573, -1521, -1031, 103, 1355, 889, -336, -434, 37, 807, 222, -718, -312, 836, 1208, 468, -837, -801, 430, 1032, 531, -215, 80, 1058, 929, -426, -1626, -1645, -503, -115, -519, -834, -85, 1023, 1282, -101, -856, -173, 601, 732, -173, -684, 56, 522, 503, -327, -854, -399, 490, 492, -76, -389, 62, 578, 188, -617, -650, 77, 1078, 1219, 535, 207, 627, 634, 150, -923, -1450, -742, -426, -673, -950, -792, -75, 481, 380, 288, 379, 1023, 1337, 642, -32, -377, -732, -768, -945, -1436, -1169, -555, 0, 315, 397, 613, 929, 1065, 879, 750, 351, 499, 223, -38, -536, -1265, -870, -467, -495, -352, -66, 337, 898, 667, 418, 350, 197, 183, 218, -121, -400, -265, -129, -61, -348, -555, 18, 332, 534, 115, -244, -57, 127, 38, -395, -673, -741, -110, 269, 28, -111, 72, 834, 904, 212, -134, -70, 234, 169, -578, -1028, -537, 134, 386, -100]
2669a00j13Q53O71P3p68n82K24K95n29r13m37M53R19p9n11L4O24Q88l47j044k23
2690f12N88K27m85q84K4R13P03L1q81K15J114L17p69o37m51Q18M05q48o13Q1Q85
2711A41P40l19o87N49O63L08j026j112j59Q78k32o56m90N70R56J73l95l01N05
2730A06J296n64r62n08O09N54M2j536j90N17R15L20n10R5M95K22N7j317p7O05
2750A69M96k85p69j30N57P27o85p59K5N79O69l53q37K26L66L51l67l67k72O52
2770gN53l23o93k0N11Rl72k68K55P59O02k53l68k13K43M9p66k95J51L35J91m95
2792d15m80M70K82L89q9l27J69N78m71j55o20k11O18L0J43J05K37M85L00l51k78
2813D09j83J29k2k48k40J18J89j5m20j13O0L20K27j03l19j61J54l05j73k69j31
$$ y = [-100, -213, 640, 1311, 1384, 616, 34, 258, 553, 24, -889, -1326, -873, 46, -33, -544, -510, 114, 1002, 655, -389, -612, -24, 203, -282, -1166, -1142, -229, 474, 505, -376, -161, 953, 1270, 501, -136, -587, 231, 636, -212, -825, -744, 141, 881, 562, -125, 424, 1087, 1395, 369, -743, -902, -24, -256, -912, -1402, -832, 124, 297, -98, -399, 106, 1402, 838, -124, -632, -23, 531, 573, -963, -1153, -636, 279, 599, 89, 184, 679, 901, 958, -359, -436, 169, 665, 380, -389, -519, 38, 765, 80, -679, -654, -75, 594, 241, -596, -370, -4, 347, -20, -387, -659, -7, 546, 223, -470, -490, 21, 30, -342, -610, -355, 404, 1006, 753, 385, 172, 415, 464, -302, -597, -446, -111, 80, -415, -895, -425, -143, 246, 157, -170, -1, 577, 106, -49, -669, -880, -262, -232, -89, 16, 253, 738, 1038, 687, 409, 226, 355, 333, 85, -155, -37, 152, 137, -283, -396, -336, -16, 211, 108, -211, -372, -218, -523, -696, -965, -1096]
2834a096O11O57k19L45j34J58J17m27k95o9M49L70l63j80J80M63J36j79l39N5
2854B40K32O3k41n65l89J29J72k20r4J05R19M88k81l80k45J4R6n38m36l5P67M74
2876B75k62o07L13N58L28j26n68K73N53j61q28o56Q2P14J21p6j92M79Q39p9p17
2897B63l82J52M21L3o32j96L11N46j06o65l39M47O12K2m50m04K14K95m86o15o6
2918a025N53O69J14o80J79N07M75m37p50l21P93K22j67l34l46Q83m2o6p39J81
2938c31P88M07l87m61j41N15J66q27m14Q2O63N13l78m81K5L56j2k09p15M28O09
2959A96J02l66n62K41L62K78m79j13J79Q20j50o47j87J89K79J14n08o3K33P12
2979F30j45m69k19K13M70k00j22j85K10J40k99o19P4K2J96Q0k73J07K88M96j46
$$ y = [-1096, -485, 172, -47, 298, 164, 322, 439, 12, -283, -352, 97, 467, 104, -76, 104, 567, 703, 524, 185, 240, 472, 535, 294, -271, -660, -531, -359, -579, -673, -568, 351, 839, 558, 178, -67, -53, 43, -495, -931, -966, -199, 275, 13, -594, -281, 277, 605, 479, -89, 184, 737, 576, -252, -908, -826, -112, 9, -67, -259, 220, 1059, 980, 263, -119, 33, 454, 487, -145, -341, -30, 516, 410, -255, -594, -147, 465, 487, 37, -367, -153, 142, -344, -959, -1025, -472, 197, 311, -369, -190, 317, 792, 355, -395, -716, 77, 299, 132, -202, -548, 335, 293, 227, -512, -331, 457, 864, 477, 16, -125, 390, 556, -271, -685, -603, 60, 573, 195, -286, -261, 95, 83, -126, -841, -413, 196, 298, -68, -630, -389, -27, 251, -228, -341, -162, 658, 508, -139, -326, -137, 142, 256, -252, -315, -82, 630, 485, 16, -203, 10, 480, 280, 158, -27, 183, 323, 24, -595, -521, -499, -303, -223, -496, -389, -101, 395, 249]
3000B49k54K1j8M37N9l31j47L71k18%l61j76M49J48j23N1l07N3L20m56k08l42
3022g83L14K88pk51N7N3K51o2k85J10K10K56K70k45k88N73n2J11n1k93L21K66
3044G63k94j64m37K48J28l78k02J6K15L57q4l90j60lL24J2n41q7L13L59m2l68
3066d15L9J97M52o1k25k82L71K93j72l41j58J41N14K6k40J90J93L30k77o13Q5
3087D7K99J1k36o20J25M53J66l19j82j75N74J98l34m13j19L82k4m89l02J48P04
3108a06l9l4p0k7M80L26l87l03K5M49L9mm02J61P73j13l43k03K1M19N6o48k15
3131a45k8L45k58m08k73L67L61R1k90l59L79L14j70l05j11J34L82j1l96R5K62
3152b4L99J74m73j03J54L69K8q17J02K11J5N0l95n9K33M30N5n90k2M77K8j65l41
$$ y = [249, -5, 16, -2, 435, 494, 163, 16, 387, 169, 169, -192, -368, 81, 229, 106, 157, -150, -97, 223, -233, -441, -783, -469, -181, -188, -439, -382, -329, -78, -140, -425, -315, -105, 151, 421, 176, -112, 461, 409, 520, 469, 176, 497, 763, 469, 305, -132, 116, 244, -134, -336, -320, -105, 252, 168, -222, -382, -385, -61, -49, -590, -677, -364, -5, -47, -415, -376, -179, 273, 212, -13, -295, 76, 369, 197, -144, -302, -161, 353, 379, 139, 329, 522, 852, 575, -38, 47, 346, 357, 121, -499, -374, 79, 245, -74, -256, -431, 143, 341, 7, -406, -525, -143, -167, -656, -958, -810, -106, -145, -179, -249, -276, 204, 530, 143, -160, -135, 314, 353, 349, -53, 108, 881, 768, 425, 222, 243, 662, 718, 70, -145, -173, 172, -86, -494, -767, -400, -39, 52, -238, -597, -218, 96, -74, -379, -490, -356, 26, 15, -381, -286, -24, 375, 549, 76, -27, 127, 496, 524, -293, -191, 20, 35, 85, -310, -369, -136, 294, 349, -241, -263, 214, 242, 77, -264]
3175b64nJ41N54k27l00L08o4K49P6o00J99M7J36j61l55N9lJ89l7m07r8L98K20
3198E5k45k15J03L25J17j55j80q5M67J79r1k79R5J34J69m1m08J95J00l8r2k81
3220a71N9L78m1j34l43n5K55L9k69l7k30L81J93o5j79L45K20j78J39K62p44M06
3242B31j49o1n9p6N62J91m25k93M6M25J78m00o69M87R0Rm18J07J02K6L02k72m1
3265a07K1J68J10j58j72O1K60k6k30j02K45K48L5l56j37L09J97r3m84J76j79M69
3287B55l05l51K14p8K42J38k61j83J85L50r4o03M51J01J68l89J36J72j59L8J25
3308A52j58J05j89M75J87o22n0K2L30j71n5k29L12K90l85l07j28N88o7P3l55r3
3330b75J77J68n8l70k66L48L68j64j42L9K62K40m32q3J85J05R2n3n32L57J26J09
$$ y = [-264, -269, -128, 426, 199, -101, 207, 143, 392, 468, -132, 67, 114, 250, 89, -266, -207, -210, -21, -58, -465, -563, -165, 55, -190, -405, -302, 23, 140, -15, -195, -280, 187, 366, 275, -4, 91, 225, 394, 353, -55, 140, 240, 202, 110, -171, -112, 266, 225, 91, -252, -307, -52, -13, -282, -319, -549, -168, 25, -40, -219, 126, 346, 168, 307, 569, -175, 231, 82, 21, -38, -114, 448, 639, 214, -79, -33, 392, 570, 170, -499, -12, 78, 87, -331, -224, -122, -96, 206, -66, -107, -86, 82, 192, 34, -138, -77, 183, 157, -73, -175, 70, 318, 353, -3, -140, 169, 366, 273, -211, -35, -214, 255, -50, -401, -187, -265, -23, 115, -146, -329, -144, 206, 112, -491, -40, 61, 229, -160, -24, 148, -11, 27, 152, -6, 99, -90, 385, 572, -50, -100, -78, 252, 81, 26, -203, 109, 399, 14, -293, -421, 167, 100, 173, -182, -275, -98, 70, 12, -358, -624, -276, 92, -72, -214, -175, 87, 327, -105, -188, -3, 102, 194, 141, -391, -34, 92, 201]
3352B01j94k9J45J12k5p1k08K5L72p9q6k20j06J33J75m36J45l5l5K71o6p46O89
3375f8j3L42m15j62L64J50j39j13q3L16m9kj06p8j34L45j10l9j76J40J11K92k24
3398A49k7k60l2M86k70J35j1Q9k33J18n61L84J39o0k13kj87O92K92q18O55l89
3420G6Q2M15k1k09n77O46j56P3o96M61k43P59p50j43K10J016q82j15j79L58K38
3441C63l13l3o5m9K02l19j11R3J77J61j19k6L0J91k93L25j57J26ML13k15j84j43
3464d2L13J3k5l47j52L82M7k93j55OJ74J20q8l36K34K73K5j19l27J66J72j22m3
3487a24k80j04K50K84j17R1K2L34j12P7j80l6K69J60m34o9m3R7j00k2j48K9K08
3510E2k0J23l83R2J21pl3j16j24R6MQ9o5M7J27p8r4K3n4K03Jj30r8K50q9K44L2
$$ y = [201, 7, -22, 123, 235, 210, 139, -69, -44, 328, 249, 163, -57, -163, -30, 145, -291, -146, -181, -216, 55, -11, -757, -68, -81, 261, -154, -316, 48, 198, 59, -54, -137, 179, 130, 128, 22, -56, -190, 155, 45, 6, -170, -30, 81, 373, 149, 122, -138, -170, 316, 46, 181, 170, 259, 26, 144, -417, -33, 106, 46, -167, -169, -356, 336, 628, -190, 465, 76, 158, 573, 552, 343, -234, 412, 256, 329, -367, 94, -149, 610, -140, -283, -73, 943, 61, -54, -233, 125, 363, 50, 17, -48, -97, 105, -214, -325, -232, -55, 106, -13, -39, -9, 182, -111, 214, 57, 183, 187, 500, 285, 101, -42, 271, 284, 259, -88, -240, 142, 189, -104, -259, -253, -79, 41, -47, -383, -149, 124, 149, 30, -297, -131, 41, -81, -124, -404, -508, -258, 26, -91, 0, 22, 356, 244, 321, 141, 105, 374, 534, 100, 31, -12, 85, -15, -37, -185, -156, 52, 32, 155, -228, -136, -15, -22, -55, -171, -295, -199, -195, -106, -171, -124, 3, -75, -169, -146, -200, 3, 4, -126, -224, 26, -63, 181, 213]
3537B13j60N5J85J77j74k14MP6j68j1q5O3N9Q8k83Q9K10J25K78m99J4o2Q7p1k17
3562b21j84M2J32N3j52j16K70J58P2J8O1k64K56M0j08k12K18m0J63j26k3L45j14
3585B68O5k00k40L51J7n2k09j71L4J41P5k34P8k4L59k54r9l17J22J20J12k41j62
3608d61J09K51N2j21J6J80L55J40k98k67K17J08l06j08j26K17J34J3j22J17K0
3629A20K22j34k14k2P4J22l3m12J8J98Q7j54Mj82M01R0j04k26j65L59m6n1j49
3652a97q6P6K17j30J11N3O8J08j55j95J79lK82l15k26K15J65r7nn9l2M33k01k01
3676Eo6oL4K20m18Q5n6Q0J21m6n5P3L64L3l62j33J02J38J96m52j42K36RJ36j50
3701e4K0j28L49j34p6J20P1r5r9j34l6J75k9J12%r0J21k3J8j43R7MK0j59q8NJ83
$$ y = [213, 53, 108, 293, 470, 296, 82, 86, 162, -6, -17, -102, -39, 20, 108, -175, -86, 124, 249, 527, 28, 42, -20, 67, -4, -221, -405, -363, -231, -178, -330, -446, -176, -18, 54, 72, 133, -131, 125, 165, 57, -155, 63, 23, 186, 60, 37, 382, 268, 333, 133, -107, 244, 261, 209, 0, -171, -137, 4, 79, -155, -77, -101, 258, 4, -95, -412, -290, -170, -58, -299, -461, -352, -101, -49, -170, -154, 26, 381, 521, 223, -44, 173, 281, -25, -133, -259, -42, 92, 105, -17, 100, 120, 342, 208, -6, -28, 46, 168, 135, -277, -259, -61, 26, -128, -124, -306, 95, 185, 81, -145, -310, 49, 3, -48, -197, -283, -207, 10, -120, -9, 44, 112, 220, 65, -130, 49, 46, 328, 13, -213, 2, 167, 70, 65, 6, -26, 407, 206, 5, -61, -67, -33, 187, -231, -146, -202, -122, -1, -47, -102, -29, 335, 368, 6, -127, -25, 113, 309, -143, -285, -49, -40, 96, -54, -34, -162, 187, 53, -23, 97, 168, 73, -26, -160, -196, -21, -50, 62, 62, -28, 93, 70, 88, -55, 42, 46, 66, -93, -181, -176, 7]
3728Go8l9J97j55J9K15j72J06j97K20j79M3k34J18M6j55J31O5R1J12qj47J15j40
3752ik5N7j25J12j37r3L55k22l9J89P8k44K22l4k67L4K14k21K17k12K31O8M9q
3776A90k09J63O8nj79L9%P2o8o5k33N9K59j65j30j36K82Q4m9j16o0J73J31j16
3800a1k75L05lO4J14j53p4L09L7m1o3j32K80Mm46o3k15K22rJ00l00L39j40K41
3824I0j29k11jK04P9J16k29L0J28k8n6j51K16J49l5J29j94r3K03J2j37j26J85
3847A51m7Q1l09j16P1K04p3j64r4L3K09n8j71R0J78J23n6LN8J73K19k50j62j7
3871G6J7J19j60q0j04J80rk6k06J01J36j40N5j58K53P0%p7q2j26K49k05K1j74
3895b70J45N0L8j3k28K78l7O7R9j1J57M5p7j94r4k2k4P7j60J27j02J23qk78K91
$$ y = [7, -61, -100, 97, -58, -39, 176, 4, 110, -87, 133, -46, -3, -237, -119, -73, -228, -97, -32, 59, 171, 163, 16, 131, -9, -34, 23, -102, 10, -127, -220, 135, -87, -126, 63, 141, -103, 119, 85, -182, -148, 66, -155, 62, -150, 81, 149, 198, 190, -19, 144, 212, 207, 28, 67, 67, 139, 71, 6, -227, -168, 91, -74, -204, -340, -58, 26, -23, -139, -199, -26, 105, -11, -286, 19, 16, 80, 194, 41, -33, 276, 313, 272, 209, 77, 357, 361, -85, -148, -363, -141, -150, -50, -350, -11, -151, 90, -39, -250, -251, -47, 32, 148, -81, -51, 77, 49, -7, -158, 58, 207, 172, 301, 107, 14, 217, 229, 92, -34, 151, 104, 185, -124, -240, -169, 35, -38, -202, -296, -263, -54, -112, -283, -193, -15, 108, 52, 55, 113, 286, 505, 255, 93, 76, 93, 212, 52, -28, -132, 48, 39, 13, -193, -92, 44, -96, -41, -199, 54, 124, 124, 47, -35, -161, 88, -117, -96, -270, -125, -75, -37, -50, -278, 0, -37, 30, 129, 118, 275, 320, 243, 49, -45, -67, -91, -14, -174, -47, -149, -26, -34, -312, -21]
3920b1N6J05OM5j58J58j07J8j16jjN0k10J93k03J1J37j10r3P2QRK39p0J42l1J57
3947B85k03k60J92N7r0l9j18O7J27k99P2M02k08K17n9m3K77o8j44j35M0r4q0n4
3971a58o0J09Q7j16k26K98j09J82KK6M8R8k24P1j74n8M9J40j2j08OK01r6P9k38
3996a83J24J14N4L6j22J10J48j88P8l8n2Q2L0j27j84J35j0j25j99jM9K57j40J22
4020c0k0J32Ko3j35k17M88Rr3k63j09J18J59p6Q4%K04l0j36j63J36OJ45j39j08
4045i9J92p0Q5L1k53L25n6p7k48p2K09O1j25j50j4Q5J42J89k48L82j41kl3l39
4069b26J64P8j57k22J84j35J25L15k14K01o2K02j7pj41l7n2L5j69j85L83r5P6
4092D4P2j31N8K22j04l8o6j56R7O5k31L0p1j06J84j19P1J70R1K51j79k00K30m
$$ y = [-21, 35, 140, 146, 191, 33, 191, 84, 102, -14, -15, -16, 34, -176, 17, -186, -175, -38, -148, -241, -169, -161, -152, 87, 17, 159, 128, 285, 82, -178, 14, 71, -19, -58, -176, -109, 18, -281, -209, 193, -15, 202, 143, 100, 377, 309, 165, 30, 70, -24, -104, -158, -218, -109, -22, -138, -364, -66, -175, 7, 9, 35, 83, 181, -43, 28, -146, -204, -155, -15, -27, -135, -129, 72, -24, 55, -183, -59, 55, 109, 145, 23, 133, 281, 93, 171, 133, 81, 163, 193, 66, -118, 17, 7, -118, -317, -318, -269, -12, -152, -30, -50, 82, 84, 21, -114, -331, 157, 166, 73, -190, -299, -181, -22, -98, -14, -14, 190, 160, 24, -139, -3, 3, 148, 9, -99, 93, 23, 108, 139, -114, 211, 155, 78, -170, -242, -33, 28, -97, -247, -261, -176, -34, 155, -93, 289, 148, 146, 113, -226, -62, 16, -141, -363, -179, -314, -189, 126, -88, 113, 51, 253, 236, 229, 88, 51, -1, 34, -135, -320, 63, -32, 44, 116, -15, 43, 265, 161, 123, 57, -99, -2, 63, -168, -138, -209, -315, -131, -250, -179, -9, 82, 333, 154, -46, 184, 180]
4116A80k40j23n6K71N8k8j76K37O8L3j42J2N6j39L9k64P2O0O8R3j36j06K27M2
4140A06J4k53J02j6K95m14O9O7m6Q5Nj23Q6J41j34J5J18k24L20j44r5M0L9j24
4164g1J09j29J80K9m6J04k22J27j3j43P7O2j28J79k89J03k9J44J19j23o1M3J55
4187A77j54n3j77Q2L5n5J21j43J48J31k01j27K05l2K08n4r5l9J68k7o1r8j08J18
4211c1K95j41l74j9J49L28k48p7L02j02J03k68l2K5J43M1k43j6J52jO3p0L2r4
4235h3L55m8m21R0J02M4Q7o0j36o5J91K2j65R6J38J18r9k81PK23j23L4r7J2j5
4260g4J22q1n0n5J58L29k49j72R8L7K30l33j35J88k4J99j59l38K75J05j40q1l6
4283a86J01J16k6q8J46N8RK1k51L2P4J13j51J5k1J13j07k1o9q4J95j3J35j13k09
$$ y = [180, -60, -183, -239, 32, 90, 62, -114, 123, 191, 224, 82, 94, 150, 11, 50, -214, -142, -82, -14, 79, -57, -163, 64, 106, 120, -133, -31, -47, 248, -166, -97, -30, -76, 9, 14, -109, -23, 118, -16, -1, 117, -107, 213, 69, -26, 14, 53, -71, 38, -91, 89, 118, 72, 176, -46, 81, 68, -75, 2, 64, -64, 115, -174, -71, -100, 44, 163, 40, -21, 22, 177, 23, -30, -207, -125, -90, -145, -24, -167, -19, 112, -89, -216, -11, -43, 165, 111, 16, -23, 145, 118, 57, -41, -149, -31, 264, 123, -251, -270, -121, 207, -41, -118, 184, 82, 185, -83, -115, -90, 53, 94, -149, -165, -13, -14, 49, -21, 11, -83, 272, 224, -197, -107, -5, 39, 126, 66, -70, -135, 56, 78, -87, 9, 147, 265, 166, -115, -108, 115, -8, 26, -71, -59, -74, 48, -33, -83, -138, 20, 349, 100, -72, 26, 63, 293, -40, -175, 13, -11, 188, 29, -309, -34, 71, -69, -150, -186, -85, 31, 5, -83, 63, 121, 130, 151, -100, -68, 6, 119, -32, -17, -38, 75, -32, -53, -122, -206, -11, -24, 111, -2, -211]
4308b11K67K9k44j30L23M1R4j74K38k19J5j89j2R6k7J90p2m5k03L24R3k57L9N1
4332A7P8pp6J85j10O4k45j39J25J23L5j93N7j6R4lKo6J77m8J81j37j08j35K65
4357A20j78J8o6j2J44j59R2n0O8p2J35q0j6M42q1q7j27nm1j23Q2k43O0J83p3o6
4383a35j1J96o2J0N7o7P4K00j46M2n8l44K93j19J5j93Q2J72Ok12R7j25L64L3j40
4408B9J21J28j31M2k34k8K1j02J28j70J61qJ5n6k19K54K56p8q6J31p0K08j68k96
4432a52j1J00j10N1O3mJ92K3O5j32k49K8J22n6K10j84m3P9o8j21J22NJ79j28l0
4457d9K11p7Q0j89j63R5J55P4j29M8J23J81k06k07m5K36k5j16k7r0Q2J72j39l59
4481c64j34M20p4J19k46P0L20k73O3J3O7J28O1l2m0R7n8j03j29P3J40j82K81r9
$$ y = [-211, 56, 85, -159, -289, 34, 75, 169, -5, 233, 14, 29, -160, -172, -76, -103, 87, 15, -30, -233, 91, 184, -73, -34, 17, 95, 88, 12, 197, 87, 151, -94, -233, -108, 15, 50, -143, -86, -102, -8, -11, -9, -75, 102, 54, 235, 98, -10, -145, 120, -58, -40, -106, -118, 26, -133, -41, -91, -23, -95, 40, -40, -56, 386, 305, 218, 91, 86, 45, -78, 4, -239, -179, 4, -69, -135, -146, 50, -12, -2, 55, -12, 62, 262, 116, 158, 100, -244, 49, -70, -55, -248, -166, 6, 12, -200, -103, -228, 136, 169, 29, 150, 278, 147, 189, -45, -73, -52, -154, -26, -196, -35, -43, -28, -84, -303, -49, 207, 129, 43, 174, 104, 312, 144, -152, -163, -63, -173, -122, -59, -63, 129, 152, 217, 85, -164, -136, -14, -70, 140, -44, -87, -8, -76, -197, -75, -70, 109, -19, -49, 162, 85, 165, -24, -187, -92, 63, 137, 8, 56, 179, 360, 154, -53, -98, 138, 113, -3, -30, -120, -38, 134, -5, -364, -498, -78, -152, -33, -279, -209, 111, -162, -99, -86, -19, 109, 170, 138, 98, 195, 137, 34, -95, -22, 118, -64, 217, 118]
4505A18j2k8O0J2j64j56O7J90j80j70ko8L52k86M7K98q8K46k04j5Rj80K39j83
4529i8k18J40J70j29J33J88l6K28l05j7n7J37K1j69j35lJ04k7l6qJ9J11K21j62
4553G2n1j41R4J57k55j40j1M13Q9j20r4j4J62q3j38j06P4P1M0m08J75J70J98l5
4577A19j18J81QL26m15k16J04k43J46J26k28O5L06o0l6q9K2L59l65k81K52J08
4599G1n17P31q91K89L14n8J34n57L47L66R9oj38j97L82p80N74l77M25q1l17K50
4621F3p9J20n7N07o20j17J27J65n9l84L33K7k7N1K9j31J74o6J03M5n11L75L60
4644D28qK76q63M51k78L06n76k12N19P5k0k53J36j34L06l12j36J88K55N2m1j67
4666hn5Q0j27p1j01L99o4ko5K08j21R9r2p4j04J32J26k77j58J16L49j5j2l00K60
$$ y = [118, 106, 78, 138, 150, -14, -170, -103, 87, -93, -263, -265, -333, 19, -267, -220, 78, -10, 236, 32, 17, 26, -154, 85, -98, -316, -176, -6, -135, -2, 186, 150, 378, 73, 56, -1, 136, 157, -12, -147, -150, -46, -73, -109, -117, -98, 13, 234, 72, 21, -120, -26, 131, -124, -264, -275, 138, 227, 107, 13, -1, 161, 78, -60, -166, -92, -21, 19, -389, -214, -44, 154, 119, 1, 182, 190, 516, 101, -115, -11, -254, -108, 18, -210, -145, 161, 101, 65, -24, -2, 357, -8, -289, -37, 71, -446, 285, -606, -317, -3, -61, 73, -484, -137, 229, 328, 322, 184, -13, 369, -411, 163, -214, 211, 130, -187, 63, -16, 104, 47, 554, -66, -183, -56, 109, 50, -334, -1, 26, -1, 50, 79, -52, 122, 56, 159, 204, -307, 68, 428, 420, 696, -167, 284, 6, 312, -264, -476, 43, 118, 98, -155, -19, -153, 153, -159, -295, -107, 148, 200, 159, -8, -63, 17, -110, -181, -282, 117, 53, 51, -14, 194, 73, 172, 80, 6, -98, 34, 160, -117, -275, -159, 190, 175, 163, -137, 123]
4691A23J12J03k83k51L16o1Q7j21q7r0J79k5j41O6j34L83j49k12K19J11J49ml01
4714a1N5Oj6p1n5L3K35j75O1j00RK81m2k76J62N1j06J08l92k1J21N7J26r0j09
4739a59K87J2J0j46P3p8Q3k32J5l8O4N9Rk27O7K99K32k37j67L02M6l11J21j26
4763d2J8R4j19p8L30jJ13j35J45m99L76K98p76J05J53J73k07mL82l11L02o15M01
4786A03o9l87M88L34q38K47j93K57kn4j62N28J50m20j16p1j35N08j68l93N22l92
4808b63K92k74K45K2L3J56q6q0m4m4k0Q5k44K69Q4k67L55k66K37K12K70p50n6
4831a34J31P9L93n05J66q0M20k92l38J84j59K36k00k06K31K00k56R9k6K98k20
4852B1L28Nk06j71m56K27J86k33k78L23L08k21Jk63J100q17M94n64J08J58m79
$$ y = [123, 235, 338, 55, -196, 120, 59, 146, 25, -62, -152, 27, 2, -139, -73, -207, 176, 27, -185, 34, 145, 294, 290, -11, 44, 50, 34, -37, -92, -59, 176, 1, 62, -38, -29, 252, 210, -66, 96, 147, 41, 149, -243, -264, -143, -86, 40, -50, -159, 128, 140, 150, 4, 77, -1, 82, -150, -135, -173, -109, -50, -41, -268, -201, 98, 330, 93, -74, 228, 274, -37, 84, -42, -24, 70, -49, -127, 203, 202, 315, 180, 325, -174, 202, 500, -276, -171, -18, 155, -52, -56, 326, 15, 317, -298, 103, 34, -353, 135, 469, -369, -122, -315, -58, -60, -114, -276, 252, 402, -18, -134, -205, -340, 168, 0, -393, 129, -263, 29, -245, 0, 22, 55, 211, 125, 45, 1, -43, -63, 22, -222, 47, 131, -136, 219, -47, 190, 402, 672, -78, -134, -3, 76, 469, -36, 130, 50, 470, 178, -160, 24, -135, 101, -99, -305, -74, 126, -130, -31, -57, 241, 21, 349, 354, 148, -23, -479, -252, -66, -299, -577, -254, 54, -167, -166, -429, 671, -146, 348, -216, -108, 50, -429]
4873d29N44j24q9k93Q05o37J98P23o26M02o06j51R6K66n69K77OK28l35Q6J56P24
4895F52m01K91l01o92O85m8k57l25J91J38M84l82J25k59K41J61l16j32J57P1L21
4916D04k99kl40J89L54r1k08K09K17j78k78j88o8K99N21q97N80m29R6K26k03K76
4938A90O7j88K45l29P1j09J5K17n01j14K96Q5J44K41o81J02N13M68q08j66L26
4959H4j28k13J43k70mK53j09L84O56o00k31kK81m36N20o70K83j00K32Q6J50l55
4981d6k95R04m46j46K44j35j14l9k75M24l67K70J90N34o00j37L29k27P8m46K69
5002c1K18k10J73o18Q62j18k02j65j1L54k0n67J14L13k39N16k03n57N64q1k22
5023a30L9K97J3k33Q2m96N84l64QM93j13p70L51M96n72K04L61o56J29K07N6n03
$$ y = [-429, 115, -9, -98, -391, 414, -223, -25, 698, 72, 474, -132, -283, -187, 79, -490, -213, -207, 21, -314, -228, -72, 652, 251, 542, 241, -451, 234, 186, -71, -396, -205, -67, 417, 35, 160, -99, 142, 303, -13, -145, 12, 83, 404, 105, 103, -237, -48, 306, 215, 7, 216, 433, 255, -23, -211, -279, 20, 541, -356, 224, -205, -109, 117, -86, 190, 257, 69, 314, -15, 56, -53, -38, 179, -322, -436, -140, -55, 89, 330, -351, -249, 264, 732, -76, -242, 84, -44, -257, -114, -384, -388, -135, -244, 140, 796, 196, -35, -37, 244, -192, 328, -342, -59, -159, 73, 159, 309, -46, -341, 563, 117, -29, 215, 80, -34, -73, -348, 76, -291, -21, 169, 703, 103, -34, 295, 68, 146, -300, -31, 187, -23, 150, -468, 394, 276, 74, -91, -102, 252, 232, -335, -221, 92, -147, 369, 166, -391, 173, 92, -130, -91, 206, 219, -14, 68, -428, 156, -208, -200, 293, 180, -590, -239, 257, -315, -111, 250, -406, -277, -70, -14, -517]
5045e17K19L23o0l32L5K96k60J68J03K20j23j62K57k08j87M19l6k98J9J4J60m2
5067Hp7O1J97o8K65o10k8L20j9j09j38j05L86Mm52J39J95K42k49K17j47M0j72
5090a00L04k27l0p0J14O8m9n7L42K1j01j96j42K93P8l52O0k72K79l0m4j23J63
5113g1Q3M0j1l25L00r5J43j66n6m9L4J61j97J96L42j6k06k0j36J4O8J77k94p6
5137a60L45m8j52l8j5K56j17p5j43M1O4K0k24L8J46J94j22K4j69L01J50k47o2
5160Gj15L12j85k82L41m6n5J44O9q1p6O6Q0l59k0P8J16J65l48No5L76k02J79j04
5185@L1L57k64j14j07O2J7N6k43J90L5L1O6k09J53R5o7J5j41j33Q0J9J0J28j67
5210a00J10J10j5m1r8J70lk21j28K75R4j38n2K2l7K42j80L6k72K54J28k29k23
$$ y = [-517, -298, 25, -35, -367, -332, -36, -296, -128, -25, 195, 72, -90, 167, -41, -228, 191, 155, -143, -124, -110, 50, 8, -69, -8, 189, 121, 386, -224, -252, 68, 49, -60, -198, -303, 83, 87, -365, -226, -31, 211, -38, 179, 32, 72, -100, 204, -23, -53, -123, -9, 59, 10, -47, 295, 316, 215, 19, -123, 170, 248, -104, -44, -316, -37, -67, -111, -234, -71, 12, 52, 41, -284, 16, -79, 64, -102, -158, -207, -173, -12, -209, -13, 329, 313, 107, 87, -49, -35, 33, 210, -84, -160, 185, 137, -15, -53, -68, 188, 71, -4, -147, -106, -42, -22, -246, -208, -62, 132, 10, 34, -135, 166, 316, 69, 7, -108, 204, 19, -263, 78, 32, -23, 121, 190, 109, 33, 99, 179, -180, -200, -122, -6, 159, -189, -184, -249, 127, -75, 104, 0, 31, 388, 124, 10, -97, -35, -18, 38, -205, -15, 20, 51, 117, -92, 61, 156, 89, 104, -37, -170, -90, -71, -61, 67, -100, 10, 120, 105, 64, -34, 136, 133, -88, -216, 59, 153, 15, -37, -15, -52, 190, 10, 46, -226, 28, 156, -73, -296]
5233b96K37k9J69m3r2L6M2K39O1k45r9R9M2j51k43J25J70J10j34k0O2p0Q3j74
5257a21P5J92j72P6j22j63L44j29N9j63J4J37J4J32j77l0J26j5j46R8K1q6K32
5280A96k22o4M6K36p8L4l52J46J03k20J6j06J18J49j57K3M9K17J3j0l58N0J75
5303DJ01j32J3P3J59l00P3M5O7j0Q6m52L21k5R9m7k08O8rk5K08j30j95K61k27
5328a82J24k20k2L77qk99J10P7Q3L8l7o7o1L02j12n9k62J37L20n91L62m17L05
5351a02N33o14N27m14j14M55k17L5l55L02k2O8j43o9J15J08q6k18j06N10r0j85
5373h2o1j15L91j5l98K22N3J43R6l86N0J91m7J04l0j21l6K53j14q0j46J91Q5m3
5397A05k9j38K21q2l0j65J12R7J2j96j00n4L13J42j60j85K36l6r8l3o1J35N7j64
$$ y = [-296, -59, -88, 81, 38, -54, -18, 24, 263, 324, 79, -20, 79, 121, -30, -273, -148, 22, 132, -2, -22, 40, -30, 53, -121, -46, 146, -26, 50, -72, -235, 109, -20, 39, -124, -110, 27, 41, 173, -4, -34, 92, 77, -69, 29, 50, -36, 196, -26, -90, -44, 192, 114, 148, -204, -58, 45, -175, -159, -265, -147, 2, -155, -132, -83, 134, 147, 137, -221, -171, 4, 105, -27, -14, 59, 218, -82, -9, 36, 103, 93, 179, -273, 48, 23, 122, 75, -133, -65, -74, -99, 109, -21, -216, 45, -182, -58, -278, -300, 77, 69, -230, -120, -43, 40, 78, 41, -26, -87, 215, 103, 44, -218, -81, 239, -352, 10, -407, -102, 431, -183, 344, -70, -184, 271, 54, 89, -266, 36, 14, 82, -61, -130, -15, 93, 7, -211, -317, 193, 103, -82, -143, -258, 133, 118, -280, -58, -5, 138, 234, -152, -102, 89, 42, 146, 116, -5, -41, 212, 98, 18, -128, 63, 148, 105, 76, -62, 159, 77, 47, -118, -6, 91, 103, -93, -193, -247, 66, 208, 48, -137, 99, 63, -35, -68, -129, 6, 63, -101]
5421a01N8n6p9J65K16m68L30J19j09j5m1j54M35k8j79p2j91K77N5o8j42j23O2
5444a09J07r2m0j16M70Q4o39j2O32k69K16Q8J09p8m81J93j79P69p23Q5O9r0j75
5467a81j17M09L28j62m59K08o0J58j07j1K69k51r1r7J07K59j44n1k16K25J3Oj12
5490g7j02K19k1J40j68p2J14J35qj69o3K88j6k04jj20O4p4k9j82L28J78Mk02n9
5515i7K77J3j89q5J78k54J39j11K5J6RM38l22Q9j89K16K34m74o2jJ30J24k01j10
5539b07l7K93J65k72n4J82L7r1j30n0J07L34q0l36M1J87N7j06j36j30M97j45o4
5562F2N3k43K41l9q4O8j0J23nm03J02J70j6r0r6M8J15j9km5j53J13J14K1j23J21
5588B3l4L1O4k05l2K57J17r4j09j27J08J77k91k3M5J1K43l12RK58J36k47oj02
$$ y = [-101, -43, -99, -178, -13, 203, -265, 65, 184, 75, 60, 19, -135, 300, 272, 93, 21, -170, 107, 162, 94, -48, -171, -109, -2, -94, -134, -250, 220, 304, -335, -347, 285, 16, 232, 320, 429, 351, -130, 63, -116, 653, -70, 15, 84, -6, -181, -298, 111, 439, 277, -182, 26, -34, 124, 17, 6, 275, 24, -67, -164, -57, 202, 58, 7, -209, 16, 29, 35, -77, -179, 40, 19, 159, -9, -81, 33, 168, 160, -9, -72, 216, 200, -4, -5, -125, -61, -135, -164, -346, -18, 160, 164, -38, -97, 180, 193, 4, -81, 97, -157, -18, -129, -104, -88, -79, 359, 37, 126, -63, 153, 387, -87, -149, -150, -20, 104, -97, -207, -244, 49, 214, -58, -112, 70, 107, 16, -114, -164, -57, 277, 197, -139, -98, 89, 146, 40, -96, -226, 271, 126, 62, 115, -128, 113, 74, -10, 58, 48, 171, 166, -237, -135, 35, 19, -71, -167, -119, -4, -23, -25, -70, -223, -110, 4, 25, -98, 23, -11, 20, 84, -121, -153, 104, 221, 127, 18, -109, -1, 176, -115, -138, -93, -82, 161, -151, -142, 116, 252, 5, -1, -103]
5612a03J44M1n3k73P5K56L6j91Q2j6K4Q1j42r9J22m8N5j23J68o5L2K07k26n2K4
5637d4J09P0j84o8J14K19j75k82P8J54m6J11r1n0m7K12L0k76J28o7J54J49j87
5660A1k7o8o0J10J27j02J11j26k1J38n4r6mQ1k19J27O9J14k46M7J41J63l0j01
5684H5j69m0K28k12O0j79P2K11R3j34l36K19J06Q9j19J91j24Q5O0k82J60K3M9
5707A36l0r6J2P3j83Q7n2J57j9J5j46Q0K3J08o1j39l0P1K01k92l4o8L32Lk81K8
5733a05J35M3K1j59J67j51j06Q3j00PJ42K56p4l24j36L41P1JJjl4Pk74J37m2L1
5759f3J83k73J02JP2Q0oj81J61J58k62J89k78N0J30n5k01k4J06L16J8l84J57o
5783a0J73j34r3m6J52J29l02O8j01L45j35p0j52P6K17J24l4k54l5K35o1o7O0o0
$$ y = [-103, 41, 82, 29, -244, -169, 87, 123, -68, 14, -2, 22, 103, -39, -138, -16, -64, -9, -132, 36, -29, 3, 210, -16, -68, -44, 65, 135, -49, -117, -3, 216, 41, -241, -163, -9, -55, 56, -35, -85, -132, 80, 110, -166, -38, -105, 49, 198, 11, -16, -84, -144, -34, 93, -9, 102, -24, -45, 93, 39, -57, -61, 20, -199, -72, -3, 111, -135, -88, 53, 216, 186, 85, -84, -124, 104, -108, -48, -227, -155, 56, 149, 15, -321, -102, 4, 93, -26, 165, 41, 126, 186, -96, 64, 87, 136, 106, 10, 22, 95, -88, -1, -53, 104, 85, 100, -46, 34, 57, 165, 104, -35, -65, 6, 207, -85, -119, -187, 145, 148, -133, -105, 30, 73, 94, -65, 102, -49, -155, -72, -172, -165, -23, 233, 159, -165, -301, 40, 111, 112, 113, 112, 78, 85, -189, -52, -94, -63, 120, -153, -51, -50, 22, 102, 96, -85, 76, 234, -28, 161, -117, -67, 63, 8, -193, -217, -111, 205, 223, -161, -4, -10, 163, 29, -64, -110, 42, 171, -131, -63, -164, 181, 46, -24, -176, -100, 117, 241, 207, -47, -82, 153, 92, 25, 85, 25]
5807B5R9ml07J25J10J8Oj84J18%J78j34n5N7q2J1M5j43R3OJ25j38r2J69P0k20
5833a04M5n5j6K32J22k01j74L8J71Q4j47JK7j3Q7p1PnP0k7j01p0q5K56J7k8K2
5860H2j16LL8r5J10N7j73Q4P9J4J7K3r8j27P7J99j31p7J37K7j7j61qQ9j59K73
5886A47p8j23J36on3j71J27j01J96r9P2q4R1P4j68L4N4J3Q7j02o9o9j5J7M2k9
5912g7n5J76j9q8N1r5q1K31j32R6J29q4p6K3j36O2K3O6r5o2L07j62K14j72k7J37
5938A54J26r1j1k49q7J96j98j50J99M2Q5j60J97j27Q8J38m1j24Q8P2q5r0L4N6
5962F2L5p4O7j38J33J26m1j42j3k6J49m6j0m7MK60k05o7N4o2j3k38K48j35J15
5987dJ24J57l93J7J30m0O0p3K0M9J50q9j16N5kr9M5qp1K54j57o1Oj9K43k09J15
$$ y = [25, 124, 120, -187, -62, 48, 66, 72, -112, 6, 6, 184, 50, -5, 52, -30, -19, 26, -117, -24, -18, 107, -31, -123, 46, 116, -104, -59, -114, -130, 102, 224, 23, -151, -113, 58, 142, -5, -4, 23, 10, 97, 26, 33, 28, 98, 71, -30, -100, -185, 71, 88, 60, 82, -34, -31, 7, -88, 22, 79, -94, -10, 69, 83, 100, 123, 25, -102, -25, 174, 43, -34, 103, 130, 113, -48, -56, 33, -126, 147, 69, -54, 82, 76, 23, -148, -21, -122, 74, -25, 47, -37, 54, 128, -40, -6, 48, 61, 148, 46, -23, -92, -107, -90, -48, -77, -132, 44, 25, -63, -12, -107, -188, 43, -89, 7, 136, 52, -24, -1, -137, -75, -52, 14, -81, -143, 164, 2, 216, 44, 17, 154, 280, 189, 178, -71, -158, 38, -160, -310, -111, -69, 16, -144, 53, -74, 14, 152, 111, -13, 75, 147, 62, -28, 6, 62, 97, 23, 90, -48, 85, 211, 170, 28, 15, -11, 138, 92, 82, 35, 39, 299, 94, 27, 81, 19, 6, -232, 16, -119, -4, 120, 277, -116, -99, 31, -9, 51, -22, -2, 47, 197, 108, -8, 47, 45, -54, -9, -17, -88, 166, 9, -52, -46, -65, 178, -31, 84]
6014H4j5K25k55M8p5J1k8m7J98j70N9J70k48K09l53K13M9p1J19l75L90l0r2m6
6038c0J5Q2oK1m2k19J20R3j8r9JJ0J05j28L5J44k19J52k4K2m1N7m0qj92J67j08
6065a50K0M8Oo5J14Q2M0J07Pk57n9J58r9o4M6J71Pq2%N0J10k81Q3J0j4Nj25J49
6093A7J85j85NK28m55j3J58O6M2j15O5J08j37J44J9j85J52j40r3K73m5o3p9o8
6117a16J56j30M3Q3K6q3j66J08P8k0M9M8p0L5j6l8qq2O2Q9j5r2J00p1j45J91J6
6144C2j21O4j8J00j14L4ok2J00n1r6Q0J06j38j13K45n5K76j60j53r4J06J28j47
6168a7J85l28J09J49r8J09k39L05o3j45J76p6J64J05l20m1P6J4n1J20k46j59N46
6191B75k38m8J08k45J48j35J80J7RK78l78n2J44j15J45nk92J62K53j37k66K85
$$ y = [84, 69, 294, 39, 87, 12, 23, -5, -52, 146, -24, 35, 205, -43, 166, -187, 26, 75, 4, 123, -252, 138, 108, 16, -30, -15, 67, 61, 82, 40, -179, -59, 34, 16, -83, -82, -72, 33, -95, -60, 84, -135, 17, -7, 15, -26, 31, -9, -17, -209, -42, -150, -130, -82, -76, -141, -27, 55, 95, 202, 209, -48, -107, 51, -48, -112, -66, 105, 112, 30, 30, 80, 190, -91, -8, 2, -12, -7, -132, 17, 202, 17, 22, 250, -205, -218, -60, 6, 48, -67, -2, 106, -31, 113, 132, -53, 99, -41, -134, 139, 94, 31, -48, -116, 40, -90, -47, 36, 62, -21, -187, -79, -1, -21, 28, 76, 6, 41, 25, -13, -21, -103, -41, 48, 33, -59, 41, -30, -175, 16, 32, -89, -25, -43, 57, -57, -23, -29, -51, 49, -2, -98, -18, 88, -50, -163, 82, 27, 303, 143, -10, -104, 2, 130, -17, 168, -160, -51, 98, 0, 109, -130, 175, 112, -33, 143, 67, 231, 336, 16, -25, 51, 65, 14, 134, -112, -271, 275, 37, -11, 97, -148, 0, -135, 45, 62, 71, 349, -29, -81, 63, -52, 93, 88, -204, -42, 211, 74, -192, 93]
6213I3k06o1K55q7J5Q5j66R8J48k90J2j84K18j42J51n1L5k7J9J71p7J57P5j99
6237D2j65K2L42m64kJ57j00K75p6k31J78j57j0K47o8j2L4K7J37j18j5M3ok84J68
6262c6J86j0J03j98K02m33L15k96m1J04j44N83j00m79Q5J65P9j33M51o97J22L53
6284A81k77K30K40n33r1J77j37L64M8j64L08n38M80n82M47j97K7L5j5k18K62l26
6306b79OO65j99k3J61m24k43N64k81K90j47r8j72k44J6M28Q3n1m75N16q7n58R37
6329C85o11L11K06m17oK34M62p40N9K78p57Q53L67o31j67K85K35j22n64L56m81
6350d65O12k74Q1L97k82J04l91k64K02J08N22o39M89K37q81P87L15p83J74j4M44
6371D79j57k48l1p65O01j49L35k40N96l09j20L2j22l0L46j26k12k50K16K33k82
$$ y = [93, -113, -174, 81, -6, 9, 94, -72, 26, 174, -116, -104, -288, -70, -212, -61, -112, -77, -104, -85, 86, 9, 166, 241, 42, -123, -101, 241, -223, -225, -68, -168, 107, 31, -200, -22, -179, -189, 58, -10, -22, 12, 39, 176, 58, 43, 86, 80, -204, -36, 150, 140, 243, 45, 247, -186, 129, -167, -208, -104, -248, 335, 235, -244, -159, 6, 85, -48, 403, -294, -172, 181, -96, 134, 374, -159, -250, -73, -210, 154, 202, 38, 346, -192, 288, -294, 153, -44, -17, 18, 3, -215, 47, -279, -273, 392, 193, 170, 331, -93, -336, 228, -53, 237, 90, -8, -180, -424, -408, 20, 103, 52, -423, 93, 6, -552, 385, -226, 85, 291, -126, -132, 102, 564, -176, -117, 161, -596, 257, 624, -7, -174, 111, 346, 224, -340, 16, -465, 147, -127, -46, 351, 69, 173, -218, -482, -280, -172, 350, -289, 200, 437, -444, 343, 658, -125, 49, 35, 479, 322, 74, 43, -722, -121, -270, 65, -175, 421, 112, -8, 24, -98, -128, 218, 92, -120, -370, -154, 79, -203]
6392b03J98j95M8R6l69L13j32M30J04l47K29K8n6k79J36K83l53O6J69l18j01J68
6414h5J67J6R0k61J8o5M51m50K0K65k42K36n9Kk07J37l9J7P0j47J2kK56k78Q8
6439A0J5j59j12M5K77j59K3J12k12K31J69j69n1J5j24R0j00K05j46j0J33R4j08
6462F9j33K45k34j00K42O2k50K67k34P3p8J72j31QR2p6M6k1j04RO3N9p1k7j11
6487a63J49K7j38K50k35K08j22M6qK9r1j60K14J94J7l9j66M5q6J1j49J94p9j71
6511b23K16L1N1k7k15K77N7k10M4o6N8O1j39P2q8J98qj19N4p6K82l69J60p0R9
6536E0r5J51n6q3O0j32O5L6q7J79R3k33P8n3L0J1p9Q9lj6L4q4n4J13j12J36O3
6563A01J19q9o1j16p4j9Q9Q7r6L7j08J2J86l1n2L2o2K50k27J49j90P4J91j99j92
$$ y = [-203, -5, -200, -152, -56, -425, -112, -244, 186, 290, -57, 172, 200, 144, -135, 1, 284, -69, -3, 166, -152, -253, -85, 82, 98, 188, -73, -55, -120, 331, -119, -99, 166, -76, 160, 101, 103, -104, 33, -6, 11, 81, -66, -54, -56, 200, -78, 10, 25, -134, -246, -201, 76, -83, -60, 52, -160, 71, 240, 71, 20, 35, -89, 1, -99, 106, -40, -50, 83, 177, 69, -64, 181, -53, -153, 89, 151, -99, 168, -66, 7, -71, 101, -30, -22, 70, -6, 40, 19, -85, -76, -13, 46, -25, -52, -163, -14, 13, -125, 125, -110, 98, -24, 22, 14, 43, -48, -208, 6, 200, 217, 178, 12, 57, -29, -18, -167, 27, -52, -223, -7, 24, 75, 48, -167, 110, 167, -43, 1, -65, -7, 54, -85, -13, -101, 97, 89, -30, 24, -52, 230, -139, 21, -49, 50, -45, 106, 50, -33, 27, -105, -40, -4, -91, 88, 181, -52, 26, -27, 3, 14, -65, 24, 21, 5, 39, -45, -99, 14, -98, 38, 101, 220, 131, 70, -46, -120, -139, -50, 37, -59, -22, -130, -118, 68, 37, -15, 17, -45, 205, -22, 127, -63, 11, 202, 3, -189]
6588a89J02J37l2Np5J34J82j42j04m9j8mJ29m3n6r4J47n6j44J24L6M1k0J0J9p0
6614c0j10J94j5m6J7J06j16j84J40LN7l9p4k2P8J53j04k76L33O3r1L3k77J43J49
6639H5n0j64j4J32J25j73N8o2R4J35k88N3J49r3n2J07r8J07j07L0Pm7N8n6M5P5
6665E6r4J36Jj59M2K8j0p4l3M0K8M0j39K15j15l0O9J60k70K91k36l9P3K23j07
6690I6k22K19m2J7j09K36k9n6j58N5j8J09j64J14j04J73L0j32O5O5o2j21J43k17
6714a12n1K31p5r4Q8m3N2O7M8j8j84K0J13l08K94j43M4J35j70J03P9M3j66R2j85
6739a40J27O5j35P5m7kJ01q6l2Q6oR4k2r8K22Rj10p2j26J37p1M6o4R1j13J80j08
6766AO0L5m1J07q9k4r5J10p5j07J90j17j11L16k46L3N1J56j07q4o4R5Q5J88j81
$$ y = [-189, -87, 50, 18, 23, -52, 82, 264, 122, 18, -31, -49, -53, 76, 33, -23, -117, 30, -26, -170, -46, -10, 31, 11, 21, 40, -30, -140, 54, 39, -7, 10, 116, 0, -184, -44, -41, 16, -23, -97, -119, -41, 112, 8, -268, 65, 128, 37, 70, -207, -64, 85, 35, -129, -143, -11, 114, -59, -1, -63, 31, 166, -122, -69, 80, -13, -65, 42, -56, 51, -56, -26, -19, -66, -8, -64, -19, 56, -38, 98, 99, -60, -18, 10, 0, -74, -107, -67, -39, 1, -138, 77, -38, -68, 1, 161, -109, 182, -54, -93, -20, 203, 96, -126, 93, 51, 68, -41, 195, 166, 110, -48, 7, -11, 98, -66, 48, -56, 117, 147, 15, 80, 145, 83, -38, 105, -112, -163, 68, -7, -101, -13, -56, -4, 63, 111, 93, -91, -71, 42, -266, 28, -115, -71, 64, -106, -3, 76, 119, -47, 45, -140, -13, 52, -83, -8, -55, -57, 44, -42, -74, 12, 6, 100, 78, -20, 202, 211, 101, 29, -97, 40, -31, 15, -49, 42, -71, 109, 1, 61, 96, 55, 162, 73, 49, -46, 64, -11, -118, 72, -45, -156, 160, -86, -53, -2, 154, 47, -37, -101, -6, 79, 267, 86]
6791H6l5L9J17k84N8n8P4pJ5o9o3J44J09j18m5Q2Ko2q9k8R2M7q3j6NM5J91q4n1
6820A4L8j41O6LQ4l8P7J3k83Q2q5J66J51K4k16J64l08K04J66k45L2J68j22K6k1
6845A9j4Q0%k4n4l16J42J63Kk33L06J01k03j23N4N9k5K92j83m5L9n7q9K0K9P7
6871A7O4j18l2o0K52n3M0k45J07J21j5k27K07K9j0J3j0k4J9qj28j67J54l0N1Q0
6897B7j59k7P7J9L4k9J6O2j03OJ06j24K31L0j73j96J00Q2J51r4o8P4Lq2n6J41
6923D8j05J18L9p8J73k28j33J65m8l0M3J1K3o7N1N6k6o6K41l3o0K9k34p4K66j69
6949h8j21M68k57k47K26L10j76L57l78j78J70m8M2j02k67J84L9K63k57J66j11
6970eo6J01J56k02J43j40k44L37j5q2j1m19O84j94p59O15J47J30p7j6o5l0m3n7
$$ y = [86, 51, 90, 207, -77, -19, -77, -3, -10, 5, -64, -127, 17, 126, 8, -37, 45, 47, -15, -104, -132, -40, 7, -76, -92, -87, -42, 149, 65, 14, 52, -89, -23, -20, 64, 26, 103, 116, -167, -85, -170, -4, 147, 171, -45, 119, -189, 15, 181, -64, -32, 136, 14, 40, 19, 5, 85, 85, 61, 7, -309, -167, -4, -2, -235, 71, 172, -31, -154, -100, -41, -66, 226, 43, -2, 37, -20, -109, -89, -60, 17, 81, -37, -69, -129, 123, 70, 110, -135, -28, 93, 78, -149, 58, 87, 77, 90, 80, 56, 75, 67, -61, -228, -74, -104, -53, 27, -132, -159, -82, -63, -29, -58, -42, 20, -83, -77, 29, -95, 136, 166, -7, -203, -103, -21, 130, 36, -32, 42, 45, -37, -93, 48, -57, 61, 100, 22, 195, -33, -166, -1, -49, -79, -36, -25, -2, -69, -18, 38, 12, -54, 187, 154, 94, 123, -111, -185, 81, -88, -209, 259, 2, -245, -19, 291, 115, 472, 94, -84, 86, 38, 80, -22, -289, -105, -66, 197, -60, 106, -5, -71, 30, 186, -16, 127, -13, -257, 80, 65, -17, -28, -447, 237, 43, -716, -101, 46, 176, 99, 83, 18, -12, -55, -112]
6994a12j28K6K73L5k04J45nJ47j3j99K6j6P7J5j01R7j71M4J55j09m8k0j2Q8N6
7019D6Q2j24q7J98k3j13j88L65p1k25L37j70j0P2j03l7J52m7j25J60j09R6k8j22
7043g4K8J9l2N7p7J46N9j62j52K42j03N3QJ51k13mJ34J26k29o1k0J19q8K52k27
7068d8Q8j36J05Rj57N1lP4mj30J84m2L1K1k52J73K00j13j12l5J34Q7j93J20n4
7093bJ06j51m3m2J01m7K26j39k8OJ2n0l0p8J66J22q3n7j9J15k1j65K5j7PJ76j90
7120a00J26j23p4K58n9o1J54o9K6M1j34J0q1rn5J07J17j19k9M7j07J24J3K6j73
7145a44M2j8J56j4j06R5J65r8j40M1J30q2J02j87J38r9OR2p2j80K01j9q7p2K81
7170A31j84m4L03k72l6J81L9l2Mj20J1M2j78N8k1Q3L0m3N9O7Lqj49j1L60j79J4
$$ y = [-112, -240, -214, 59, 94, -110, 35, 30, 177, 164, -35, -9, -25, 52, 67, -34, 63, -108, -64, 91, -18, -66, -86, -98, -10, 46, 128, 4, -83, 115, 92, -21, -209, 156, 85, -140, 197, 27, 17, 89, -14, -51, 101, 54, -71, 89, -20, 76, 48, -74, -46, -27, -59, -2, -79, 67, 126, -36, -188, 54, -49, 4, 12, 163, -50, -54, 80, 206, -23, -84, -104, 15, -73, 179, -48, 40, -96, 9, 18, -139, -88, -91, -17, -21, -151, 33, -9, 22, 43, -209, -36, 164, 51, -61, -96, 38, 125, -68, 52, -2, 104, -47, -90, -132, -31, -78, 148, 9, -19, -13, -1, -51, -81, -159, 7, 129, 46, -11, -30, 85, 64, -101, -76, -93, -86, 90, -100, 26, -97, -171, 87, 28, -33, 121, 52, 78, 119, -15, -5, -86, -95, -150, -43, 74, -45, -74, -27, -134, -10, 3, 29, -144, -102, -120, 36, 22, -84, 11, 176, 78, -62, -21, 109, 27, 129, -58, 80, -19, -13, 79, 7, -173, 28, 9, -78, -150, 131, -53, -97, 206, -66, -102, 79, 118, 86, 90, -30, -19, 23, -155, -97, -118, -35, -5, -48, 11, 78, 81, 73, -76, -87, 273, 94, 108]
7197A08l03K43q2L9J25j94N6R3K22j98k27J18jn2K24k81J67p3K47k14J55k89J25
7220HJ15r5j66M1l2K14j64o7k0K98k21J56r8J34j58J37j43p4J63o5J74j62j0J02
7244F7J77j59N6k23J47R7r2j96P0p6J15j35k1J92J30l8r4J48k44J35m9Q4M4j58
7268b3Q9j17O1M7M6m0j07lj30K05M0k03K5j27K80j16K09k04LK26q8p2J6j16J02
7293CP3j85K00j05j14K02p6J8J93k58j38K20R0j70M9l1K8j53J12J0R5j56J88O8
7317A63j24K2pon3p7J24J3q7P8K4o4Q4l7r4P7r9J22q7j67K96ll03K43J57o0k25
7344i0J56l4o0L5P3k34k0K00K7r5k4K60l0J1j18m6k1R7j21M4j26R1O0o3n1R2m1
7371b8O0R3j1p7o5M7O6p4J00l3o1n1M4J66j2j00j91K54j14N4q7j35J36l6P7m6
$$ y = [108, -195, 48, -34, 5, 130, -64, -8, 85, 307, 109, -118, 0, -1, -53, 171, -110, 57, -16, 231, 17, 172, -117, 8, 123, 28, -138, -97, -129, 85, -79, -146, -166, 132, -89, 67, -31, 103, -55, 82, -61, -135, 28, -37, 137, -25, -35, 67, 244, 85, 141, -82, 65, 162, 70, -126, -56, -132, -17, -152, -173, 19, 149, 111, 17, 165, -79, 56, 7, 91, 135, -23, 66, -51, 10, 57, 103, 63, -44, -47, -177, 28, 68, -135, -110, -237, 43, -73, 136, -68, -65, 161, 73, 1, 17, -99, 3, 76, -109, 91, -14, -128, 74, -2, 16, 209, -49, -187, 33, 123, -47, 2, -29, -1, -154, -42, -32, 63, -93, 95, 163, 39, 61, 54, 48, -5, -82, 42, 55, -32, 46, 70, 6, 90, 53, -41, 36, -63, 59, -28, -195, 101, 98, -205, 38, 195, 135, -90, 66, 32, -28, 7, 80, -154, -174, 26, 53, -42, -66, 194, 164, 175, 57, 11, -10, 87, -34, 10, -116, -25, 35, -28, -79, 13, -28, 32, 125, 114, 37, -28, 19, 85, 11, 111, 78, 17, -34, 10, 176, 164, 64, -127, 127, 13, 67, -20, -155, -19, -55, 22, -24]
7397b4Q5j29J56J0r1j43J93Mq6o2R6K9k24L46k73J08j7J58j05j09J74o9jj52J32
7422Fj25J21J26j36l3j91L49L6m7j49L2L3o1k7m5J83n6n9j0r7J17j4jn3J33j06
7448g4k0O8R1Q9O2j89r5O0j69K78k05K8J49r1m0J66j0j94J18O0r5j49J28R7j95
7473a32J18p2J16Ln6l2OM8j9J31K3j27K6Qj61J68j05J96k37Q0J27j03m8J1J33
7498A02j98N4M8n4r3O6J97P7k79m4J74n5J58j65j8m8J07R6m7j22J1Q1j5P2j98
7523i3K17j82Q0o3kkK9K15j07K1J4j16O7m0lP6p4j27J2QK2J9J76j97M1q0mJ75
7551H2pj41j00P9J61j90L7J47j23m2K25q0P7n3q0J11j95NJ14k9j61K97k49J46
7575C1M8p5Rl0R8j22j19j3K46N0k89J21R3j07J09r4k9J38NP1l38J58J07L6j74
$$ y = [-24, 61, -68, 88, 98, 7, -136, 57, 61, -25, -87, 9, 38, -186, 160, -113, -5, -22, 136, 31, -78, 96, 27, 26, -126, 6, -119, 2, 128, -8, -41, -232, 117, 153, 106, -43, -11, 22, -39, -66, -111, 72, 16, -43, -53, -150, -33, -47, -48, -101, 32, -74, -94, -26, 65, 154, 216, 27, -68, -8, -177, 101, -104, -76, 73, -18, -58, 108, 98, -96, 22, 82, -13, -162, -34, 63, -132, -14, -86, 30, 33, -23, -55, -49, -1, -20, 111, 134, 7, 33, 41, -120, 48, -57, 139, -98, -18, 109, 6, -42, -31, 102, -96, -42, 6, -48, -141, -75, 122, 199, -80, -124, 50, -5, 153, -12, -30, -78, 29, 125, 78, -44, -33, 48, 33, 105, -93, 124, -58, 22, -41, -43, -45, -16, 199, 92, 113, 127, 11, 78, 38, 35, 111, 37, -90, -78, -70, -48, -29, 147, -50, -9, -89, -93, 82, 75, -66, -166, -87, 74, -116, -79, 68, -55, -97, 128, 48, 125, 72, -8, 103, -92, -87, 27, -2, -163, 134, -115, 31, 79, 4, 13, -17, 81, -41, -160, -173, 73, 123, -166, -45, 48, -59, 50, -44, -73, 65, 70, 141, -197, -39, 68, 104, -70]
7600g0J57r7L5j15K77k9%k39J36Kk21J73p8J97k81J54m0j5k5R7M8j91K38j28M2
7625B7N7k33oJ4J24Q3K2j49K18p9J1o3Q5j28p5mO4P1k07J41j22K39m9o3o1M7L2
7652dP9M2k58L33j85n3l6K11n4O9j05r9p0J41J26L5l4k40O2J02m3K6J00k25Q4
7677DNj17J08n5o2J42L8J10j62j59J47j30J59R7j79k3j07J9J31J84j85J28j99
7700a06J49L5p7oN0J10j13j41QM3J71p1j17L4j10J53q8OL4P9Jk03J07J80j11K
7726A9q9J32k35J32J03j61l7j6R3L4J21j00j0J7m0j91K26J07l8J2Q0j01o5M4J1
7751D8qL0k5o2O0p2M9P2P7j90j28J38P7p8R2j78O8j27J84O1k69J59J54k07j7K51
7777A59j97M8j14J13jn6P9j04J06j62J54O0Q9l69J69P1K4k17k5K18j33J52j7m3
$$ y = [-70, 87, -10, 25, -90, 187, 158, 158, -81, 55, 57, -164, 9, -69, 128, -153, 1, -39, -54, -79, 18, 66, -125, 113, -15, 27, 84, -149, -155, -141, -17, 66, 88, -61, 157, 78, 89, 26, 111, -17, -92, -96, -32, 39, -168, -27, -149, 90, 41, -22, -83, -36, -4, 75, 117, -141, 192, 7, -46, -82, 129, 75, 144, 39, -60, -130, 11, 137, 172, 138, -102, -40, 62, 19, 45, 145, -80, 4, 9, -108, 0, -55, -117, 25, 63, 173, 11, -148, -1, -131, 28, 125, -54, -77, -184, -165, -34, 150, -35, 93, -106, 43, 78, 1, -5, 45, 155, 42, -99, -91, -48, 123, 52, -65, -31, -141, 12, -76, -70, -36, 43, 44, -159, -52, 128, 17, 19, -70, 62, -173, -41, 62, -99, -136, -152, -59, -25, 96, -4, -14, 3, -37, -228, -2, 105, 67, 79, 159, 58, -7, 37, 48, 40, 70, 45, -17, 43, -29, 20, 92, 169, -21, -149, -11, 66, -12, 80, -98, -30, -157, 27, 88, -181, -22, 132, -75, -92, 159, -38, 10, -104, 9, 8, -48, 31, -73, 33, -129, 25, 85, 174, -195, -26, 45, 69, -148, -173, 45, -88, 64, 47, 4]
7801DO2N2p2J43k77J93j44m4Q8q2R1m9p6nJ89k0j08J31n3n8J06j6k5Q6n8Nmr4
7829c5J2J5p2J81j28P6R2j33L3k3j07M5J44k40l1J20P6R9r2j13J24M8j15J2p6
7854h8K7P2K3n8L1j10J35PN9k4pr6M1K3J2j77J68N2p4M8j7j06M9R9p5KJ00j09
7882Gr5l8M3J80k06R1o2K7J39k23k64L47j8J44j02O%K04k1j31j49K46j36J19r4
7907A4r2N5J63j82n7K29k59K10k27L57l28K64j02p7j37J74pj2n0J37l03K99K3
7930I2q5m4M4k3j2K1O1ok8N5q8J22n5jj32K16j34q0j8J04j47J11R5p9J00k24K50
7957A15k02J76r4K08j19N7k42J50K0j17J74k27N7K0j1qj83J60J30J1O2j18o7J63
7981A15m0j30j5J44Ol2q2Q9Lj53J74O6j82J69j03k9J33k73J19L8l7J00n9j10M2
$$ y = [4, 66, 118, 46, 189, -88, 105, -39, -83, 5, -77, 14, -35, -111, -116, 73, 53, -55, 76, 23, -35, 71, 55, 30, 116, 58, 63, 59, -35, -23, -8, -80, 101, -27, 49, 141, 8, 41, 18, -89, -44, 100, -140, -171, -51, 25, 124, 32, -81, 43, 91, -24, -12, -88, -61, 11, 34, -24, 7, -103, 32, 39, 98, 74, 67, -29, 12, 35, 47, -130, 38, 90, 16, 64, 47, -59, -10, 89, 14, 16, 116, 7, -88, -126, -83, 97, -109, -18, -80, -53, 86, -137, -401, -54, -72, 72, -30, -24, -24, 180, 159, 28, -121, 125, -11, 108, 14, -78, -23, 140, -42, -99, 130, -129, 81, -146, 211, -117, 147, 45, -32, -169, 5, -2, -14, -64, 73, -230, 69, 92, 7, -37, 7, -16, -28, -7, 54, 48, 20, 75, -13, 109, 54, 53, -79, 137, 3, -77, -95, 9, -138, -27, 68, -11, 89, -135, 115, -87, 89, -5, 203, 84, 141, -101, 49, 69, -48, 126, -101, -44, -24, -35, -43, -226, -66, 64, 75, 137, 19, -48, 115, 75, -55, -70, 74, 80, 48, -34, 55, 58, -95, 79, 145, -37, 132, 29, 0, 133, -140, -21, 17, -20, 80, 21, -89, -47]
8006d7r7J68k4j25J4J20J21m30L86k25J93j83L7J80j16j2J1L6K8R5j52%j5J52
8030A15j32m7K11p0n6J55j38j08J31pQ5j53j9M3J05M4k01k9J17J2j73OJ18K0L
8055C2r5J8O8N1k0j1j1r4Q2jj42K77k39M6L1o6J84j57J15o7j4lj26J72Q0j39L0
8082AJj77J23K01l78J62j9N1J66qj50M6J3j85K1J40J45l1k00o0J03J03p2P8Jl5
8108D0j47K7l5K05J3PJ2j44m3J57Q7k86K50j29j2j1P7j23K36k15O0j25K19p1j11
8133f2J28o4O6O5j97r4K91r6k02J28K6o1N8L1q3Q3k2O9k8pQ2j80L0P8r3k1M1K02
8161A68j31pj63L3Kp2K74k8n1q1N8j11K51k73L03n0j95j3J95m5n2N2J05q9k12
8186a32N8p7J56o3J29
$$ y = [-47, -144, 24, 0, -125, -111, 9, 130, -300, 86, -139, 54, -129, -92, 88, -28, -40, -29, 7, 35, 130, -22, -22, -37, 115, -17, -64, 147, 77, 21, 176, 38, -70, 61, 54, 139, -14, -33, 10, 115, 159, -42, -71, 46, 58, -115, -109, 9, 29, 32, -63, -45, 23, 74, 54, 43, 32, -62, 20, 19, -123, 154, -85, -39, -8, -74, 110, -47, 68, 1, -13, -16, -142, 30, 110, -29, 1, 2, -175, -52, 149, -229, -67, -86, -35, 131, 123, -27, 19, 32, -153, -132, 8, 153, 122, -78, -138, -35, 68, -4, 74, 75, 40, -107, -80, -115, 90, 103, 110, 122, -22, -65, 92, 179, -107, 143, 14, 2, -9, 68, -55, 181, -34, 26, -99, 120, 49, -62, 66, 2, 68, 133, -64, -158, 133, 37, -165, -37, -11, -72, -14, 17, -66, 17, -5, 64, 36, 29, 111, -69, -39, 39, -54, -75, -34, 168, 37, 30, -133, -100, -98, -170, 104, 76, 25, -56, 2, -109, 142, -131, 172, 122, -73, -86, 109, 64, 12, 64, 169, 80, -132, -74, -151, 5, -58, 71]
8191G1
$$ Imaginary data points
##PAGE= N=2
##DATA TABLE= (X++(I..I)), XYDATA
0@%%%%%%QqQj6J6k4L2m0M8n6P2q8J04j28J59j90K23k63L10l62M20m90N64o46P41
31C94q44R59j084J226j382J551j741J948k173K420k689K984l305L659m043M460
47B340m920N424n973O578p250P991q814R738j0779J1957j3312J4882j6727J8940
61A0075k1643K5035k9439L5413m4022N7579q2207J41245n59560o27326O64628
72d30222J61708o571J08705M76732K18495k70659m43634K3073M23538L11347k61891
83C10621m08425p3722K43772R6571k22882j84826L44453O06307K74295k89408
93F96756m55214j55324N9022j75318l86056j82677L11831N21655J57014k95225
103I6464k84782J2309J40369r8454l00074o2697L17834L44740j3598l56443k41581
$$ y = [0, 0, 0, 0, 0, 0, 0, 8, 0, 8, -8, 8, -16, 16, -24, 24, -32, 40, -48, 56, -72, 87, -103, 120, -143, 167, -195, 225, -265, 299, -347, 394, -450, 509, -575, 651, -731, 820, -921, 1027, -1146, 1274, -1415, 1569, -1736, 1923, -2120, 2340, -2580, 2844, -3129, 3449, -3801, 4190, -4624, 5114, -5665, 6292, -7020, 7862, -8865, 10075, -11568, 13467, -15972, 19441, -24581, 32998, -49209, 92036, -467524, -1094850, -430222, -268514, -275085, -166380, 310352, 528847, 258188, -185446, -162373, 261165, 572512, 310621, -97804, -171526, 72246, 168817, -54065, -238891, 105562, 711869, 986164, 696756, 241542, 86218, 145240, -30078, -416134, -598811, -286980, 234675, 391689, 96464, -188318, -176009, -35640, -134094, -434168, -496865, -179031, 165709, 152111, -204332, -445913]
114d45913J15523J90820M115p5657J39880M11604K91599j31836l66815k28380
124i5060N4867R8989r0099j03414J15002K57121J17255k09724l25478r8063J28287
135a50317J42537L3352J9116J73406K05767k1164k63136l09417j24315P1823O2336
146a60012q89L7968J15174J11242n4409k04323j40776J9459J34516J42898P4804
157G5652P6528Q9955j505j15054j69682j11061K6419R5627J01749Q3842K3299
168A75769l1648r9725j53564j01510j8856N3139J30524J50525J21701L9048r1378
179A74025j40166j03141n2884l861Q367N1032J30052R2541m1399j49954j48978
190a84366j6975P3899M9160M3036R6470J60440J13325q8511k09166j22727K2269
$$ y = [-445913, -330390, -139570, -135455, -211112, -71232, 340372, 631971, 500135, 133320, -95060, -40193, 58796, -31303, -134717, -19715, 237406, 354661, 144937, -180541, -278604, -150317, -7780, 25572, 44688, 218094, 423861, 402697, 139561, -169856, -294171, -222348, -160012, -160901, -122933, -7759, 103483, 49074, -155249, -296025, -276566, -142050, 848, 75652, 152180, 242135, 240630, 125576, -44106, -155167, -128748, -33121, 68628, 152470, 175769, 144121, 44396, -109168, -210678, -229534, -176395, -45871, 104654, 226355, 265403, 174025, 33859, -69282, -122166, -126027, -117660, -66628, 63424, 155965, 114566, -35388, -184366, -201341, -127442, -78282, -35246, 61224, 221664, 334989, 246478, 37312, -85415, -63146]
201f3146P7698q724p7855J9781J07277K2688j57708k28239m3805J82178J82828
212A2973N2010o606Q1322J58432o146k54054k64515m0402J71674J31354n6858
223b0816o0318J07639J73239J1214k17648j81044R9673K32493Q4104j28804j30824
234c1092O8396J13167j00531k60729j36766J67650K81846N8371j49047q0217J03768
245C4816J14657j14647k53766n2426K28866K46362o059k03050q0436J22470O6433
256A03220j56578k29401N429K86172K29663n3817j75974k3078J59118O1812j93985
267A2581k08730M3286K35723J17071j76044k27672J4065J78228O8932j33886j03807
278a80253J67744K82465O8372k03633k23947M987J26923l6434j91822q2044J73511
$$ y = [-63146, 14552, 5828, -72027, -52246, 55031, 77719, -79989, -308228, -352033, -169855, 12973, 64983, 58377, 139699, 298131, 291985, 37931, -226584, -266986, -95312, 36042, -20816, -81134, 26505, 199744, 210958, -6690, -187734, -88061, 144432, 228536, 99732, -31092, 37304, 150471, 49940, -210789, -347555, -179905, 101941, 160312, 11265, -68952, 34816, 149473, 34826, -218940, -271366, -42500, 203862, 197803, -5247, -85683, 36787, 103220, -53358, -282759, -277330, 8842, 238505, 184688, 8714, -14364, 144754, 206566, 12581, -196149, -152863, 82860, 199931, 23887, -203785, -189720, -11492, 57440, -76446, -180253, -12509, 269956, 338328, 134695, -89252, -84265, 42658, 6224, -185598, -267642, -94131]
289i4131K54689K8178j94963j22831R1533J50653k4170j72922m4847J66792J53648
300A91629o3149k19129j02820J21336J29483m0234j21401P733J80753J19288j09515
311I3974j92939n2091J25064J13545n5625r5963M7825J47497N6964j37014j78523
322a27286r202J18539O3535o2511p6685O3715J38760K0411j17565j08923K8985
333f8227J20005L3841p7810n7360L5420O6580l2626j31191o9158N9879J05351
344a5296M6935l0287l004P2966N6107k7499q2355m5402M2447M5061k0590m8950
356i867k5806K0762J9629l3659l3026K0750O1481O0762R078k5298j5675k3887
368B5244m0695m9250m4888k242K3885K0165K7789K4953J5058R071o413L376J3573
$$ y = [-94131, 160558, 188736, -6227, -129058, -37525, 113128, 88958, -83964, -128811, 37981, 191629, 128480, -90649, -193469, -72133, 57350, 17116, -104285, -96552, 84201, 203489, 93974, -98965, -151056, -25992, 87553, 31928, -64035, -16210, 131287, 188251, 51237, -127286, -136488, -17949, 45586, -16925, -93610, -29895, 108865, 129276, 11711, -97212, -68227, 51778, 85619, 7809, -49551, -14131, 52449, 19823, -111368, -180526, -120647, -15296, 31639, 1352, -1652, 71314, 127421, 99922, 17567, -27835, 14612, 59673, 39083, -9867, -35673, -14911, 4718, -28941, -61967, -41217, 20264, 81026, 90104, 64806, 49131, 25244, -15451, -64701, -109589, -111831, -87946, -67781, -39992, -15039, 19, 9090, 2677, 6053, 19626]
381A9626o273j1835m244Q791J8825j2154k8495J0033M7102N1402J1509k7805l612
394G2870K1687r032o0469q2830k6497M4324K6196k7348l3686J8288P0408K6846
406D0757o1284o4976N616O1183K3241o4509n5664L7686Q0213K6491n8981m5818
418g6045O2433R7885J4235p5959n7848N4666Q9755r512q7768m1778P4134J03692
430A47890j3361j03827m3553O3374O8705n3454j35669m7423P7276O9984m8300
441a8358j17038j8324J10283P8370n3179j05030m158J16553P3102o5885r4798
452i8462J8611J25369O7498q4717j04853K0880J09806M4340r4254r7165M9312
463d3635J30709M7605q2159p8278O3793J26528J4726j09867r1980M0558R0453
$$ y = [19626, 13353, 1518, -2726, 6065, 24890, 12736, -15759, -5726, 41376, 92778, 104287, 76482, 72870, 94557, 85525, 25056, -57774, -84271, -39947, -13751, -41099, -74785, -56497, 13911, 40757, -20527, -85503, -79887, -18704, 4537, -59972, -115636, -77950, 2263, 28754, -30227, -76045, -13612, 84273, 98508, 22549, -35299, 19367, 109122, 99610, 11842, -29936, 44198, 147890, 134529, 30702, -12851, 50523, 119228, 65774, -69895, -117318, -40042, 29942, -18358, -135396, -153720, -43437, 34933, -18246, -123276, -127434, -10881, 62221, -3664, -98462, -79851, 45518, 113016, 28299, -76554, -55674, 54132, 98472, 4218, -92947, -43635, 87074, 134679, 52520, -25758, 38035, 164563, 179289, 69422, -22558, 18000, 108453]
474A08453l4909j51473r8892M7345J02533n520j01648k4906J11948J27702q72
485G9761j07031l7357R1464Q1845m6790j25594m3299Q6113O7454n9675j08256
496a21365j0196J17771J00463k7736o6517K1924J03159N3402q3693j17383j0692
507d0863P3465L2729p0774q3652K8641R6936L2350o6012p1746L0246R1776J7905
519G1001p4509o6692J9974O5072n424p9564l8298O0381R8971L1231n0656k8918
531B569L9749L8325l5106r3438n2397L7549N0051o593m2156o077O1124N4962j3030
544C5532l8478N85N0439M0062k8963n8306k3157J1318O801k9427l2216K1243N4488
557I921L6756j954k3107r49J6535n798k5090j8802Q860L0166R280j6247j6295
$$ y = [108453, 73544, -77929, -176821, -129476, -26943, -32463, -134111, -159017, -47069, 80633, 79761, -27270, -64627, 26837, 108682, 61892, -63702, -107001, -20888, 46566, -13109, -121365, -131561, -13790, 86673, 58937, -7580, 14344, 117503, 170905, 87212, -30171, -40863, 32602, 65331, -5443, -89095, -60454, 36482, 68832, 2820, -68926, -38680, 53096, 71001, -3508, -70200, -50226, 14846, 9422, -70142, -108440, -48059, 50912, 82143, 31487, 2569, 42318, 80643, 45537, -47901, -100298, -62749, -12698, -19291, -61447, -67524, -6400, 48562, 35532, -2946, -2361, 48078, 88140, 59177, 871, -22286, -10968, -4167, -33594, -65810, -44567, 9921, 46677, 44723, 21616, 20667, 37202, 31404, 6314, -12488, -3628, 26538, 35818, 19571, 3276]
570C276j1056l252q043j4717N02J1353O537L35j0837j0380n972q415M535K0824
584b5310K2058J9111P444M463J0433m710k3145k0826j422K2998J7094j0959j3929
597C300K917J4494L325k3202j2698K9893M4106J7853k4797l4063q43N370k9044
610c389n3514l2843K5094M7148L801l0725j3619K9310L9126q786l9846j535M8618
623H840M6799j5294o1006k3316L2485K7830j9950m1934J1055P3120M7692k7231
635E9090n7652j2668M4226K1014m5022m7457J7782O8875L2061n2956o3626O272
647c0061N1197J6698n1043m6618L2218O4766N588o7330o1374K2643O3845Q205
659H734m8032k4697N0939P2365n041p3784m3010L5225O0057k739n7183j3756N8522
$$ y = [3276, -7780, -11032, -19075, -33792, -33290, -21937, -15400, -15065, -25902, -36282, -42254, -50669, -46134, -25310, -3252, 15859, 23303, 27766, 38199, 33489, 10344, -10482, -11904, 11094, 28188, 17229, 3300, 6217, 20711, 24036, 834, -11864, 18029, 62135, 79988, 55191, 21128, 20285, 25655, -3389, -56903, -89746, -64652, -17504, -13703, -44428, -58047, -28737, 10389, 1603, -38243, -39778, 8840, 55639, 40345, -20661, -43977, -11492, 16338, -3612, -45546, -34491, 38629, 86321, 59090, 1438, -11230, 32996, 54010, 8988, -38469, -20687, 48188, 80249, 27293, -36333, -30061, 21136, 37834, -13209, -59827, -27609, 37157, 42745, -24585, -85959, -63316, 529, 8734, -39298, -63995, -13056, 59309, 54268, -19516, -62526, -27301, 32756, 30017, -27166, -40922, 17600]
672A7600N5648k0338p4621k5575N7971N5855j5665n6499j0588N7024L4767n0148
684B5431p8177j6767N8414M7069k9693m9289J1677N9816K6086n6104o9622O371
696f4788O0578K9098l8861m7186K1930O1590J4015m6870l9270L3100P3160K0550
708G7046m3738l7090J7062L9228j4343o6271l5244L4733N7393J0422m1592k1865
720b4259L0609L1424j8273n4227k2659L8598L9737j1254m0407j4624L3244L0775
732A8684j7639l2298M735M5336L6176j6613l8791p494K0785J0820k3683k9679
744b9661J2223L9875J8674j8911l1566l961J8648K40k2701j7118J1700K9894Q644
757A5980j9690j6496L063J4585L831j3008k436J7510J7847K084j6519j3912M396
$$ y = [17600, 73248, 52910, -21711, -47286, 10685, 66540, 50875, -5624, -16212, 40812, 75579, 25431, -52746, -69513, -11099, 35970, 6277, -43012, -31335, 28481, 54567, -1537, -71159, -64788, -4210, 24888, -13973, -61159, -39229, 22361, 36376, -10494, -49764, -16664, 56496, 77046, 33308, -3782, 13280, 52508, 38165, -28106, -63350, -28617, 28776, 39198, -2394, -24259, 6350, 37774, 19501, -34726, -57385, -18787, 20950, 9696, -30711, -45335, -12091, 18684, 1045, -31253, -26518, 18818, 54994, 38381, -410, -7904, 12881, 23701, 18, -29661, -17438, 22437, 41111, 22200, -9366, -13327, 5321, 5561, -17140, -34258, -22558, 7336, 15980, -3710, -20206, -17143, -2558, 1273, -11735, -14171, 3339, 21186, 23270, 6751, -7161, -2765]
770b765O767J440j111J736J0860O508q478j2170j1098o117o54k132K878P540L053
785c743J295q86k090K13l826j184J0361J1927N778n184j0559M22M304m607q361
800f140k558J3899J9943k95j5531r738L012P130j0418k1810l299J7160J6251n247
814B359k3526o131J8582J4101o534j6471L935K8733J4756j8100k7379n058K3406
827B673J4709j6723j7016J2120L3189J5432k5148l0655L623K3312N628k7376k5497
840c1729J5374L2337L052l0761k5338J7240L6976L678k8711j7133K0828L2525
852B8338p223m1206j9479K3935L4692o90l1968p456L3142K9379j3446m2621j5147
865b9750L0325K6818j4805l5115o737L4537K4818k1729l5446k89L7439K6400k1548
$$ y = [-2765, 4002, 5442, 4331, 6067, 16927, 23435, 14957, 2787, -8311, -14428, -15082, -17214, -14336, -6796, -3743, -2448, -3334, -5424, -5211, -9037, -10221, 140, 12067, 17845, 12661, 2102, 2524, 6828, 2221, -6140, -8698, 5201, 25144, 24849, 9318, -420, 2592, 9722, -696, -22506, -25805, -8645, 7606, 2359, -21167, -27298, -8716, 5385, -1149, -17620, -13685, 15048, 29804, 11704, -15675, -20733, 2673, 17382, 659, -16357, -4237, 28952, 44384, 19236, -11419, -7796, 15516, 21144, -6232, -31729, -16355, 15982, 19034, -11727, -37065, -19825, 17151, 20829, -7882, -25015, -4187, 28338, 21115, -20091, -39570, -15635, 19057, 18367, -13601, -21057, 12085, 41464, 28018, -14603, -29750, 575, 27393, 12588, -22527, -29264, 5273, 30091, 8362, -27084, -27373, 10066, 36466, 14918]
878A4918l4301K899L1984J4403l0534l7735P447L8126J6995k3366k8237J3281
890a4120L8079P898l0645k6553J5165L8081M703l3827k4926J3869L0686n83l5329
903a7502j7893K4533L4625J889l1164j5564K2951K4408r790l3717j4268K5916
915e576K5987j0524k9652r017K4642K2923j2496k6039j821K5865K0223j4083k6910
928a6478j80K3199J4923j2643k0652O354K7575J2150j5369k2041K17J9071L277
941A9403j9625j7634L463J9261L831j8562j3323P438J7005L758j5214r895J0008
954a0086J3505J7j4860j0478R199J2150K8p121k430J1960J3356j466p833j915
968D026O965Q904k670p924j065L460K836l713q476j881K273R2j718m143j525J534
$$ y = [14918, -19383, -16484, 15500, 29903, -631, -38366, -30919, 7207, 24202, 836, -27401, -14120, 23959, 31857, 1212, -25341, -10176, 27905, 32608, -1219, -26145, -12276, 18410, 17827, -17502, -35395, -10862, 23763, 25652, -5512, -21076, 1875, 26283, 16493, -17224, -31492, -5576, 20411, 9887, -19765, -28782, -4140, 18783, 6287, -19752, -21573, 4292, 24515, 10432, -16478, -16658, 6541, 21464, 8821, -11831, -5477, 22098, 34248, 18879, -3162, -2945, 16126, 19403, -222, -17856, -14393, 4868, 8699, -9863, -23186, -15748, 1257, 5015, -10199, -20094, -10086, 3419, 3436, -11424, -21902, -12703, -553, -525, -7646, -10076, 1884, 15240, 13774, 5941, 4026, 10991, 19895, 17225, 9301, 8236, 11696, 14532, 10819, 2343, 462, 2735, 2827, 1109, -3034, -4559, -3025]
984c025k658l323k086k645K73J57P68M016O70j078J308K646M896R06m266J67N058
1001A784M202n06o153q61Q510N667j862n721N07J0624N139q279j0475k538P628
1016G666M013j0664j1407J570J0564N139j0586j1720M622J2645K813j1673j2670
1029a9688O152J5207J303j3218j0898Q384J8406J946j4115p429J0794J7886j49
1042A4581j7432p270J3300J6914k211j8884p238J5757J5226n867k0678p452J6688
1055E434J3644r763k0642m699J7599J3249j2866k0559r66J9154J3489j3689k0097
1068b0712L090K0644J1238j3849j9459N443K2028P864j5509j7584O791K2786N295
1081A8066j7613j5171Q208K2528L736j9760j3897R840J9553J364k1092j2703J2746
$$ y = [-3025, -5683, -9006, -11092, -13737, -13464, -13307, -12539, -8523, -7853, -8931, -7623, -4977, -81, 825, -3441, -3274, 1784, 5986, 5480, -673, -1534, 6976, 12643, 10781, 5060, 5567, 16191, 21330, 13051, 2576, 38, 7666, 11679, 1015, -10392, -8822, 1742, 6881, -3705, -15425, -10803, 1842, 4655, -7018, -19688, -13536, 1671, 2974, -10244, -21142, -12758, 5648, 7594, -6521, -13950, -3156, 14730, 14581, -2851, -10121, 3179, 20093, 17882, -1002, -8240, 7517, 22743, 16876, -3802, -11254, 5434, 19078, 9315, -11327, -16026, 1573, 14822, 1956, -18603, -19569, -415, 13074, -615, -20712, -17622, 3022, 14260, 411, -19048, -13605, 8423, 16287, 778, -16806, -10015, 12771, 18066, 453, -14718, -6510, 16018, 19754, -6, -13903, -4063, 15490, 16854, -4238, -16941, -4195]
1094d195J8065r19k0785j0839J5309J7997m196j9567q668J5841J7077o645j8929
1107a0454n552J6143J5576q248j8565j933J6177J2591r618j8660k37J6752R813
1120A3785r946j6967J236J7430P447j0788j4275K378J6547N674j2334j1615M273
1133g155J5130N241j2852j0213N591J2727L242j2304r764O664J1034N29j0424
1146b554p679P289J0585j568r711n672O635R542k286r437l519O225Q069j933q653
1161d667j260O273N654j954p544r56O148L347k166n613r55N717K532k619l545
1176a608p68L552J873k934k115K53J649J451k000j464J093O16O03m10j335L56
1192a188J57l49J460L69l81o97k21K427J863j675j883j73K448K008k806l338J076
$$ y = [-4195, 13870, 12951, -7834, -18673, -3364, 14633, 10437, -9130, -17798, -1957, 15120, 8475, -10454, -16006, 137, 15713, 7465, -11100, -13033, 3144, 15735, 6117, -12543, -12780, 3972, 13785, 3839, -13128, -11892, 5538, 12985, 2197, -12078, -9700, 6847, 12521, 187, -11428, -7155, 7975, 13216, 364, -9849, -4258, 8469, 11711, -593, -10357, -3693, 7341, 7870, -2554, -10233, -2944, 7641, 6073, -3638, -9310, -2675, 6867, 4581, -4856, -8375, -2150, 5919, 3986, -4667, -5927, 346, 6000, 4046, -3498, -4454, 1694, 5041, 2875, -2738, -3693, 2024, 4556, 1937, -1608, -2376, 1176, 3049, 115, -2000, -1747, -98, 1353, -647, -2111, -1018, -402, 201, -209, -1544, -1188, -1031, -1380, 80, 449, 68, -629, -850, 1577, 3440, 1765, -118, -291, 2157, 4165, 1359, -1979, -903]
1209i03K924J941l546m855J810M984Q49m166n227J977O599P18n448m300K796P699
1225C852M20p133l433M471P457Q4q348l874O029P292m40q997m109P425P311k071
1241E936r170l459Q270P985m321r872k573Q616P933o055j0945j126R115P050o122
1256A262j1375R43J0686O526o861j0445K150J2265M355q235j0236K449J2796L711
1270I991r815q785M049J2486L387j1143q111N428J1334J382j2150q460O912J0878
1284G383k17j1807p202Q648J1404j457j1190o076Q528J0614l360j1809m203Q974
1298a770J0139l965j1764j668J0212R036m038j1451j030J0689O965n441j1480
1311e566q84J0393N413p180r742N83J0867M809q166q887J829R890L799q537q495
$$ y = [-903, 2021, 3962, 416, -4439, -2629, 2355, 3204, -962, -6189, -4212, 2387, 3105, -2343, -6643, -3847, 3852, 4272, -2861, -6294, -1823, 5634, 5718, -2630, -6504, -475, 6817, 6377, -2620, -6729, 696, 8007, 5936, -3234, -6693, 1577, 9562, 5241, -4631, -7204, 1412, 9345, 3290, -7655, -8781, 334, 7384, 1262, -10113, -9170, 1516, 8042, 1181, -9264, -7114, 5151, 9506, 1271, -8965, -6516, 6280, 9991, 176, -8609, -4560, 7926, 11313, 170, -7941, -2513, 8821, 10203, -1947, -10407, -3495, 7383, 7166, -4641, -11843, -3195, 8209, 6752, -4438, -10514, -1986, 8628, 5268, -6541, -10744, -1770, 8369, 4404, -7360, -9028, 1184, 10220, 6182, -5269, -6299, 4390, 11355, 5914, -5566, -6450, 3943, 9356, 2176, -7566, -6983, 3884, 8693, 527, -8360, -6531, 3359, 7158, -1379, -9874]
1326i874L269R260K548p809p102N057R336J793o677n510M942Q722k90p719n268
1341e322M099P510o96p166l006M553O790q57p250k532M631M508j882p204k938
1356f762M478L319k542n061j265N655M252j322l155j08M379L128l110l709N4L072
1372A303K156k206l175J028K759J505j458k413Q39K519K42j481k080m67J121n59
1388c67j253m57K14J427J089n60k5m56p29L60k47r3j95r16O21J479M03j92j165
1407a062J159K457L98j132j290J53J456o30l816j904J087K788J259k216j007L116
1423H16L375M00l414k272K891K819j291m278k873K501L172k130m442j258M555
1438a429M872j249m924p31L887L202k657n761K1N597L895k519n040K05N971K671
$$ y = [-9874, -6605, 2655, 5203, -2606, -9708, -4651, 4685, 6478, -199, -5709, -767, 7955, 7665, -54, -5322, -1223, 6287, 5591, -1575, -4581, -28, 6762, 5905, -1345, -3877, 754, 5262, 3380, -3824, -6762, -2284, 1035, -1507, -6568, -7833, -2178, 2074, 752, -2403, -2511, 1868, 4996, 1886, -1823, -1769, 1303, 3459, 1253, -1922, -894, 1865, 3370, 1912, -501, 338, 2857, 3099, 1618, -462, -929, 192, -367, -1620, -2077, -1863, -436, 653, 93, 68, -388, -1117, -757, -1004, -1097, -1292, -2208, -1587, -108, 295, 103, -1062, 97, 2554, 2952, 1820, 530, 683, 2139, 1509, -2307, -4211, -3124, -336, 923, -1293, -2300, 816, 4191, 4591, 1177, -1095, 1796, 4615, 3324, -954, -3827, -1326, 1846, -284, -4726, -5984, -1429, 3443, 2194, -2730, -3461, 426, 3628, 971, -4790, -4769, 828, 4723, 2204, -2836, -2631, 3340, 6011]
1454F011l695n304J18O692K347n208n607P88N538K416n106m312L055P041J788
1469F562o045n868K443N337L0o403m727M335P102Q17n966l303M751P305o0o269
1485D1k228M718N961k125q587l592M091N139j814o672j126O549N036k695o831
1500d135j837N596M424l339n935n72O499M057m213n783O02O423M421l151m925
1515a868J651N498J857n404o185J029N967J922m247m216K256N618L66n458m301
1530e515J855N316O31m658l016K444M540l37n001k020M070N240Q45l639j934L185
1546B006K799j687m420j960L484L758j098l255j094K410K204k060m056k48K854
1561c63K844j289l532n80J994J087j326k128R11L534J569j023k137k12J427J13
$$ y = [6011, 2316, -2988, -2870, 3822, 6169, 961, -4646, -3858, 1680, 4096, -1010, -5322, -2267, 4774, 6562, 517, -5351, -2908, 2429, 2459, -3944, -8671, -4336, 2766, 3583, -2383, -5686, -935, 6370, 6310, 41, -2187, 2531, 8492, 6367, -2220, -5812, -1721, 3418, 1604, -5068, -6194, 355, 5391, 2696, -4135, -5972, -376, 4048, 709, -5226, -5798, 701, 4758, 545, -5238, -4636, 1787, 6208, 3057, -1868, -217, 5281, 7138, 1734, -4451, -3422, 2545, 4467, 220, -3996, -1740, 3878, 4244, -1214, -5515, -3660, 1656, 2287, -2371, -5387, -2943, 1597, 1260, -3741, -5761, -1691, 3549, 4394, 755, -1179, 2006, 4805, 3118, -1302, -3262, 222, 3980, 2882, -373, -1467, 943, 3147, 1087, -2969, -3217, -363, 2481, 1192, -2340, -2920, -926, 161, -1165, -3293, -2382, 1152, 2721, 1698, -439, -651, 776, 889]
1577H89j719r76O78K216J272j307j043k63M65M65o69m93J089Q48M6p05j751n15
1595a473QJ57J56O60N63Q53J30l69l92j260k72M95P60J034j65n19M57k39j81j483
1615a080j039J307J955L2q54r98L63J060j039j723k58K006K483K13k083p99J004
1632E50J027j161k667k03K556K109p22k782j216K007J397j509k054M78L722K388
1648C920j801k827n50K296J564k471k674J248L159J610l019l808K54K920J097
1663I18k070j975K142M134O49l316l165Q34L416N34l311j890K445L691k67m126
1679a357k524J993L675M21k950j021L295L228j316m269k535K589L123j036l366
1694b050q89L124K724k327m548o43L150L527r90l258P06L497K154k685m109R0
$$ y = [889, -830, -1806, -1128, 1088, 2360, 1053, 10, -253, 212, 677, 8, -485, 604, 1452, 1498, 793, -958, -1473, -1465, -1308, -1152, -492, 71, 924, 1054, 685, 293, -967, -1239, -744, 16, 1050, 885, 366, 823, 584, 403, -1080, -2119, -812, 1143, 1175, 321, -677, -314, 746, -293, -2016, -2274, -268, 2215, 2428, 345, -454, 550, 1577, 416, -2251, -2454, 102, 2211, 1489, -1293, -2509, -502, 895, -614, -2668, -2190, 1532, 3920, 2119, -708, -1258, 1038, 2602, 131, -2543, -1295, 1864, 3474, 455, -3353, -3099, -179, 918, -1152, -3127, -985, 3149, 3798, 482, -2683, -1849, 1567, 2101, -1210, -3100, -655, 3036, 2769, -1357, -3881, -1888, 1787, 2208, -742, -1763, 1532, 4760, 3444, -825, -3360, -771, 2352, 1316, -2050, -2939, 185, 2909, 582, -3966, -4609, -1459, 2068, 1078, -2180, -1474, 2023, 4177, 1492, -2617, -2527]
1710b527L981K319j837l190K32L226J023l594l365R06L856J805k182k472J296
1725e23K784K50l460k941J550L477Q68k641k276J417K659n45k543j261K617M025
1741C457J88k500j528J306J652j309l202r35K147K576j74k341j013J687J589r84
1757F16k222q2K469J549j507k435j004J007J047p30q15Q15K500K107r86j526r1
1774G12M14K76j106j912M66J183K26q41j241K98J266Q64J5K28N09Q83m23j797
1792B0j111j010K30L54k75Q95P74Q21O91q8m69k74j66K76P9o09k38n27k29J53
1812g03l85K6O48R41J300L79j164q02k17l48n09j391k99J524J358M39m96l36J283
1831A248R73o74j070p31J018O68j465j993o63J152J473l09j073Q68K323J230j032
$$ y = [-2527, 1454, 3773, 1936, -1254, -1022, 2204, 3227, -367, -3732, -2826, 1030, 2835, 653, -1819, -523, 2261, 2511, -949, -3890, -2340, 1137, 2005, -636, -2912, -1495, 1164, 619, -1924, -3185, -568, 3457, 3645, 1145, -383, 923, 2575, 1266, -1936, -2871, -724, 1852, 1678, -663, -1676, 11, 1600, 616, -1606, -1688, 781, 2330, 823, -1612, -2616, -1609, -562, -1292, -2107, -1292, 1208, 3315, 2329, 803, 712, 1126, 1402, 296, -1616, -1150, 33, 259, -582, -1823, -1525, -259, 605, 620, 848, 1357, 2240, 1817, 20, -1091, -2101, -1871, -1517, -1792, -897, -123, 698, 1389, 1301, 832, 558, 392, 668, 747, 138, -100, -627, -856, -703, -1088, -1062, -414, 527, 1827, 2206, 1042, 240, 23, -325, -834, -2225, -2524, -1000, 358, 797, 301, -35, 1248, 2221, 1547, 477, -254, 764, 1432, -33, -2026, -2689, -1537, -64, -373, -1446, -578, 1745, 2975, 1943]
1848A943k528m45J359K2j329j825R07K625J023j671j278O51K514Q05k067j776
1864a070M94J626J35k610j899J360K735Q87j545q93K042K268l70l105k366J221
1880a090J815q98k771p99J914K984m01k122k18K568K567o55k836r11J795J207
1896B149j797l236m20K782J744j033j952L75K989J540j883k336K44K405J172k427
1912C16k476N46K282J000k112k231J075K894N95k014k266R59K565J18k121j338
1928b208J354K575L27k200j318J200K395l57k406j398J297J743k01k239n09K107
1944A62J904k43j842o26J680J441j231k173p32J328J166j098j529q4J630J447
1960A200o27j341N98J454P72j002k235j56R96N7m92j481P61J736P46k89q29N04
$$ y = [1943, -585, -1030, 329, 351, -978, -2803, -1896, 729, 1752, 81, -1197, -546, 1968, 2773, 706, -1070, -576, 1050, 1185, -1425, -3324, -1964, 771, 1658, 113, -780, 1262, 3530, 3160, 55, -2311, -1090, 725, -173, -2944, -3743, -1829, 1155, 754, -1368, -1586, 982, 3549, 2894, 58, -853, 942, 2149, 352, -2884, -3304, -522, 1222, 189, -1763, -1388, 1601, 3141, 1258, -1078, -834, 1571, 2743, 316, -2160, -1614, 668, 1668, -444, -2675, -1600, 1294, 1889, -125, -2391, -1432, 1133, 1251, -870, -2208, -854, 1721, 2048, -152, -1470, -270, 2125, 1768, -638, -2036, -739, 1004, 803, -1436, -1945, 162, 2066, 1823, -19, -645, 1035, 2476, 1245, -928, -1660, -332, 834, -264, -1793, -1877, -247, 1200, 573, -768, -170, 1284, 2056, 1054, -1181, -1337, -341, -284, -776, -2257, -1496, 240, 986, 697, -132, 372]
1978C72J328J99r83j036m3L91k38j277p30M43R00Q67M33P9O82N63M8q81j156j78
1998b17j00m14k15l29j98O48K19J85J67L79N40O80N6m37n57o25l96m62l79J63
2018a292J06J032R94k06k64n1O1K72l71o64K63M13N08m61j196P6P90Q46k04o17
2038C5N14J011l48j255j622m43R47O86p09p1Q87J589O50j501j230K67J210O08
2056A225j233r73J186J196l78j608j264J102J675L93j096p72R35J197r09k284
2072a608p35J315K251J86j349k25J142J109j333k456r80J799J651m23j628k72
2088a556J760J098j236j487K81K511J638j082j827l55R85L20k089j935R37K428
2104C91J150j137j680O19J240P4j824j240J490K748P81j409j541M01J483k41k136
$$ y = [372, 1700, 1899, 916, -120, -163, 228, -10, -1287, -2017, -1574, -674, 193, 626, 705, 1387, 1950, 1998, 1117, -39, -217, -317, -731, -946, -1275, -1473, -825, -606, -421, -254, 125, 665, 1345, 1401, 964, 407, -218, -614, -1076, -1455, -1292, -1186, -154, 840, 634, 370, 319, 380, 652, 281, -383, -120, 293, 801, 340, -856, -780, 10, 856, 652, 35, 549, 1560, 1212, -43, -1665, -2108, -1161, -475, -1184, -1255, -368, 1221, 1871, 370, -860, -593, 617, 1225, -8, -981, 205, 1401, 1023, -585, -1849, -747, 928, 1321, 225, -547, 388, 1585, 676, -1608, -2343, -1028, 1223, 1409, 60, -165, 977, 2086, 753, -1703, -2683, -884, 767, 344, -1284, -1556, 204, 1302, 66, -1421, -1140, 1371, 3009, 1927, 100, -255, 730, 1050, -1039, -2974, -2037, 391, 1541, 404, -1276, -657, 583, 657, -1167, -2407, -917, 1831, 2612, 1203, -338, 63, 1546, 1305, -831]
2121h31j060J322J849k36k662r51P78J575J54r74M56K636K035n48k410j988L67
2138d88J65j193j564Q4J920J986m91j268L00J548J452j83j261K97Q44p9k020k700
2156b651r29R62Q76L37J44J269K034M19j328j505n01J026K77j012m92P02J027
2173F55J12j384o50J034J553P67p4n95J03N4j453j647j268M63J358O63M20L22
2191D33K97L01n41j372l05K31P69M16k84k40k35j80r7m21K69J231J134P80J49
2210B335p53n93q74o27j09m9M67P61N00j18o22j119n30Q5r6M66L77O95O62j27
2230G31j005p44j86Q29Q58P2L60L38M31l72j989r64K23Q85P49K5J64R08K11n17
2250A007j507r72P59J291L20n14m10J27K42j085j720j63J495J766P71p18J24N83
$$ y = [-831, -1891, -569, 1280, 1044, -1618, -2569, -1791, -216, -62, -1036, -580, 2056, 4091, 3543, 1133, -855, -488, -323, -1516, -3080, -2996, -1076, 910, 419, -849, -549, 999, 2451, 2268, 1007, 1304, 2148, 2069, 49, -2651, -3580, -2618, -1742, -1405, -1261, 8, 2042, 2461, 1133, -372, -873, 153, 430, -582, -1074, -372, 655, 767, -617, -1267, -233, 1320, 2087, 2013, 1418, 1521, 1575, 122, -1525, -2793, -2330, -972, -309, 111, 433, 730, 1031, 490, -882, -1187, -956, -187, 229, -55, -295, -530, -710, -807, -1228, -959, 272, 1406, 2186, 2335, 1582, 989, 115, -512, -621, -670, -203, 558, 1058, 940, 318, -801, -1331, -1246, -1342, -876, -499, 196, 858, 731, -274, -1018, -1204, -375, 483, 555, 915, 1253, 1684, 1312, -677, -1641, -1418, -533, 216, 241, 405, 1313, 1524, 1007, -500, -1472, -713, 578, 898, 384, -26, 101, 343, -742, -2462, -2625, -1130, 636, 1407, 689, 813, 1396]
2268A396J0j073j786k03J656J207k73j100m09Q48J34j125r04N03K339J596r82
2285A834j518n64M1o9j545j189J164K269J257r79j183O2J048j16j162p39J090
2302b99K296l7j978j337m3J059R2o63j15J992K045k91k488j229M98O98k50j072
2320a122Q5K069J314q56j872j277Q48Q85n99q67K41J372J055j020j675l88J134
2337f73R90M01N6O20P59l08j242k713l67J492M78J70j77P78J729M0j565j387L46
2356e73J061N27j048n11L1M27m39j529n71J327J800J107J16j64L97J33j168j705
2374g82q77N32J279O3k70pJ49J77o44r19M69Q70P96K47q55n70j86l84n33n24L61
2395a608J422Q95L67J8m93K8Q7m31j39M94O51N01j62j063q09n57k58Q1l3M13P55
$$ y = [1396, 1406, 333, -1453, -1656, 0, 1207, 934, -166, -575, 273, 407, -718, -1622, -1119, 1220, 2816, 1834, 316, -248, -207, -276, -1821, -3010, -1846, 423, 1680, 701, -482, -420, 628, 512, -650, -1389, -299, 1997, 1960, -18, -1355, -1398, -339, -247, -910, -1025, 967, 3012, 2721, 233, -996, -498, 200, -50, -1122, -1037, 1032, 2346, 1490, -382, -1659, -811, 74, -525, -1392, -1151, 221, 1276, 256, -1419, -1807, -673, 317, 718, 774, 1394, 2153, 1845, 603, -2110, -2477, -985, -507, -337, -514, 264, 1993, 2033, 468, -919, -573, 488, 1015, -33, -544, -513, -86, -525, -2054, -2625, -1298, 502, 1609, 1725, 1561, 1958, 2091, 923, -782, -1659, -1127, 152, 215, -55, -62, 87, 264, -380, -1299, -830, 40, 836, 1083, 228, -342, -528, -912, -1445, -1969, -1608, -186, 709, 1076, 1094, 601, 629, 716, 285, 146, 640, 1291, 1792, 1630, 567, -242, -799, -1057, -976, -1009, -596, 159]
2416A59L52K65o01p04l99K51J9L59k67K16j8j08l97q65J16J207Q05Q40N07q4L58
2437B011l27j012j151l85M77N73k49K00q9L21K31m63r05M22O09R10n88q85m36
2456g36Mj93m22n59Q83J702R78j18q11n89M50k66j503n40L21J286O54p18m92O55
2476a4O90K34p86k20Q30R86l35j323j434K16P55k34m98K36J225J534nj526r31
2495f00J13O50l64j334K78J085J109r7j247l44J219O88k03j006l41J041K78j387
2513d62j324l59J190J108j47k23O61J506N32j245j545j05M32K97j004j055M90
2530a253J026J11r37o66Q62J512N82m79n89N19Q53k13j382p95M76Q91L70p76n47
2549d35N59L73k91j161l92J168J021Qn58k39M08M76m92j218j29K82O06l53r22
$$ y = [159, 511, 776, 175, -529, -928, -677, -658, -299, -566, -350, -368, -476, -873, -1738, -1622, -415, 390, 1230, 1737, 1653, 2011, 1684, 672, -479, -864, -387, 186, -63, 137, 48, 369, 600, 137, -768, -346, 263, 1173, 585, -300, -736, -732, -925, -1347, -1906, -1023, 679, 1657, 1539, 728, 139, 589, 323, -1180, -1720, -1399, -113, 541, -177, -669, -14, 676, 910, 124, -96, 734, 1720, 1385, 62, -1372, -1156, -401, -635, -1133, -897, 328, 1862, 1857, 331, -600, -487, 163, -201, -1535, -1257, -172, 937, 840, -407, -751, 468, 1156, 953, -53, -394, 647, 925, -462, -1786, -2145, -955, 153, 6, -217, 444, 1950, 2482, 1237, -308, -413, 19, 316, -688, -1743, -1253, -227, -116, -1053, -1719, -857, 655, 1237, 758, 169, 688, 1541, 1328, -54, -849, -373, 518, 888, 112, -435, 124, 497, 206, -955, -1347, -179, 842, 850, 292, 53, 461, 937, 445, -773, -902, -620, -14, -367, -1289]
2568a289j8N65P17j31o14O79R62Q26k75q02k62K30k36o19o48J15R57M42l49l93
2588a43K1N49J67m87m54K32J40K85m47o93J84J90N36Lj92M62K02R4n44m12l96
2609g03J27K6J00r7M9O62J79K6k27Q8K84K80j88l57r9k26j03n1n53L6L14M50K58
2632B75l05J18L98j12K32m05k51L67L31k30l39k72j0K18r0n18k65L58M65J54n42
2653d23j98N47N21Pn18p7K71M16o8p78o12O35L59p3p70j94R25L33J16o03r6P66
2675D86O12j67o15k80M72M23n98q66j41O86L12m45p48n3J083L12k88o98L58Q76
2695G21K9p52r05O4O93L43q17o73L20J286M04o30m89N22R92J0q62o95K10P56j58
2716C69p39n25O84J246j3m69n39O07M94l83j187m98L23P27j34o90j70M73J129
$$ y = [-1289, -1307, -742, -25, -156, -770, -91, 871, 1697, 1422, 620, 358, 588, 352, -267, -915, -800, 157, 599, 250, -143, -122, 427, 594, 107, -347, -115, 25, 310, -137, -830, -646, -456, 80, 83, -109, 353, 555, 649, 105, -307, -703, -576, -550, -450, -547, -498, 164, 343, 369, 142, 230, 514, 794, 606, 249, 150, -76, -179, -230, -783, -747, -433, 17, 275, -30, 88, 486, 374, 606, 201, -50, 317, 648, 418, 79, -193, -203, 15, -75, -593, -858, -500, -35, 119, -423, -621, -74, 447, 454, -64, -141, 130, 546, 478, -300, -912, -277, 82, 9, -761, -955, -30, 303, 419, -184, -280, 486, 1098, 931, 316, 36, 508, 931, 333, -533, -674, 12, 324, -121, -869, -922, 161, 473, 185, -513, -155, 721, 750, -2, -907, -843, -150, 193, -624, -1297, -977, 309, 713, 83, -406, 116, 1108, 1118, 256, -439, -229, 527, 369, -370, -895, -211, 1035, 1022, 553, 14, 621, 1115, 732, -455, -953, -630, 97, -37, -727, -897, -424, 705]
2735G05o5j122j09M75J215o52r52o77J101M88n44q14L33R89O75k12o00rR1K55
2755E71r43q22J84P68L64l55l68L17Q78N57n12p32K72M34k81o61p86qO38M42l58
2776d01J52N43J066K17o47o53l19L12l20q35m51M32M21M29l04M3N72P92k38k25
2796E86l10j85K81p66p91l40M09N33L96J27L83O02K40j75m62l80j74K7m1l59k22
2817f21P4J04K29Q6Q3M00M23P9m5o35j66j07k91m08J9J59O02N19j28m3j39J78
2839C72k31j75m58kL50jj26m34K29L94J68P6n50L65N68j15l14m39k54M64K34k43
2861a22j7K81P95N8n69l09j98K98K27m68l39L59J58K44o01n15K96P51l7n14j83
2882d05L37K21j98o86l40N80N91L14n78J03L47L88k26p91k95N02M22j42l39j78
$$ y = [705, 640, -482, -591, -116, 1099, 447, -505, -1182, -81, 407, -137, -951, -618, 371, 1046, 834, 234, 225, 316, 571, -372, -1194, -1010, -242, 122, -233, -601, -284, 594, 1151, 639, -93, 179, 613, 332, -329, -1115, -1123, -485, -43, -401, -249, 294, 1360, 1577, 930, 277, -42, 270, -50, -885, -1336, -904, -483, -54, -358, -315, 257, 1049, 811, 586, 276, 91, 372, -394, -1185, -1525, -1116, -583, -187, -60, 323, 925, 1165, 990, 528, 148, -26, 1, -40, -399, -621, -547, -443, -214, -128, -45, 355, 778, 857, 812, 177, 11, -96, -387, -795, -776, -617, -15, 504, 376, 333, 194, 372, 141, -34, -492, -494, -144, -145, -271, -705, -476, -82, 86, 162, -388, -23, 545, 430, 116, -323, -577, -113, 121, -122, -139, 142, 937, 995, 426, 117, -81, 217, 444, -24, -363, -4, 154, 398, -203, -718, -422, 329, 292, -222, -405, -68, 153, -45, -731, -1071, -491, 100, 414, -164, -61, 286, 674, 448, -343, -638, -136, 286, 144, -195, -373]
2902c73O87J71n0o18j39N45O63k90n78j52K67M91n64n26m7O70N00m72p36J24O87
2923B60N9n42n41J78P20M07m58l78N3L97J43m88n69K80O28L35o41l05J10L84K37
2944B69k86l90N61Q31M1m97o62K19N06k74o43j18K61O30j72o83l15L34N51l7o49
2965e23J97L94K45P4p74k5J25L41M3l23l5M77K06m31k48k81N81L26j54j23o6L20
2987C46j5k0n91Q9J04M15p2l84N2K48J87l28l74r6N78K3Ol23j50K92J55k62RJ42
3011C1K32K45m60J3l48J70J39j50l58M02M5L27J08l09L8K96L8l47l26jJ32J89
3033A06o0l28l64L97L74m16j52J24L18K45k27m54n8L04L32j23j53M5N94J84l43
3054C45l08m8L08J50R7l76j82K89K02j56l56n7J80M24m07m77n1O0J55m79n00J96
$$ y = [-373, 314, 485, 435, -183, -322, 223, 886, 596, 18, -134, 133, 624, 60, -466, -513, 157, 657, 185, -551, -427, 260, 319, -223, -764, -586, 134, 541, 83, -295, -242, 155, 298, -190, -759, -479, 149, 484, -157, -462, -352, 32, 269, -17, -407, 154, 985, 1026, 529, -133, 86, 592, 318, -325, -443, -182, 448, 276, -407, -722, -388, 163, 126, -523, -326, 68, 313, 387, -387, -412, -287, 54, 97, -226, -261, 216, 422, -9, -257, -538, 43, 369, 215, 92, 26, 346, 331, 311, -280, -191, -87, 328, 256, -128, -76, 172, 359, 31, -343, -439, 139, 162, 168, -155, -305, -13, 142, -120, -111, 31, 263, 508, 48, 61, -287, -117, 22, -128, -486, -84, -39, 288, 396, 87, 125, 421, 459, 112, -214, -215, -83, 106, 46, -282, -646, -249, 125, -291, -443, -319, -1, 244, 17, -437, -495, -191, 141, 18, -135, -90, 504, 688, 345, 37, -11, 297, 447, 544, 168, -14, 275, 477, 321, -35, -92, 88, 512, 105, -372, -423, -363, -208, -687, -1187, -991]
3076i91L65M66l9k32K1M31K36k09j81l3N80J43j77l97K47N20j50l02j0P0L23n0
3098F31l85k69j44K72k6l88k15K01M87N1m90k05O2M95%l75m00J87N54j8l07J7
3120b65J30K68P0k81j23K65L80j4n45k43L14L27J97k35l57P06or3m66o6K26L82
3142E71k14m10l93N26K78k11l41m3R1L31k73m73j57L44J91j34m55K0M26K52J1
3163f3p2PL46J81k91n2p6M16K10l19k44L06J75J73k22l61Q7J85k3j81n13j99K35
3186b95J63n7m43Q9M53j61oj03o9K77K56l45J00l0L35K7j94l0K72K26J37l19l01
3209a8J42N6L8k21l06K77kJ78k89k38L74J49l5k56j27K1L18O8j63k37J54K32J45
3232B60k91j69J41Q12o56l77j3K42J57J3k21k86O49j15o7p8k19l17P26l2l27n06
$$ y = [-991, -626, -160, -199, -431, -410, 21, 257, 48, -133, -166, 414, 557, 380, -17, 230, 750, 600, 298, 288, 358, 681, 631, 246, -23, -167, 105, 79, -309, -524, -323, 164, 215, -275, -480, -418, 77, 77, -298, -698, -511, 43, 25, -282, -265, -135, 133, 203, -78, -201, 64, 444, 430, -115, -358, -44, 283, 480, 245, -112, 594, 588, 495, 29, -37, 189, 571, 357, -53, -446, 80, 358, 147, -194, -237, -146, 185, -88, -561, -718, -374, -183, -317, -772, -752, -326, -74, -63, -135, -128, 218, 399, 108, 56, -20, 396, 606, 287, 43, 349, 524, 697, 475, 114, 201, 386, 363, 182, -331, -530, -295, -132, -189, -632, -543, -90, -251, -257, -360, -429, -152, 104, -241, -141, -171, 164, 191, -3, -33, 239, 465, 602, 283, -18, 124, 180, 218, -3, -309, -32, -34, 144, -145, -383, -9, 140, 105, -151, -278, -257, 61, 129, -34, -271, -117, 115, 260, -31, -200, -59, 753, 97, -280, -293, -51, 106, 119, -102, -388, 261, 146, 79, 1, -218, -535, 191, 159, -168, -674]
3254f74M50L13L3l76k0J57k0N62n86PL07L4P2k52k55K48L27j69k47n1R7L52k99
3277A0l18K5J08L09J12k85k93M12J01J01m10j27M74J1k41j12j72L92J94m73J88
3298Fm26O03J24l92m96M48n5J73o21J45K64J91J98l0m88J8N29K06m51j88J37J47
3320D2J03j67J4q2K61J84k32M5j34L02j08m6l05O8Q6J23k49j80M5K24J21k22k69
3343c76J07N13j67j26k24J80J51j7j95p8K9L32K81l30r0J17J79R1k88o7J02J60
3365B84j16Qk11k6L28J4k46L45n84O22ln83j13J4J84J31l4m16J28M94k01m8j29
3388a58J67Q1J13j37j47J21K27j07l59J58pjj68K37l40M13J37R3m82J2M07j93
3410F7n68L48k66K69J88j69l20J66l76J44L28K16k64M17k57O22l15j3J62j06k82
$$ y = [-674, -224, 89, 122, -254, -274, -117, -137, 425, -161, -154, 153, 187, 259, 7, -248, 0, 327, 158, -89, -140, -43, 309, 10, -308, -283, -175, 134, 246, -39, -332, 80, 181, 282, -128, -255, 219, 230, -11, -123, -295, 97, 291, -182, 6, -420, 183, 307, -85, -581, -133, -188, -15, -636, -491, -227, -36, 162, 132, -356, -338, 191, 397, -54, -242, -105, 42, 145, -22, -8, -90, 171, 355, 123, 168, 34, 336, 228, 182, -123, -55, 31, 154, -95, -275, -230, -6, 115, -107, -376, -269, 244, 77, -49, -273, -93, 58, 41, -154, -232, -203, 129, 410, 80, -10, 107, 286, 377, 89, 22, 124, 284, 168, 176, -35, -61, 267, 281, 35, 380, -204, 418, 415, -168, -281, -267, -83, 48, 14, -402, -274, 220, 19, -29, -158, 9, 90, 203, 66, -81, 40, 267, 160, -199, -41, -48, -49, -217, 20, -320, 93, 230, 323, -159, -147, 260, 67, -501, -153, -419, -150, 38, -131, -451, -285, -661, -517, -189, 27, -237, 180, -77, 545, 230, 217, 379, 273, -9]
3431il32n6O35J18r56M40O5K38P7k81jM7L4J79l46k0qK19j09J69m35N03l53K95
3455A13J08r00M86K79J01k32J96l20L80J63k51J85j39J20J29n08K5K01j21k0P
3476Bm26J92J69K29k34j30J56M35l34j52m6J21j4m7l95J73K2J45K7j60JR1J90
3499A5L5%j81K94p7QO2j37J33rN2Km11L32J38j43j84J07J07J73j99j58k4M0J73
3524A48n9k70lJ97j72Q4j22N9kN5j64L5j52K85K2K6k7R6J35K74n9k94J08j39k0
3549D1K40m54Q3K01l6q4M2K0R8l6J56j88k03J29K44k03q7j97p0J70j30J22o4L8
3573a68M9L20j61l33J88kL33l04k56J69J18j2pk4L1K15K1k76q1J76J85k21p9J76
3597E7kM1J19k35J04L02j03L8m06L9J03L9M5l99j40J96J28q4j90J26J68J20J0
$$ y = [-9, -341, -397, 238, 356, -600, -160, -95, 143, 220, -61, -62, -15, 19, 198, -148, -168, -176, 43, -66, 103, -332, 171, -182, 113, 221, -679, -193, 86, 187, -45, 151, -169, 211, 374, 123, 308, 169, 289, 418, -90, -65, 136, 15, -5, 2, -424, -232, -63, 166, -68, -198, -42, 393, 59, -93, -139, -18, -32, -79, -474, -301, -279, -134, -107, -267, -266, -175, 15, 50, 50, -131, 163, 86, 94, 156, 19, 152, 143, 195, 197, -214, 118, 256, 113, -71, 36, 143, 316, 117, -41, -65, -25, 148, 89, -181, -184, 13, -159, -75, -197, -138, -140, -85, -249, -214, -366, -81, -59, -33, -60, 36, 171, 445, 386, 92, 200, 61, 41, 281, -173, -90, 111, 75, -9, 33, 53, 151, 115, 271, 83, -120, 9, 253, 50, -37, -234, -304, -134, -264, -142, -206, -168, -119, 201, 40, -293, -105, -107, 226, -78, -334, -165, -47, -59, -66, -90, -59, 156, 177, -99, -180, -4, 181, -40, -119, 57, 55, 96, 215, -20, 84, 386, 283, 321, -85, -46, 57, 96, 141, -258, -398, -202, -74, -158, -348, -222, -54, 66, 76]
3620G6j84m8J79lk54j61J41K94P0k06K8K75m6J11j33j88J08N0K06l39M1J2J95
3643B24j15r2o0K27J74q7k7l47q1L9m0j46j84K83Q4M6qj16L25l3N7L7l61K40K57
3668B96k74j39l02K74K06J4j88J73j07J90L00m23L5Pm2J74m02J02K46mj30m7J
3691d0J27R8n7l27J85R4j20j65k03K16L7J63q2j31J66L37j71J6j27m0jm3Q2j52
3715a38k4L28k5j01n7M9L8Q8q1m2j5J13q0k32L8J1J5K23j27j03R8M2J15m2N9J3
3741A63j0j12j9l4o4r1R0Q8R3j51k8J83l0J5j60J13M5k03NJ07n3J97Jk42L6R2
3767C1O5N8p5j27Q6J6R6o2j66R0J19l27M51l87J76j3j18M4j65Q8O9q7L0K7R9J06
3793A24j70lM0K36K6m1j08m9L97k50j99k05Q3P4K82j80j59r8K29N0q3j97J8J60
$$ y = [76, -108, -156, 23, 20, -234, -395, -254, 40, 110, -96, -68, 207, 161, 272, 139, -49, 59, 109, 315, -24, 17, 29, 224, 109, 17, -43, 184, 358, 271, 244, -103, -184, -145, -185, -331, -515, -232, -148, -102, -110, -226, 99, 66, 123, 160, -201, 39, 296, 22, -117, -419, -145, 61, 75, -113, 60, -47, 143, 443, 20, 55, 62, 20, 194, -208, -106, 140, 136, 6, -41, -40, 87, 185, 128, -199, -14, 80, -40, -205, -408, -192, -155, 8, -74, -205, -39, 298, 127, 143, 16, -24, -25, -68, 14, -138, -162, 166, 141, 40, -17, 32, 70, 158, 77, 35, 20, 133, 53, -179, -141, -130, -115, 108, -19, -122, -24, 18, 133, 91, 150, 163, 153, 41, 22, -12, -76, -167, -77, 11, 104, -47, -75, 108, 78, 93, -67, 46, 91, -112, -107, 0, -53, 144, 145, -97, -61, 31, 96, 154, 79, -48, 38, 54, 150, 88, -78, 12, 131, -196, 255, -132, 44, 31, -87, -43, -208, -120, -51, -138, -108, -81, 18, 124, -46, -49, -9, 227, 253, 212, 104, 55, 452, 202, 3, -202, -119, -45, 237, 57, -102, -200, 29, 79, -4, -201, -183, -23]
3817b3J5j63j07J61N4L0R8k12m2N70k33N1m7J47J3k01K6Mj08L50j66k22k48J28
3841a25M2Q4l17J25J15r2J14k93R1M5K55k22N7J72J0M00m21j62n7K98P5j91j98
3864a95J66K43j32Jj07l4K31J38l19J37k27K24j19j18k53q5L93m4j96j6K96J16
3886A00L4j67q3K14J18K6k14K1K18n5qj98j61Q6P5O4k14J40r0J95r5j37J59J64
3910A92qk04m0j52K47j7j87J07j04M0N3J09j60J02J18j02J64j22N5J47o6l8Q1
3933B15j25Q0j06o4p3M8l2j00O9M1J75k37j04J90n1J05J68o2r7J99k12P8k33P6
3957e2j2j86R7J2o7K76k23n0K01M8K14p7K6o4l5j7l7j34k5QO3k12J64J20q5J13
3983F6k9l00L45n1J42j31q9o8J66j62P6j57K14O9j04j44M4n8K40n5j87K74pK2
$$ y = [-23, -8, -171, -278, -117, -63, -33, 65, -147, -189, 381, 148, 199, 152, 299, 312, 111, 137, 141, 33, 383, 217, -5, -253, -125, -83, 1, -316, -191, -76, -168, -54, -347, -256, -211, 44, -178, -121, 51, 61, 461, 40, -122, -179, 119, 194, 3, -195, -29, 214, 82, 83, -24, -58, 173, 311, -8, 129, -98, 126, 7, -111, -364, -449, -56, -100, -296, -312, -16, 100, 134, -33, -116, 98, 216, 242, 28, 49, 267, 212, 204, 6, -155, -69, 6, 70, -144, -4, -94, 101, 6, -131, 28, 192, 184, -20, -60, -212, 35, 18, -169, -62, -166, -126, -73, 36, -124, -22, 96, -6, 158, 36, 91, 238, 172, 134, 215, 90, 170, 64, 0, -73, -25, -57, -157, -88, -47, 128, -109, -213, -23, -74, 31, 199, 137, 40, 239, 27, 105, -128, -52, -64, -250, -153, -141, -208, 68, -155, -205, -4, 44, 258, 181, 207, 143, 108, 91, 54, -80, -105, -97, -34, -246, -82, 38, -47, 66, 37, -263, 82, 31, 173, 42, -47, -115, 51, -111, -35, -192, 22, 91, -13, -157, -113, -171, 69, 14, -173, 101, 94, 116]
4007A16Q8k4QJ96j87k29J23j29L8J68l93K3K0P5O9Lj28J91J65J3j02m2j1kk07
4032a58l3j09Q9N7o3K5j16K63J17J3n1L1J56J0j16l53K1K68Ln4ON5j1R3J45k29
4058E9J09N0j69j62j9p9K25L3N6k05q2L58k10n3%k5K40j08q2j80LJ54p1j52LK80
4084b7J43ok02K0J57J81q4k96L1K12Q5k35k86J84J59J01j7j47J66j42J41l19J52
4107b9j7mq7L5M8j09NM7J31q4N5J12j20kr7j0J80j06k30J33J15qK95k53j15K51
4133A36J44k66p8k6J4J11l10L11Q4l3n4J61k20J89q3q5k3j39L8j36J62K7j41J51
4157f6J49o1Q6p2OL5j36J25j47R0q8j4l9K05m6k5j06J63n0M9%l63L00%mj36J89
4184D4j28j3Q3j13M7R9K18J09m10j16L6K07j15j44Q8K37Mk6m2K6N8K1j28j52N0
$$ y = [116, 204, 180, 188, 384, 197, -32, 91, -38, 0, 168, -225, -202, -182, -107, -38, -35, -163, 28, 193, 206, 104, 62, 51, 49, -158, -191, -300, -211, -154, -217, -192, -308, -45, 72, 85, 34, 65, 221, 231, 115, -238, -217, 51, 54, 0, 6, 61, 50, 143, 288, 59, 168, 218, 49, -113, -132, -211, 14, 47, 103, -102, -184, 174, -36, -89, -89, -114, 126, 18, -64, -244, -241, -87, -158, -310, -307, -27, 116, 110, -92, -72, 85, 266, 182, -114, -83, 129, 214, -21, -307, -123, 36, 137, 120, -27, 139, -3, 138, -181, -29, -46, -50, -137, -102, -54, -163, -158, -111, 20, -64, -9, 103, -17, -19, -116, -126, 54, -52, -282, -149, -34, -42, 253, 0, -115, 136, 280, 14, -64, -90, -76, 35, -275, 36, 120, 87, 33, 194, -26, 163, 80, -5, -28, -167, -129, -265, -103, -76, -217, -66, 83, 22, 108, 36, 42, 77, -59, 66, -81, 9, -79, -93, -132, 73, 27, 2, -104, 59, 9, 58, 58, -305, -5, -5, -9, -145, 44, -84, -97, -14, -127, -80, 19, 237, 346, -64, -180, -144, 63, -52, -196, -108, 129, 133, 107, 65, 91, 149, 170, 42, -110, -60]
4209f0JP5j27j90L61qj36J88q2N8NR5k00k80J08N5J09qj75J85J94n9O5j90J30
4234A14J70j81j11j35JP6L2l32K89J44J68J6j14k50J53J91j67k88J03M2N0j79
4256b08K1N2K73j3k21O8J63K1R0k31Mq2K2J73l39j28J43K47J12j76n7J18J34j64
4280B2j72L68j13l8q9j44O6R4n1j22n1K06n4J87J94k78K9K41k00o1M2JK46k89
4304C4k22J06m6J66j95r2J16R7J16l4k10K56K10k25J8j80j0L66j28k02j16k1K01
4327Ej84J45M6J11R4q7j4j69M9Ok24K18J00m3KJ6q4No7j2J74j43J07J16L7k76
4353g2J4L1Q2J6j36R1O6J14l8j86lJ7j39Q2m3O5O0P2j01J21k91L23P3k59pm5L07
4380B14J3l38l8K3M3l9PJ62Q0j07Q2K0j13J29j86R1n8n3K08J8j35j38p8K14n5
$$ y = [-60, -59, 16, -111, -301, 60, 52, -84, 104, 22, 80, 85, 180, -20, -300, -192, -137, -28, -36, -211, -26, 168, 109, 174, -16, 114, 284, 103, -8, -143, -142, -66, -34, -366, -77, 67, 235, 251, 137, -113, 40, 231, 64, -224, -121, -79, -29, -208, -187, -135, 138, 125, -96, -28, 135, 156, 246, 15, 19, -63, -41, 132, -207, -335, -192, 55, 167, -9, -66, 52, 186, 22, -150, 218, 105, 67, -22, -166, -100, -6, -57, -179, -230, -24, -78, 109, 303, 25, 54, 295, 95, 34, 76, 77, 323, 34, -188, -82, -128, 38, -157, -249, -133, -36, 80, 46, -164, 92, 302, 77, 95, -85, -95, 271, 143, -59, -175, -196, 5, -179, -34, 12, 123, 217, 130, 116, -53, -4, 2, -222, -4, 96, 53, 55, 71, -13, -8, -75, -87, 87, -56, 51, 167, 204, -72, -58, -27, 55, 71, -65, 26, 92, 206, 168, -18, -21, -4, -143, -61, -104, -39, 21, 93, -8, 113, -178, 145, 218, -41, -48, -93, 214, 227, -111, -149, -126, -83, -122, -115, 47, 127, 20, 102, 122, 9, 138, -48, 43, -15, -68, 140, 158, 23, -115, -193, 21, -34]
4405c4O5JO4p8j37k5k48K74O3k2K69j16m4K12M9j82K8l21L84k16p4J62o1K6j26
4430h7l4M0J24J65K90l81J00p8j07j46j54k40J99R7p4m9K07K48j24J60k01j01
4452a46K50j1J0j45N3K04l73K2m0K05L13j07j32j9m7J31Ml01j99J57L63o9l22
4475a99J29P5l8j21n8j03J61K60j85j50J30M8J23j54qK94Jp6K6mo5p3kk29M8K54
4501H4O4k56R5P7j08J66K0r8o2q9N0j76q4M8J26O6J40j76L09J8R2j80k08J55l0
4526D3J29l46n3J83K5nn4OK03k4q1jJ18r5o6j50j11l6J80M4J36R8P6O9p5o7j47
4553aK1p3m6k9N6o9J75p3J18j74K07l3j73J23r3o2L03k97j56k5K86m7J65j06j1
4578a4L19l94J44k22RJ17j41KP3q5K22L63k72p3j27K04j50K5P0R9l15R9m80K91
$$ y = [-34, 31, 32, 96, 18, -119, -144, -392, -118, -55, -77, 192, 76, 32, 244, 293, 111, 139, -182, 202, -14, -88, 74, 13, 39, -87, -121, -81, 43, 208, 498, 117, 217, 139, 32, -114, -268, -508, -309, -212, -286, -335, -128, 120, -4, 156, -45, -146, 104, 93, 103, -42, 11, 215, -158, -136, -176, 29, 342, 235, 103, 84, 37, 168, 172, -129, -328, -171, 192, 123, -199, -70, 5, -33, -154, -212, -315, -154, 106, -79, -229, -99, -51, 72, -82, -90, 204, 205, 129, 155, 151, 86, 13, 11, -218, -170, 84, 148, -108, -13, 64, -44, 122, 142, 44, -18, -107, -57, -233, -317, -269, -143, -77, 63, -113, 196, 214, 306, 126, -82, 73, 43, 172, -174, -227, -44, -19, -24, -78, -72, 131, 107, 26, 25, 143, 48, -18, -168, -279, -315, -135, -91, 45, 143, 219, 288, 213, 146, -1, 20, -53, -99, -128, -72, -141, 34, -39, 79, -95, 112, 79, -94, 29, -64, -126, 177, -120, -276, -301, -15, -62, 103, -3, -14, 305, -89, 55, -167, -158, -41, -182, -180, -107, -192, 30, 393, 121, 48, -79, 125, -25, 0, 70, 169, -146, -47, -527, -236]
4602b36L47q4N3J78r7j77K83p00J23P44m35J23q45O95l21P42l09l66K53k4l32
4623c85L99MkL9K59k99O5l99K92M22m09J65k63L8J73k54J49j30O8K47J27p49O36
4646A93K66p29j05m6M79q6m6K18r1N6J54j80Kj2J52p0J2l50k0m0K10o0m6J39J21
4671A21Q6k2k18J2M1J9j21j36K39j87L05l38J53j63N22k13k37j27K28K09M9p1
4693A51j81J35j35j12nQ9k7L77l19jk2j23K75J36k90j4lL15k19k5j05J19p0j54
4717b08J06j8K78j53P8r6l6K12Kj91o2J22M1j50j2j79K96J34k4j41p8K02pK0j86
4742e0M9K2R2p2j03M8J56r9J7m3n9J16J21o1l63K83M3o4l04P9J21L57k91pk1M03
4768C70m65M52n06k36N27l78n9p8r9J114k04o01P54m65J12k09L48l01l94M12n26
$$ y = [-236, 111, 27, 80, 258, 161, -16, 267, -433, -310, 434, -1, 122, -723, -28, -349, 393, 84, -282, -29, -53, -385, 14, 18, 16, 55, 314, 15, 80, -319, -27, 395, -14, 151, -112, -74, 99, -155, -6, -136, -68, 179, 306, -443, 193, 459, -270, -375, -421, 58, -28, -74, 144, 53, 109, 263, 83, 85, 73, 225, 155, 167, -183, -203, -243, -33, -93, -139, 0, 121, 207, 185, -33, -21, 20, 39, -82, -218, 21, -166, 139, -199, -46, -209, 313, 100, -137, -264, -36, 173, 222, 151, -30, 105, -30, -142, -147, -58, -85, 292, -27, -28, -50, -173, 102, 238, -52, -66, -69, 246, 27, 2, -103, 16, -54, -208, -102, -120, 158, 5, 83, -13, -49, 163, 165, -26, -88, 34, 75, -75, -87, -266, 30, 164, 140, -1, -79, 123, 116, 136, -50, -1, 21, 113, 41, -62, -14, 142, 43, 60, 17, -42, 74, 195, 134, -229, 54, 97, 33, -271, -192, -71, 286, -5, -12, -33, 370, -95, 357, -149, -385, 142, -236, -295, -373, -472, 642, 438, -163, 591, 126, 238, 29, 377, 76, -318, 94, -432]
4789d32J28n1O24j66L2K11k86n50M03q2k88k63N36K98k99k48L81L57J15p78M69
4810A11j21L8k5K8l07M5J40q0m5N15r49Q63l23M18j89K3K23n54K94m45m3N17l6
4833I8LJ30j92L63M1m83J4J52O1k19n13K53L91L0Q5l40L21p3l09N6K0J64j0L29
4857C72l35m18Q51j027M77K11k08MM02m77l54M4q8P06m16N20p00M97N6l71l8L43
4879E1nnK9J47o42N72l14j16K64j14J32N9m46L81K8M74k27k97m6r7N0J74k13j90
4903c51K62K34J61r92K30M72N25n79K25l46J54J14o02M63P6j7K53k14m1j34J51
4924D4j12j87L71J55J7q6l00j1l13O00ql50J30J6J08J0k72K21n5J57Pj55J6j28
4948a25K95J6j5K04m90K04K89q92K23K84j23k94M72L66j30l72L40l42O05n77k85
$$ y = [-432, -304, -355, 269, 103, 135, 346, 60, -490, -87, -169, -457, -720, -184, 114, -185, -433, -52, 305, 420, -358, 111, -10, 28, 3, 31, -276, -231, -91, -171, -216, 299, -650, 213, -110, 308, 119, 142, 365, -189, 105, -340, -383, 134, 98, 101, 231, 39, 402, 443, -40, -26, 126, 187, -32, -545, -292, 99, 129, 214, -126, 195, 122, -187, -131, -111, 53, 43, 372, 37, -381, 470, -557, -80, 131, -77, -73, 329, -148, -502, -458, -546, 160, -256, 264, -436, 61, 117, -254, -292, 51, 46, 41, 70, 217, -425, 147, -167, -283, -19, -133, -1, 58, -388, -7, 21, 495, 268, -29, -75, -172, -122, 52, -161, -351, -89, 145, 306, -686, -456, 16, 541, -38, 187, -159, -5, 109, -493, -30, 46, 29, 282, 68, 27, -107, 44, -68, -255, 116, 271, 288, 202, -98, -109, -422, 178, 170, -180, -50, -34, 74, 84, -188, 33, -22, 135, 142, -13, 3, -125, 170, 186, 171, 375, -115, 89, 378, -514, -291, -7, -130, -424, 48, 414, 284, -88, 252, -90, 515, -62, -347]
4969c47J96n3m1j05L96j38L93j97j24M9Q8k96K42Ol62j31K53k80O97m00j77N06
4991A75M27p18N19n43M43P1k71n96KL61O74l55K81k67J96m00q1M99k56k79P9J11
5013G2j24K7K19q7j76K81%j55R6k35l3L01J63l83J5m0N37p9j58m10m55N68P1L55
5037C70k05o4K07m98K47k70j59M99J95m65J00j42N7J00P3k83M28P8k59j75P3M9
5059d4J62p5j5j84K94R2r3q6j62Q9J18R2o3j19k46K93k10r6P5M13j67m7M4O0j49
5084b4K17q5k10L7J12L2k00M1J81k8j88MkL99K4j75r9k6O7L1r4m63L89R6o3j24
5110a51R6R9Q7q8m6o0P2J23n8j29J6L1K53k09k13K79l0j12J35l55M3K11j1q9P
5135i9o1K48O9k21J9N8N6L0k21j92L1K09K61k52j03L21m1L6M8k79K75O6k22k08
$$ y = [-347, -151, -204, -245, -350, 46, -92, 301, 104, -20, 29, 117, -179, 63, 69, -293, -424, -171, -451, 246, -154, -331, 175, 602, -116, 403, -140, 303, 374, 103, -493, -491, -130, 544, 189, 470, 203, 399, -1, -82, 417, 161, -118, -39, 72, -52, -25, 194, 107, -69, 212, 212, 57, 153, -82, -115, 186, 349, -34, -19, -59, 478, 399, 241, -169, -624, -56, 15, 370, 165, 101, 308, -190, 57, -213, -372, 127, 322, -143, -43, -185, -128, -28, 45, -238, 190, 268, 9, -166, -93, -44, 118, 43, 28, -156, 138, 230, 137, 51, -111, -22, 96, 188, 125, 6, -240, 53, -157, -253, -178, 235, 68, 21, 65, 125, -24, 193, 108, -102, -65, 47, 79, -121, -80, 101, 73, -115, -111, -113, 286, 310, 135, 36, 10, 77, 108, 14, -449, -60, 36, -27, -151, -55, 44, 131, 43, -3, -63, 9, 132, 74, -55, -39, -8, 245, 36, -177, 102, 72, -40, 95, -260, -217, -6, -17, -106, -99, -160, 88, 157, -64, -45, 13, 69, 99, -122, -314, -283, -74, 187, -65, -168, 153, 112, 148, 196, -83, 192, 258, 36, -172]
5159a72J18j3m9j45J44R2n3M61l55o0KJ68j35j69j37pL20MJ8k76K23K98r4Pk13
5184b3J9K25j02l76Q7O0J49J13k40LJ99m7J14j62m2N2Kj02j84J68J49k0j9q1J64
$$ y = [-172, -54, -67, -116, -261, -117, -25, -78, 383, 28, -32, -30, 138, 3, -166, -303, -310, 10, 14, 32, -244, -21, 277, 183, 190, -23, -4, 221, 119, -257, -170, -110, 39, 152, -88, -85, 114, 67, 181, 19, -23, 29, 31, -71, -255, -87, 62, 42, 23, -58, 106]
$$ [...]
8191A86
##END NTUPLES=NMR FID
##END=
