##TITLE=1H_106-2023
 CDCl3
 8 sc, 
 1.11.2023
##JCAMPDX= 6.0         $$ Bruker NMR JCAMP-DX V2.0
##DATA TYPE= NMR FID
##DATA CLASS= NTUPLES
##ORIGIN= UXNMR, Bruker Analytische Messtechnik GmbH
##OWNER= root
$$ XWIN-NMR		Version 3.5
$$ Wed Nov  1 13:52:05 2023 Russian Standard Time (UT+4h)  she@DPX200
##.OBSERVE FREQUENCY= 200.13135
##.OBSERVE NUCLEUS= ^1H
##.DELAY= (6, 6)
##.ACQUISITION MODE= SIMULTANEOUS
##.ACQUISITION SCHEME= undefined
##.AVERAGES= 8
##.DIGITISER RES= 18
##SPECTROMETER/DATA SYSTEM= spect
##.PULSE SEQUENCE= zg30
##.SOLVENT NAME= DMSO
##.SHIFT REFERENCE= (INTERNAL, DMSO, 0, 15.7039)
##AUDIT TRAIL= $$ (NUMBER, WHEN, WHO, WHERE, WHAT)
$$ ##TITLE= Audit trail, XWIN-NMR		Version 3.5
$$ ##JCAMPDX= 5.01
$$ ##ORIGIN= Bruker BioSpin GmbH
$$ ##OWNER= she
$$ F:/spectra/data/she/nmr/H-F/1/audita.txt
$$ ##AUDIT TRAIL=  $$ (NUMBER, WHEN, WHO, WHERE, WHAT)
(   1,<2023-11-01 13:50:49.37 +0400>,<she>,<DPX200>,
      <created by zg, POWCHK disabled, PULCHK disabled
       configuration hash MD5:
       00 E9 B6 7A A2 85 ED C7 34 08 36 98 17 FE 4E 26
       data hash MD5: 16K
       E8 12 D3 AD C8 58 61 8C DE C9 A2 8B BB 70 87 71>)
$$ ##END=
$$ 
$$ hash MD5
$$ 1D 0D F5 87 1A 8C E6 88 F4 A8 4C 2E 1F AA 17 82
##$RELAX= 
##$RELAX= 
##$RELAX= 
##$RELAX= 
##$RELAX= 
##$RELAX= 
$$ Bruker specific parameters
$$ --------------------------
##$DU= <F:/spectra>
##$EXPNO= 1
##$NAME= <H-F>
##$PROCNO= 1
##$TYPE= <nmr>
##$USER= <she>
##$AMP= (0..31)
100 100 100 100 100 100 100 100 100 100 100 100 100 100 100 100 100 100 
100 100 100 100 100 100 100 100 100 100 100 100 100 100 
##$AQSEQ= 0
##$AQ_mod= 1
##$AUNM= <au_zg>
##$AUTOPOS= <>
##$BF1= 200.13
##$BF2= 200.13
##$BF3= 200.13
##$BF4= 200.13
##$BF5= 200.13
##$BF6= 200.13
##$BF7= 200.13
##$BF8= 200.13
##$BYTORDA= 1
##$CFDGTYP= 0
##$CFRGTYP= 5
##$CHEMSTR= <none>
##$CNST= (0..31)
1 1 145 1 1 1 1 1 1 1 1 1 1 1 1 1 1 1 1 1 1 1 1 1 1 1 1 1 1 1 1 1 
##$CPDPRG= <>
##$CPDPRG1= <>
##$CPDPRG2= <>
##$CPDPRG3= <>
##$CPDPRG4= <mlev>
##$CPDPRG5= <mlev>
##$CPDPRG6= <mlev>
##$CPDPRG7= <mlev>
##$CPDPRG8= <mlev>
##$CPDPRGB= <>
##$CPDPRGT= <>
##$D= (0..31)
0 1.2 0 0 0 0 0 0 0 0.06 0 0.03 0 0 0 0 0.0002 0 0 0 0 0 0 0 0 0 0 0 0 
0 0 0 
##$DATE= 1698832248
##$DBL= (0..7)
120 120 120 120 120 120 120 120 
##$DBP= (0..7)
150 150 150 150 150 150 150 150 
##$DBP07= 0
##$DBPNAM0= <>
##$DBPNAM1= <>
##$DBPNAM2= <>
##$DBPNAM3= <>
##$DBPNAM4= <>
##$DBPNAM5= <>
##$DBPNAM6= <>
##$DBPNAM7= <>
##$DBPOAL= (0..7)
0.5 0.5 0.5 0.5 0.5 0.5 0.5 0.5 
##$DBPOFFS= (0..7)
0 0 0 0 0 0 0 0 
##$DE= 6
##$DECBNUC= <off>
##$DECIM= 32
##$DECNUC= <off>
##$DECSTAT= 4
##$DIGMOD= 1
##$DIGTYP= 9
##$DL= (0..7)
0 120 120 120 120 120 120 120 
##$DP= (0..7)
150 150 150 150 150 150 150 150 
##$DP07= 0
##$DPNAME0= <>
##$DPNAME1= <>
##$DPNAME2= <>
##$DPNAME3= <>
##$DPNAME4= <>
##$DPNAME5= <>
##$DPNAME6= <>
##$DPNAME7= <>
##$DPOAL= (0..7)
0.5 0.5 0.5 0.5 0.5 0.5 0.5 0.5 
##$DPOFFS= (0..7)
0 0 0 0 0 0 0 0 
##$DQDMODE= 0
##$DR= 18
##$DS= 0
##$DSLIST= <SSSSSSSSSSSSSSS>
$$ [...]
##$SUBNAM2= <"">
##$SUBNAM3= <"">
##$SUBNAM4= <"">
##$SUBNAM5= <"">
##$SUBNAM6= <"">
##$SUBNAM7= <"">
##$SUBNAM8= <"">
##$SUBNAM9= <"">
##$SW= 18.05172834244
##$SWIBOX= (0..15)
0 0 2 0 0 0 0 0 0 0 0 0 0 0 0 0 
##$SW_h= 3612.71676300578
##$TD= 16384
##$TD0= 1
##$TE= 0
##$TE2= 300
##$TE3= 300
##$TEG= 300
##$TL= (0..7)
0 120 120 120 120 120 120 120 
##$TP= (0..7)
150 150 150 150 150 150 150 150 
##$TP07= 0
##$TPNAME0= <>
##$TPNAME1= <>
##$TPNAME2= <>
##$TPNAME3= <>
##$TPNAME4= <>
##$TPNAME5= <>
##$TPNAME6= <>
##$TPNAME7= <>
##$TPOAL= (0..7)
0.5 0.5 0.5 0.5 0.5 0.5 0.5 0.5 
##$TPOFFS= (0..7)
0 0 0 0 0 0 0 0 
##$TUNHIN= 0
##$TUNHOUT= 0
##$TUNXOUT= 0
##$USERA1= <user>
##$USERA2= <user>
##$USERA3= <user>
##$USERA4= <user>
##$USERA5= <user>
##$V9= 5
##$VALIST= <valist>
##$VCLIST= <CCCCCCCCCCCCCCC>
##$VD= 0
##$VDLIST= <DDDDDDDDDDDDDDD>
##$VPLIST= <PPPPPPPPPPPPPPP>
##$VTLIST= <TTTTTTTTTTTTTTT>
##$WBST= 1024
##$WBSW= 4
##$XGAIN= (0..3)
0 0 0 0 
##$XL= 0
##$YL= 0
##$YMAX_a= 159542
##$YMIN_a= -136291
##$ZGOPTNS= <>
##$ZL1= 120
##$ZL2= 120
##$ZL3= 120
##$ZL4= 120
##$ABSF1= 10
##$ABSF2= 0
##$ABSG= 5
##$ABSL= 3
##$ALPHA= 0
##$AQORDER= 0
##$ASSFAC= 0
##$ASSFACI= 0
##$ASSFACX= 0
##$ASSWID= 0
##$AUNMP= <proc_1d>
##$AZFE= 0.1
##$AZFW= 0.1
##$BCFW= 1
##$BC_mod= 2
##$BYTORDP= 1
##$COROFFS= 0
##$CY= 11.3945322036743
##$DATMOD= 1
##$DC= 2
##$DFILT= <>
##$DTYPP= 0
##$F1P= 15.7292609196834
##$F2P= 12.9074282941183
##$FCOR= 0.5
##$FTSIZE= 0
##$FT_mod= 4
##$GAMMA= 1
##$GB= 0.15
##$INTBC= 1
##$INTSCL= 1
##$ISEN= 128
##$LB= 0.24
##$LEV0= 0
##$LPBIN= 0
##$MAXI= 10000
##$MC2= 0
##$MEAN= 0
##$ME_mod= 0
##$MI= 1.114404
##$NCOEF= 0
##$NC_proc= 0
##$NLEV= 6
##$NOISF1= 3.799351
##$NOISF2= 2.8
##$NSP= 1
##$NTH_PI= 0
##$NZP= 0
##$OFFSET= 15.70392
##$PC= 1
##$PHC0= -23871.09
##$PHC1= 8.452708
##$PH_mod= 1
##$PKNL= yes
##$PPARMOD= 0
##$PSCAL= 0
##$PSIGN= 0
##$REVERSE= no
##$SF= 200.130013532006
##$SI= 16384
##$SIGF1= 3
##$SIGF2= 2
##$SINO= 400
##$SIOLD= 16384
##$SREGLST= <1H.CDCl3>
##$SSB= 0
##$STSI= 0
##$STSR= 0
##$SW_p= 3612.71676300578
##$SYMM= 0
##$S_DEV= 0
##$TDeff= 0
##$TDoff= 0
##$TI= <>
##$TILT= no
##$TM1= 0
##$TM2= 0
##$TOPLEV= 0
##$USERP1= <user>
##$USERP2= <user>
##$USERP3= <user>
##$USERP4= <user>
##$USERP5= <user>
##$WDW= 1
##$XDIM= 8192
##$YMAX_p= 0
##$YMIN_p= 0
$$ End of Bruker specific parameters
$$ ---------------------------------
##NTUPLES= NMR FID
##VAR_NAME=  TIME,          FID/REAL,        FID/IMAG
##SYMBOL=    X,             R,               I
##VAR_TYPE=  INDEPENDENT,   DEPENDENT,       DEPENDENT
##VAR_FORM=  AFFN,          ASDF,            ASDF
##VAR_DIM=   8192,          8192,            8192
##UNITS=     SECONDS,       ARBITRARY UNITS, ARBITRARY UNITS
##FACTOR=    0.0002768,     1,               1
##FIRST=     0,             0,               0
##LAST=      2.2672688,     0,               0
##MIN=       0,             -136291,         0
##MAX=       2.2672688,     159542,          0
$$ Real data points
##PAGE= N=1
##DATA TABLE= (X++(R..R)), XYDATA
$$ plain form
0 0 0 0 0 0 0 0 0 0 0 0 0 0 0 0 0 0 0 0 8 -8 8 -8 8 -8 15 -16 16 -17 24 -24 30 -32 38 -41 48 -54 57 -65 73 -81
40 -81 89 -102 111 -124 135 -151 167 -183 200 -222 244 -269 297 -327 362 -403 448 -502 562 -638
60 -638 729 -845 993 -1190 1470 -1901 2625 -4075 8068 -40685 -136291 -31034 72784 159542
74 159542 123349 2267 -11785 13520 71181 130059 40602 -45686 -79077 -65208 39946 40817
86 40817 -39054 -53168 -67250 -13131 46341 22081 21685 -13291 -39943 23502 37747 38767 18911
99 18911 -47594 -13259 30022 27260 46988 2132 -25466 3154 6843 49650 38359 -39963 -46972
112 -46972 -45749 -9242 34366 -26815 -57226 -51100 -44278 28564 44585 16575 8482 -25493 15595
125 15595 71221 48994 37615 -10325 -39886 3940 -2224 -738 -379 -53851 -48892 -34810 -19797
$$ packed form
0@%%%%%%%%%%%%%%%%%%Qj6J6j6J6j6K3l1L2l3M1m8N4o2P0p9Q9j02J11j22J38j54
40h1J70j91K13k35K59k86L18l50L83m22M66n13N66o24O89p65Q51r50J064j200
60f38J367j574J838k183K660l371M526o700J2143m8753r5606J05257J03818Q6758
74A59542l6193j21082j4052K5305N7661N8878q9457q6288l3391J3869J05154Q71
86D0817p9871j4114j4082N4119N9472k4260l96l4976k6652O3445J4245J020j9856
99A8911o6505L4335M3281k762J9728m4856k7598K8620L689M2807j1291p8322p009
112d6972J223L6507M3608o1181l0411O126O822P2842J6021k8010q093l3975M1088
125A5595N5626k2227j1379m7940k9561M3826o164J486L59n3472M959J4082J5013
$$ plain form
138 -19797 27686 2663 -16811 -3846 -14487 29837 47892 17035 17807 -15804 -16012 30416 17290
151 17290 7788 -17456 -46163 -497 10965 976 360 -41001 -23785 12485 2833 11841 -20275
164 -20275 -42316 1640 11356 20390 8202 -35899 -7124 19157 25103 41762 -1035 -14417 12554
177 12554 11194 37949 26139 -15920 -7359 -13472 2225 25753 -7910 -8565 -12589 -26054 10383
190 10383 8828 1680 10553 -21484 -9728 11806 4146 21339 -1172 -19877 2093 -5214 12767
203 12767 18754 -16978 -7099 -5728 -2356 23957 -2936 -13891 -2873 -10390 16535 10970 -15045
216 -15045 -3462 -13726 895 22868 -6471 -7582 -10944 -15868 18494 8955 -6016 -4506 -24764
229 -24764 -836 15795 1223 9630 -13466 -19895 10935 6543 17337 12771 -18968 -3445 2054
$$ packed form
138a9797M7483k5023j9474J2965j0641M4324J8055l0857P72l3611k08M6428j3126
151A7290r502k5244k8707M5666J1462r989o16m1361J7216L6270r652R008l2116
164b0275k2041M3956R716R034j2188m4101K8775K6281N946J6659m2797j3382K6971
177A2554j360K6755j1810m2059Q561o113J5697K3528l3663o55m024j3465L6437
190A0383j555p148Q873l2037J1756K1534p660J7193k2511j8705K1970p307J7981
203A2767N987l5732R879J371L372K6313k6893j0955J1018p517K6925n565k6015
216a5045J1583j0264J4621K1973k9339j111l362m924L4362r539j4971J510k0258
229b4764K3928J6631j4572Q407k3096o429L0830m392J0794m566l1739J5523N499
$$ plain form
242 2054 8215 27046 -3525 -12600 -5919 -11888 19329 14506 -11344 -5823 -19417 -1578 21678
255 21678 -1554 -2247 -12419 -17616 14331 6315 -1636 -447 -21477 1231 13790 -801 8252
268 8252 -9227 -8251 16964 4611 9086 4812 -13035 9126 6301 1273 10611 -12641 -6332 4890
282 4890 -8117 6994 -1823 -12506 4307 -8271 -1217 9118 -7738 4864 -667 -11192 8208
295 8208 -2348 437 8756 -12855 -1835 1492 -4640 14244 -593 -6324 5363 -6829 10222
308 10222 13389 -4497 6568 -4231 -4365 14375 -1587 1501 736 -15276 3405 196 -4610 6084
322 6084 -13143 -7603 2802 -7808 7884 12 -11074 5102 -3861 4104 12550 -6470 3849
335 3849 2874 -2298 15287 729 -2640 5285 -7938 6741 7167 -7608 3355 -7110 -5270 9586
$$ packed form
242B054O161J8831l0571r075O681n969L1217m823k5850N521j3594J7839K3256
255B1678k3232o93j0172n197L1947q016p951J189k1030K2708J2559j4591R053
268H252j7479R76K5215j2353M475m274j7847K2161k825n028R338k3252O309J1222
282D890j3007J5111q817j0683J6813j2578P054J0335j6856J2602n531j0525J9400
295H208j0556K785Q319k1611J1020L327o132J8884j4837n731J1687j2192J7051
308A0222L167j7886J1065j0799j34J8740j5962L088p65j6012J8681l209m806J0694
322F084j9227N540J0405j0610J5692p872j1086J6176q963P965Q446j9020J0319
335C849r75n172J7585j4558l369P925j3223J4679M26j4775J0963j0465J840J4856
$$ plain form
349 9586 -6563 -1326 -1220 -12725 5389 -1145 -6345 3851 -11460 -2210 5195 -7125 6003 -490
363 -490 -5084 10813 -1333 3586 9275 -4805 7990 3625 -5039 7572 -5469 -2641 5371 -10156
377 -10156 364 -1248 -8429 8591 -1247 -1848 7091 -6322 5992 7798 -4397 6377 -5136
390 -5136 -6820 6339 -6902 -1094 -1326 -13767 2299 53 -1521 9108 -5905 477 9001 215
404 215 12387 3380 -6322 5966 -3340 2574 7237 -10357 -2120 -3874 -6331 9018 -3474 -5134
418 -5134 977 -9839 4518 4791 -7276 1652 -9042 -6463 7484 -4070 2303 1037 -7696 9846
432 9846 6843 6615 14681 -1686 5040 10891 1059 11143 -211 -9692 690 -9466 -2786 264
446 264 -14351 -5067 -7339 -8133 8203 -2656 -1405 4207 -6392 7378 8001 -748 7143 -5275
$$ packed form
349I586j6149N237J06j1505J8114o534n200J0196j5311R250P405j2320J3128o493
363d90m594J5897j2146M919N689j4080J2795m365q664J2611j3041K828Q012j5527
377a0156J0520j612p181J7020r838o01Q939j3413J2314J806j2195J0774j1513
390e136j684J3159j3241N808k32j2441J6066k246j574J0629j5013O382Q524q786
404B15J2172r007r702J2288r306N914M663j7594Q237j754k457J5349j2492j660
418e134O111j0816J4357K73j2067Q928j0694K579J3947j1554O373j266q733J7542
432I846l003k28Q066j6367O726N851r832J0084j1354r481J0382j0156O680L050
446B64j4615R284k272p94J6336j0859J251N612j0599J3770O23q749P891j2418
$$ plain form
460 -5275 -3622 6504 -3337 4147 -546 -11462 2474 -1940 346 8600 -7481 -2725 1202 -3260
474 -3260 10901 2546 -5137 1918 -6793 4864 10551 -3529 2007 -5600 -6708 10273 798 -366
488 -366 -2140 -14911 165 3282 -1090 4762 -11522 -8510 5553 954 10479 2654 -10631 2284
502 2284 1626 7738 13056 -6623 -4652 -2313 -2649 13415 938 -9058 -4163 -11176 3710 9135 -5627
517 -5627 -3330 -10810 -6862 10643 2482 2154 -1179 -10739 8047 11455 6964 11066 -4895 -1072 11200
532 11200 5623 11644 876 -10681 679 -2560 3306 6664 -11563 -6833 -4195 -3991 11441 1139
546 1139 -6114 -1761 -8334 5757 8802 -3928 -1718 -12548 -9125 7105 -1321 -100 -4329 -15293
560 -15293 1853 6125 5393 9430 -6954 -3256 6373 3816 13345 1504 -10611 -1262 -5620 2325
$$ packed form
460e275J653J0126r841P484m693j0916J3936m414K286Q254j6081M756L927m462
474c260J4161q355p683P055q711J1657N687j4080N536p607j108J6981r475j164
488c66j774j2771J5076L117m372N852j6284L012J4063m599R525p825j3285J2915
502B284o58O112N318j9679J971K339l36J6064j2477r996M895p013J4886N425j4762
517e627K297p480L948J7505q161l28l333r560J8786L408m491M102j5961L823J2272
532A1200n577O021j0768j1557J1360l239N866L358j8227M730K638K04J5432j0302
546A139p253M353o573J4091L045j2730K210j0830L423J6230q426J221m229j0964
560a5293J7146M272p32M037j6384L698R629k557R529j1841j2115R349m358P945
$$ plain form
574 2325 7731 -8864 -5952 -6344 -5523 9848 1914 -1500 -252 -9174 4727 8613 -146 4263 -7774
589 -7774 -7235 7012 1916 5784 623 -10546 2497 4601 7601 11374 -6831 -5134 2413 629
603 629 11997 411 -12789 -5716 -7155 4965 9194 -7377 -5972 -7768 -2242 15860 5676 -526
617 -526 -1481 -9381 6834 11663 1981 2229 -10896 -7639 6301 1869 6757 -829 -11534 1633 2825
632 2825 7081 12769 -4018 -3423 638 -657 11467 2338 -7724 -4846 -11045 874 5978 -7125
646 -7125 -4927 -10230 -8018 8668 2370 -637 -2239 -10184 5131 8570 3010 3791 -9545 -4853 8241
661 8241 2841 6737 -1500 -11110 2425 3673 6310 7930 -7959 -4804 -853 -544 10432 -647
675 -647 -8436 -3691 -9535 2509 8238 -2974 -553 -7706 -5789 9635 5591 6615 1769 -10173
$$ packed form
574B325N406j6595K912l92Q21J5371p934l414J248q922J3901L886q759M409j2037
589g774N39J4247n096L868n161j1169J3043K104L000L773j8205J697P547j784
603F29J1368j1586j3200P073j439J2120M229j6571J405j796N526J8102j0184o202
617e26r55p900J6215M829r682K48j3125L257J3940m432M888p586j0705J3167J192
632B825M256N688j6787N95M061j295J2124r129j0062K878o199J1919N104j3103
646g125K198n303K212J6686o298l007j602p945J5315L439n560P81j3336M692J3094
661H241n400L896q237r610J3535J248K637J620j5889L155L951L09J0976j1079
675f47p789M745n844J2044N729j1212K421p153J917J5424m044J024m846j1942
$$ plain form
689 -10173 2477 6386 5612 8759 -7442 -8072 1975 776 8474 1087 -10004 -1657 -1867 5136 8521
704 8521 -6726 -3744 -1685 -2140 9145 -879 -7380 -2138 -6014 3832 4806 -5647 -904 -5033 -1317
719 -1317 9848 558 1500 737 -6372 5681 5604 2182 5610 -6070 -3529 3125 -52 8213 815
734 815 -8387 -1207 -4261 3618 9121 -4898 -4272 -5970 -5089 8918 2482 -2621 -3040 -9825 2952
749 2952 7409 3 3259 -5638 -4037 7956 2569 4797 1432 -6597 3715 2735 1612 5208 -6146
764 -6146 -1902 2516 -2695 4790 -1587 -6950 924 -3556 1162 4143 -6380 -2105 -3821 -2960 7682
779 7682 -180 -3098 -1797 -8080 4663 7831 -93 1180 -7798 -3485 8833 4777 5228 -2666 -10628
794 -10628 2882 4824 5072 5085 -10048 -5702 2337 934 7297 -2759 -9105 -672 -2536 4339 4299
$$ packed form
689a0173J2650L909p74L147j6201o30J0047j199P698p387j1091Q347k10P003L385
704H521j5247K982K059m55J1285j0024o501N242l876R846R74j0453M743m129L716
719a317J1165r290R42p63p109J2053p7l422L428j1680K541O654l177Q265p398
734H15r202P180l054P879N503j4019O26j698Q81J4007o436n103m19o785J2777
749B952M457p406L256q897J601J1993n387K228l365q029J0312r80j123L596j1354
764f146M244M418n211P485o377n363P874m480M718K981j0523M275j716Q61J0642
779G682p862k918J301o283J2743L168p924J273q978M313J2318m056M51p894p962
794a0628J3510J942K48J3j5133M346Q039j403O363j0056o346Q433j864O875m0
$$ plain form
809 4299 -6949 -1133 -1613 -1032 7393 -1747 -1588 2264 -2766 5056 3365 -1851 4181 -1932 1065 6297
825 6297 -1550 2926 1012 -4316 4431 506 46 3031 -6518 -1551 1052 -1993 4938 -2516 -6051
840 -6051 586 -3158 3436 4460 -5363 -863 -3132 -1801 7164 -783 -615 103 -5627 4191 3343 -340
856 -340 4795 -3552 -1560 3916 -1879 4333 1285 -4966 707 -4490 -1550 3763 -4540 -1605 -3333
871 -3333 -6722 3495 189 -1586 1608 -6118 887 4366 -674 3879 -2402 -2701 5208 -214 2280
886 2280 1581 -5303 3332 2434 126 4397 -3763 -663 4001 -1335 3656 -1093 -5153 2359 -2105 30
902 30 2703 -5618 118 210 -2794 4792 -520 -420 3461 -3350 2299 3107 -1254 4857 -1449 -2913 3091
919 3091 -2012 3083 3148 -4229 1695 -617 -17 6288 -1423 74 1078 -4267 3575 554 -3053 1321
$$ packed form
809D299j1248N816m80N81Q425r140J59L852n030P822j691n216O032o113K997N232
825F297p847M476j914n328Q747l925m60K985r549M967K603l045O931p454l535
840f051O637l744O594J024r823M500k269J331Q965p947J68P18n730R818q48l683
856c40N135q347J992N476n795O212l048o251N673n197K940N313q303K935j728
871c333l389J0217l306j775L194p726P005L479n040M553o281k99P909n422K494
886B280o99o884Q635q98k308M271q160L100M664n336M991m749m060P512m464K135
902C0K673q321N736R2l004P586n312J00L881o811N649Q08m361O111o306j464O004
919C091n103N095O5p377N924k312O00O305p711J497J004n345P842l021l607M374
$$ plain form
935 1321 -5313 -2394 1310 -4776 761 -1367 -4601 2471 -2162 56 4191 -2829 2152 1297 -2175
950 -2175 5209 -153 -638 3253 -3116 1748 2434 -2767 2678 -1933 -2170 3592 -2594 73 50 -5442
966 -5442 1882 -718 -2842 1793 -5096 -1566 1846 -2898 3065 -216 -2854 3991 -376 2513 4929
981 4929 -2151 2731 1353 -1413 5318 -720 -884 1888 -4138 1742 1699 -2766 2287 -3121 -2237 2970
997 2970 -2484 1698 1040 -4445 1932 -554 -848 3422 -3514 -537 1562 -2580 3456 317 -2649 3044
1013 3044 -1957 1253 3831 -2643 1925 46 -1855 4276 -881 -256 1831 -4161 1854 1195 -2440
1028 -2440 2525 -2939 -2067 2352 -2888 1142 201 -4404 1358 -1715 -1188 2977 -3753 -297 755 -2675
1044 -2675 4158 566 -1115 3544 -1693 2155 4166 -1443 3108 -278 -1441 4236 -1255 219 1143
$$ packed form
935A321o634K919L704o086N537k128l234P072m633K218M135p020M981q55l472
950b175P384n362m85L891o369M864O86n201N445m611k37N762o186K667k3n492
966e442P324k600k124M635o889L530L412m744N963l281k638O845m367K889K416
981D929p080M882j378k766O731o038j64K772o026N880m3m465N053n408Q84N207
997B970n454M182o58n485O377k486k94M270o936K977K099m142O036l139k966N693
1013C044n001L210K578o474M568j879j901O131n157O25K087n992O015o59l635
1028b440M965n464Q72M419n240M030r41m605N762l073N27M165o730L456J052l430
1044b675O833l592j681M659n237L848K011n609M551l386j163N677n491J474R24
$$ plain form
1059 1143 -5155 977 -34 -2972 1591 -4149 -3031 1182 -2907 2053 -31 -4029 1824 -1178 852
1074 852 4746 -2336 678 1204 -1053 5500 1227 -1213 1986 -3017 1915 3408 -2274 1654 -2335
1089 -2335 -2909 3360 -1708 -276 351 -4845 1293 18 -1768 2713 -3193 -873 1933 -2244 3042
1104 3042 852 -2581 2780 -1404 375 3501 -2311 1254 18 -2410 3775 -197 -574 1911 -3390
1119 -3390 1371 2544 -1612 2170 -1821 -2435 2752 -1381 1060 425 -4741 804 -594 -1079 2817 -3728
1135 -3728 -2034 959 -2251 3373 863 -2379 1593 -1924 1351 4124 -1334 1929 -144 -1979 4659
1150 4659 456 367 2171 -3835 796 1515 -1412 2260 -2822 -3082 1084 -2914 1210 288 -4826 558
1166 558 -1409 -990 3364 -2242 -331 1412 -1394 4141 1197 -961 2846 -1856 1613 3565 -2120
$$ packed form
1059A143o298O132j011k938M563n740J118M213m089M960k084l998N853l002K030
1074H52L894p082L014N26k257O553m273k440L199n003M932J493n682L928l989
1089b335n74O269n068J432O27n196O138j275j786M481n906K320K806m177N286
1104C042k190l433N361m184J779L126n812L565j236k428O185l972l77K485n301
1119c390M761J173m156L782l991o14N187m133K441o35n166N545j398m85L896o545
1135c728J694K993l210N624k510l242L972l517L275K773n458L263k073j835O638
1150D659m203q9J804o006M631P19k927L672n082k60M166l998M124r22n114N384
1166E58j967M19M354n606J911J743k806N535k944k158L807m702L469J952n685
$$ plain form
1181 -2120 1658 -452 -2564 3268 -815 -522 984 -3874 766 380 -1886 2423 -2740 -2520 1441 -2363
1197 -2363 1886 901 -3652 778 -1328 272 4065 -1156 521 91 -2167 4404 2053 -841 1482
1212 1482 -3154 430 3514 -1020 1443 -2284 -3199 2801 -606 863 462 -5006 675 810 -708 2656
1228 2656 -3222 -2462 1216 -1364 2508 336 -3792 1489 -662 1275 4099 -2332 268 960 -765
1243 -765 4772 736 -1690 1307 -2293 1924 2699 -2230 751 -2317 -2078 3476 -935 -349 -78 -3979
1259 -3979 1436 1127 -956 1737 -3147 -1005 1957 -1595 2329 -147 -2864 2217 -655 647 2802
1274 2802 -2010 949 993 -961 3375 -170 -692 1950 -2421 960 1120 -2720 1403 -1658 -2161 1564
1290 1564 -2489 -64 337 -3237 959 -1251 -1497 2606 -1998 -405 1034 -2302 2237 1118 -1421
$$ packed form
1181b120L778k110k112N832m083K93J506m858M640l86k266M309n163K20L961l804
1197b363M249r85m553M430k106J600L793n221J677m30k258O571k351k894K323
1212A482m636L584L084m534K463l727r15O000l407J469m01n468N681J35j518L364
1228B656n878P60L678k580L872k172m128N281k151J937K824o431K600O92j725
1243g65N537m036k426K997l600M217P75m929K981l068K39N554m411N86K71l901
1259c979N415l09k083K693m884K142K962l552L924k476k717N081k872J302K155
1274B802m812K959M4j954M336l545n22K642m371L381J60l840M123l061n03L725
1290A564m053K425M01l574M196k210k46M103m604J593J439l336M539j119k539
$$ plain form
1305 -1421 2074 -1318 826 3374 -651 2129 -121 -1986 3117 138 106 1383 -3482 61 1046 -1641
1321 -1641 1504 -2608 -2863 1125 -1654 1387 463 -3363 1173 -156 150 3696 -1344 -205 1434 -488
1337 -488 3870 1182 -1210 1655 -1300 1472 2966 -1902 597 -933 -2008 2474 -812 -961 388
1352 388 -3232 360 215 -1701 1760 -1950 -1281 1665 -1649 1332 976 -1950 1604 -464 -484 2570
1368 2570 -1473 691 802 -1979 2511 -84 -1376 1669 -1840 220 1629 -2193 871 -776 -1448
1383 -1448 2121 -1239 -126 1057 -2501 1259 322 -1701 1712 -1811 -1025 1324 -1835 905 286 -2017
1399 -2017 1579 -1109 -109 2679 -1292 1467 1205 -1121 3140 865 268 2183 -1857 393 1215 -1379
1415 -1379 1566 -1413 -2543 810 -2024 -358 501 -3162 412 -671 -1432 1921 -1459 -120 1664
$$ packed form
1305a421L495l392K144K548m025K780k250j865N103k979l2J277m865L543R85k687
1321a641L145m112k55L988k779L041r24l826M536j329L06L546n040J139J639j922
1337d88M358k688k392K865k955K772J494m868K499j530j075M482l286j49J349
1352C88l620L592j45j916L461l710O69K946l314K981l56k926L554k068k0L054
1368B570m043K164J11k781M490k595j292L045l509K060J409l822L064j647o72
1383a448L569l360J113J183l558L760r37k023L413l523P86K349l159K740o19k303
1399b017L596k688J000K788l971K759k62k326M261k275n97J915m040K250Q22k594
1415a379K945k979j130L353k834J666Q59l663L574j083p61L353l380J339J784
$$ plain form
1430 1664 -1191 2122 1033 -862 2816 149 560 2118 -1237 1415 1268 -1243 1608 -1095 -927 1680
1446 1680 -2290 80 -102 -2604 1007 -877 -1808 728 -2051 371 1075 -1941 926 -470 -630 2836
1462 2836 -760 -64 859 -1869 1941 1010 -821 1235 -2011 -664 1861 -1288 990 -317 -2134 1680
1478 1680 -587 267 1812 -2219 491 486 -1272 1965 -924 -1069 868 -2260 483 797 -1983 1271
1494 1271 -613 -861 2387 -746 667 1468 -883 2128 916 -370 1826 -1036 406 1813 -1505
1509 -1505 549 -700 -1965 1620 -656 -598 274 -2829 274 497 -1457 1014 -2022 -1442 1236 -1465
1525 -1465 673 615 -1625 2009 272 346 2589 -654 1336 1904 -876 1682 -156 -762 2061 -1277
1541 -1277 -480 119 -2255 959 -303 -1515 727 -1810 17 1475 -1470 803 -263 -1461 1609
$$ packed form
1430A664k855L313j089j895L678k667M11J558l355K652j47k511K851k703J68K607
1446A680l970K370j82k502L611j884r31K536k779K422P04l016K867j396j60L466
1462B836l596O96R23k728L810r31j831K056l246J347K525l149K278j307j817L814
1478A680k267Q54J545m031K710nj758L237k889j45J937l128K743L14k780L254
1494A271j884k48L248l133J413Q01k351L011j212j286K196k862J442J407l318
1509a505K054j249j265L585k276N8Q72l103L103K23j954K471l036N80K678k701
1525a465K138n8k240L634j737P4K243l243J990N68k780K558j838o06K823l338
1541a277P97N99k374L214j262j212K242k537J827J458k945K273j066j198L070
$$ plain form
1556 1609 -701 -251 1086 -1979 773 516 -1226 1649 -652 -247 2107 -933 728 818 -1561 1579
1572 1579 -222 -663 1161 -2056 -248 421 -1742 1129 -560 -1368 922 -1425 292 1106 -1572 717
1588 717 -488 -1025 1902 -445 -88 1082 -1613 1448 1215 -373 1726 -613 -146 2039 -922 945
1604 945 474 -1439 1243 -771 -700 821 -1994 -59 266 -1733 838 -1089 -1271 1076 -1695 308
1620 308 677 -1852 1131 143 -704 1541 -702 249 1577 -1030 1531 718 -642 1933 -670 8 1283
1637 1283 -1114 974 192 -1511 1073 -877 -409 901 -1779 123 -195 -1699 724 -1011 -1236 903
1653 903 -1647 401 773 -1060 1366 114 -234 1888 -261 1094 1634 -993 1546 197 -768 1738
1669 1738 -1130 -813 445 -1941 294 -472 -1555 407 -1565 -411 958 -1537 526 164 -1497 1562
$$ packed form
1556A609k310M50J337l065K752k57j742K875k301M05K354l040J661R0k379L140
1572A579j801m41J824l217J808O69k163K871j689q08K290k347J717Q14k678K289
1588G17j205n37K927k347L57J170k695L061k33j588K099k339M67K185k961J867
1604I45m71j913K682k014P1J521k815J935L25j999K571j927j82K347k771K003
1620C08L69k529K983r88q47K245k243R51J328k607K561q13j360K575k603O78J275
1637A283k397K088p82j703K584j950M68J310k680J902l18j504K423j735k25K139
1653I03k550K048L72j833K426j252l48K122k149J355N40k627K539j349r65K506
1669A738k868L17J258k386K235p66j083J962j972J154J369k495K063l62j661L059
$$ plain form
1685 1562 -131 -191 1206 -1271 701 903 -623 1654 -72 -691 1716 -869 548 1076 -1306 851
1701 851 -210 -593 1355 -1157 -275 182 -1484 1027 -4 -1011 831 -1436 -551 1286 -1287 461
1717 461 114 -1304 1054 -589 -196 1128 -1442 623 500 -1007 1557 -339 -453 1303 -858 1128
1733 1128 990 -881 1334 -299 -430 1467 -1067 -354 42 -2357 333 -538 -1219 247 -1646 -760 809
1750 809 -756 1178 111 -991 1933 191 1018 1729 -959 475 516 -556 1543 -632 -686 455 -1270
1767 -1270 877 652 -1268 914 -802 -544 1374 -1026 -31 -63 -1936 426 -514 -733 968 -1314 -101
1784 -101 1108 -483 1916 510 -549 1540 -124 737 1672 -1319 363 -159 -782 1197 -1080 -817
1800 -817 213 -1247 1066 1117 -953 817 -964 -138 1521 -1030 69 -490 -1989 711 -304 -576
$$ packed form
1685A562j693o0J397k477J972K02j526K277j726o19K407k585J417N28k382K157
1701H51j061l83J948k512Q82M57j666K511j031j007J842k267Q85J837k573J748
1717D61l47j418K358j643L93J324k570K065j23j507K564j896j14J756k161J986
1733A128j38j871K215j633j31J897k534P13L96k399K690q71o81J466j893Q86J569
1750H09j565J934j067j102K924j742Q27P11k688J434M1j072K099k175n4J141j725
1767a270K147k25j920K182j716K58J918k400R95l2j873K362r40k19J701k282J213
1784a01J209j591K399j406j059K089j664Q61R35k991J682n22o23J979k277K63
1800h17J030j460K313N1k070J770j781Q26J659k551J099n59j499K700j015k72
$$ plain form
1816 -576 545 -1675 -9 1076 -163 1849 401 -150 1705 153 1262 1603 -1212 480 -658 -960
1832 -960 1417 -1147 -1105 -52 -1912 783 281 -933 598 -1154 -179 1455 -661 488 -275 -1577
1848 -1577 1342 93 -303 795 -1499 589 1343 23 1876 -346 -418 1712 -8 741 793 -1993 71
1865 71 -559 -1018 844 -1534 -851 -274 -1288 1075 223 -612 1157 -623 -123 1406 -800 467 -219
1882 -219 -1592 922 -429 -129 812 -1336 478 611 -323 2096 145 -255 1404 -597 978 933 -1474
1899 -1474 351 -931 -875 803 -1493 -546 -42 -1332 1001 174 -579 789 -1034 -30 1111 -668
1915 -668 914 -341 -1147 1377 -229 500 1350 -1236 541 887 47 1878 -257 -670 369 -1106 582
1932 582 257 -1722 -123 -1389 -879 1210 -1134 -330 105 -1101 1320 411 -86 892 -1028 363 1187
$$ packed form
1816e76J121k220J666J085j239K012j448n51J855j552J109L41k815J692j138l02
1832i60K377k564M2J053j860K695n02j214J531j752R75J634k116J149p63j302
1848a577K919j249l96J098k294K088P54j320J853k222p2K130j720P49N2k786K064
1865G1o30m59J862k378O83N77j014K363q52q35J769j780N00J529k206J267o86
1882b19j373K514j351L00R41k148J814J33r34K419j951m00J659k001J575m5k407
1899a474J825j282N6J678k296R47N04j290K333q27p53J368j823J004J141j779
1915f68J582j255q06K524j606P29Q50k586J777L46q40J831k135m13J039j475J688
1932E82l25j979J599j266N10K089k344Q04M35j206K421r09m97R78j920J391Q24
$$ plain form
1949 1187 -589 1197 -130 -985 1384 -241 320 887 -1094 551 341 -505 1111 -762 -589 474
1965 474 -1350 261 130 -1285 641 -748 -464 1026 -737 338 125 -1044 1039 42 -494 945
1981 945 -1111 119 882 -720 1198 68 -372 1036 -123 794 1165 -993 753 98 -529 1159 -1108
1998 -1108 -743 82 -1255 424 -187 -1284 568 -804 -294 1058 -927 293 418 -800 1384 -157
2014 -157 -38 977 -647 690 895 -486 1311 -9 -41 1421 -758 429 283 -1446 436 -465 -1243
2031 -1243 495 -1311 -526 165 -1406 616 -85 -641 1323 -249 337 1323 -775 672 634 -370 1321
2048 1321 -326 -462 790 -872 356 416 -911 955 -382 -461 1199 -977 94 442 -1008 756
2064 756 -501 -789 645 -1098 28 323 -1268 477 -203 -613 1176 -695 -104 793 -745 738 601
$$ packed form
1949A187j776J786j327q55K369j625N61N67j981J645k10q46J616j873J73J063
1965D74j824J611j31j415J926j389K84J490j763J075k13j169K083r97n36J439
1981I45k056J230P63j602J918j130m40J408j159R17L71k158J746o55o27J688k267
1998a108L65Q25j337J679o11j097J852j372N10J352j985J220J25j218K184j541
2014a57J19J015j624J337K05j381J797j320l2J462k179J187j46j729J882r01p78
2031a243J738j806P85O91j571K022p01n56J964j572N86R86k098J447l8j004J691
2048A321j647j36J252j662J228O0j327J866j337p9J660k176J071L48j450J764
2064G56j257k88J434j743J126K95j591J745o80m10J789j871N91Q97j538J483j37
$$ plain form
2081 601 -390 1217 -300 257 1267 -657 582 383 -784 1034 -386 -438 621 -1436 178 135 -1276
2098 -1276 299 -788 -860 775 -1018 107 157 -985 884 229 -323 1092 -375 511 1163 -343 951
2115 951 276 -423 1374 -333 74 480 -1178 282 81 -975 451 -723 -731 697 -834 140 273 -871
2133 -871 611 -248 -247 834 -868 295 305 -1121 771 -299 -410 1121 -629 150 849 -584 933
2150 933 292 -331 1058 -477 199 768 -923 513 -210 -1109 335 -996 -587 241 -1133 2 -82 -1057
2168 -1057 922 -459 -283 753 -997 558 580 -577 1069 -13 -233 1260 -360 461 748 -557
2184 -557 992 111 -734 594 -785 -21 395 -1377 52 -507 -1091 654 -1018 -173 407 -931 630
2201 630 333 -450 1045 -140 86 900 -687 653 396 -579 871 -301 -393 1126 -670 214 267 -1018
$$ packed form
2081F01r91J607j517N57J010j924J239j99j167J818j420n2J059k057J614m3j411
2098a276J575j087p2J635j793J125N0j142J869o55n52J415j467Q86O52j506J294
2115I51o75o99J797j707M07M06j658J460k01j056J426j174qJ428j531R74J33j144
2133h71J482q59JJ081j702J163J0j426J892j070j11J531j750P79O99j433J517
2150I33o41o23J389j535O76N69j691J436p23q99J444j331M09Q28j374J135q4r75
2168a057J979j381J76J036j750J555K2j157J646j082k20J493j620Q21K87j305
2184e57J549q81q45J328j379P64M16j772J429n59n84J745j672Q45N80j338J561
2201F30k97p83J495j185K26Q14j587J340k57r75J450j172r2J519j796Q84N3j285
$$ plain form
2219 -1018 692 -240 -287 914 -1006 32 463 -944 566 -61 -1015 662 -890 146 356 -889 550
2236 550 24 -458 784 -662 50 1012 -523 722 411 -522 1095 -239 60 978 -695 513 315
2253 315 -714 835 -482 -462 388 -1039 285 248 -1048 602 -256 -713 555 -805 110 639 -553
2270 -553 784 140 -289 1042 -200 299 931 -367 826 453 -362 984 -415 -163 401 -916 69
2287 69 -226 -1088 380 -925 -734 706 -899 304 259 -843 713 3 -116 1027 -789 319 698
2304 698 -716 888 -277 -315 792 -554 207 483 -830 815 258 -220 1032 -610 -305 481 -772
2321 -772 113 -117 -1149 188 -641 -257 486 -1013 34 -36 -490 1170 -92 -198 816 -824 612
2338 612 582 -457 512 -428 -98 900 -398 442 408 -987 641 89 -629 649 -595 -383 462 -827
$$ packed form
2219a018J710r32m7J201j920J038M31j407J510o27r54J677j552J036K10j245J439
2236E50n26m82J242j446P12R62j535J245l11r33J617j334K99R18j673J208j98
2253C15j029J549j317K0Q50j427J324l7j296J650q58m57J268j360R15N29j192
2270e53J337o44m29J331j242M99O32j298J193l73q15J346j399K52N64j317R85
2287F9k95q62J468j305J91J440j605J203m5j102J556p10j19J143j816J108L79
2304F98j414J604j165l8J107j346P61K76j313J645n57m78J252j642L05P86j253
2321g72Q85k30j032J337q29L84P43j499J047p0m54J660j262j06J014j640J436
2338F12l0j039R69r40L30R98j298Q40l4j395J628n52p18J278j244K12Q45j289
$$ plain form
2356 -827 324 -441 -1184 553 -559 129 611 -629 575 304 -270 1201 49 115 658 -480 482 119
2374 119 -873 674 -568 -597 735 -623 229 489 -709 564 170 -228 697 -702 -155 278 -998 543
2392 543 -322 -1002 445 -582 79 717 -379 646 136 -487 1041 -308 253 385 -710 543 441
2409 441 -722 731 -437 -100 797 -463 402 262 -785 578 -301 -288 375 -1273 -481 -232 -1181 428
2427 428 -91 -588 552 -509 317 1042 -375 819 223 -42 1120 -204 309 604 -865 380 145
2444 145 -666 621 -387 -177 426 -789 169 -6 -946 460 -387 -484 767 -654 -237 188 -542 706
2462 706 125 -142 624 -422 452 868 -577 485 -165 -711 880 -229 -21 295 -1044 398 161 -303
2480 -303 380 -741 -512 570 -537 478 65 -935 208 -348 -80 659 -635 -192 141 -436 954
$$ packed form
2356h27J151p65p43J737j112O88M82j240J204k71n74J471j152O6N43j138R62l63
2374A19r92J547j242k9J332j358Q52K60j198J273l94l98R25j399N47M33j276J541
2392E43q65o80J447j027O61O38j096J025n10o23J528j349N61J32j095J253j02
2409D41j163J453j168L37Q97j260Q65j40j047J363q79J3O63j648P92K49r49J609
2427D28n19m97J140j061Q26P25j417J194n96k65J162j324N13K95j469J245k35
2444A45q11J287j008K10O03j215R58j75r40J406q47r7J251j421M17M25p30J248
2462G06n81k67P66j046Q74M16j445J062o50n46J591j109K08L16j339J442k37m64
2480c03O83j121K29J082j107J015m13j000J143n56K68P39j294M43L33n77J390
$$ plain form
2497 954 87 -358 647 -346 568 832 -428 435 -285 -240 795 -174 263 239 -752 472 180 -433 202
2516 202 -863 -417 444 -733 271 -213 -902 238 -444 -34 423 -705 278 370 -230 1118 64 -261
2534 -261 679 -210 606 335 -818 510 -242 -259 880 -650 -182 135 -571 411 -141 -552 343 -627 -149
2553 -149 230 -786 594 172 -304 857 -448 39 855 -338 451 37 -438 594 -242 -193 259 -778
2571 -778 226 434 -568 522 -381 -354 579 -462 109 152 -886 387 -251 -393 470 -718 -266 284
2589 284 -636 840 5 -560 617 -391 409 785 -387 148 -152 -364 684 -139 12 399 -315 277
2607 277 541 -437 492 -332 -404 200 -441 212 -109 -620 147 -402 -378 502 -495 74 405 -191 672 271 -27
2628 -27 675 -295 425 638 -429 537 -158 -440 531 -129 15 90 -699 80 80 -565 431 -247 -397 293 -535
$$ packed form
2497I54q67m45J005r93R14K64j260Q63p20M5J035r69M37k4r91J224k92o13O35
2516B02j065M46Q61j177J004m84o89J140o82M10M57j128R83R2o00J348j054l25
2534b61R40q89Q16k71j153J328p52j7J139j530M68L17p06R82n52m11Q95r70M78
2553a49L79j016J380m22m76J161j305M87Q16j193P89m14m75J032q36M9M52j037
2571g78J004K08j002J090r03K7R33j041N71M3j038J273o38j42Q63j188M52N50
2589B84r20J476q35n65J177j008Q00L76j172N35l00k12J048q23J51L87p14N92
2607B77K64r78R29q24p2O04o41O53l21n11P67n49K4Q80r97N69L31n96Q63m01k98
2628b7P02r70P20K13j067R66o95k82R71o60J44P5p89P79%o45R96o78j50O90q28
$$ plain form
2649 -535 67 117 -651 241 -243 -85 837 -262 355 112 -169 708 101 -116 502 -191 178 611 -439 158
2669 158 -410 -518 554 -435 -110 295 -585 397 92 -547 483 -319 -281 653 -461 378 -91 -603 338
2688 338 -172 -42 481 -449 382 377 -93 777 -174 103 630 -412 194 262 -521 320 -271 -319 247 -590 -199
2709 -199 62 -617 286 -139 -331 376 -489 -298 301 -527 214 4 -455 576 -220 206 600 -124 411 268
2729 268 -86 759 1 40 633 -493 96 61 -797 133 -545 -676 420 -564 -70 289 -562 408 32 -174
2749 -174 580 -288 231 512 -349 384 185 -189 767 -169 208 617 -223 261 285 -156 545 11 -280 212
2769 212 -556 222 -125 -504 379 -418 -307 289 -307 1 92 -255 478 -81 10 693 -101 31 369 -368 354
2790 354 161 -155 766 -258 -56 450 -390 311 -51 -349 357 -371 -148 -7 -425 362 149 -516 384 -467
$$ packed form
2649e35O02N0p68Q92m84J58R22j099O17k43k81Q77o07k17O18o93L69M33j050N97
2669A58n68j08J072r89L25M05q80R82l05o39J030q02L8R34j114Q39m69n12R41
2688C38n10J30N23r30Q31nm70Q70r51K77N27j042O06O8p83Q41n91m8N66q37L91
2709a99K61o79R03m25j92P07q65J91N99q28P41k10m59J031p96M26L94p24N35j43
2729B68l54Q45p58L9N93j126N89l5q58R30o78j31J096r84M94L59q51R70l76k06
2749a74P54q68N19K81q61P33j99l74R56r36L77M09q40M84K4m41P01n34k91M92
2769B12p68P78l47l79Q83p97J11N96n96L08R1l47P33n59R1O83p94J32L38p37P22
2790C54j93l16R21j024K02N06q40P01l62k98P06p28K23J41m18P87k13o65R00q51
$$ plain form
2810 -467 -243 605 -631 208 394 -534 548 142 -156 377 -543 170 368 211 398 245 -196 497 -95
2829 -95 66 253 -624 140 50 -474 404 -553 -151 93 -425 280 -12 -348 438 -286 -199 254 -708 278 192
2850 192 -317 583 -14 117 545 -204 484 266 -264 524 -57 -70 520 -184 51 63 -514 144 -238 -349 213
2871 213 -352 -124 50 -351 287 3 -438 443 -128 -24 418 -571 332 -128 -79 660 -243 -29 275 -96
2891 -96 524 330 -311 403 -180 -232 385 -415 44 0 -547 188 -37 -306 278 -467 27 512 -345 454 -212
2912 -212 -343 428 -308 -70 178 -483 261 243 -137 421 -202 27 629 -399 401 222 -437 264 -294 -223
2932 -223 173 -449 94 -176 -561 267 -324 -297 22 -535 -15 360 -358 322 -38 -106 392 -121 265 430 -320
2953 -320 457 212 -200 699 -322 59 253 -308 243 4 -526 57 -289 -115 518 -377 37 145 -374 214
$$ packed form
2810d67K24Q48j236Q39J86r28J082m06k98N33r20P13J98j57J87j53m41O93n92
2829i5J61J87q77P64r0n24Q78r57M02K44n18P05k92l36P86p24Q7M53r62R86q6
2850A92n09R00n97J31M28p49O88k18n30P88n81j3N90p04K35J2n77O58l82j11N62
2871B13n65K28J74m01O38k84m41Q81n71J04M42r89R03m60M9P39r03K14L04l71
2891i6O20j94o41P14n83n2O17q00M59m4n47P35k25k69N84p45M94M85q57P99o66
2912b12j31P71p36K38K48o61P44j8l80N58o23K29O02j028Q00j79o59P01n58P1
2932b23L96o22N43k70l85Q28n91K7L19n57N20L75p18O80l60o8M98n13L86J65p50
2953c20P77k45m12Q99j021L81J94n61N51k39n30N83l46J74O33q95M14J08n19N88
$$ plain form
2973 214 -114 -328 303 -352 272 127 -242 382 -67 -158 441 -160 182 314 -218 240 -73 -197 489 -421
2993 -421 -132 62 -329 380 -23 -266 125 -307 -180 339 -583 -44 125 -417 224 33 70 358 -293 216
3013 216 269 -145 362 -157 -2 524 -334 333 395 -167 274 -66 -327 330 -333 -37 104 -449 132 -47 -435
3034 -435 260 -403 -29 295 -275 296 109 -377 354 -345 114 393 -656 177 311 -398 499 27 -170 414
3054 414 -223 227 268 -292 320 -121 -434 533 -481 -260 69 -449 204 -39 -304 25 -285 99 256 -305
3074 -305 263 -14 -224 390 -240 230 253 -464 253 159 -40 529 -109 15 214 -321 324 365 -230 405 -204
3095 -204 -326 180 -518 -29 32 -382 259 -1 -193 398 -151 337 403 -278 442 40 -52 511 -89 191 365
3116 365 -543 360 -149 -155 240 -308 -97 203 -349 36 188 -123 104 -285 -246 338 -524 -29 305 -475 343
$$ packed form
2973B14l28k14O31o55O24j45l69O24m49r1N99o01L42J32n32M58l13j24O86r10
2993d21K89J94l91P09m03k43L91m32J27N19r22N39J69n42O41j91L7K88o51N09
3013B16N3m14N07n19J55N26q58O67O2n62M41l40k61O57o63K96J41n53N81j79l88
3034d35O95o63L74L24n70N71j87m86P31o99M59K79j049Q33J34p09Q97m72j97N84
3054D14o37M50M1n60O12m41l13R67j014K21L29n18O53k43k65L29l10L84J57n61
3074c05N68k77k10O14o30M70K3p17P17r4j99N69o38J24J99n35O45M1n95O35o09
3095b04j22N06o98M89O1m14O41k60j92N91n49M88O6o81P20m02r2N63o00K80J74
3116C65r08R03n09oL95n48K11L00n52L85J52l11K27l89L9N84q62M95L34p80Q18
$$ plain form
3137 343 -109 -310 151 -277 -40 288 -163 410 -171 -238 299 -266 124 454 -362 243 -101 -213 326 -215
3157 -215 -259 40 -481 344 -17 -285 101 -250 -83 144 -314 214 66 -126 179 -24 -124 505 -272 84
3177 84 321 -116 259 -121 -298 339 -369 -125 73 -490 86 101 -170 275 -154 -23 71 -623 214 -190 -513
3198 -513 336 -74 -74 221 -252 -28 236 -426 544 -267 -160 448 -327 239 41 -24 446 -216 -9 337 -312
3219 -312 224 0 -291 214 75 -455 369 -417 -135 237 -436 227 -42 -288 300 -139 -9 203 -213 382
3239 382 -2 -215 371 30 39 491 -205 194 66 -140 238 -278 -82 187 -306 -23 82 -530 173 -17 -364
3260 -364 133 -309 -121 206 -130 185 3 -158 430 -339 192 417 -315 296 136 -159 472 -207 -87 241
3280 241 -250 86 -57 -224 277 -98 -162 170 -209 -74 167 -354 84 -82 -33 175 -419 86 198 -143 198
$$ packed form
3137C43m52k01M61m28K37L28m51N73n81o7N37n65L90L30q16O05l44j12N39n41
3157b15m4K99n21Q25l61k68L86l51J67K27m58N28j48j92L05k03j00O29p77L56
3177H4K37m37L75l80j77O37p08K44J98n63N76J5k71M45m29J31R4o94Q37m04l23
3198e13Q49m10%K95m73K24K64o62R70q11J07O08p75N66j98o5M70o62K07L46o49
3219c12N36k24k91N05j39n30Q24p86K82L72o73O63k69k46N88m39J30K12m16N95
3239C82l84k13N86l41RM52o96L99j28k06L78n16J96K69m93K83J05o12P03j90l47
3260c64M97m42J88L27l36L15j82j61N88p69N31K25p32O11j60k95O31o79J20L28
3280B41m91L36j43j67N01l75o4L32l79J35K41n21M38j66M9K08n94N05J12l41L41
$$ plain form
3301 198 22 153 423 -241 35 217 -88 294 -112 -172 335 -265 -124 77 -393 178 -29 -176 367 -41
3321 -41 -53 72 -502 192 61 -358 317 -196 225 237 -280 -161 159 -229 368 -80 5 443 -461 276 118
3342 118 -184 105 88 -178 403 -432 71 319 -280 180 -201 -457 234 -233 -125 247 -389 91 90 -230 109
3363 109 -232 -105 235 -206 326 304 -117 385 -138 18 252 -177 301 41 -215 216 -165 -142 457 -322 36
3384 36 -20 -353 35 -9 -420 170 -227 -91 22 -170 124 -119 -201 473 22 17 253 -426 367 20 -165 449
3406 449 -64 19 256 -167 320 164 -177 140 -196 -111 241 -339 7 165 -393 71 104 -147 374 -246 -118
3427 -118 199 -323 231 -114 -181 164 -44 -44 180 -216 95 173 -198 301 76 -50 388 -411 103 -98 -176 338
3449 338 -307 -64 238 -361 213 77 -372 141 -111 21 81 19 74 220 -122 141 56 112 292 -29 164 105
$$ packed form
3301A98j76J31K70o64K76J82l05L82m06o0N07o00J41K01m70N71k07j47N43m08
3321d1j2J25n74O94j31m19O75n13M21J2n17J19L20l88N97m48Q5M38r04P37j58
3342A18l02K89j7k66N81q35N03K48n99M60l81k56O91m67J08L72o36M80jl20L39
3363A09l41J27L40m41N32k2m21N02n23J56K34m29M78k60k56M31l81K3N99p79L58
3384C6n6l33L88m4m11N90l97J36J13j92K94k43q2O74m51nK36o79P93l47j85O14
3406D49n13Q3K37m23M87j56l41L17l36Q5L52n80L46J58n58M64L3k51N21o20J28
3427a18L17n22N54l45o7L45k08%K24l96L11P8l71M99k25j26M38p99N14k01p8N14
3449C38o45K43L02n99N74j36m49N13k52J32O0o2N5J46l42K63q5N6J80l21J93n9
$$ plain form
3471 105 -369 339 39 -159 62 -307 -317 101 -350 228 23 -272 79 -234 -88 -14 -326 -183 16 -106 318
3492 318 -202 29 336 -22 68 350 -229 579 117 81 460 9 23 149 -360 9 84 48 301 -162 103 68
3514 68 -316 177 -101 -224 297 -239 157 78 -560 83 -37 -298 321 -231 -91 280 -175 291 197 -185 216
3535 216 -78 51 165 -220 -121 67 -299 121 -315 -375 146 -260 -32 71 -461 175 -18 -50 126 -111 152
3556 152 15 -79 79 101 -203 253 -72 86 417 -43 184 129 -260 251 93 -3 292 -107 205 38 -324
3577 -324 139 -286 -247 17 -339 -134 -116 -55 364 -87 -237 238 -99 38 66 -261 235 -147 -157 394 -1 117
3599 117 124 -324 254 11 36 161 -119 -163 304 -193 -33 164 -484 10 22 -59 196 -290 -25 22 -403 239
3621 239 -15 -162 257 -91 -35 93 -41 70 151 -162 361 -232 156 84 -391 18 -185 -285 17 -61 -261
$$ packed form
3471A05m74P08l00j98K21l69j0M18m51N78k05k95L51l13J46P4l12J43J99j22M24
3492C18n20K31L07l58R0K82n79Q08m62l6L79m51J4J26n09L69P5l6K53m63K65l5
3514F8l84M93k78j23N21n36L96p9o38O43j20k61O19n52J40L71m55M66r4l82M01
3535B16k94J29J14l85R9J88l66M20m36o0N21m06K28J03n32O36j93l2J76k37K63
3556A52j37r4J58K2l04M56l25J58L31m60K27n5l89N11j58r6K95l99L12j67l62
3577c24M63m25L9K64l56K05J8O1M19m51j50M75l37J37K8l27M96l82j0N51l95J18
3599A17Pm48N78k43K5J25k80m4M67m97J60J97o48M94J2q1K55m86K65M7m25O42
3621B39k54j47M19l48N6J28j34J11Q1l13N23n93L88p2m75M09k03j00L02p8k00
$$ plain form
3642 -261 118 -282 168 -13 -171 127 -31 -90 178 -227 -80 46 -165 136 -94 -193 282 -126 136 173 -158
3663 -158 201 155 28 195 -62 -112 304 -380 218 10 -118 80 -144 -9 67 -445 115 -82 -284 51 -236
3684 -236 2 212 -239 287 139 -324 364 163 -73 348 -115 152 231 -129 203 28 27 178 -289 0 284
3705 284 -373 108 95 -86 98 -124 -282 59 -77 107 -102 -240 194 -118 -61 175 -320 -59 159 -203 290
3726 290 -34 86 163 -304 182 75 -164 265 -208 -214 405 -373 48 97 -322 21 -106 -238 102 -227 -180 -60
3748 -60 -260 289 -14 -167 484 196 9 352 8 189 50 -173 285 -229 217 247 -93 223 49 -163 122
3769 122 -12 -300 58 -86 260 74 -70 -205 120 -262 -64 -478 76 160 -286 138 -75 -174 308 -225 -41
3790 -41 182 -102 247 126 -159 141 -159 -124 135 -115 93 -64 -201 29 -74 -130 156 -34 144 21 -170
$$ packed form
3642b61L79m00M50j81j58K98j58n9K68m05J47J26k11L01k30r9M75m08K62L7l31
3663a58L59m6j27J67k57n0M16o84N98k08j28J98k24J35P6n12N60j97k02L35k87
3684b36K38K10m51N26j48m63O88k01k36M21m63K67P9l60L32j75jJ51m67K89K84
3705B84o57M81j3j81J84k22j58L41j36J84k09j38M34l12N7K36m95K61K18l62M93
3726B90l24J20P7m67M86j07k39M29m73oO19p78M21M9m19L43j27j32L40l29M7J20
3748f0k00N49l03j53O51k88j87L43l44J81j39k23M58n14M46L0l40L16j74k12K85
3769A22j34k88L58j44L46j86j44j35L25l82J98m14N54Q4m46M24k13r9M82n33J84
3790d1K23k84L49j21k85L00l00L5K59k50K08j57j37K30j03n6K86j90J78j23j91
$$ plain form
3811 -170 7 -239 -112 154 -103 177 229 -247 -27 -229 -17 250 -25 118 244 -240 128 -40 -162 386
3831 386 -92 89 123 8 -2 37 -95 251 -261 -232 199 -132 54 -154 -243 -22 -139 -308 288 -84 -42 171
3853 171 -65 139 -193 151 214 14 76 123 61 306 -124 -72 32 -205 20 117 -352 92 -84 -169 167 -122
3875 -122 103 134 -118 163 -10 -209 230 -66 -71 105 -109 158 96 -175 267 -50 -148 176 -159 -66 293 -2
3897 -2 206 -336 -28 273 -15 88 -52 -344 242 -277 -210 35 -226 -80 283 -231 179 185 -260 37 30 75 79
3920 79 -137 148 138 -262 259 -10 52 -35 -319 116 160 -136 224 -44 -170 18 -164 16 93 -146 6 -42
3942 -42 -77 234 -35 55 91 -52 107 92 -36 64 -119 -9 105 -192 188 132 127 211 71 -83 183 -245 106
3965 106 -8 -439 201 -54 -56 89 -42 -275 -32 -47 368 -137 -258 32 -364 20 38 -15 343 -31 -158 149
$$ packed form
3811a70J77k46J27K66k57K80N2m76K20k02K12K67k75J43J26m84L68j68j22N48
3831C86m78J81L4j15j0L9j32L46n12K9M31l31J86k08q9K21j17j69N96l72M2K13
3853A71k36K04l32L44O3k00O2M7o2K45m30N2J04k37K25R7m69M44j76q5L36k89
3875a22K25L1k52K81j73j99M39k96nJ76k14K67o2k71M42l17r8L24l35R3L59k95
3897bK08n42L08L01k88J03j40k92N86n19O7K45k61J46L63n14M10Om45K97pM5M
3920G9k16K85j0m00N21k69O2q7k84M35M4k96L60k68j26J88j82J80P7k39J52m8
3942d2l5L11k69R0L6j43J59j5j28J00j83J10J14k97L80n6nQ4j40j54K66m28L51
3965A06j14m31O40k55kJ45j31k33K43j5M15n05j21K90l96L84J8n3L58l74j27L07
$$ plain form
3987 149 54 -57 202 -136 241 107 -248 69 -283 -73 35 -135 26 37 -85 198 -143 -209 194 -137 -4
4008 -4 86 -271 362 -52 -112 261 20 87 25 -159 159 -92 -129 105 -234 95 60 -314 306 -130 -157 121 -106
4031 -106 43 -89 -449 43 -51 -322 55 -162 -125 277 -224 59 60 -87 342 -14 -6 233 -48 -5 88 -307 19
4054 19 -50 -11 75 -400 59 141 106 -18 -7 -278 123 -180 37 123 -227 0 96 -122 310 -261 154 109 -113
4077 -113 250 82 44 216 -14 -11 90 -124 90 -11 -263 210 -147 -229 86 -62 -3 143 -80 -27 3 -113
4099 -113 -14 -236 36 113 -188 6 -60 -86 279 18 46 197 17 95 253 -217 217 -36 -77 318 -235 72
4121 72 -107 -305 -74 -31 -18 82 -290 128 -72 -155 115 -43 -26 98 -234 -5 238 -147 68 -160 -36 385
4143 385 -147 60 76 -234 180 301 -111 268 -227 198 -68 -12 138 -50 -317 60 -159 -80 61 -226 156
$$ packed form
3987A49r5j11K59l38L77j34l55L17l52K10J08j70J61J1j22K83l41o6M03l31J33
4008dR0l57O33m14o0L73k41O7o2j84L18k51l7K34l39L29l5l74O20m36k7K78k27
4031a06J49j32l60M92r4k71L77k17L7M02n01K83Jj47M29l56QK39k81M3R3l95L26
4054A9o9L9Q6m75M59Q2l5j24J1k71M01l03K17Q6l50K27R6k18M32n71M15m5k22
4077a13L63j68l8J72k30LJ01k14K14j01k52M73l57q2L15j48N9J46k23N3L0j16
4099a13R9k22K72P7l01J94o6k6L65k61K8J51j80P8J58m70M34k53m1L95n53L07
4121G2j79j98K31M3J3J00l72M18k00q3K70j58J7J24l32K29K43l85K15k28J24M21
4143C85n32K07J6l10M14J21m12L79m95M25k66N6J50j88k67L77k19P9J41k87L82
$$ plain form
4164 156 69 -36 -3 -163 -72 214 -61 -87 46 -115 254 161 -152 62 -98 299 91 -3 139 19 -128 236
4186 236 -120 -5 160 -174 114 -38 -160 34 -357 -225 -225 -220 88 170 -114 69 27 -55 76 59 201 52 -188
4209 -188 211 -32 -115 189 -163 171 128 -96 177 -81 4 327 -280 7 -86 -101 -65 16 -337 -35 -92 -121 168
4232 168 -189 5 -41 -171 395 94 41 98 -154 182 -94 -190 97 24 37 136 62 187 16 -61 67 -44 103
4255 103 216 -252 5 38 -70 154 46 -183 -2 -156 -24 239 -219 95 -158 -84 101 -26 161 108 43
4276 43 100 245 -50 44 -60 -160 79 -73 -106 162 53 205 -87 34 156 -400 73 102 -121 257 11 -7
4298 -7 27 61 -218 230 -66 23 146 -196 270 29 55 172 -145 191 -48 -109 -3 -143 98 71 -42 178 -161
4321 -161 -172 259 -95 -191 190 -198 -37 -62 -170 304 48 -205 536 -85 -27 146 -219 -41 109 -175 108
$$ packed form
4164A56q7j05L3j60R1K86k75k6J33j61L69r3l13K14j60L97k08r4J42j20j47L64
4186B36l56J15J65l34K88j52j22J94l91J32%NL08Q2k84J83m2q2J31j7J42j49k40
4209a88L99k43q3L04l52L34m3k24K73k58Q5L23o07K87r3j5L6Q1l53L02n7k9K89
4232A68l57J94m6j30N66l01n3N7k52L36k76r6K87p3J3R9p4J25j71p7J28j11J47
4255A03J13m68K57L3j08K24j08k29J81j54J32K63m58L14k53P4J85j27J87n3o5
4276D3N7J45k95R4j04j00K39j52l3K68j09J52k92J21J22n56M73K9k23L78k46j8
4298gL4L4k79M48k96Q9J23l42M66k41K6J17l17L36k39o1J06j40K41k7j13K20l39
4321a61j1M31l54r6L81l88J61k5j08M74k56k53P41o21N8J73l65J78J50k84K83
$$ plain form
4342 108 9 131 223 26 83 -35 -190 324 -158 -203 -95 -126 3 -8 -43 40 -31 -76 28 -210 309 26 -179
4365 -179 122 -163 4 267 -74 -50 196 -191 125 227 -53 186 -176 4 -80 -434 198 -132 -142 192 -168
4386 -168 -120 168 -97 76 93 -212 92 -150 22 17 -296 42 -75 -89 426 7 24 167 -168 70 135 16
4408 16 225 66 -11 210 -104 140 40 -183 -88 12 -115 27 -57 49 -98 -159 320 -76 -152 164 -92 -197
4430 -197 -32 -140 168 161 -126 113 -227 -151 187 133 -68 184 -77 62 -21 -51 36 -68 155 -68 -113 222 -200
4453 -200 -186 157 -270 83 251 -73 -85 82 -247 126 -221 161 51 -275 150 209 -209 214 -137 55 201
4474 201 -172 205 -5 -263 21 -166 19 178 -7 87 -27 -164 176 25 -285 199 -163 284 82 -108
4494 -108 95 59 120 183 4 -67 125 -71 -45 170 -134 306 -175 -136 267 -159 249 -40 -76 378 -352 -26
$$ packed form
4342A08r9J22R2j97N7j18j55N14m82m5J08l1J29j1l5Q3p1m5J04k38N19k83k05
4365a79L01k85J67K63l41K4K46l87L16J02k80K39l62J80q4l54O32l30j0L34l60
4386a68M8K88k65J73J7l05L04k42J72nl13L38j17j4N15m19J7J43l35K38O5j19
4408A6K09j59p7K21l14K44j00k23R5J00j27J42q4J06j47o1M79l96p6L16k56j05
4430a97J65j08L08pk87K39l40P6L38n4k01K52k61J39q3l0Q7j04K23k23m5L35m22
4453b00J4L43m27L53J68l24j2J67l29L73l47L82j10l26M25N9m18M23l51J92J46
4474B01l73L77k10k58K84j87J85J59j85R4j14j37L40j51l10M84l62M47k02j90
4494a08K03l6O1O3j79p1J92j96K6K15l04M40m81L9M03m26M08k89l6M54p30L26
$$ plain form
4516 -26 -9 -273 44 43 36 135 -93 -86 -161 -3 142 75 -234 78 30 72 253 -42 150 44 -119 242 86 10 65
4541 65 -224 -42 276 -193 9 37 -91 108 -81 42 90 -238 -50 -92 0 254 -50 93 332 -101 230 -66
4563 -66 -158 257 -52 -1 203 -275 111 94 -108 140 44 64 -47 -250 -24 90 -251 138 -140 -179 86 28 181
4586 181 183 67 -30 136 -161 89 -11 -49 17 -144 55 10 46 113 -152 -216 378 -5 267 112 -129 -68 -173
4609 -173 -31 -155 -205 -245 26 -24 145 0 -97 144 -141 52 145 -141 4 -10 47 195 -215 52 165 -334
4631 -334 26 69 -89 226 -46 39 122 -68 -144 29 -153 33 -120 153 -13 -280 67 -13 -140 138 37 -245
4653 -245 50 -182 267 67 -214 205 1 -193 254 -288 26 -19 -161 108 -151 -112 276 -260 -195 223 -54
4674 -54 49 127 -62 62 81 -143 85 -178 103 102 -121 275 -158 4 69 29 115 148 18 209 190 -89 104
$$ packed form
4516b6J7k64L17jpR9k28Pp5J58J45o7l09L12m8M2J81k95J92j06j63L61j56p6N5
4541F5k89J82L18m69K02K8j28J99j89J23M8l28J88m2R2K54l04J43K39m33L31k96
4563f6r2M15l09N1K04m78L86j7k02K48r6K0j11k03K26J14l41L89k78l9K65n8J53
4586A81Kj16r7J66k97K50j00l8O6j61J99m5L6O7k65o4N94l83K72j55k41O1j05
4609a73J42j24n0m0K71n0J69j45r7K41k85J93R3k86J45j4N7J48m10K67J13m99
4631c34L60M3j58L15k72Q5Q3j90p6J73j82J86j53K73j66k67L47q0j27K78j01k82
4653b45K95k32M49k00k81M19k04j94M47n42L14m5j42K69k59L9L88n36O5M18k77
4674e4J03P8j89J24J9k24K28k63K81jk23L96m33J62O5m0Q6L3j30J91j9k79J93
$$ plain form
4697 104 -95 131 -193 -261 34 -112 -141 51 132 -244 -76 -117 -106 191 4 115 -128 -55 94 -218 208 42
4719 42 77 100 97 -69 53 20 84 26 1 184 63 -91 146 -127 5 91 -279 1 34 -193 211 -110 73 71
4743 71 -152 141 9 127 162 81 119 160 -16 -37 138 -186 307 -114 148 -16 7 189 -63 -227 100 -110
4765 -110 -83 67 -174 -24 36 18 17 -108 38 -142 45 -130 122 23 -42 -79 -77 158 -183 148 96 52 192 40
4789 40 33 144 -25 -75 175 -17 30 -130 -191 79 -113 146 -41 -41 -90 91 -223 42 -108 -72 35 -310 153
4812 153 -15 -150 16 -137 97 159 132 -99 22 -29 237 -15 -254 226 -143 -1 158 -121 12 -198 21
4833 21 260 -106 38 157 37 -109 63 -120 77 -304 -9 80 81 190 205 -16 54 -38 -142 80 54 129 -124
4856 -124 60 109 154 187 114 -19 78 -75 -190 -41 124 -152 50 -123 -111 38 -233 -49 -31 -153 -82 -300 98
$$ packed form
4697A04j99K26l24o8K95j46k9J92Q1l76J68m1J1K97j87J11k43P3J49l12M26j66
4719D2L5K3lj66J22l3O4n8k5J83j21j54K37k73J32Q6l70K80L3k27M04l21J83k
4743G1k23K93j32J18L5q1L8M1j76k1J75l24M93m21K62j64K3J82k52j64L27k10
4765a10K7J50k41J50O0j8jj25J46j80J87j75K52r9o5l7KK35l41L31n2m4J40j52
4789D0pJ11j69n0K50j92M7j60o1K70j92K59j87%m9J81l14K65j50L6J07l45M63
4812A53j68j35J66j53K34O2k7k31J21n1K66k52k39M80l69J42J59k79J33k10K19
4833B1K39l66J44J19j20j46J72j83J97l81K95Q9JJ09J5k21P0r2j04K22k6P5k53
4856a24J84M9M5L3p3j33R7j53j15J49J65k76K02j73J2J49k71J84J8j22P1k18L98
$$ plain form
4879 98 90 -225 143 3 -44 294 14 30 317 -2 81 90 48 66 92 -44 127 -173 16 141 -257 49 -249 -157
4903 -157 194 -162 -102 53 -118 112 -63 -84 235 -82 22 182 -249 -90 191 -124 97 77 15 158 -148
4924 -148 -130 -42 60 79 207 -206 39 56 15 -22 -215 114 151 -157 -76 -174 -42 -46 -110 36 27 -41 343 -20 112
4949 112 127 -374 159 -154 30 76 -54 -232 101 -202 235 -61 -204 94 -82 67 -110 -257 -123 7 -178
4970 -178 158 -60 -131 -80 -56 -124 46 -139 113 -70 2 246 -12 -25 95 -205 53 -14 -406 78 -101 -14 12
4993 12 -207 95 -141 -115 186 54 -118 -9 85 -28 -125 -174 125 -41 -99 -103 -140 42 -22 -128 149 -215 -229 260
5017 260 -190 48 2 -155 152 50 -66 -30 -74 -62 33 -99 90 -37 -272 193 -98 -52 -50 -193 91 -14 -253
5040 -253 83 -74 -105 83 -28 -11 94 -87 81 -170 -32 340 -33 166 175 -26 111 -123 118 244 -81
$$ packed form
4879I8ql15L68j40m7L38k80J6K87l19Q3Rm2J8K6j36J71l00J89J25l98L06k98R2
4903a57L51l56O0J55j71K30j75k1L19l17J04J60m31J59K81l15K21k0o2J43l06
4924a48J8Q8J02J9J28m13K45J7m1l7j93L29L7l08Q1r8J32mo4J46ro8L84l63J32
4949A12J5n01N33l13J84M6j30j78L33l03M37k96j43K98j76J49j77j47J34J30j85
4970a78L36k18p1N1K4o8J70j85K52j83P2K44k58j3J20l00K58o7l92M84j79Q7K6
4993A2k19L02k36K6L01j32j72J09R4j13r7m9K99j66n8ml7J82o4j06K77l64j4M89
5017B60m50K38m6j57L07j02j16L6m4J2R5j32J89j27k35M65k91M6Kj43K84j05k39
5040b53L36j57l1J88j11J7J05j81J68k51J38L72l73J99Rk01J37k34K41J26l25
$$ plain form
5061 -81 57 60 -13 -50 -173 -172 -47 -137 -150 48 88 44 -77 -133 -36 -122 152 113 -22 169 170 -136 169 -25 -93 344
5087 344 -214 -166 -51 -185 -111 -24 37 131 -194 41 -105 -248 -174 27 -78 90 -213 -8 171 -200 27 149
5109 149 -29 39 82 152 -13 -149 92 -140 -184 69 -145 49 80 -51 125 81 -96 17 -34 -198 -92 -78 28
5132 28 46 -228 26 -22 0 -26 -142 -60 -115 -172 149 -167 -159 334 -480 13 86 -25 290 265 -204 153 -116 -123 88
5157 88 -168 -11 -215 74 268 -111 121 28 -43 -234 24 27 96 -27 -58 36 -63 223 152 61 88 83 -272 175 -175
5182 -175 125 -22 82 3 -126 -129 -36 -188 -41 -55 -316 51 -79 10 159 -109 -11 71 -58 53 50 -246 154
5205 154 -36 -71 94 20 -117 205 1 178 -35 131 9 -129 31 43 -38 150 13 -161 -151 -253 84 6
5227 6 -217 4 14 -190 28 -190 79 179 -49 277 62 -177 129 -89 -114 -121 -29 15 -57 -65 74 45 -33 307
$$ packed form
5061h1J38Lp3l7j23JJ25r0j3J98M0m4j21n6R7q6K74l9j35J91Jl06L05j94o8M37
5087C44n58M8J15j34P4Q7O1R4l25K35j46j43P4K01j05J68l03K05J79l71K27J22
5109A49j78O8M3P0j65j36K41k32m4K53k14J94L1j31J76m4j77J13n1j64J06J4J06
5132B8J8k74K54m8K2k6j16Q2n5n7L21l16QM93q14M93P3j11L15k5m69L57k69pK11
5157H8k56J57k04K89J94l79K32r3p1j91K58LO9j23l1R4r9K86p1r1K7nl55M47l50
5182a75L00j47J04p9j29lR3j52J47j4k61L67j30Q9J49k68R8Q2j29J11lk96M00
5205A54j90l5J65p4j37L22k04J77k13J66j22j38J60J2q1J88j37j74J0j02L37p8
5227Fk23K21J0k04K18k18K69J00k28L26k15k39L06k18k5pR2M4p2qJ39k9p8L40
$$ plain form
5251 307 -138 131 113 -230 122 -72 -158 30 -222 49 -86 -301 65 -97 9 260 -33 -10 117 -6 83
5272 83 55 19 298 10 152 39 14 73 -93 -261 252 19 -95 -37 -370 123 20 -113 59 -189 -85 141
5294 141 67 -85 29 -219 150 -78 -2 259 -57 161 -80 -132 64 -8 -176 267 40 100 304 -41 -41 -101 -127
5317 -127 170 -80 38 172 -43 82 -73 -82 76 -191 44 -90 -191 133 179 78 -76 -184 -182 106 -265 88
5339 88 67 61 -50 18 109 186 -96 14 127 -236 19 124 -257 -40 -76 -17 15 -179 -221 -159 -109 8 -33 -118 126
5364 126 -91 58 -122 -94 184 51 38 30 -102 40 52 -95 94 -99 -36 117 -134 118 53 -40 179 -96 -114
5387 -114 -5 -203 -261 79 -200 264 -130 -135 146 -291 89 -191 -57 129 168 25 95 20 -52 128 -185 137
5409 137 -70 -161 163 222 122 44 -278 105 -76 -134 -94 -75 140 83 -129 18 -53 -82 234 154 -99 102 -133
$$ packed form
5251C07m45K69j8l43L52j94q6J88k52K71j35k15L66j62J06K51k93K3J27j23Q9
5272H3k8l6K79k88J42j13k5N9j66j68N13k33j14N8l33M93j03j33J72k48J04K26
5294A41p4j52J14k48L69k28P6K61l16K18k41n2J96p2j68M43k27O0K04l45%o0k6
5317a27K97k50J18J34k15J25j55rJ58k67K35j34j01L24M6j01j54j08KK88l71L53
5339H8k1oj11O8R1P7k82J10J13l63K55J05l81K17l6N9L2j94m2O2N0J17m1q5K44
5364A26k17J49j80K8K78j33j3qj32J42J2j47J89j93O3J53k51K52o5r3K19k75j8
5387a14J09j98n8L40k79M64l94nK81m37L80k80J34J86L9j43P0p5p2J80l13L22
5409A37k07r1L24N9j00p8l22L83j81n8M0J9K15n7k12J47p1k9L16q0k53K01k35
$$ plain form
5432 -133 113 144 -61 153 -57 27 205 83 -1 11 -57 -158 -30 -280 105 -134 87 81 -216 -4 75 -246 21
5455 21 61 -207 30 -294 -73 191 -127 149 149 14 201 -12 138 151 -12 211 -106 -69 20 55 -46 142 25
5478 25 112 -32 -166 -45 -115 -183 227 -326 151 -109 -173 251 -276 -57 55 -68 77 35 -96 183 -124 -153
5500 -153 91 -115 169 67 -244 56 -18 5 157 -134 210 68 108 65 1 -145 312 -216 -24 124 -203 -122
5522 -122 -23 -243 -71 11 32 31 -206 151 94 -146 125 -87 -64 76 -204 189 154 -106 204 -104 -38 164 -115
5545 -115 211 60 118 255 -226 -60 -171 -36 15 -176 5 132 -95 -22 247 -35 59 326 -89 -13 -10 -19 361
5568 361 -54 -134 140 -93 29 10 -72 253 -17 -63 -64 -192 231 87 -303 -19 -16 121 304 -331 22 98 -28
5591 -28 -39 -57 -37 219 -72 127 351 -30 81 290 -220 102 -45 164 -60 -299 242 -282 -47 137 -113
$$ packed form
5432a33K46L1k05K14k10Q4J78j22q4J2o8j01J28k50L85k39K21ok97K12P9l21K67
5455B1M0k68K37l24K21K64l18K76%j35J87k13J50J3j63K23l17L7Q9L5j01J88j17
5478B5Q7j44j34J21p0o8M10n53M77k60o4M24n27K19J12j23J45m2j31K79l07k9
5500a53K44k06K84j02l11L00p4K3J52k91L44j42M0m3o4j46M57n28J92J48l27Q1
5522a22R9k20J72Q2K1jk37L57n7k40K71k12K3J40k80L93l5k60L10l08O6K02k79
5545a15L26j51N8J37m81J66j11J35N1j91J81J27k27P3K69k82R4K67m15P6LrL80
5568C61m15q0K74k33J22j9q2L25k70m6jj28M23j44l90K84LJ37J83o35L53P6j26
5591b8j1j8K0K56k91J99K24l81J11K09n10L22j47K09k24k39N41n24K35J84k50
$$ plain form
5612 -113 47 58 -351 -75 -61 -256 80 -207 -78 57 -434 -60 215 41 223 -8 33 288 19 -56 162
5633 162 -151 264 -110 -28 70 19 102 -110 -86 180 -84 -91 187 -210 -160 -85 -50 -101 -79 -27 -21 -236 -20 -152 -180
5658 -180 113 136 -80 95 190 -179 67 32 231 152 -172 75 -91 -150 322 -212 -101 46 88 6 -38 -36 86
5681 86 -104 62 144 -265 169 85 38 -53 -325 217 259 -307 177 -38 -142 96 -17 16 132 -214 52 -7 -156
5704 -156 250 -154 -54 107 -70 77 109 -100 -74 -73 41 14 53 108 83 -241 -30 -128 -108 425 -31 118 132 3
5728 3 258 -101 -200 194 -302 127 -31 -340 -30 -169 -120 28 98 16 -74 -102 -13 -105 -157 -29 -150 -41 133 4
5752 4 217 141 -80 126 17 -47 146 -88 154 21 -92 6 126 -350 146 -5 -118 123 -96 98 -22 -110
5774 -110 102 -86 -22 111 -391 16 -51 -248 102 -206 -40 222 -103 133 47 -102 119 -9 -133 206 -141
$$ packed form
5612a13J60J1m09K76J4j95L36k87J29J35m91L74K75j74J82k31M1K55k69p5K18
5633A62l13M15l74Q2R8n1Q3k12K4K66k64pK78l97N0P5L5n1K2N2Ok15K16j32k8
5658a80K93K3k16J75R5l69K46l5J99p9l24K47j66n9M72n34J11J47M2q2m4KJ22
5681H6j90J66Q2m09M34q4m7r1k72N42M2n66M84k15j04K38j13L3J16l46K66n9j49
5704a56M06m04J00J61j77J47L2k09K6JJ14k7L9N5k5l24K11r8K0N33m56J49J4j29
5728CK55l59r9L94m96M29j58l09L10j39M9J48P0q2r0k8Q9r2n2J28j21J09J74j29
5752DK13p6k21K06j09o4J93k34K42j33j13R8J20m76M96j51j13K41k19J94j20q8
5774a10K12j88O4J33n02M07o7j97L50l08J66K62l25K36q6j49K21j28j24L39l47
$$ plain form
5795 -141 328 140 -70 124 -101 142 313 21 -48 -8 -113 69 227 -202 206 -114 -11 118 -212 85 7
5816 7 -204 79 52 154 -203 -165 -3 215 -185 81 147 7 142 24 17 -149 -67 169 -102 96 65 -189 119
5839 119 311 -62 21 -41 -82 205 -173 -162 -5 -92 88 18 -109 66 -356 -108 99 4 6 111 156 15 29 91
5863 91 138 123 49 0 -13 -28 -59 6 62 66 -157 -117 -36 80 144 110 79 -43 -131 133 7 139 -108 -282 246 -30
5889 -30 11 119 70 137 -266 58 10 -201 -45 100 -123 68 43 -184 154 -224 -22 12 -202 76 -62 -290
5911 -290 -24 -125 -145 61 -138 168 56 64 -123 97 -13 82 120 157 -62 -148 279 70 14 205 -184 18 92
5934 92 -234 -123 -127 -130 -60 -34 -122 125 -15 68 -151 -486 123 -131 83 -3 92 96 10 72 97 6 -106 112 -92 -43
5960 -43 7 -130 310 141 -114 231 -108 -42 -97 -89 -70 -22 -74 78 -14 90 -46 -36 61 29 -72 151 45 56 184
$$ packed form
5795a41M69j88k10J94k25K43J71k92o9M0j05J82J58m29M08l20J03J29l30K97p8
5816Gk11K83k7J02l57L8J62K18m00K66O6j40J35j18pj66Q2K36k71J98l1k54L08
5839A19J92l73Q3o2m1K87l78J1J57q7J80p0j27J75m22K48K07r5KJ05M5j41J4O2
5863I1M7j5p4m9j3j5l1O5N6Mk23M0Q1J16O4l4l1j22q8K64j26J32k47j74N28k76
5889c0M1J08m9O7m03L24m8k11J56J45k23J91k5k27L38l78K02L4k14K78j38k28
5911b90K66j01k0K06j99L06j12Qj87K20j10R5L8L7k19q6M27k09n6J91l89K02P4
5934I2l26J11mlP0K6q8K47j40Q3k19l35O09k54K14q6R5Mq6O2K5r1j12K18k04M9
5960d3N0j37M40j69k55L45l39O6n5QJ9M8n2J52r2J04j36J0R7l2j01K23j06J1J28
$$ plain form
5985 184 28 -5 -55 -63 19 -115 -225 183 -29 98 -128 -69 87 42 -24 78 -234 55 -65 -144 79 -5 -215
6008 -215 185 -16 10 -55 -129 134 27 94 52 -32 204 119 45 41 0 63 4 -158 82 202 -188 68 -182 -41
6032 -41 64 -3 51 143 -257 282 -30 35 291 -10 64 165 92 118 135 -28 186 -31 37 79 -14 17 46 45 188
6057 188 47 120 265 55 -39 132 -142 104 190 -7 276 13 -93 153 -327 43 0 -188 12 55 124 19
6079 19 -144 255 125 -42 103 12 -122 338 -53 6 -81 84 -3 -113 38 142 -28 -47 244 -189 5 -146
6101 -146 100 107 247 97 59 -218 87 90 10 -5 -22 155 -5 -108 84 -173 -66 6 -195 -33 -15 69 -26 -52
6125 -52 39 49 -76 45 100 -97 74 -85 -109 300 -55 -44 -7 -227 50 49 -55 207 69 -92 92 -72 -87
6148 -87 -27 -100 48 131 2 238 4 15 66 -71 215 37 -294 92 -165 -11 57 -199 53 -103 -128 -9 -37
$$ packed form
5985A84j56l3n0qQ2j34j10M08k12J27k26N9J56m5o6J02l12K89j20p9K23q4k10
6008b15M00k01K6o5p4K63j07O7m2q4K36q5p4mm1O3n9j62K40J20l90K56k50J41
6032d1J05o7N4R2m00N39l12O5K56l01P4J01p3K6J7j63K14k17O8M2r3L1K9jJ43
6057A88j41P3J45k10r4J71k74K46Q6j97K83k63j06K46m80L70m3j88K00M3O9j05
6079A9j63L99j30j67J45r1j34M60l91N9q7J65q7j10J51J04j70j9K91m33J94j51
6101a46K46PJ40j50l8k77L05Lq0j5j7J77j60j03J92k57J07P2k01J62J8Q4r5k6
6125e2R1J0j25J21N5j97J71j59k4M09l55J1L7k20K77jj04K62j38j61J84j64j5
6148h7O0p3J48Q3j29K36k34J1N1j37K86j78l31L86k57J54O8k56K52j56k5J19k8
$$ plain form
6171 -37 85 102 82 120 189 -222 54 87 -53 162 0 108 179 -189 105 61 -244 106 -91 99 23 101 73 65
6195 65 -79 -128 118 23 -50 -189 -52 148 -11 174 -4 33 -149 -28 126 65 -142 -69 43 -218 106 66 -36
6218 -36 43 -150 252 0 -275 125 -98 197 -58 -267 -129 -41 -227 261 -10 -53 249 -182 95 105 125 34
6240 34 -16 10 53 17 -27 120 -180 123 -37 96 220 -83 0 104 -296 -117 -89 -306 54 -127 -112 6 60
6263 60 3 -81 -200 -29 254 -12 107 -177 -4 64 -181 100 15 118 59 -78 -18 -5 -59 4 -6 -187 186 -200
6287 -200 244 147 54 0 -50 24 207 -10 44 44 -198 110 -130 -153 -20 43 122 110 -334 25 268 37 -6 159
6311 159 203 -48 -176 122 152 -29 259 -44 -136 32 -138 -129 128 -207 6 -74 -111 90 3 171 161 100 109 -30
6335 -30 -40 98 -92 14 48 -18 90 -93 -34 -74 -95 -59 123 15 -92 -125 -13 269 -308 12 176 -114 30
$$ packed form
6171c7J22J7k0L8O9m11K76L3j40K15j62J08P1l68K94m4l05L50j97J90p6P8k8q
6195F5j44m9K46r5p3j39J37K00j59J85j78L7j82J21J54o1k07P3J12k61L24m0j02
6218c6P9j93M02k52k75M00k23K95k55k09J38Q8j86M88k71m3L02m31K77J0K0r1
6240C4n0K6M3l6m4J47l00L03j60J33J24l03Q3J04m00J79K8k17L60j81J5J18N4
6263F0n7q4j19J71K83k66J19k84J73O8k45K81q5J03n9j37O0J3n4O3j0j81L73l86
6287b00M44r7r3n4n0P4J83k17N4%k42L08k40k3J33O3P9j2m44L59K43k31m3J65
6311A59M4k51j28K98L0j81K88l03r2J68j70RK57l35K13q0l7K01q7J68j0o1Rj39
6335c0j0J38j90J06L4o6J08j83N9m0k1L6J82j08j07l3J12K82n77L20J64k90J44
$$ plain form
6358 30 1 -62 -157 -61 80 44 -112 98 28 -13 48 -210 109 -102 -147 156 229 -20 244 205 -52 48 3 211
6382 211 -46 -96 53 208 55 215 -67 -44 219 -58 162 -53 -134 -95 111 117 14 -144 149 75 -265 44
6404 44 25 71 43 -86 105 27 -73 -21 -234 110 213 113 195 -35 -143 -50 -158 -99 -6 14 -116 48 -92 19
6428 19 -146 5 83 -3 -13 -92 -14 42 81 -90 -47 -155 -152 -62 -343 63 282 -45 -90 -172 -201 -92 -119 -41 -64 50
6454 50 -92 -19 47 67 11 -6 34 -5 195 -97 -44 37 76 130 118 17 7 102 -182 289 -150 126 194 -102 189
6479 189 39 -133 130 -28 33 -197 -135 -227 -71 -100 36 -55 -31 218 -71 -151 -39 30 273 53 -225 116 26
6502 26 11 205 67 -19 87 67 106 -123 11 -57 -194 -14 0 -157 -95 -253 -32 -43 -38 -4 -55 -150 60 -69 142
6527 142 90 -175 -16 -95 -114 209 -53 11 26 -180 149 178 -153 263 11 132 220 -107 72 -5 -31 332 -74
$$ packed form
6358C0k9o3r5R6J41l6j56K10p0m1O1k58L19k11m5L03P3k49K64l9k57J00m5K08
6382B11k57n0J49J55j53J60k82K3K63k77K20k15q1L9K06Oj03j58K93p4l40L09
6404D4j9M6k8j29J91p8j00N2k13L44J03j00Q2k30j08R3j08N9R3K0j30J64j40J11
6428A9j65J51P8q6j0p9P8N6L9j71M3j08LR0k81M06K19l27m5q2k9J09k7P8k3J14
6454E0j42P3O6K0n6j7M0l9K00k92N3Q1L9N4j2j01j0R5k84M71m39K76O8k96K91
6479A89j50j72K63j58O1k30O2r2J56k9J36r1K4K49k89q0J12O9K43k20k78L41r0
6502B6j5J94j38q6J06k0L9k29J34o8j37J80J4j57O2j58K21j1NL4n1r5K10j29K11
6527A42n2k65J59p9j9L23k62O4J5k06L29K9l31M16k52J21Q8l27J79p7k6L63m06
$$ plain form
6550 -74 -12 185 -63 130 136 62 88 -154 34 104 -78 -9 -3 -26 -105 -205 87 257 157 -132 13 -22 78 -11 -19
6575 -19 195 -173 -98 21 -153 151 -71 -178 38 -170 -3 114 -138 -29 53 -55 3 -143 -125 117 -86 -80
6597 -80 -87 -77 -68 127 262 135 -9 31 104 -171 92 -94 27 131 40 -20 162 -209 -9 -75 -72 -15 -90 -196 -95
6622 -95 60 -23 -211 -130 102 85 142 -186 -184 73 14 -14 88 -135 -120 154 -87 -75 42 -59 159 80 -82 152
6646 152 -318 -100 122 -187 94 62 -45 187 -131 -77 22 -173 -21 -78 7 169 59 2 -24 -171 13 153
6668 153 -22 118 -16 14 -49 -138 -54 -68 3 30 -237 -185 -79 -27 128 -1 -133 43 -64 -76 113 4 -181
6691 -181 29 10 143 247 75 128 -76 -40 -92 -81 121 3 45 78 -21 -141 -146 -170 186 125 -80 25 -62 -46 18
6716 18 -18 36 118 9 140 -49 181 108 0 1 -60 -118 192 124 14 106 -38 -141 131 -61 4 -94 -104 76 55
$$ packed form
6550g4O2J97k48J93Op4K6k42J88P0j82O9Ok3p9j00K92J70j00k89J45l5J00q9q
6575a9K14l68P5J19j74L04k22j07K16k08J67J17k52J09Q2j08N8j46J8K42k03O
6597h0pJ0RJ95J35j27j44M0P3k75K63j86J21J04r1o0J82l71K00o6LN7p5j06J01
6622i5J55q3j88Q1K32j7N7l28KK57n9k8J02k23J5K74k41J2J17j01K18p9j62K34
6646A52m70K18K22l09K81l2j07K32l18N4R9j95J52n7Q5J62j10n7k6j47J84J40
6668A53j75J40j34L0o3q9Q4j4P1K7k67N2J06N2J55j29j32J76j07j2J89j09j85
6691a81K10j9J33J04j72N3k04L6n2J1K02j18M2L3r9j20nk4L56o1k05J05q7J6O4
6716A8l6N4Q2j09J31j89K30p3j08Jo1n8L10o8j10R2j44j03K72j92O5r8j0J80k1
$$ plain form
6741 55 -14 204 -293 -23 106 42 105 -145 69 -36 -43 -123 45 -122 38 -30 78 -40 -83 114 -108 138 106
6764 106 67 -68 126 -62 113 200 113 266 233 29 56 119 145 149 -54 72 -184 -152 -17 8 -90 -32 -27 22 78 -125
6790 -125 150 129 -25 116 -23 230 169 -34 65 -24 49 145 -73 -58 -120 -227 -95 -84 -153 21 -81 31 -39 -46
6814 -46 -48 37 -154 5 -139 -149 283 13 -185 -158 24 171 126 182 77 -60 109 43 116 130 51 -195 -133 -18
6838 -18 101 129 -173 119 23 127 160 105 -115 -11 70 20 37 -52 -99 -45 13 124 -32 11 46 138 218 -89 20
6863 20 69 -40 158 186 -93 116 93 97 205 42 -132 68 -76 -110 59 21 214 -114 181 -2 -102 53 27
6886 27 158 192 72 74 80 -12 94 12 -46 116 -23 -59 50 -179 154 75 154 65 118 -172 -40 -38 101 78 -83 100
6912 100 -148 -27 149 -78 -96 43 -123 -39 120 67 51 85 2 152 186 148 64 65 41 4 157 151 17 88 100 -13
$$ packed form
6741E5o9K18m97K70J29o4O3k50K14j05pq0J68j67J60o8J08j18m3J97k22K46l2
6764A06l9j35J94j88J75Q7q7J53l3k04K7O3K6Mk03J26k56L2J35K5r8N8NM9N6k03
6790a25K75k1j54J41j39K53o1k03R9q9P3R6k18J5o2j07J32J1o9J74j02J12p0p
6814d6kQ5j91J59j44j0M32k70j98K7J82J47m5N6j05j37J69o6P3J4p9k46O2J15
6838a8J19K8l02K92r6J04L3n5k20J04Q1n0J7q9m7N4N8J11j56M3L5R2Q0l07J09
6863B0M9j09J98K8k79K09k3MJ08j63j74K00j44l4J69l8J93l28K95j83j00J55k6
6886B7J31L4j20KOr2J06q2n8J62j39l6J09k29L33p9P9q9N3k90J32KJ39k3j61J83
6912A00k48J21J76k27j8J39j66Q4J59n3j6L4q3J50L4l8q4Jk4l7J53oj34P1J2j13
$$ plain form
6938 -13 195 152 -67 9 -244 -112 -44 41 190 20 153 108 -64 65 109 188 252 57 -20 45 -104 26 -13 -1
6962 -1 101 -127 -133 124 -74 -93 44 -177 195 187 -85 91 -218 -110 -22 49 -38 16 129 78 -194 83 -75 97
6986 97 131 234 -75 -1 165 -28 -40 -85 157 116 -43 14 -41 -37 38 -95 -99 -4 2 -197 44 19 25 -183 72 88 -197
7013 -197 80 113 237 14 -87 136 133 136 152 87 -96 32 -55 100 -44 -222 37 -113 -274 107 -304 11 112
7036 112 -306 -126 -20 93 35 -32 -113 298 57 157 193 -92 100 80 49 -1 -69 4 60 -105 338 -197 -182 -97
7060 -97 -120 -155 56 -38 235 116 -214 -105 -258 237 218 -186 7 178 -167 56 -67 -188 156 -188 37 114
7082 114 50 200 9 -103 36 -3 12 14 -131 -160 124 113 -54 -205 32 86 -194 43 62 -74 -4 -171 137
7105 137 62 -171 99 77 -115 18 174 -41 -36 -24 58 57 28 257 -3 2 105 -127 42 43 22 41 135 -110 61
$$ packed form
6938a3K08m3k19P6k53J32O8Q5J49j70J33m5j72J29M4P9O4j95p7O5j49J30l9J2
6962aJ02k28oK57j98j9J37k21L72qk72J76l09J08Q8P1q7N4J13n1k72K77j58J72
6986I7L4J03l09P4J66j93j2m5K42m1j59N7n5MP5j33mR5Oj99K41k5Ok08K55J6k85
7013a97K77L3J24k23j01K23lLJ6o5j83J28q7J55j44j78K59j50j61L81m11L15J01
7036A12m18J80J06J13n8o7q1M11k41J00L6k85J92k0l1n0o8P3N6j65M43n35J5Q5
7060i7k3l5K11r4K73j19l30J09j53M95j9m04J93J71l45K23j23j21L44l44K25P7
7082A14o4J50j91j12J39l9J5Kj45k9K84j1j67j51K37N4k80K37J9j36P0j67L08
7105A37p5k33K70k2j92J33J56k15NJ2Q2jk9K29k60NJ03k32J69Jk1J9R4k45J71
$$ plain form
7130 61 -80 68 -245 63 -47 -81 16 76 -138 -45 -144 -37 181 108 -71 27 -153 -291 -37 51 205 9 62
7153 62 32 -99 -105 -113 -9 149 -28 -19 -150 90 -170 46 -39 -49 88 -56 -86 122 65 218 29 -87 -66 3 50
7178 50 50 -2 210 -96 12 190 -160 41 -61 157 105 -41 -98 -126 -154 142 22 57 -32 -180 62 136 83 -58
7202 -58 -174 -51 149 -184 -5 81 46 10 4 223 215 148 -68 132 19 -83 -139 59 46 -8 147 -48 -304 39
7226 39 56 -221 -8 -68 -109 -184 -116 -28 69 40 -19 -21 -281 64 1 -299 55 -3 87 21 -3 88 -125 -57 130 -23
7252 -23 35 -6 -283 -119 -51 -25 36 -76 -55 155 -181 152 -87 10 63 -220 -98 63 10 -10 0 -68 60 -48
7276 -48 33 251 79 34 -80 5 110 65 -276 -27 107 2 -45 -22 64 -30 -73 67 -51 40 125 -149 -200 -34
7300 -34 -13 161 -29 127 5 -72 -62 -63 -10 -40 91 137 -114 -119 -169 -112 6 218 103 -80 79 78 -6 -27 -92 -75
$$ packed form
7130F1j41J48l13L08j10l4R7O0k14R3r9J07K18p3j79R8j80j38K54Q8J54j96N3
7153F2l0j31oqJ04J58j77Rj31K40k60K16q5j0J37j44l0K08n7J53j89j16K1O9M7
7178E0%n2K12l06J08J78l50K01j02K18n2j46n7k8k8K96j20L5q9j48K42P4n3j41
7202e8j16J23K00l33J79Q6l5l6oK19qo7k16K00j13j02n6J98j3n4J55j95k56L43
7226C9J7k77K13o0m1p5O8Q8R7k9n9kk60L45o3l00L54n8R0o6k4R1k13O8J87j53
7252b3N8m1k77J64O8K6O1j12K1K10l36L33k39R7N3k83J22J61n3k0J0o8J28j08
7276d8Q1K18j72m5j14Q5J05m5l41K49J34j05m7K3Q6r4m3J40j18R1Q5k74n1J66
7300c4K1J74j90J56j22p7J0jN3l0J31M6k51nn0N7J18K12j15j83J59jq4k1o5J7
$$ plain form
7326 -75 64 -32 75 -99 188 24 94 230 33 -84 42 78 74 -75 -44 -53 -25 62 226 -170 54 196 27 -12
7350 -12 -140 57 37 -21 -70 -43 57 109 0 139 140 121 -19 -6 42 147 -101 -74 177 -93 218 49 4 97 181
7375 181 -18 39 22 178 -139 -130 15 110 -67 -212 97 1 -40 -76 -104 17 4 -46 58 -256 140 -2 231 28
7399 28 -197 3 -89 88 -35 130 -91 -150 -84 -77 -112 -151 133 -31 63 -111 -93 161 42 -232 105 5 -114
7422 -114 52 -59 -113 56 -139 96 -3 -173 75 -78 158 -83 -259 -150 2 -79 -32 -88 48 44 -93 -88 48
7445 48 -107 -12 156 0 83 37 38 -62 -79 99 15 -169 -10 5 -245 68 12 -31 -60 -121 163 12 158 115 -116
7470 -116 -8 -125 34 -3 43 56 112 -108 11 83 67 199 -153 -4 255 83 80 -62 -27 68 -8 -54 151 74
7494 74 19 -135 -172 23 -99 63 -66 -3 -57 390 -193 167 118 93 95 146 166 -35 -15 -16 -66 33 126 -136 67 70
$$ packed form
7326g5J39r6J07j74K87j64P0J36j97j17J26L6mj49L1rK8Q7J64l96K24J42j69l9
7350a2j28J97k0n8m9K7J00N2j09J39Jj9j40J3M8J05k48K7K51k70L11j69m5R3Q4
7375A81j99N7j7J56l17RJ45R5j77j45L09r6m1l6k8J21j3n0J04l14L96j42K33k03
7399B8k25K00r2J77j23J65k21n9O6Pl5l9K84j64R4j74J8K54j19k74L37j00j19
7422a14J66j11n4J69j95K35r9j70K48j53K36k41j76J09J52q1M7n6J36mj37NJ36
7445D8j55R5J68j56Q3m6Jj00j7J78q4j84J59J5k50L13n6m3k9o1K84j51J46m3k31
7470a16J08j17J59l7M6J3N6k20J19P2j6J32l52J49K59j72lj42L5R5p6m6K05p7
7494G4n5j54l7J95j22J62j29O3n4M47n83L60m9k5KN1K0k01K0jn0R9R3k62K03L
$$ plain form
7520 70 -73 118 -148 -84 -22 -28 -103 -178 -41 -62 -108 69 -75 -80 -75 -58 -83 -16 19 58 -9 117 -7 119 0 -43 -103
7547 -103 -54 11 -113 -6 -41 -140 -66 -4 9 240 -56 -2 -40 -81 -129 77 192 162 105 52 -99 61 36 -54 131
7572 131 -55 7 -25 -59 -78 96 -40 -162 99 208 -134 151 -84 -7 378 -200 -105 -23 -151 -16 25 -37 34
7595 34 -59 205 -7 7 147 86 67 28 -88 30 -29 -28 291 -21 -136 100 -3 20 167 -53 -218 110 81 -167
7619 -167 11 -88 6 -224 6 -49 -85 244 -90 52 142 -96 -24 155 16 51 134 -88 177 60 130 177 -158
7642 -158 -54 -103 -51 187 -82 69 184 -126 148 17 2 -22 -5 106 4 5 -22 -106 74 106 -188 -42 73
7665 73 76 212 -175 8 92 -226 32 -50 -26 18 26 -73 61 -114 -24 -149 137 -81 -60 150 -69 -170 99 69
7689 69 -26 -42 68 41 188 162 1 121 21 52 178 -12 -1 143 16 212 -19 -57 65 -72 -47 132 -21
$$ packed form
7520G0j43J91k66O4O2op5p5J37k1m6J77j44nNJ7k5O7L5L9o7J26j24J26j19m3o0
7547a03M9O5j24J07l5r9P4O2J3K31k96N4l8m1m8K06J15l0n7n3j51J60k5r0J85
7572A31j86O2l2l4j9J74j36j22K61J09l42K85k35P7L85n78R5Q2j28J35M1o2P1
7595C4r3K64k12J4J40o1j9l9j16J18n9JL19l12j15K36j03K3J47k20j65L28k9k48
7619a67J78r9R4k30K30n5l6L29l34J42R0k38P2J79j39L5Q3k22K65j17P0M7l35
7642a58J04m9N2K38k69J51J15l10K74j31j5k4J7J11j02Jk7q4J80L2k94J46J15
7665G3LJ36l87J83Q4l18K58q2K4M4Qr9J34j75R0j25K86k18K1K10k19j01K69l0
7689F9r5j6J10k7J47k6j61J20j00L1J26j90J1J44j27J96k31l8J22j37K5J79j53
$$ plain form
7712 -21 14 22 8 68 -118 -110 -52 -47 -31 -153 -15 -13 -113 14 76 -22 39 -19 221 87 109 -94 211 -28 5 119 -150
7739 -150 96 -49 -8 112 -128 106 -36 -22 139 150 -117 193 -164 -114 29 81 18 31 -42 -1 62 18 -69 -18
7763 -18 -6 -12 19 208 -159 -107 2 -146 202 -33 -74 114 79 161 9 -154 37 -95 97 290 65 -148 -117
7786 -117 -209 -50 214 -63 -81 89 -49 165 -21 -109 100 23 -35 128 -34 144 -43 297 -31 -141 -2 185
7808 185 -27 111 19 -10 8 -134 116 -96 -175 161 80 115 -16 -25 -31 -10 61 94 -36 -2 33 -60 -24 -64 -130 55
7834 55 73 -24 18 -174 160 23 57 -83 102 -17 79 -46 -6 -73 -38 -125 16 -30 148 65 -169 -36 46 130 30
7859 30 -280 51 -92 -192 -32 184 -2 -119 37 216 -54 70 107 -293 -79 46 -118 -22 -110 -33 -26 -190
7881 -190 80 185 58 165 93 -145 61 5 -60 23 -103 -16 149 -176 193 -210 -57 117 85 211 -113 -179
$$ packed form
7712b1L5Qj4O0j86QN8NJ6j22J38Kj00J27O2r8O1n8K40j34K2k03L05k39L3J14k69
7739a50K46j45M1J20k40K34j42J4J61J1k67L10l57N0J43N2o3J3p3M1O3m4q7N1
7763a8J2oL1J89l67N2J09j48L48k35m1J88l5Q2j52j63J91j32J92J93k25k13L1
7786a17r2J59K64k77j8J70j38K14j86q8K09p7n8J63j62J78j87L40l28j10J39J87
7808A85k12J38r2k9J8j42K50k12p9L36q1L5j31roK1P1L3j30L4L5r3L6m0o6J85
7834E5J8r7M2j92L34j37L4j40J85j19R6j25M0o7L5q7J41m6J78q3k34J33Q2Q4j00
7859C0l10L31j43j00J60K16j86j17J56J79k70J24L7m00K14J25j64R6q8P7Pj64
7881a90K70J05j27J07p2k38K06n6o5Q3j26Q7J65l25L69m03J53J74l2J26l24o6
$$ plain form
7903 -179 -193 -4 -144 134 -44 124 62 -41 -40 -37 -221 -70 122 9 -5 -25 -20 49 217 -136 21 -117 -29 -231
7927 -231 164 -27 21 17 -92 29 -2 -127 13 15 -137 137 175 192 -257 -157 -97 54 -12 80 -31 -140 159 -117
7951 -117 -150 -21 -107 122 -74 55 -50 2 49 12 29 62 18 169 95 -63 -82 115 13 -9 116 -21 57 -199
7975 -199 115 -31 88 -141 -138 -41 42 -92 108 86 -119 137 -31 25 145 -42 -34 -42 -162 -32 -145 -57 35 45
7999 45 36 134 -107 -78 -107 -119 151 -41 69 -75 47 -63 95 -9 3 -27 -44 -117 -88 -3 88 7 14 60 -77 -24
8025 -24 10 4 70 67 -125 211 4 -2 -22 114 45 97 36 86 -41 -127 20 -115 -1 -144 15 93 -145 65 169
8050 169 -155 251 140 -11 -92 95 -37 47 63 84 85 -39 106 -17 -108 -42 46 186 -27 38 71 111 104 -23 -51
8075 -51 -86 163 58 88 25 -140 211 -59 87 -23 -129 120 99 24 -33 19 68 32 26 -66 -236 -120 22 97 84
$$ packed form
7903a79j4J89j40K78j78J68o2j03JLj84J51J92j13j4k0NO9J68l53J57j38Q8k02
7927b31L95j91M8mj09J21l1j25J40Kj52K74L8J7m49J00O0J51o6R2j11j09K99k76
7951a17l3J29q6K29j96J29j05N2M7l7J7L3m4J51p4j58j9J97j02k2J25j37P8k56
7975a99L14j46J19k29LR7Q3j34K00k2k05K56j68N6J20j87Qqj20J30j13Q8R2J0
7999D5rR8k41K9k9j2K70j92J10j44J22j10J58j04J2l0j7p3K9Q5R1q1PM6j37N3
8025b4L4oO6lj92L36k07ok0J36o9N2o1N0j27q6J47j35J14j43J59P8k38K10J04
8050A69l24M06j11j51q1J87j32Q4J6K1Jj24J45j23r1O6Q8J40k13O5L3M0pj27k8
8075e1l5K49j05L0o3j65L51k70J46j10j06K49k1p5n7N2M9l6or2j70J16J42P5j3
$$ plain form
8100 84 -112 -134 -100 37 -96 137 -101 -153 70 -76 66 -91 160 192 0 64 0 -84 -28 -177 205 49 -116
8123 -116 18 41 -83 31 -200 21 -45 -12 75 25 34 -27 20 -47 -84 -25 -52 131 1 96 -113 120 -87 -143 -11
8148 -11 -5 77 46 -140 133 53 -89 172 69 -30 -39 60 40 28 45 156 -314 29 -117 -155 -39 116 -123 61 267
8173 267 -266 -20 22 -214 -37 -78 -25 276 -66 -24 14 -74 153 114 -221 61 16 32
$$ packed form
8100H4j96k2L4J37j33K33k38n2K23j46J42j57K51L2j92O4o4q4N6j49L82j56j65
8123a16J34K3j24J14k31K21o6L3Q7n0Ro1M7o7l7N9k7J83j30R5k09K33k07n6J32
8148a1OQ2l1j86K73q0j42K61j03r9rR9k0j2J7J11m70L43j46l8J16J55k39J84K06
8173B67n33K46M2k36J77m1N3L01l42M2L8q8K27l9l35K82m5J6
8191C2
$$ Imaginary data points
##PAGE= N=2
##DATA TABLE= (X++(I..I)), XYDATA
$$ plain form
0 0 0 0 0 0 0 0 0 0 0 0 0 0 8 -8 8 -8 8 -16 16 -17 24 -26 32 -40 48 -56 64 -72 82 -96 109 -123 141 -161
34 -161 180 -203 228 -254 286 -319 354 -394 438 -484 537 -592 652 -721 794 -875 964 -1062
52 -1062 1171 -1291 1428 -1580 1752 -1951 2183 -2454 2783 -3184 3686 -4344 5241 -6542 8608
67 8608 -12438 21969 -102158 -114573 31876 15636 -20230 -134184 -86607 15269 79892 116237
79 116237 45204 -42111 -4033 33401 104192 84347 -36165 -57197 -33061 -6725 42109 -7032
91 -7032 -36957 -36995 -50176 14927 43036 5556 -5091 -47945 -18990 44995 18790 9465 -12468
104 -12468 -40835 13341 34131 46989 47676 -20989 -13628 30913 44804 65970 -1650 -57562 -27258
117 -27258 -21326 11182 13579 -50484 -55970 -53572 -17500 51008 24249 341 -2071 -11265 49183
$$ packed form
0@%%%%%%%%%%%%Qj6J6j6J6k4L2l3M1n0N8p2Q8j04J20j36J54j78K05k32K64l02
34a61L41l83M31m82N40o05O73p48Q32r22J021j129J244j373J515j669J839k026
52a062K233k462K719l008L332l703M134m637N237n967O870q030R585j1783J5150
67H608k1046L4407j24127j2415J46449j6240l5866j13954M7577J01876O4623L6345
79A16237p1033q7315L8078L7434P0791j9845j20512k1032K4136K6336M8834m9141
91g032k9925l8j3181O5103K8109l7480j0647m2854K8955O3985k6205r325k1933
104a2468k8367N4176K0790J2858O87o8665P361M4541J3891K1166o7620n5912L0304
117b7258N932L2508K397o4063n486K398L6072O8508k6759k3908k412r194O0448
$$ plain form
130 49183 62985 31881 31731 -14955 -22869 8568 -560 13914 -14574 -58910 -31912 -26179 -2031
143 -2031 25583 -15020 -14759 -8927 -8267 44502 35220 2831 -1223 -19832 18753 39167 1338 -2817
157 -2817 -24198 -17439 29060 8624 -5401 -16767 -39580 5472 19131 -4661 -13640 -48376 -25561
170 -25561 16744 835 1693 -23391 -39268 8715 16362 20839 20896 -20341 -5189 15565 16267 35950
184 35950 3169 -14457 2137 -11186 13099 19254 -10263 -1183 -17389 -15791 19640 5625 5918
197 5918 -319 -24182 5528 10679 6695 17823 -16186 -13173 9552 1747 19186 1215 -21469
210 -21469 3619 1824 11469 15120 -18246 -5871 2646 1282 23243 -4436 -17578 34 -5957
223 -5957 17865 15147 -15980 -6569 -12383 -702 22733 -3654 -7122 -11705 -23661 10773 10669 -1360
$$ packed form
130D9183J3802l1104j50m6686p914L1437r128J4474k8488m4336K6998N733K4148
143b031K7614m0603K61N832O60N2769r282l2389m054j8609L8585K0414l7829m155
157b817k1381O759M6499k0436j4025j1366k2813M5052J3659k3792q979l4736K2815
170b5561M2305j5909Q58k5084j5877M7983P647M477N7m1237J5152K0754P02J9683
184C5950l2781j7626J6594j3323K4285O155k9517R080j6206J598L5431j4015K93
197E918o237k3863K9710N151l984J1128l4009L013K2725p805J7439j7971k2684
210b1469K5088j795R645L651l3366J2375Q517j364K1961k7679j3142J7612n991
223e957K3822k718l1127R411n814J1681K3435k6387l468m583j1956L4434j04j2029
$$ plain form
237 -1360 2068 -24360 -10336 13720 6229 17954 -3323 -20667 4146 2940 17479 19522 -16811
250 -16811 -8613 -2875 1565 25590 -128 -13694 -4393 -10851 14980 13289 -11532 -3491 -14129
263 -14129 -3220 17705 -7023 -6644 -8084 -15052 12665 4201 -6629 1964 -12642 5053 15695
276 15695 -1607 8755 -2789 -6129 15712 958 3652 6145 -12652 3772 1046 -5852 9898
289 9898 -6247 -4155 3907 -11596 6073 5653 -6147 7235 -9188 -7672 7950 -5230 5185
302 5185 117 -16384 2040 -3214 248 11991 -9869 -2422 2919 -4944 15487 5443 -3395 7324
316 7324 -6990 5440 13255 -3628 6245 -4518 -9112 9655 -3389 -160 2231 -16018 -271
329 -271 247 -5778 7287 -9812 -7682 5089 -5533 8289 3390 -9394 6693 -512 3524 13565
$$ packed form
237a360L428k6428J4024K4056p491J1725k1277j7344K4813j206J4539K043l6333
250a6811Q198N738M440K4025k5718j3566R301o458K5831j691k4821Q041j0638
263a4129J0909K0925k4728L79j440o968K7717q464j0830Q593j4606J7695J0642
276A5695j7302J0362j1544l340K1841j4754K694K493j8797J6424k726o898J5750
289I898j6145K092Q062j5503J7669m20j1800J3382j6423J516J5622j3180J0415
302E185n068j6501J8424n254L462J1743k1860P447N341p863K0431j0044q838J0719
316G324j4314J2430P815j6883R873j0763m594J8767j3044L229K391j8249J5747
329b71N18o025J3065j7099K130J2771j0622J3822m899j2784J6087p205M036J0041
$$ plain form
343 13565 -6094 1699 3851 -3561 13068 810 -4916 5921 -6565 4851 7823 -8192 3509
356 3509 -4573 -6865 7821 -7708 -3718 330 -12995 2956 -1434 -7659 6166 -5929 346 8663
370 8663 -5281 7242 4586 -3139 10771 -2850 -2392 5765 -8081 3098 1034 -10437 3174
383 3174 -4970 -1848 9930 -4893 3124 4331 -4255 11942 2987 -2940 4892 -9657 -757 4048
397 4048 -9170 478 -8342 -10563 6125 -3405 1756 4296 -9025 6513 6318 1932 11717 -3951
411 -3951 -2845 6900 -2593 8064 1508 -9904 3136 -3746 1602 9788 -7443 -1148 -1203 -7018 8204
426 8204 -3033 -8714 -2250 -13985 -2109 2192 -8597 1658 -5974 -4586 12442 3169 9010 10223
440 10223 -2424 11688 9256 4492 11892 -5015 -3380 2376 -7557 3690 -3580 -12859 -901 -8283
$$ packed form
343A3565j9659P793K152p412J6629j2258n726J0837j2486J1416K972j6015J1701
356C509q082k292J4686j5529L990M048j3325J5951m390o225J3825j2095O275Q317
370H663j3944J2523k656p725J3910j3621M58Q157j3846J1179k064j1471J3611
383C174q144L122J1778j4823Q017J207q586J6197q955n927P832j4549Q900M805
397D048j3218R648q820k221J6688r530N161K540j3321J5538j95m386R785j5668
411c951J106R745r493J0657o556j1412J3040o882N348Q186j7231O295n5n815J5222
426H204j1237n681O464j1735J1876M301j0789J0255p632J388J7028r273N841J213
440A0223j2647J4112k432m764P400j6907J635N756r933J1247p270r279J1958p382
$$ plain form
454 -8283 -1542 7327 -5966 1292 -366 -4567 10860 2361 377 4155 -9373 2033 5352 -3329
468 -3329 5603 -6206 -8399 4819 -2365 5091 3193 -10746 517 -1077 1145 11668 -5098 -3752
482 -3752 1192 -4304 11813 6514 -4505 1518 -7028 2449 11265 -2714 71 -8079 -11220 7491
496 7491 743 -711 -1145 -16026 -1362 6555 1915 8295 -6995 -8160 5999 2784 12054 5219
510 5219 -11388 -127 -355 4573 12704 -6709 -8135 -4374 -6030 9691 1057 -10620 -6558 -13545
524 -13545 -13 8262 -5610 -1931 -7901 -6866 12205 6693 5238 4179 -7096 6976 11027 6263
538 6263 10683 -6126 -6114 5706 134 8524 2156 -11948 -801 -1094 5404 13077 -3654 -2912 -1587
553 -1587 -3007 13133 4282 -6333 -3681 -13677 -1423 7149 -4352 -2112 -10905 -10478 7799 4044
$$ packed form
454h283O741Q869j3293P258j658m201J5427q499j984L778j3528J1406L319q681
468c329Q932j1809k193J3218p184P456j898j3939J1263j594K222J0523j6766J346
482c752M944n496J6117n299j1019O023q546R477Q816j3979K785q150l141J8711
496G491o748j454m34j4881J4664P917m640O380j5290j165J4159l215R270o835
510E219j6607J1261k28M928Q131j9413j426L761j656J5721q634j1677M062o987
524a3545J3532Q275j3872L679n970J035J9071n512j455j059j1275J4072M051m764
538F263M420j6809J2J1820n572Q390o368j4104J1147k93O498P673j6731P42J325
553a587j420J6140q851j0615K652r996J2254Q572j1501K240q793M27J8277l755
$$ plain form
567 4044 6222 3078 -10339 3262 7127 4944 11057 -5950 -8024 481 -3220 6961 1343 -10673
581 -10673 -3090 -6741 1056 10324 -3839 -1872 -3818 -7489 8870 3983 -2730 -1613 -12500 -863
595 -863 7049 447 4410 -7672 -7968 8943 5822 9477 4478 -11369 432 5118 5909 9542 -9532
610 -9532 -11447 -3115 -2670 9970 1407 -12400 -4579 -6017 5333 14740 -1403 -2405 -4954 -4591 11690
625 11690 5679 -712 -2002 -13640 -519 6510 604 5755 -6378 -8080 6308 4558 10846 7665
639 7665 -6241 2062 2524 5977 12956 -4077 -6508 -2948 -5354 8064 2092 -10010 -5072 -9060
653 -9060 1437 9256 -3547 -3146 -7123 -5825 10899 3805 -1393 -2153 -11436 2381 8605 1613 3665
668 3665 -7492 -6283 6906 3582 9026 2573 -9946 -199 -460 2455 9600 -5989 -7505 -5656
$$ packed form
567D044K178l144j3417J3601L865k183O113j7007k074Q505l701J0181n618j2016
581a0673P583l651P797R268j4163J967j946l671J6359m887o713J117j0887J1637
595h63P912o602L963j2082k96J6911l121L655m999j5847J1801M686P91L633j9074
610i532j915Q332M45J2640q563j3807P821j438J1350R407j6143j002k549L63J6281
625A1690o011o391j290j1638J3121P029n906N151j2133j702J4388j750O288l181
639G665j3906Q303M62L453O979j7033k431L560k406J3418n972j2102M938l988
653i060J0497P819j2803M01l977J298J6724p094n198p60r283J3817O224o992K052
668C665j1157J209J3189l324N444o453j2519R747k61K915P145j5589j516J849
$$ plain form
682 -5656 -7259 7321 3663 -4659 -3260 -10839 307 10877 2120 3759 -5347 -8108 8196 6007
696 6007 4857 1849 -10892 -768 4714 2767 6883 -6445 -6487 4517 1128 7647 2185 -8662
710 -8662 1194 277 2442 6010 -7555 -5033 -1465 -3314 6520 -1487 -7131 -773 -6231 2492 7246
725 7246 -2458 1453 -3754 -4518 7661 2960 4263 2122 -9236 671 3718 3147 9158 -4733 -7215
740 -7215 703 -951 8949 4103 -7796 -3456 -5811 1660 8959 -4081 -4029 -4841 -6356 7347 2553
755 2553 -2657 273 -6440 2273 6682 -226 4093 -2478 -2542 7460 708 2940 2670 -6017 2845 2806
771 2806 112 5369 -5108 -3889 1711 -1822 5778 341 -8169 -1658 -4692 2029 7915 -4687 -4593
786 -4593 -5523 -4154 9801 3827 -2689 -3348 -9321 4070 9937 1368 1821 -7781 -5574 8650 4257
$$ packed form
682e656j603J4580l658q322J399p579J1146J0570q757J639r106k761J6304k189
696F007j150l008j2741J0124N482j947M116j3328m2J1004l389O519n462j0847
710h662R856r17K165L568j3565K522L568j849R834q007n644O358n458Q723M754
725G246r704L911n207p64J2179m701J303k141j1358R907L047n71O011j3891k482
740g215P918j654R900m846j1899M340k355P471P299j3040N2q12j515J3703m794
755B553n210K930o713Q713M409o908M319o571o4J0002o752K232k70q687Q862l9
771B806k694N257j0477J219N600l533P600n437q510O511l034O721N886j2602R4
786d593r30J369J3955n974o516o59n973J3391N867q569M53r602K207J4224m393
$$ plain form
801 4257 3979 -1105 -9734 1544 3211 1641 4018 -7861 -4525 1995 -2488 3967 -1892 -7219 1271
816 1271 -2736 463 3018 -5734 334 79 -2083 5921 -1117 -1038 3411 -3244 4298 4889 -1514 3956
832 3956 -2005 -1206 6467 50 2964 548 -6616 2652 1322 965 4696 -6086 -3417 1239 -1515
847 -1515 5896 -94 -5596 510 -4014 1735 5222 -3431 1130 -1758 -3454 5615 508 1880 4128
862 4128 -3937 2129 2782 103 6909 -1173 -2773 1115 -4531 2755 2232 -5943 -704 -4989 -2858 4328
878 4328 -3098 -1436 -1565 -5225 4112 683 -2474 1680 -5316 770 4472 -2785 1583 -1781 -2800
893 -2800 5807 359 1041 1875 -4510 3195 2590 -1417 3452 -3819 -2691 2493 -3536 1695 54 -5088
909 -5088 1501 -2807 -994 4248 -2406 1510 660 -4470 3898 699 -305 3604 -4618 -677 2333
$$ packed form
801D257k78n084q629J1278J667j570K377j1879L336O520m483O455n859n327Q490
816A271m007L199K555q752O068k55k162Q004p038P9M449o655P542N91o403N470
832C956n961P99P673o417K914k416p164R268j330l57L731j0782K669M656k754
847a515P411n990n502O106m524N749L487q653M561k888j696R069n107J372K248
862D128q065O066O53k679O806q082j600L888n646P286n23q175N239m285K131P186
878D328p426J662j29l660R337l429l157M154o996O086L702p257M368l364j019
893b800Q607n448O82Q34o385P705o05m007M869p271J128N184o029N231j641n142
909e088O589m308J813N242o654L916q50n130Q368l199j004L909q222L941L010
$$ plain form
924 2333 -1437 4959 -223 -2939 3619 -1124 3621 5379 -1877 2859 287 -1580 5041 -1449 -801
939 -801 1330 -5394 609 -510 -3846 2373 -3747 -2661 1957 -3461 2135 1597 -3262 2729 -1184 -52
955 -52 4432 -2309 1136 1596 -2397 4713 392 -1414 3100 -2782 1615 3453 -3222 1685 -2120 -3586
971 -3586 3011 -3182 -1524 -578 -6456 682 -500 -2878 2558 -3506 -1232 2856 -1831 3906 2183
986 2183 -2407 3412 -876 796 4618 -2232 975 282 -3217 4089 -445 -1182 2097 -3927 780 2540
1002 2540 -2251 2558 -1861 -2740 3134 -2107 978 1278 -4689 1486 -400 -1524 3718 -2713 -1001
1017 -1001 2039 -2577 3319 1170 -2479 3093 -1534 647 3992 -2317 1893 656 -2795 4017 -224
1032 -224 -635 2409 -3660 804 1429 -2557 2681 -2626 -3312 1940 -3406 607 941 -4841 1034 -1302
$$ packed form
924B333l770O396n182k716O558m743M745J758p256M736k572j867O621o490O48
939h01K131o724O003j119l336O219o120J086M618n418N596n38m859N991l913J132
955e2M484o741L445M60l993P110m321j806M514n882M397J838o675M907l805j466
971c586O597o193J658R46n878P138j182k378N436o064K274M088m687N737j723
986B183m590N819m288J672L822o850L207o93l499P306m534p37L279o024M707J760
1002B540m791M809m419q79N874n241L085L00n967O175j886j124N242o431J712
1017a001L040m616N896k149l649N572m627K181L345o309M210j237l451O812m241
1032b24m11L044o069M464O25l986N238n307o86N252n346M013L34n782N875k336
$$ plain form
1048 -1302 -1616 3707 -2441 -54 1883 -2263 4463 2063 -835 3688 -1754 1427 4530 -1626 1984
1063 1984 -561 -3369 3432 -1110 -823 765 -5624 -411 263 -2263 2479 -3347 -3346 1819 -2021 2541
1079 2541 1648 -3598 1570 -186 782 4900 -1763 200 1468 -2018 4617 1240 -1729 2163 -3010
1094 -3010 270 2761 -2674 1132 -1477 -3356 2534 -1837 -220 1576 -4300 939 541 -1990 3507
1109 3507 -1638 -1468 1833 -2270 2345 1670 -2734 2087 -1750 -273 4097 -2127 583 796 -2599 3680
1125 3680 1261 -663 2130 -3259 1051 2935 -1731 2291 -1833 -3650 2459 -1775 169 990 -5087
1140 -5087 -149 -383 -1408 3331 -2241 -1717 1116 -2528 3306 2147 -1834 2255 -1488 443 4764
1155 4764 -399 2106 527 -2503 3459 683 151 2403 -4493 -441 1195 -2796 1815 -2544 -3976
$$ packed form
1048a302l14N323o148K387J937m146O726k400k898M523n442L181L103o156L610
1063A984k545k808O801m542K87J588o389N213O74k526M742n826JN165l840M562
1079B541q93n246N168j756R68M118o663J963J268l486O635l377k969L892n173
1094c010L280K491n435L806k609j879N890m371J617J796n876N239l98k531N497
1109C507n145J70L301m103M615o75m404M821l837J477M370o224K710K13l395O279
1125C680k419j924K793n389M310J884m666M022m124j817O109m234J944Q21o077
1140e087M938k34j025M739n572N24K833l644N834j159l981M089l743J931M321
1155D764n163K505j579l030N962k776n32K252o896M052J636l991M611m359j432
$$ plain form
1170 -3976 1060 -2274 832 1009 -4267 1003 -306 -569 4261 -1482 -226 2203 -1831 3289 1852
1185 1852 -1602 1994 -1744 262 3396 -1605 1484 -340 -3261 2704 -521 -408 2054 -4223 -910
1200 -910 388 -1723 2711 -1813 -3254 873 -2250 2516 2700 -3345 665 -1058 -65 5135 -484 -514
1216 -514 203 -2799 3729 1872 -914 1452 -3588 106 3612 -1136 1079 -1475 -3479 2599 21
1231 21 -179 461 -4846 -142 909 -1265 2211 -3330 -2985 1904 -1261 2070 1269 -3465 1240 77
1247 77 991 4175 -1923 -132 765 -1368 4246 881 -2132 1176 -2403 1070 2995 -1803 713 -1267
1263 -1267 -2148 2957 -740 -184 512 -3786 929 921 -1740 1899 -2238 -1317 1970 -1514 1894 888 -1909
1280 -1909 2489 -91 508 3592 -1625 1231 1634 -2122 2428 -100 -1143 1759 -2275 -73 1014
$$ packed form
1170c976N036l334L106J77n276N270j309k63M830n743J256K429m034N120j437
1185A852l454L596l738K006L134n001L089j824k921N965l225J13K462o277L313
1200i10J298k111M434m524j441M127l123M766J84o045M010j723R93N200n619l0
1216e14P17l002O528j857k786K366n040L694L506m748K215k554k004O078k578
1231B1k00O40n307M704J051k174L476n541L45M889l165L331q01m734M705j163
1247G7R14L184o098J791Q97k133N614l365l013L308l579L473J925m798K516j980
1263a267q81N105l697N56O96m298M715qk661L639m137R21L287l484L408j006k797
1280a909M398k580N99L084n217K856M03l756M550k528j043K902m034K202J087
$$ plain form
1295 1014 -2365 1490 -1282 -2667 1299 -2185 -246 1297 -3116 101 -646 -1824 2759 -1297 -779
1310 -779 1132 -2081 2591 2075 -920 2367 -976 -90 3647 -513 1063 -90 -2744 2232 -23 -792
1326 -792 727 -4159 -763 999 -2056 1339 -1883 -3403 1377 -813 1232 1397 -2997 1219 570 372
1342 372 3956 -1226 -159 1947 -764 3044 1506 -1513 1469 -1463 226 2367 -1732 847 -545
1357 -545 -2620 1986 -856 -915 1312 -2720 134 883 -1739 1735 -648 -1277 1854 -1436 1250 1368
1373 1368 -2161 1790 -18 -833 2537 -1258 -332 1033 -1724 1791 90 -1679 1625 -1873 257
1388 257 1892 -1973 882 -189 -1934 1868 -880 -616 1185 -2735 361 -137 -2311 1619 -1670 -1672
1404 -1672 925 -2289 794 1489 -1417 1710 -219 -145 3474 -42 1499 1296 -1885 2379 717 -652
$$ packed form
1295A014l379L855k772j385L966l484J939J543m413L217p47j178M583m056N18
1310g79J911l213M672n16k995L287l343Q86L737m160J576j153k654M976k255p69
1326g92J519m886L396J762l055L395l222j520M780k190K045J65m394M216o49j98
1342C72L584n182J067K106k711L808j538l019K982k932J689K141m099K579j392
1357e45k075M606k842n9K227m032K854P49k622L474k383o29L131l290K686J18
1373A368l529L951j808q15L370l795R26J365k757L515j701j769L304l498K130
1388B57J635l865K855j071j745L802k748K64J801l920L096m98k174L930l289k
1404a672K597l214L083O95k906L127j929P4L619l516J541k03l181M264j662j369
$$ plain form
1420 -652 1792 -2140 -648 997 -2156 765 -1092 -2442 920 -1669 -695 815 -2418 826 521 -1518
1436 -1518 2047 -704 155 2390 -594 1510 1405 -643 2951 203 -55 2204 -1458 1089 1115 -2145
1452 -2145 1096 -447 -986 1581 -2093 -599 472 -1970 1561 -399 -1962 971 -1261 684 2106
1467 2106 -1612 554 -333 -1059 2640 -490 -358 464 -2255 1275 704 -1220 1392 -1620 -911 1891
1483 1891 -965 1079 766 -1929 1481 -303 -418 1666 -2043 -340 23 -2187 951 -864 -1735 1021
1499 1021 -1455 665 1332 -1593 1484 359 -266 3038 -491 73 1425 -1089 2245 1154 -1226 1326
1515 1326 -1262 177 2238 -1460 264 -462 -1919 1674 -834 -1233 250 -2709 -342 133 -1981 805
1531 805 -854 -868 1935 -1014 846 1459 -366 2539 614 -652 2016 -635 1030 1630 -1960 625
$$ packed form
1420f52K444l932J492J645l153K921j857j350L362k589R74J510l233L244l05k039
1436a518L565k751Q59K235k984K104j05k048L594k748k58K259l662K547K6l260
1452b145L241j543n39K567l674J494J071k442L531j960j563K933k232J945J422
1467B106l718K166q87p26L699l130J32Q22k719L530n71j924K612l012P09K802
1483A891k856K044l13k695L410j784j15K084l709J703L63k210L138j815q71K756
1499A021k476K120O67k925L077j125o25L304l529N64J352k514L334j091k380K552
1515A326k588J439K061l698J724p26j457L593k508l99J483k959K367M75k114K786
1531H05j659j4K803k949J860O13j825K905j925j266K668k651J665O00l590K585
$$ plain form
1547 625 -404 -970 1730 -1125 -651 580 -1564 1094 455 -1254 1210 -1282 -584 1140 -1682 321
1563 321 103 -1536 1510 -441 -524 1412 -1211 951 1162 -1048 1703 -160 -636 1877 -840 175
1579 175 850 -1914 824 57 -850 1496 -1612 -500 610 -1389 1402 -116 -1857 613 -1515 -21
1595 -21 1413 -1610 366 -126 -1002 2113 -58 -185 1391 -1201 1358 1438 -712 1646 -308 -485 1555
1612 1555 -994 280 322 -1716 938 -442 -1124 905 -1793 -215 429 -2003 564 -496 -1509 1373
1628 1373 -1157 -112 1054 -1410 1421 350 -969 1762 -390 -24 1534 -1284 826 962 -891
1643 -891 1590 -441 -294 1349 -1325 707 560 -1793 762 -941 -1085 892 -1767 -347 -68 -1873
1659 -1873 881 -445 -848 1374 -1010 532 1764 -589 1940 689 -521 2122 -381 625 1294
$$ packed form
1547F25j029n66K700k855M74J231k144K658o39j709K464k492O98J724k822K003
1563C21k18j639L046j951q3J936k623K162K11k210K751j863m76K513k717J015
1579A75O75k764K738p67r07K346l108J112J110j999K791j518j741K470k128J494
1595b1J434l023J976m92q76L115k171j27J576k592K559Q0k150K358j954j77K040
1612A555k549J274M2k038K654j380o82K029k698J578O44k432K567j060j013K882
1628A373k530J045J166k464K831j071j319K731k152L66J558k818K110J36j853
1643h91K481k031J47J643k674K032j47k353K555j703j44J977k659J420K79j805
1659a873K754j326m03K222k384J542J232k353K529j251j210K643k503J006O69
$$ plain form
1674 1294 -1230 618 -217 -1321 1061 -1197 -996 563 -1797 585 83 -1664 591 -786 -736 1104
1690 1104 -1146 319 325 -1304 1410 36 -447 1448 -943 290 865 -707 1402 34 -852 1284
1706 1284 -621 474 1216 -1333 623 -351 -1085 1408 -757 -464 577 -1661 775 440 -1070 894
1722 894 -1217 -513 1169 -1202 658 81 -1712 1079 -314 -527 1256 -1098 413 764 -633 1929
1738 1929 356 -204 1499 -756 754 1501 -1178 508 -721 -1250 740 -1371 -856 -395 -2291 456
1754 456 56 -763 1249 -975 -393 1623 -362 1509 660 -997 1137 37 283 1391 -1298 384
1770 384 293 -1009 1667 -106 -570 1067 -939 390 708 -1290 367 -1219 -1201 788 -1265 -197 236
1787 236 -1955 700 509 -229 1495 -664 105 1121 -424 1445 195 -1170 736 -649 176 1135
$$ packed form
1674A294k524J848q35j104K382k258K01J559k360K382n02j747K255j377N0J840
1690A104k250J465Oj629K714j374m83J895k391J233N75j572K109j368q86K136
1706A284j905J095P42k549J956r74p34K493k165K93J041k238K436l35j510J964
1722H94k111P04J682k371J860n77j793K791j393k13J783k354J511L51j397K562
1738A929j573n60J703k255J510P47k679J686j229n29J990k111N15M61j896K747
1754D56m00q19K012k224N82K016j985J871q49j657K134j100K46J108k689J682
1770C84r1j302K676j773m64J637k006J329L18j998J657j586J8J989k053J068M33
1787B36k191K655j91p38J724k159P69J016j545J869j250j365J906j385Q25R59
$$ plain form
1803 1135 -1607 88 195 -593 1830 107 -154 879 -1036 999 910 -1164 159 -1605 -1448 573
1819 573 -1263 -630 -235 -1883 593 313 187 1896 -756 414 1531 -37 1850 558 -1086 796
1835 796 -634 19 1200 -1647 -194 -387 -815 1687 -518 -670 320 -1400 889 838 -1323 268 -1445
1852 -1445 -757 1154 -659 -133 -101 -1304 1689 786 297 1555 -893 730 1729 -234 1128 -319 -1251
1869 -1251 629 -1025 103 529 -1746 223 -340 -895 1560 -249 -285 695 -1123 551 615 -865 438
1886 438 -1367 -911 550 -1089 377 119 -1542 1125 542 243 1901 -460 470 1235 -166 1587 -105
1903 -105 -1064 788 -1139 318 681 -1659 194 -475 -914 1264 -820 -389 253 -1652 750 242 -905
1920 -905 663 -1098 -709 1211 -485 614 527 -943 1233 566 759 1670 -949 330 470 -641 1190
$$ packed form
1803A135k742J695J07p88K423j723k61J033j915K035q9k074J323j764J57K021
1819E73j836O33L95j648K476k80j26J709k652J170J117j568J887j292j644J882
1835G96j430O53J181k847J453j93m28K502k205j52R90j720K289n1k161J591j713
1852a445O88J911j813N26L2j203K993r03m89J258k448J623R99j963J362j447r32
1869a251J880j654J128M26k275J969n63n55K455j809l6R80j818J674O4j480J303
1886D38j805M56J461j639J466k58j661K667n83k99J658k361R30P65j401J753j692
1903a05r59J852j927J457L63k340J853o69m39K178k084M31O42j905K402n08j147
1920i05J568j761L89J920j696J099q7j470K176o67J93R11k619J279J40j111J831
$$ plain form
1937 1190 -568 -1482 325 -1456 73 604 -1476 198 -725 -608 1504 -600 -11 634 -1177 1128
1953 1128 387 -843 955 -792 -44 1045 -401 928 202 -820 1527 -184 164 748 -1428 231
1969 231 411 -1096 725 -754 -881 501 -1033 496 510 -1034 606 -650 -658 1329 -812 -159 319
1986 319 -1297 716 70 -541 1021 -706 110 1386 -326 1213 380 -720 1366 -425 106 844 -1387
2003 -1387 -14 -14 -1148 767 -964 -476 668 -1325 467 384 -1139 556 -796 -533 1035 -716 278
2020 278 493 -867 1442 293 9 1450 -573 480 1275 -449 1131 36 -786 586 -859 -593
2036 -593 161 -1572 136 -170 -1148 867 -754 -348 978 -754 746 305 -717 1073 -496 -170 1191
2053 1191 -883 349 505 -891 1004 -43 -95 1150 -511 650 790 -805 1015 -34 -807 990
$$ packed form
1937A190j758r14J807j781J529N31k080J674r23J17K112k104N89O45j811K305
1953A128p41j230J798j747P48J089j446J329p26j022K347j711L48N84k176J659
1969B31J80j507J821j479j27J382j534J529J4j544J640j256qJ987k141O53M78
1986C19j616K013o46o11J562j727Q16J276j712J539q33j100K086j791N31P38k231
2003a387J373%j134J915j731M88J144j993J792q3j523J695j352K63J568j751R94
2020B78K15j360K309j149k84J441k023J053P95j724J580j095q22J372j445K66
2036e93P54j733J708l06r78K015j621M06J326j732J500m41j022J790j569L26J361
2053A191k074J232J56j396J895j047n2J245j661J161J40j595J820j049p73J797
$$ plain form
2069 990 -1133 -361 505 -1072 535 -354 -893 583 -890 -49 687 -1176 316 81 -857 1100 -415
2086 -415 -358 925 -408 1117 626 -927 1251 -127 82 1278 -915 124 356 -993 727 -458
2102 -458 -972 606 -1015 -271 279 -1386 491 -298 -877 952 -596 -248 725 -701 1006 430 -562
2119 -562 1392 -194 344 1239 -809 535 82 -732 766 -583 -505 657 -826 440 228 -738 753
2136 753 -344 -462 823 -1109 43 417 -1133 608 -539 -741 668 -758 -173 617 -923 948
2152 948 106 -412 1478 13 437 1136 -521 656 242 -571 1145 -602 -525 472 -1206 59 51 -1147
2170 -1147 459 -699 -570 539 -932 73 185 -1094 700 -286 -261 911 -423 565 891 -508 1002
2187 1002 382 -123 1165 -545 100 752 -815 591 -326 -1193 585 -928 -366 231 -1117 178 27
$$ packed form
2069I90k123P72Q66j577J607q89n39J476j473Q41P36j863J492k35r38J957j515
2086d15N7J283j333J525m91j553K178j378K09J196k193J039K32j349J720j185
2102d58n14J578j621P44N50j665J877p89n79J829j548L48R73j426J707n76r92
2119e62J954j586N38Q95k048J344m53q14J498j349P8J162j483J266k12r66J491
2136G53j097j18J285j932J152L74j550J741j147k02J409j426N85P90j540J871
2152I48q42n18J890j465M24O99j657J177m14q13J716j747P7R97j678J265qj198
2170a147J606j158J29J109j471J005J12j279J794r86K5J172j334R88L26j399J510
2187A002o20n05J288j710O45O52j567J406r17q67J778j513N62N97j348J295j51
$$ plain form
2204 27 -871 697 -367 -7 999 -563 663 274 -648 1149 77 -263 706 -634 310 527 -777
2221 -777 529 -183 -262 1103 -634 346 429 -1022 493 146 -583 785 -817 -258 283 -1052 419 -318
2239 -318 -970 675 -397 -180 869 -905 517 303 -430 990 -156 -65 1280 -490 760 562 -531
2256 -531 959 -209 -242 1022 -585 40 325 -879 525 -324 -705 472 -1142 -370 509 -828 444
2273 444 -16 -637 898 -346 16 944 -559 665 492 -510 1104 -67 201 1176 -692 193 164 -799
2291 -799 686 -297 -588 78 -997 39 440 -875 629 -366 -490 800 -591 -110 366 -1080 690
2308 690 65 -701 639 -699 -2 738 -639 605 30 -294 1311 -208 328 934 -766 341 384 -650
2326 -650 509 -885 -776 172 -927 335 21 -1186 545 -231 -256 810 -763 237 322 -868 951
$$ packed form
2204B7q98J568j064L60J006j562J226l89r22J797j072l40R69j340R44K17j304
2221g77J306p12p9J365j737R80Q3j451J515l47p29J368j602N59N41j335J471p37
2239c18o52J645j072K17J049j774J422k14p33J420j146R1J345j770J250j98j093
2256e31J490j168l3J264j607O25K85j204J404q49l81J177j614P72Q79j337J272
2273D44m60o21J535j244L62R28j503J224j73j002J614j171K68R75j868Q85k9r63
2291g99J485r83k91O66j075J036M01j315J504r95j24J290j391M81M76j446J770
2308F90o25p66J340j338O97P40j377J244n75l24J605j519N36O06j700J107M3j034
2326f50J159j394J09R48j099J262l14j207J731p76k5J066j573J000Q5j190J819
$$ plain form
2343 951 -83 -476 807 -534 549 890 -532 740 265 -205 1092 -212 -20 408 -785 310 -275
2360 -275 -1143 474 -1041 -606 331 -783 130 90 -659 797 -128 -56 941 -652 458 438 -526 653 -248
2379 -248 -303 624 -658 139 534 -495 723 -79 -204 841 -285 167 351 -962 320 -166 -476 723
2397 723 -876 -507 186 -716 438 -26 -578 640 -400 30 743 -538 454 230 -604 1065 127 -124
2415 -124 554 -584 646 842 -269 618 -200 -293 614 -644 148 268 -1245 -189 -266 -923 488 -644
2433 -644 -140 137 -418 618 274 -321 750 -385 160 907 -516 421 135 -471 609 -208 -25 569
2451 569 -810 196 217 -672 838 -439 -540 331 -510 237 12 -933 124 -443 -287 777 -522 33
2469 33 292 -606 791 467 -408 557 -471 95 910 -487 273 -281 -586 1024 -103 -50 385 -889 94
$$ packed form
2343I51j034l93J283j341J083L41j422J272m75m70J297j304J92M28j193J095n85
2360b75q68J617j515M35R37j114R13m0p49J456r25P2R97j593J110k0r64J179r01
2379b48n5R27j282P97L95j029J218q02j25J045j126M52J84j313J282m86l10J199
2397G23j599L69O93r02J154m64n52J218j040M30P13j281R92k24q34J669r38k51
2415a24O78j138J230J96j111Q87q18r3R07j258P92J20j513J056p7o57J411j132
2433f44N04K77n55J036l44n95J071j135N45P47j423R37k86o06J080q17J83N94
2451E69j379J006K1q89J510j277j01Q71q41P47k25r45J057n67J56J064j299N55
2469C3K59q98J397l24q75R65j028N66Q15j397P60n54l05J610j127N3M35j274R83
$$ plain form
2488 94 370 -507 576 -688 -558 296 -561 193 112 -925 571 -238 -132 720 -453 93 465 -367 562
2507 562 203 -25 636 -377 456 741 -491 355 56 -321 988 -167 0 365 -916 257 -59 -670
2525 -670 179 -710 -685 358 -481 413 119 -707 762 -13 49 651 -491 282 307 -262 1006 -178 -317
2544 -317 648 -490 -23 474 -269 327 -248 -446 494 -575 -11 167 -682 122 -158 -527 523 -225 45
2563 45 384 -421 333 337 -358 507 -102 -49 917 -423 132 211 -458 812 -152 -251 414 -630 242 402 -584
2584 -584 246 -258 -662 411 -313 -49 46 -1044 146 -43 -438 561 -544 -166 337 -430 543 78 -539
2603 -539 645 -192 -144 887 -257 327 225 -299 797 92 -142 521 -452 -10 341 -542 393 -516 -924
2622 -924 198 -666 -86 194 -649 97 -11 -264 861 -187 57 484 -243 511 270 -266 709 -151 144
$$ packed form
2488I4K76q77J083j264J30Q54q57P54q1j037J496q09J06Q52j173N46L72q32R29
2507E62l59k28O61j013Q33K85j232Q46k99l77J309j155J67L65j281J173l16o11
2525f70Q49q89K5J043q39Q94k94q26J469p75O2O02j142P73K5n69J268j184j39
2544c17R65j138M67M97p43N96n75j98R40j069N64J78q49Q04k80l69J050p48K70
2563D5L39q05P54Mo95Q65o09N3R66j340N55P9o69J270r64r9O65j044Q72J60r86
2584e84Q30n04m04J073p24K64R5j090J190j89l95R99j105L78N03p67R73m65o17
2603e39J184q37M8J031j144N84j02n24J096p05k34O63r73M42L51q83R35r09m08
2622i24J122q64N80K80q43P46j08k53J125j048K44M27p27P54k41n36R75q60K95
$$ plain form
2641 144 619 -305 333 -22 -457 544 -93 -81 438 -748 91 181 -588 459 -504 -693 160 -492 149 279
2661 279 -476 430 80 17 864 -344 119 391 -242 473 133 -419 447 -467 -64 487 -576 227 -162 -240
$$ packed form
2641A44M75r24O38l55m35J001o37J2N19j186Q39R0p69J047r63j89Q53o52O41J30
2661B79p55R06l50o3Q47j208M63K72o33P15l40n52Q66r14M03N51j063Q03l89p8
$$ [...]
8191B
##END NTUPLES=NMR FID
##END=
