##TITLE=1H_105-2025-Bay
 200.13MHz, CDCl3,
 8 sc
 
 1.9.2025
##JCAMPDX= 6.0         $$ Bruker NMR JCAMP-DX V2.0
##DATA TYPE= NMR FID
##DATA CLASS= NTUPLES
##ORIGIN= UXNMR, Bruker Analytische Messtechnik GmbH
##OWNER= pz
$$ XWIN-NMR		Version 3.5
$$ Mon Sep  1 14:41:49 2025 Russian Standard Time (UT+4h)  she@DPX200
##.OBSERVE FREQUENCY= 200.1313
##.OBSERVE NUCLEUS= ^1H
##.DELAY= (6, 6)
##.ACQUISITION MODE= SIMULTANEOUS
##.ACQUISITION SCHEME= undefined
##.AVERAGES= 8
##.DIGITISER RES= 18
##SPECTROMETER/DATA SYSTEM= spect
##.PULSE SEQUENCE= zg30
##.SOLVENT NAME= CDCl3
##.SHIFT REFERENCE= (INTERNAL, CDCl3, 0, 14.3821)
##AUDIT TRAIL= $$ (NUMBER, WHEN, WHO, WHERE, WHAT)
$$ ##TITLE= Audit trail, XWIN-NMR		Version 3.5
$$ ##JCAMPDX= 5.01
$$ ##ORIGIN= Bruker BioSpin GmbH
$$ ##OWNER= she
$$ F:/spectra/data/she/nmr/H-C/1/audita.txt
$$ ##AUDIT TRAIL=  $$ (NUMBER, WHEN, WHO, WHERE, WHAT)
(   1,<2025-09-01 14:40:21.98 +0400>,<she>,<DPX200>,
      <created by zg, POWCHK disabled, PULCHK disabled
       configuration hash MD5:
       00 E9 B6 7A A2 85 ED C7 34 08 36 98 17 FE 4E 26
       data hash MD5: 16K
       25 BD A6 4F E6 D4 A5 45 B5 93 3B CD B4 5D 3A 28>)
$$ ##END=
$$ 
$$ hash MD5
$$ DE 0E EE 30 90 84 18 30 61 5D F9 0D 1B 6C CE 21
##$RELAX= 
##$RELAX= 
##$RELAX= 
##$RELAX= 
##$RELAX= 
##$RELAX= 
$$ Bruker specific parameters
$$ --------------------------
##$DU= <F:/spectra>
##$EXPNO= 1
##$NAME= <H-C>
##$PROCNO= 1
##$TYPE= <nmr>
##$USER= <she>
##$AMP= (0..31)
100 100 100 100 100 100 100 100 100 100 100 100 100 100 100 100 100 100 
100 100 100 100 100 100 100 100 100 100 100 100 100 100 
##$AQSEQ= 0
##$AQ_mod= 1
##$AUNM= <au_zg>
##$AUTOPOS= <>
##$BF1= 200.13
##$BF2= 200.13
##$BF3= 200.13
##$BF4= 200.13
##$BF5= 200.13
##$BF6= 200.13
##$BF7= 200.13
##$BF8= 200.13
##$BYTORDA= 1
##$CFDGTYP= 0
##$CFRGTYP= 5
##$CHEMSTR= <none>
##$CNST= (0..31)
1 1 145 1 1 1 1 1 1 1 1 1 1 1 1 1 1 1 1 1 1 1 1 1 1 1 1 1 1 1 1 1 
##$CPDPRG= <>
##$CPDPRG1= <>
##$CPDPRG2= <>
##$CPDPRG3= <>
##$CPDPRG4= <mlev>
##$CPDPRG5= <mlev>
##$CPDPRG6= <mlev>
##$CPDPRG7= <mlev>
##$CPDPRG8= <mlev>
##$CPDPRGB= <>
##$CPDPRGT= <>
##$D= (0..31)
0 0.7 0 0 0 0 0 0 0 0 0 0.03 0 0 0 0 0 0 0 0 0 0 0 0 0 0 0 0 0 0 0 0 
##$DATE= 1756723221
##$DBL= (0..7)
120 120 120 120 120 120 120 120 
##$DBP= (0..7)
150 150 150 150 150 150 150 150 
##$DBP07= 0
##$DBPNAM0= <>
##$DBPNAM1= <>
##$DBPNAM2= <>
##$DBPNAM3= <>
##$DBPNAM4= <>
##$DBPNAM5= <>
##$DBPNAM6= <>
##$DBPNAM7= <>
##$DBPOAL= (0..7)
0.5 0.5 0.5 0.5 0.5 0.5 0.5 0.5 
##$DBPOFFS= (0..7)
0 0 0 0 0 0 0 0 
##$DE= 6
##$DECBNUC= <off>
##$DECIM= 32
##$DECNUC= <off>
##$DECSTAT= 4
##$DIGMOD= 1
##$DIGTYP= 9
##$DL= (0..7)
0 120 120 120 120 120 120 120 
##$DP= (0..7)
150 150 150 150 150 150 150 150 
##$DP07= 0
##$DPNAME0= <>
##$DPNAME1= <>
##$DPNAME2= <>
##$DPNAME3= <>
##$DPNAME4= <>
##$DPNAME5= <>
##$DPNAME6= <>
##$DPNAME7= <>
##$DPOAL= (0..7)
0.5 0.5 0.5 0.5 0.5 0.5 0.5 0.5 
##$DPOFFS= (0..7)
0 0 0 0 0 0 0 0 
##$DQDMODE= 0
##$DR= 18
##$DS= 0
##$DSLIST= <SSSSSSSSSSSSSSS>
$$ [...]
##$SUBNAM0= <"">
##$SUBNAM1= <"">
##$SUBNAM2= <"">
##$SUBNAM3= <"">
##$SUBNAM4= <"">
##$SUBNAM5= <"">
##$SUBNAM6= <"">
##$SUBNAM7= <"">
##$SUBNAM8= <"">
##$SUBNAM9= <"">
##$SW= 18.0517328524113
##$SWIBOX= (0..15)
0 0 2 0 0 0 0 0 0 0 0 0 0 0 0 0 
##$SW_h= 3612.71676300578
##$TD= 16384
##$TD0= 1
##$TE= 0
##$TE2= 300
##$TE3= 300
##$TEG= 300
##$TL= (0..7)
0 120 120 120 120 120 120 120 
##$TP= (0..7)
150 150 150 150 150 150 150 150 
##$TP07= 0
##$TPNAME0= <>
##$TPNAME1= <>
##$TPNAME2= <>
##$TPNAME3= <>
##$TPNAME4= <>
##$TPNAME5= <>
##$TPNAME6= <>
##$TPNAME7= <>
##$TPOAL= (0..7)
0.5 0.5 0.5 0.5 0.5 0.5 0.5 0.5 
##$TPOFFS= (0..7)
0 0 0 0 0 0 0 0 
##$TUNHIN= 0
##$TUNHOUT= 0
##$TUNXOUT= 0
##$USERA1= <user>
##$USERA2= <user>
##$USERA3= <user>
##$USERA4= <user>
##$USERA5= <user>
##$V9= 5
##$VALIST= <valist>
##$VCLIST= <CCCCCCCCCCCCCCC>
##$VD= 0
##$VDLIST= <DDDDDDDDDDDDDDD>
##$VPLIST= <PPPPPPPPPPPPPPP>
##$VTLIST= <TTTTTTTTTTTTTTT>
##$WBST= 1024
##$WBSW= 4
##$XGAIN= (0..3)
0 0 0 0 
##$XL= 0
##$YL= 0
##$YMAX_a= 138943
##$YMIN_a= -201574
##$ZGOPTNS= <>
##$ZL1= 120
##$ZL2= 120
##$ZL3= 120
##$ZL4= 120
##$ABSF1= 10
##$ABSF2= 0
##$ABSG= 5
##$ABSL= 3
##$ALPHA= 0
##$AQORDER= 0
##$ASSFAC= 0
##$ASSFACI= 0
##$ASSFACX= 0
##$ASSWID= 0
##$AUNMP= <proc_1d>
##$AZFE= 0.1
##$AZFW= 0.1
##$BCFW= 1
##$BC_mod= 2
##$BYTORDP= 1
##$COROFFS= 0
##$CY= -3
##$DATMOD= 1
##$DC= 2
##$DFILT= <>
##$DTYPP= 0
##$F1P= 0
##$F2P= 0
##$FCOR= 0.5
##$FTSIZE= 0
##$FT_mod= 4
##$GAMMA= 1
##$GB= 0.15
##$INTBC= 1
##$INTSCL= 1
##$ISEN= 128
##$LB= 0.25
##$LEV0= 0
##$LPBIN= 0
##$MAXI= 10000
##$MC2= 0
##$MEAN= 0
##$ME_mod= 0
##$MI= 1.114404
##$NCOEF= 0
##$NC_proc= 0
##$NLEV= 6
##$NOISF1= 3.799351
##$NOISF2= 2.8
##$NSP= 1
##$NTH_PI= 0
##$NZP= 0
##$OFFSET= 14.38212
##$PC= 1
##$PHC0= -1474.048
##$PHC1= 12.19228
##$PH_mod= 1
##$PKNL= yes
##$PPARMOD= 0
##$PSCAL= 0
##$PSIGN= 0
##$REVERSE= no
##$SF= 200.129724274929
##$SI= 16384
##$SIGF1= 3
##$SIGF2= 2
##$SINO= 400
##$SIOLD= 16384
##$SREGLST= <1H.CDCl3>
##$SSB= 0
##$STSI= 0
##$STSR= 0
##$SW_p= 3205.1282051282
##$SYMM= 0
##$S_DEV= 0
##$TDeff= 0
##$TDoff= 0
##$TI= <>
##$TILT= no
##$TM1= 0
##$TM2= 0
##$TOPLEV= 0
##$USERP1= <user>
##$USERP2= <user>
##$USERP3= <user>
##$USERP4= <user>
##$USERP5= <user>
##$WDW= 1
##$XDIM= 8192
##$YMAX_p= 0
##$YMIN_p= 0
$$ End of Bruker specific parameters
$$ ---------------------------------
##NTUPLES= NMR FID
##VAR_NAME=  TIME,          FID/REAL,        FID/IMAG
##SYMBOL=    X,             R,               I
##VAR_TYPE=  INDEPENDENT,   DEPENDENT,       DEPENDENT
##VAR_FORM=  AFFN,          ASDF,            ASDF
##VAR_DIM=   8192,          8192,            8192
##UNITS=     SECONDS,       ARBITRARY UNITS, ARBITRARY UNITS
##FACTOR=    0.0002768,     1,               1
##FIRST=     0,             0,               0
##LAST=      2.2672688,     0,               0
##MIN=       0,             -201574,         0
##MAX=       2.2672688,     138943,          0
$$ Real data points
##PAGE= N=1
##DATA TABLE= (X++(R..R)), XYDATA
0 0 0 0 0 0 0 0 0 0 0 0 0 0 -8 8 -8 8 -8 16 -16 24 -24 32 -32 40 -48 56 -64 78 -88 104 -116 132 -152 169
34 169 -193 217 -241 273 -305 340 -377 421 -466 517 -571 632 -696 768 -847 933 -1028 1133
52 1133 -1248 1376 -1521 1686 -1870 2081 -2328 2618 -2966 3392 -3927 4623 -5573 6947 -9120
67 -9120 13103 -22822 98958 68328 -72631 69735 24721 -107246 -52327 83883 -4281
78 -4281 -62898 45087 43354 -136374 -107668 74331 52951 -71612 12395 100464 -7267 -75270
90 -75270 21913 26840 -61526 -3358 100124 -4283 -123739 -35947 37260 -56719 -66545 63755
102 63755 85314 1381 14524 43755 -47700 -93569 14790 58770 -30630 -30346 60648 22138
114 22138 -87476 -74901 -18106 -37630 -29219 51653 62626 -2297 9194 62896 13312 -60125
126 -60125 -20637 33245 -4029 -38915 -11313 -1084 -21496 12 41351 26474 -1841 26786
138 26786 45033 -8259 -44619 -4957 31707 19288 12342 29816 21519 -15211 -27898 -24698 -47671
151 -47671 -54416 -3566 33642 9911 -4459 26216 34694 -3115 -18856 5109 6390 -11751 6174
164 6174 24049 -5828 -17882 21142 27497 -18111 -25912 12007 8349 -28734 -15499 19403 4579
177 4579 -6653 27806 25839 -24794 -25647 11042 -8309 -46095 -14675 29701 8762 -10857 21230
190 21230 22302 -21199 -14926 19765 -2949 -27578 14363 43862 7979 -8225 26052 23262 -20845
203 -20845 -17829 8858 -15076 -34291 3260 18821 -14409 -12721 23994 14347 -22802 -12719 11580
216 11580 -9257 -23599 8262 18492 -8267 -1278 25370 6935 -20745 -3623 14222 -4978
228 -4978 -11847 15723 21916 -972 1930 16537 -4477 -25430 -10163 -2343 -19664 -17834 6423
241 6423 10043 -3877 1528 13485 569 -11660 1039 6369 -4508 1742 18969 16833 6011
254 6011 7857 9281 -4921 -17458 -13209 -10308 -15817 -8721 6256 7752 4848 9260 8640 -1937
268 -1937 -10143 -9987 -9276 -11703 -6996 4525 8815 8932 13628 13914 6472 953 -1500 -4516 -7635 -7781
284 -7781 -3889 -2026 -3575 -2228 -1227 -5238 -7229 -5980 -5520 -3792 -43 4285 8400 9697 9888 10588
300 10588 7579 3584 2245 -110 -2476 -2580 -3188 -3535 -3409 -4531 -4193 -3098 -3157 -1026 2321 3828 5709
317 5709 6612 5217 3575 265 -3253 -4085 -5084 -4685 -618 2622 4788 7827 8012 5621 2818 -990
333 -990 -4121 -6372 -7692 -5250 -2498 -1331 2061 3879 1322 90 -720 -4229 -6230 -4669 -1927 353
349 353 2682 7025 9335 6336 5172 5046 -1375 -6290 -4097 -4290 -7405 -4934 440 917 -1513 478
365 478 2728 -2395 -5026 764 488 -4940 400 7850 3925 392 5549 6904 -456 -2682 2519 -704
381 -704 -8151 -2143 4154 -4437 -7119 4194 5600 -3423 -1013 7479 3310 -3462 2925 5904 -5849
396 -5849 -8047 3180 -1416 -14714 -7716 3839 -2630 -6702 5232 10369 1901 3887 14016 6583
410 6583 -5011 4748 12073 -2881 -9608 1906 1263 -11714 -10306 -1508 -5924 -9588 2659 7881
424 7881 -4166 -3693 11243 8712 -4313 53 8913 2396 -4840 -1418 -2004 -9606 -5952 5428 2605
439 2605 -4750 4165 13045 4571 -3155 1811 6092 3282 1720 2199 -2731 -9360 -7632 -5020 -10946
454 -10946 -12144 -219 9262 5692 -737 1116 6168 4007 424 3962 5946 1983 2142 2377 -8166
469 -8166 -16566 -6498 6632 2039 -5137 5425 13048 259 -6856 2091 1947 -3135 8679 16201
483 16201 -2094 -14434 -93 3525 -17703 -18455 6725 8517 -7697 -751 7262 -10111 -12370
496 -12370 13778 16314 -6278 1525 25451 7319 -23433 -9835 8893 -6570 -6745 20521 14848
509 14848 -12475 -971 17097 -10505 -29837 4207 22944 -7755 -15413 10888 1044 -25270
521 -25270 -4787 16848 -7445 -13191 23048 21215 -21834 -18420 18797 9138 -14518 11117 29465
534 29465 -1479 -10969 14536 1037 -31743 -8531 26831 3650 -21423 5367 16592 -17835
546 -17835 -22238 8789 3211 -16200 8419 25240 -9241 -24746 8103 14360 -16064 -9215 24037
559 24037 14300 -10179 4050 12169 -14164 -14313 17496 13359 -15081 -4074 19094 -642 -23085
572 -23085 -3466 11699 -4594 -4261 14522 2631 -19728 -6591 8730 -8746 -16557 9382 20861
585 20861 798 -5600 6984 940 -11936 -546 10172 -1554 -4373 11640 10791 -9128 -10777
598 -10777 5661 6199 -5144 -1213 6407 -1945 -8052 -415 465 -7661 -3020 10404 7291 -7581
612 -7581 -7562 2324 -1508 -8963 -375 9152 5040 2739 7936 3642 -8278 -5656 6654 3333 -6994
627 -6994 631 10590 -122 -10120 -2036 1852 -5973 -2830 8774 3819 -7701 3 9206 -3555
641 -3555 -11535 3631 9079 -5364 -6811 4267 -1060 -11151 -594 9906 -938 -5470 9810
654 9810 9857 -9232 -8367 6760 1334 -8951 2263 10234 -3058 -7881 4654 2389 -12547 -5359
668 -5359 11067 2986 -7621 4623 10654 -3978 -6605 6259 3367 -8785 -1389 9277 -1928
681 -1928 -10003 4074 9172 -4178 -3095 10370 5631 -5678 1251 8277 -1861 -5955 6446 7744
695 7744 -5208 -3676 6660 -186 -9662 -1206 5500 -2226 -3330 6735 6065 -3843 -1546 5756 -870
710 -870 -7745 63 4381 -3449 -4068 3831 2311 -4560 -1726 3309 -1913 -6365 -433 2154 -4243 -4065
726 -4065 2724 1225 -3993 -1122 2136 -2054 -4722 -350 1438 -2748 -2061 3296 1991 -2384 -58
741 -58 2199 -1756 -3674 -320 727 -1918 -1168 2590 1887 -1316 462 2460 -545 -1881 1096 1631
757 1631 -532 99 2416 1830 -295 688 2439 536 -467 2040 2448 551 1053 2342 1108 -665
773 -665 -626 -162 -1538 -2494 -718 237 -660 319 1966 1292 400 696 619 -297 -978 -340 216 -481 -411 600
793 600 84 -840 -424 -333 -752 -542 24 671 777 557 1041 854 -451 -826 -822 -1589 -1683 -1127 -522 55 382
814 382 1072 1700 1084 688 1193 628 -37 416 531 224 206 352 289 -367 -635 96 -163 -725 347 1029 312
835 312 522 963 166 -629 -581 -737 -1522 -1743 -543 -31 -892 -185 1098 130 -552 325 -187 -1441 -878 72
855 72 -691 -1648 -440 557 -1008 -1582 193 -204 -1526 103 1171 -429 -387 1636 1386 -916 -831 915
873 915 -199 -1943 -177 914 -874 -127 2270 856 -1103 649 1932 -317 -1691 411 1085 -1006
889 -1006 -535 1383 -235 -1246 1426 1835 -840 -374 2304 1865 -336 288 1770 369 -624 760 -134
906 -134 -2427 -981 929 -882 -1815 308 1529 392 -354 120 -262 -899 101 241 -1408 -870 1031
923 1031 327 -975 -605 9 633 1415 1136 231 667 1845 1098 -912 -629 597 -191 -454 241 -1416
941 -1416 -2363 432 1327 -1577 -1484 2096 2110 -1172 -939 952 -1027 -1719 2127 1766 -2642 -361 3982
958 3982 82 -4158 105 3526 -178 -928 3503 1820 -3320 134 3641 -3015 -5517 2439 3460
973 3460 -4503 -4013 2586 0 -4314 735 3955 -1958 -2327 4943 2137 -6314 -2162 5162 125 -4080
989 -4080 2651 4772 -2529 -2306 4272 378 -5652 1781 7289 -1568 -5252 3081 2990 -5552 -3221 4233
1005 4233 246 -4241 2592 4366 -5309 -5548 4493 2743 -5209 202 7241 613 -4438 1747 2456
1020 2456 -4737 -1888 6499 1931 -5289 1003 5362 -3250 -5995 2717 3863 -2474 -207 4474 -1622
1035 -1622 -6644 -72 2855 -3989 -3082 5736 4137 -3633 -1803 2373 -1632 -3472 2694 4231 -1344
1050 -1344 -794 4091 306 -5540 -1139 4344 1355 -863 2639 2285 -2727 -2924 572 -580 -2522 1849
1066 1849 4980 247 -3350 -559 388 -2516 -1797 2342 2801 360 703 1500 -1843 -3599 544 3074
1082 3074 277 -489 2263 1532 -2856 -3310 98 480 -716 2037 3652 -657 -3171 -75 100 -3501
1098 -3501 -2087 3109 2586 -1745 -909 1381 -1946 -3524 1542 3156 -993 -234 3775 633 -4707 -1872
1114 -1872 2513 -410 -2248 2725 3325 -2520 -2297 2221 -509 -4051 1120 4936 -137 -2757 2043
1129 2043 1870 -3951 -2293 3431 760 -2840 1900 3729 -2575 -3583 2466 1990 -3136 -351 4548
1144 4548 428 -3674 869 2301 -3217 -2496 3552 1738 -3209 -57 3525 -1059 -3735 1494 2928
1159 2928 -1996 -1101 3692 894 -3487 1 2697 -1636 -2804 2071 2355 -2245 -1328 2700 138 -3140
1175 -3140 462 2569 -1451 -2072 1939 1147 -2725 -1162 2290 196 -2053 1154 2716 -970 -1454 1815
1191 1815 738 -2285 -423 2122 -25 -1710 873 1782 -1243 -1463 1447 664 -1863 -247 1576 -632
1207 -632 -1808 426 1040 -1087 -932 1473 859 -1350 -166 1415 -423 -1248 913 1382 -402 -152 1440
1224 1440 701 -1126 -348 920 -575 -1489 279 591 -1042 -632 911 434 -705 122 1061 -199 -1202
1241 -1202 -4 256 -1170 -796 774 378 -411 551 1281 338 -256 662 803 -434 -425 654 62 -868 -86
1260 -86 454 -342 -631 126 222 -621 -636 190 15 -665 75 727 38 -168 491 370 -332 -408 104 -19 -565
1281 -565 -92 614 217 32 760 828 152 102 333 -35 -680 -632 -209 -558 -789 -6 276 -231 22 580 237
1302 237 -158 53 287 -60 -334 130 292 -198 -53 480 85 -273 218 297 -171 -155 263 260 -38 183 512
1323 512 27 -237 261 24 -630 -357 1 -347 -445 27 214 -80 25 529 207 -253 217 402 -369 -377 225
1344 225 -87 -483 -91 176 -221 -274 330 228 -502 -148 491 -196 -634 127 152 -511 -170 341 -152 -473 171
1365 171 457 -392 -502 455 260 -507 86 560 -150 -164 621 265 -459 24 651 -5 -571 235 541 -308
1385 -308 -144 581 -90 -466 477 517 -326 -150 757 478 -280 141 524 -228 -369 340 -174 -817 65 541
1405 541 -372 -440 424 380 -321 -31 421 -320 -473 565 331 -764 11 976 -59 -674 210 137 -810 -333
1425 -333 615 -168 -652 861 1198 -596 -595 899 47 -1258 -98 538 -917 -776 919 321 -1248 140
1443 140 1823 181 -937 979 1087 -1125 -583 1141 -162 -1227 869 1577 -992 -1312 1190 635
1459 635 -1635 -181 1758 -225 -1201 948 562 -2045 -1034 1576 106 -1778 409 1649 -1226 -1886
1475 -1886 769 340 -1666 433 2389 -115 -1460 998 1094 -1945 -1428 1493 434 -1744 132 1186
1491 1186 -1442 -1519 1528 1186 -1105 272 2219 -226 -2339 -339 735 -1167 -427 2309 1291 -802
1507 -802 519 1380 -964 -1614 997 1686 -220 -26 1472 68 -1549 -53 857 -519 -300 1519 847
1524 847 -1149 -824 564 57 -542 894 1593 198 -411 209 -560 -1565 -552 913 595 -135 271 542
1542 542 -590 -1217 -272 346 25 333 806 67 -1089 -1021 -299 -417 -758 387 1400 443 -466 37 64
1561 64 -897 -599 634 455 -697 -174 643 -689 -1534 266 1112 -216 -218 1178 375 -1288 -422 864
1579 864 -228 -731 1318 1578 -855 -973 769 -228 -1752 40 1625 50 -558 1352 1036 -1517 -868
1596 -868 1291 -43 -1641 448 1466 -928 -1266 985 670 -1375 -131 1852 12 -1520 644 1277
1612 1277 -1250 -1089 1432 658 -1429 -60 1348 -679 -1609 792 1286 -900 -237 2029 636 -1409
1628 -1409 37 987 -1114 -1586 711 795 -1169 -366 1484 45 -1445 351 1227 -732 -832 1151 728
1645 728 -1109 -215 1157 -192 -1246 411 997 -890 -814 1021 449 -963 170 1273 -18 -828 502
1662 502 606 -1049 -912 634 59 -1080 65 997 -227 -776 448 572 -609 -278 1054 570 -479
1679 -479 289 921 -372 -866 326 429 -528 -103 1017 567 -340 290 789 -255 -727 232 169 -853 -533
1698 -533 380 -13 -570 134 695 -89 -494 339 256 -676 -311 606 279 -209 450 723 -139 -552 4 -25 -778
1719 -778 -474 411 7 -549 26 213 -602 -817 -184 -199 -717 -489 261 6 -363 274 680 149 24 600
1739 600 445 -200 -101 302 -15 -407 26 337 -221 -387 165 116 -283 68 542 351 -8 259 315 -257 -448
1760 -448 31 95 -276 88 571 301 76 376 449 41 -68 321 245 -230 -52 262 -94 -375 2 14 -398
1781 -398 -325 15 -12 -178 200 585 318 99 385 154 -406 -403 -229 -493 -564 -192 66 -108 -88 300 212 -96
1803 -96 110 298 -57 -106 198 84 -173 -13 64 -149 -306 -85 5 -236 -65 267 97 -3 252 182 -201 -177
1825 -177 -12 -163 -357 -73 167 -6 16 368 246 -76 179 291 -72 -100 205 84 -164 -54 118 -131 -345
1846 -345 17 43 -307 -59 349 88 -109 254 237 -221 -211 50 -173 -425 -105 184 -147 -134 450 313 -86
1867 -86 202 400 -37 -158 199 86 -374 -181 187 -160 -482 30 180 -260 -51 433 161 -87 261 305 -218
1888 -218 -286 112 -61 -521 -122 300 -133 -153 469 337 -112 214 504 -42 -318 157 106 -446 -338 172 -231
1909 -231 -586 23 185 -392 -166 504 273 -104 416 697 52 -182 346 58 -647 -225 321 -360 -560 237
1929 237 244 -402 -137 521 88 -393 232 381 -473 -479 336 22 -597 99 625 -14 -227 545 442 -278 0
1950 0 664 20 -564 142 239 -733 -639 207 -97 -594 90 544 -120 -282 530 452 -319 103 791 112 -419 109
1972 109 166 -585 -482 209 43 -407 93 517 -149 -381 314 262 -335 -74 335 -142 -524 -63 41 -320 -164
1993 -164 488 423 37 315 510 54 -149 152 81 -254 -189 -69 -301 -510 -277 -94 -103 0 327 309 212 170 92
2016 92 34 65 86 52 78 -55 -169 -208 -168 -238 -233 94 209 72 79 254 76 -200 21 113 -196 -243 37 -66 -385
2041 -385 -176 260 99 -89 419 518 -79 -137 261 -29 -423 38 354 -140 -396 164 140 -546 -270 402 99
2062 99 -301 324 488 -254 -386 264 61 -560 -155 465 -59 -415 347 490 -222 4 699 242 -389 47
2082 47 381 -402 -618 199 214 -544 -217 464 -41 -529 157 455 -214 -178 524 262 -426 -142 290 -327 -693
2103 -693 74 271 -364 -96 633 324 -160 247 546 -83 -425 139 90 -569 -388 227 -165 -542 17 320
2123 320 -94 -92 520 527 5 192 611 119 -299 64 102 -426 -480 -74 -132 -462 -72 456 295 81 475 524 -60
2146 -60 -140 156 -5 -312 -55 249 -83 -344 -64 19 -326 -246 280 267 -18 182 292 -109 -322 -114 -30 -349
2168 -349 -291 24 -33 -290 -29 298 145 152 409 390 -31 -193 -33 -156 -427 -214 102 -96 -276 -45 -111 -329
2190 -329 -241 133 216 100 279 398 87 -172 -27 45 -184 -78 221 196 8 126 280 133 -31 192 184 -149
2212 -149 -237 -55 -172 -376 -114 115 35 -43 149 194 -54 -65 227 220 84 212 244 -7 -242 -170 -199 -361 -231
2235 -231 50 91 -14 183 297 105 26 155 56 -186 -181 -79 -201 -300 -111 52 -44 -42 170 142 -9 78 245 162
2259 162 67 184 134 -113 -242 -164 -231 -377 -171 53 40 70 272 233 128 71 143 -36 -183 -128 -98 -211 -169 23
2283 23 -5 -95 68 114 55 50 177 155 107 123 128 13 -154 -117 -219 -311 -216 -45 -41 54 214 261 181 153 127 40 -132 -68
2311 -68 -90 -185 -164 -6 -79 -86 53 93 26 35 160 134 45 117 129 -32 -151 -55 -160 -309 -155 -58 -50 30 233 304 163
2338 163 171 203 14 -163 -110 -158 -320 -265 -119 -173 -206 -9 86 1 31 174 204 74 186 248 2 -87 22 -115 -322
2363 -322 -230 -106 -133 -144 134 229 127 181 327 137 -68 50 33 -190 -165 15 -55 -129 4 149 23 -2 193
2386 193 208 56 133 270 62 -61 16 -51 -287 -287 -139 -197 -221 28 170 59 131 291 149 -37 58 59 -180 -181 -63
2411 -63 -54 -184 -60 70 -38 -115 74 129 -62 0 142 32 -129 -28 22 -177 -276 -45 -95 -178 21 193 66
2434 66 84 252 195 -44 -17 41 -136 -262 -96 -21 -175 -110 124 89 -11 203 216 68 74 186 121 -44 -44 26 -134
2459 -134 -224 -72 -48 -131 -36 158 131 127 229 233 55 -27 11 -117 -213 -176 -118 -180 -177 -9 14 -29 109 175 122 130 168 96
2487 96 -39 -38 -34 -138 -197 -130 -149 -186 -46 39 54 132 262 278 179 142 83 -48 -193 -101 -109 -195 -98 -1 -72 -48 61 137
2515 137 55 136 226 133 36 46 30 -158 -194 -102 -132 -212 -135 -8 9 -15 154 200 111 111 214 14 -100 -90 -61 -224 -165
2542 -165 -5 -28 -88 39 146 24 45 126 103 -19 -4 64 -79 -222 -120 -76 -208 -149 31 55 21 142 259 158
2566 158 72 157 102 -92 -80 -14 -113 -205 -81 -18 -87 -44 92 132 68 119 172 73 -31 20 -16 -126 -128 -62 -93 -146 -60 67
2594 67 24 31 209 199 131 108 103 -18 -137 -134 -133 -132 -155 -63 -15 -25 -7 105 101 87 130 184 71 -31 -6 -62 -142 -156 -82 -94
2624 -94 -99 10 43 46 52 158 126 125 123 58 6 -115 -163 -137 -172 -144 -59 -8 12 24 100 95 89 88 95 59 9 -12 -85 -182 -160 -124 -72
2657 -72 -28 27 106 106 82 124 152 65 79 17 -20 -97 -128 -104 -117 -127 -27 25 43 77 145 117 53 50 65 -8 -68 -75 -115 -150 -156 -102
2689 -102 -53 4 60 109 134 139 118 130 6 2 -23 -45 -123 -115 -95 -114 -104 0 50 78 91 174 156 98 64 54 -27 -124 -59 -113
2719 -113 -171 -109 -77 -41 -5 67 118 72 119 129 75 15 2 -49 -87 -134 -82 -96 -125 -72 -5 37 53 128 141 104 119 100 18 -54
2749 -54 -52 -82 -107 -125 -69 -79 -35 39 68 75 95 143 124 49 -2 -18 -66 -93 -115 -111 -120 -62 -24 22 68 93 118 72 83 115 33 -35
2781 -35 -23 -82 -103 -119 -66 -71 -43 12 53 69 96 128 96 70 48 7 -54 -108 -106 -85 -101 -88 -43 2 6 90 98 81 80 75 59 0 -34
2814 -34 -75 -139 -127 -79 -64 -53 10 98 78 102 127 119 65 72 37 -36 -89 -96 -114 -133 -95 -62 -3 -1 84 105 103 87 133 90 -30 -44
2846 -44 -53 -114 -144 -100 -74 -111 -42 20 57 81 120 102 83 58 69 29 -69 -85 -53 -129 -114 -79 -27 -4 22 128 76 94 107 80
2876 80 9 2 -29 -77 -128 -86 -77 -115 -73 22 36 50 95 96 76 52 50 -5 -63 -77 -75 -85 -124 -55 -63 -34 18 74 83 86 113 79 52 21
2910 21 34 -48 -82 -97 -50 -117 -77 -15 -6 10 82 102 93 75 73 37 -40 -67 -36 -105 -105 -88 -76 -46 -14 34 75 103 109 109 63 3 16
2943 16 -27 -85 -89 -89 -117 -73 -3 -23 36 82 103 101 88 81 39 10 -14 -27 -76 -100 -57 -69 -51 -6 30 70 49 101 89 60 28 13
2975 13 -47 -93 -85 -116 -77 -105 -56 -17 0 51 105 84 65 78 95 9 -23 -9 -39 -97 -100 -50 -63 -43 24 40 45 99 124 81 53 47
3007 47 7 -41 -97 -78 -97 -122 -62 -13 7 -14 73 95 41 50 65 -2 -5 -17 -41 -88 -95 -76 -44 -50 29 52 43 85 103 84 66 28 16
3040 16 -41 -62 -51 -61 -71 -66 -34 -3 11 80 40 81 68 60 49 24 -7 -52 -79 -123 -69 -72 -70 -37 17 23 78 89 74 70 37 30 -19 -23
3074 -23 -42 -70 -65 -91 -39 -2 7 42 91 97 70 55 66 19 -8 -48 -64 -55 -81 -85 -53 -30 -7 14 67 81 92 80 27 30 33 -72 -48
3107 -48 -67 -96 -88 -53 -55 -8 43 84 87 87 97 50 52 12 -23 -43 -66 -75 -58 -66 -25 -27 21 23 71 94 83 68 47 34 -39 -49 -81 -71 -73
3142 -73 -47 -37 -40 -11 26 36 84 77 75 57 21 -5 -14 -55 -48 -66 -37 -40 -32 9 16 31 74 68 79 51 7 -22 -36 -64 -63 -87 -60 -30 -34 -32
3178 -32 4 40 30 70 73 55 22 -22 -42 -56 -85 -71 -77 -64 -14 -20 25 1 52 58 84 87 74 49 1 -24 -40 -51 -58 -70 -34 -4 8
3211 8 21 3 23 63 39 63 28 -21 -51 -48 -101 -85 -79 -24 -34 -14 38 29 44 66 45 22 37 -14 -11 -45 -71 -64 -81 -69 -37 3 38
3244 38 66 65 59 40 12 32 7 -35 -54 -72 -51 -57 -28 13 9 18 39 17 47 50 45 18 -9 -19 -63 -78 -68 -80 -68 -57 22 17 29 82
3278 82 76 58 28 49 -4 34 -22 -47 -60 -61 -58 -24 -7 -10 50 39 50 52 63 7 1 -17 -38 -56 -72 -57 -68 -42 6 13 17 23 25 54 29
3313 29 48 28 16 -38 -14 -29 -43 -23 -27 -16 -2 21 43 55 66 71 49 52 18 -33 -38 -50 -77 -58 -58 -1 -6 11 21 65 46 18 25 -1
3347 -1 29 3 -29 -74 -56 -52 -62 -56 -11 8 17 41 20 71 26 6 0 0 -23 -23 -38 -40 -30 -20 -17 -3 45 56 58 33 35 49 0 -16 -28 -52
3383 -52 -61 -37 -58 -1 -44 24 22 19 52 44 49 14 34 15 -68 -57 -34 -55 -60 -34 6 8 36 36 34 12 4 62 37 -1 -5 -43 -56 -38 -22 -28
3419 -28 -37 -4 38 27 7 44 54 1 29 -3 -18 -23 -56 -47 -46 -35 -12 -24 -8 24 22 29 61 45 28 -8 -5 -14 -13 -46 -12 -40 -6 2 9 35
3455 35 23 54 28 13 44 28 -8 -29 -20 -35 -54 -18 -23 -29 -28 11 32 25 50 3 5 6 -16 -24 -33 -59 -35 -48 -27 -16 -8 28 25 63 55 59 56
3492 56 19 25 -17 -18 -9 -7 -28 -29 -9 -11 30 37 8 36 42 10 2 -26 -28 -63 -56 -49 -45 -43 10 -31 6 21 16 26 40 9 -10 -1 -18 -60 -34 -39 -30
3531 -30 -23 -16 -4 24 10 22 29 37 30 31 16 -29 -28 -27 -26 -39 -36 -34 -14 -16 8 15 27 30 32 -2 -3 -14 -28 -35 -37 -43 -29 -35 -3 4 -4 -6 15 44 14 25
3573 25 18 -2 -27 -23 -26 -29 -43 -6 4 16 5 32 -10 15 45 12 26 -2 15 -19 -20 -29 -39 -17 13 -16 23 14 24 2 44 9 3 20
3607 20 -16 -32 -10 -17 -48 -20 -13 7 4 27 53 39 37 21 13 -13 -14 -5 -12 -33 -50 -16 -11 3 49 7 17 34 18 10 9 -8 13 -25 -40 -47
3643 -47 -25 -42 -14 -20 14 15 26 44 31 0 -25 -2 2 -31 -36 -13 -52 -22 -35 -7 13 26 24 14 26 43 17 -30 -28 -29 -12 -35 -37 -19
3677 -19 -36 -10 -2 3 -3 40 -2 7 18 -3 -12 3 -41 -29 -22 -23 1 -1 -3 -14 21 37 56 15 18 32 -3 -14 19 -26 8 -2 2 -24 18 9
3713 9 -2 22 23 18 16 4 -17 -28 -54 -37 -53 -15 -8 2 -6 -7 -26 21 47 26 48 -6 -1 -15 -28 -20 -28 -40 -11 -26 -4 19 35 34 27 48
3749 48 20 11 18 -20 -29 -24 -8 -22 -50 1 2 -11 -6 19 1 17 18 -18 6 1 -18 -12 -30 -13 13 1 15 14 43 25 56 32 39 27 2 -9
3785 -9 -14 -26 -20 -39 -56 -7 -6 25 14 3 35 2 0 1 14 -4 -23 -1 -3 -25 -32 -37 -41 7 -34 9 0 11 -12 -5 -23 -13 -10 -41 -29 -32 -38 9
3823 9 6 29 28 42 54 53 31 -5 14 -7 -2 -33 -34 -38 -29 -37 -15 -16 -14 -15 17 31 10 16 0 22 -32 -28 -8 -12 -33 -36 -1 -10 -11 11 44 22 12
3862 12 20 -3 -7 4 -42 -31 5 -23 1 -3 41 28 21 65 48 31 5 44 7 -4 -26 -26 -33 -39 -67 -45 -3 -15 29 15 -2 26 25 11
3896 11 -1 -26 -9 -19 -15 -22 -5 -27 6 28 13 22 35 49 8 12 16 -45 -36 -22 -10 -55 -30 1 -43 15 63 14 33 22 12 -17 -9 -16
3930 -16 -15 -60 -29 -24 -43 -48 -13 5 -21 15 33 42 8 37 11 3 -36 -10 -36 -39 -27 -3 -17 -12 22 -9 53 43 29 1 -20 20 -5 -11
3964 -11 -35 -41 -35 -10 -22 -21 8 6 6 20 -1 -12 -6 -4 -5 -28 -14 -16 -24 -19 -18 4 32 38 38 33 56 42 -15 11 -24 -6 -42 -30 -22 -46 -50 -8 6
4003 6 -6 53 21 36 56 15 -30 -9 -5 -22 -55 -15 -26 -17 -29 20 20 10 59 6 25 -31 -2 16 -21 -26 -11 -5 2 -12 -6 21 13 66 51
4038 51 40 32 34 3 -34 -38 -47 -81 -39 -32 -33 -41 -25 33 13 18 58 24 44 24 24 -40 -59 -33 12 -19 -13 9 28 14 17 23 36 4 23 34
4074 34 -33 -54 -10 -12 -45 -53 16 23 -1 21 40 11 27 45 18 11 14 17 -37 -62 -49 -14 -61 -46 29 27 16 13 49 18 22 67 20 11 -18
4109 -18 -4 -18 -60 -6 0 3 1 38 27 -4 15 29 42 15 11 11 -32 -54 -28 -33 -55 -26 27 6 -11 37 42 10 25 25 14 4 -33 8
4143 8 -28 -81 -69 -6 -21 -19 26 47 -19 17 61 24 -8 9 12 -38 -44 -16 -8 -35 -13 18 23 1 46 76 25 -28 29 -18 -27 -44 4 -39
4177 -39 -64 -23 2 -5 -4 24 82 -13 23 21 -12 -49 -6 -2 -60 -42 0 21 -17 6 58 61 15 78 49 -28 -20 10 3 -72 -36 -16 -63 -64
4211 -64 11 77 21 29 91 57 15 31 38 -21 -42 -2 -26 -114 -70 -13 -36 -22 14 63 -7 -38 45 46 -8 34 50 -7 -63 1 -6 -68
4243 -68 -22 42 45 11 71 49 30 17 27 30 -44 -47 -21 -47 -78 -42 -35 -21 -21 5 63 15 31 40 18 6 15 24 7 -69 -7 -51 -47 -42 -9
4278 -9 27 21 47 35 53 6 -8 9 -17 -12 -11 -33 11 -56 -10 9 11 19 50 43 20 13 14 -32 -62 -37 -14 -80 -75 -11 -54 -20 -26 31 25 43
4314 43 49 60 6 13 40 2 -61 -47 -31 -11 -19 19 19 -15 15 96 38 2 3 24 -61 -21 -4 -37 -51 -32 25 -30 -42 17 22 3 35
4347 35 30 17 -38 11 -25 -56 -45 -24 -32 -35 -24 41 14 5 49 46 24 20 30 -3 -41 -21 -23 -73 -24 12 41 -14 34 54 16 -7 50 28
4381 28 -17 0 -8 -42 -64 -30 -35 -38 -48 22 -33 9 65 39 36 14 35 14 -31 -16 -11 -31 -63 -38 2 -26 12 58 18 18 44 21 -18
4414 -18 23 -23 -44 -74 -46 -17 -29 -26 15 -10 44 48 64 27 6 22 -12 -35 -44 -52 -68 -79 -43 -48 -45 1 40 32 17 51 62 35 4 14
4448 14 -1 -37 1 -43 -63 -23 -12 6 10 48 57 17 19 29 25 -32 -32 -38 -55 -56 -27 -35 -12 17 30 6 21 93 65 30 44 29 -10 -45
4482 -45 -38 -28 -37 -51 -17 -29 -18 17 44 43 42 82 59 32 10 19 -26 -38 -27 -29 -57 19 33 2 1 40 59 -8 -6 30 14 -50 -33 -32 -65
4517 -65 -59 -7 -4 -18 -1 67 16 -4 53 46 -12 -26 -4 -9 -54 -3 -2 -59 -49 -5 34 15 16 61 36 10 16 46 -50 -36 1 -15 -75 -40
4551 -40 19 11 -26 50 55 29 12 10 6 -47 -8 -5 -29 -69 -25 11 -67 -20 35 66 67 50 84 43 -17 22 33 -38 -26 -4 -37 -68 -20
4584 -20 15 -13 -33 33 62 49 21 46 21 -75 -27 -25 -35 -50 -19 -23 -26 -32 50 29 26 56 82 57 -9 12 10 -51 -62 20 -5 -36 -18
4617 -18 24 -6 -35 44 98 31 34 75 25 -67 -33 -22 -45 -47 19 55 -42 -26 25 4 -9 48 49 45 -40 6 -19 -77 -110 12 -5 -51
4649 -51 20 57 13 -7 59 69 2 35 100 54 -65 -22 14 -78 -103 15 35 -27 17 86 30 -23 60 54 -18 -31 53 28 -102
4678 -102 -45 -3 -51 -87 61 79 -28 5 80 71 -45 1 39 -27 -82 54 15 -72 -48 21 -16 -16 39 127 53 -15 26 25 -60
4707 -60 -40 30 -32 -74 -54 16 -59 -60 21 38 -12 23 85 22 -44 20 13 -71 -62 -3 40 -56 -12 42 -27 -33 43 53 25 15 60 23
4739 23 -44 -29 -25 -61 -66 4 26 -7 -16 43 9 25 29 60 36 -28 -25 15 -56 -93 -23 -20 -30 -17 14 12 -4 18 50 16 -14 31 13 -50
4773 -50 -41 -26 -18 -58 -16 26 22 -12 35 63 10 28 56 70 21 10 -16 -57 -77 -36 -3 -27 -19 54 39 12 39 78 -9 -14 18 5 -62
4806 -62 -67 -2 -23 -76 -13 -6 -21 14 67 57 11 65 64 8 -56 -9 1 -76 -72 -31 -41 -43 16 68 66 0 59 64 -16 -9 35 -4 -57 -23
4840 -23 -23 -78 -48 28 -7 -30 18 65 17 -5 47 35 -46 -44 5 -45 -64 -27 -25 -49 -29 27 42 20 51 90 50 -1 12 21 -33 -32 -11
4873 -11 -41 -49 -27 13 -18 -11 25 43 45 30 22 11 -34 -28 -14 -51 -33 -55 -19 -28 -27 16 3 29 44 14 11 2 -19 -29 -32 -15 -54 -24 -13
4908 -13 25 11 31 34 38 28 36 17 20 2 -2 -25 -21 -14 -53 -28 -43 -26 -13 30 33 44 33 -1 7 4 -24 -31 -45 -46 -36 -19 -37 -28 -3 56 3
4945 3 -7 71 14 16 8 21 -11 -35 -23 -29 -44 -31 0 19 20 51 65 34 11 34 0 -17 -32 -30 -40 -55 -44 -23 -41 -13 19 19 19 2
4979 2 43 6 5 5 -21 -47 -37 -17 -13 -32 41 24 -20 33 64 32 19 40 46 -3 -24 -4 -45 -36 -31 -33 -18 -44 -9 54 0 15 31 22 -35
5014 -35 4 28 -23 -65 -33 16 -49 -41 6 18 -21 10 49 44 35 21 36 -9 -38 22 -32 -49 -22 -9 -32 -33 34 21 1 48 88 34
5046 34 -35 -1 18 -50 -52 -9 -17 -48 -37 -5 -3 -34 11 57 45 0 38 8 -41 -59 -28 -28 -83 -27 11 -29 -35 42 30 -1 12 42 35
5079 35 -26 10 16 -54 -58 -22 -6 -36 -34 29 52 -17 4 56 15 -9 -9 31 -38 -55 -18 -32 -64 -21 24 7 -4 55 66 7 2 15 11
5112 11 -54 18 23 -19 -73 -21 25 -47 -1 61 76 -21 34 89 7 -27 35 -4 -79 -22 35 -30 -61 -27 34 -38 -9 62 57 -36 -10
5143 -10 58 -24 -90 21 -1 -64 -38 7 7 -58 -28 85 26 11 85 48 -17 -12 32 -8 -64 9 60 -26 -58 69 34 -14 2 57
5173 57 15 -16 41 50 -37 -77 8 -27 -103 -26 52 -6 -51 -11 47 5 -23 58 89 -23 -13 30 -49 -101 -16 4 -36 -26 64 59 -18
5204 -18 18 86 24 -27 36 72 -44 -47 -10 -33 -88 -46 20 3 -10 12 42 -14 22 41 3 -33 1 26 -41 -68 -18 16 -24 -37
5234 -37 51 39 -36 25 51 14 -35 28 38 -62 -55 -13 -28 -76 -44 29 28 -30 55 48 28 -17 27 48 -58 -48 11 -31 -52 -4 3
5265 3 -34 -16 66 46 -22 2 28 25 -31 22 25 -59 -52 3 -39 -49 -5 51 2 -17 57 52 -23 -40 77 -7 -43 -6 29 -32 -68 -28
5297 -28 -8 -39 -9 43 6 -31 42 69 -14 -72 30 -10 -45 -25 28 -34 -73 15 35 -18 32 66 38 9 15 34 -19 -39 9 10 -42
5328 -42 -33 10 -17 -3 22 34 5 36 39 25 -22 -1 -18 -41 -56 -1 -39 -15 -43 8 21 -17 30 31 12 26 3 24 -28 -33 -44 -15
5360 -15 5 -8 27 9 -6 43 39 39 12 30 4 -20 12 -22 -55 -44 -24 -39 -18 -15 11 -15 11 23 -11 19 15 -15 1 -34 -53 -43
5392 -43 -38 -46 -11 -20 18 4 41 27 53 11 13 27 -9 -34 -14 -10 -18 -23 -43 0 1 17 48 14 -7 -1 31 -18 -5 -22 -28 -70 -34 -18 -30
5427 -30 -15 -9 -2 -5 -8 32 31 -12 -16 -11 3 -16 -30 -22 -28 1 -7 9 2 23 -2 9 7 39 11 9 11 7 -29 10 -25 -51 -40 2 39 15 16 39
5465 39 44 -3 12 37 5 -69 -30 -42 -34 -32 -19 -18 -14 11 24 50 6 43 -1 -2 -18 14 -45 -23 -7 -20 9 -22 7 47 -10 33 28 29
5499 29 -17 15 2 -42 -21 -39 -16 -30 -34 -1 -15 4 6 14 -1 29 34 -5 -4 -1 -10 -31 -70 -35 -17 -38 -14 16 36 17 46 26 26 -9
5533 -9 15 20 -23 -12 -4 -7 -16 -5 14 24 -1 28 61 -7 -24 48 5 -27 -27 -10 -27 -22 -38 10 -40 -13 18 39 -18 -10 71 -1 -8 38 29
5568 29 -32 -42 -4 -3 -20 -21 27 27 10 49 43 22 -19 18 27 -48 -62 20 -1 -23 -10 34 3 -24 47 32 16 12 53 -8 -79 -12 39
5601 39 -72 -47 42 5 -54 0 37 4 9 57 10 -29 10 55 2 -68 -8 7 -51 -39 20 37 -29 28 57 12 -8 -5 71 -37
5631 -37 -57 21 -35 -60 -25 31 -20 -45 4 27 -6 -28 52 3 -5 -19 20 -17 -63 -2 18 -22 -5 44 22 13 9 61 6 4 57 39
5663 39 -26 -21 12 -16 -68 -33 55 -23 -18 38 68 -15 5 35 -3 -24 4 21 -40 -45 -42 -7 -33 -41 28 -14 22 57 61 7 -10 17 28
5696 28 -63 -32 16 -5 -78 -7 1 -8 1 35 41 5 3 60 34 -25 9 26 1 -51 -4 7 -53 -58 29 12 -28 32 60 25 -15 23 -8
5729 -8 -55 -47 18 -20 -16 3 16 -43 -36 52 48 10 12 60 16 -64 -4 21 -34 -15 51 31 -47 -29 33 13 -11 42 67 -21 -62 16 -3
5762 -3 -79 -46 2 -62 -70 21 40 -45 -34 27 5 -18 12 60 5 -65 4 -2 -49 1 53 23 -15 20 68 6 -9 64 16 -27 23 12
5794 12 -24 -65 -18 -3 -37 -45 33 8 13 -4 39 -34 -12 5 15 -11 -51 -13 -28 -30 6 -15 -42 11 50 29 -3 1 27 16 -42 23
5826 23 -1 -40 -17 18 -16 -11 -9 -1 3 40 10 38 10 8 -5 8 -56 -10 -30 -26 -32 -16 26 13 6 19 33 -4 16 15 27 0 -6 21 3
5861 3 -1 3 -5 -41 -7 5 25 44 -8 45 52 -11 -8 41 -29 -20 -15 -20 -36 -18 -11 16 14 20 35 12 -34 33 12 -38 -33 -23 -49 -31 -37 -1 -2 -33
5899 -33 -1 24 28 33 34 7 -34 -14 -15 -15 -49 -19 -18 -26 -17 21 14 16 47 24 24 -12 23 -4 -24 14 -23 -19 -44 -13 -11 23 10 27 32 8 9 -8
5937 -8 -30 -20 -10 3 -47 -23 2 -2 0 -1 49 -10 44 48 0 17 27 31 -23 -22 -21 -13 -28 4 20 -7 2 40 25 -8 -4 -1 5 -18 -2 -28 -16
5974 -16 -47 -33 5 -24 17 7 33 9 14 39 0 6 22 -13 7 -35 -7 -34 -22 -17 31 7 -14 50 22 21 -23 34 -6 -14 -34 -10 -10
6007 -10 -18 -10 -11 -39 20 18 13 15 6 13 9 4 -15 -6 -20 -12 7 -11 -14 12 -2 -8 24 40 8 5 22 18 12 30 -9 -14 -14 -35 17 22 16 14 37 5 -5
6048 -5 19 22 -4 -12 1 -5 -23 -11 -17 -19 -20 0 42 4 9 27 14 -21 22 60 -4 -41 -27 -8 -40 3 5 -1 -34 -5 35 18 -6 6 41
6083 41 -1 0 -3 -5 -57 -34 2 -3 -22 18 24 18 -5 20 2 -43 0 19 -51 -26 32 5 -25 -8 37 24 -6 38 62 -15 -4 42 41 -33
6117 -33 -27 40 -3 -61 17 11 -59 -20 38 23 -6 2 34 -2 -67 -36 -4 -51 -39 16 -18 -29 -31 8 5 -24 42 45 -29 19 45 -24 -38
6150 -38 -33 -11 -20 -38 2 8 -32 -16 46 24 36 41 49 5 8 -12 21 -15 -17 23 3 -19 2 53 -2 -22 25 16 -13 -23 47 -9 -59 -39
6184 -39 -3 -24 -45 36 52 -8 -4 35 20 -9 32 61 6 -46 19 5 -75 -73 -2 18 -23 36 54 -8 4 40 50 -20 -27 51 39 -38
6216 -38 -49 -9 -43 -29 8 40 -6 1 46 -7 -25 -4 30 -40 -30 34 -23 -34 -52 24 9 -23 60 79 4 7 45 38 -36 11 43 -18
6248 -18 -48 14 13 -40 -42 14 29 -14 -9 66 -6 -57 27 3 -73 -15 23 -11 -78 -44 24 -33 -12 42 17 -19 7 53 19 -31 7 17
6280 17 -3 2 12 -16 -36 3 35 8 30 39 35 23 4 12 8 -56 -10 16 -17 -27 10 50 -15 17 16 33 -15 20 18 -11 -20 -8 -42 -35 -30
6315 -30 1 29 -15 -2 12 38 13 24 42 -3 35 10 -23 -36 -13 0 -18 -15 -3 7 -14 -3 13 4 -7 9 20 10 -18 -10 -11 -41
6347 -41 -40 -7 12 -14 -26 2 10 -16 12 25 -17 -22 17 6 -7 -19 -4 -11 -11 11 53 16 -6 41 25 28 8 43 19 -30 -35 -1 -61 -30
6381 -30 16 -45 -54 -8 16 8 -9 15 20 -25 -1 -16 7 -29 -40 -7 -28 -23 18 10 10 9 39 45 12 -19 -3 -15 7 -9 -8 -33 -29 21 -23
6416 -23 0 2 24 20 19 22 -11 -11 -24 -39 -20 -14 -40 -20 -25 -14 -8 26 -9 14 20 1 -6 -2 -3 14 -8 0 -16 7 7 -18 4 9 34 27 38 -4
6454 -4 47 -22 14 -18 -15 -41 -28 -14 -18 -23 -4 1 -7 3 36 -7 4 25 -31 -1 -34 -7 2 -48 -12 -5 38 14 6 11 23 4 5 14 -23 13
6490 13 -12 -24 -33 -17 -19 10 8 29 4 29 6 7 0 9 -38 -19 -1 10 -20 -25 -28 -4 -35 11 0 -27 24 29 1 -4 0 -1 5 10 -7 14 -21
6527 -21 30 40 21 -12 45 11 9 -6 30 -6 -16 35 -2 -21 0 10 -18 -25 12 33 -20 34 51 30 2 0 1 -2 -39 -17 11 -25 -40
6560 -40 -6 -42 -18 -13 7 17 45 25 16 -3 -24 9 -24 -15 -2 30 -23 7 28 -10 1 -8 36 32 -29 -11 -5 -10 2 -3 -24 -33 -12 -7 -3 -9
6596 -9 2 -4 -9 -8 30 -4 -14 -14 10 -16 -46 -29 17 -40 25 15 4 -3 27 38 8 -2 12 12 -12 -34 -1 13 -54 -27 10 16 -9 24
6630 24 -17 -17 3 10 2 -27 -27 9 -33 -41 -16 9 -19 23 29 -9 -34 7 37 0 -30 10 -7 -8 13 -20 -17 -31 -8 28 32 -11 55 17 2
6665 2 -5 5 -25 -48 2 4 -49 -40 24 -6 11 -2 52 26 -20 15 30 2 -50 9 -22 -19 -10 1 -33 -47 17 31 16 -13 43 7 -10
6698 -10 -5 29 -43 -38 -13 7 -16 -41 21 11 -1 35 26 9 -16 11 15 -55 -28 24 -37 -27 -23 -7 -28 -18 27 -12 -28 -20 62 10 -21
6731 -21 0 18 -5 -45 -11 9 -23 19 25 5 -17 9 28 -8 0 34 -1 -28 1 7 -15 -34 29 10 -19 24 46 33 -17 -6 31 -16
6763 -16 7 -2 -25 -43 -35 -6 -27 -11 39 3 -5 -35 13 23 1 -3 21 15 -25 5 0 9 -13 6 17 14 -4 30 24 -11 20 16 1 -32 -21
6798 -21 7 -17 -33 -26 13 -24 -19 2 -4 4 -4 19 11 8 22 2 -25 -5 0 -35 -12 24 20 11 17 9 26 16 13 15 24 4 -2 1 -14 -17 -3 -18 -17 -10
6838 -10 13 25 4 10 25 -9 -45 14 -19 -43 -51 -25 -44 -33 -27 -24 10 25 8 -4 17 21 28 -13 -14 -5 -13 1 -16 15 -19 -17 10 34 12
6873 12 4 45 -8 -58 -12 -14 -19 -59 -17 -10 15 -11 22 2 -5 -9 21 -14 -7 11 -36 -31 -40 -15 -41 -46 -11 -15 -12 16 4 50 11 11 15 18 0 12
6911 12 -8 -13 -27 -2 -43 3 8 12 9 -11 3 14 -17 29 -8 3 -2 -27 -17 -61 -39 -15 -16 -1 -4 0 23 10 17 11 8 0 8 -18 -10 7 -11
6948 -11 -15 -18 13 13 10 19 -10 2 18 -8 33 3 -4 -29 -14 -30 -33 -13 -12 -13 -12 -3 -15 2 34 -6 -8 -9 -8 -17 -38 -26 -14 5 29 4 19 31
6986 31 31 4 -2 -1 1 -1 -9 -33 3 -18 0 19 12 28 -11 -1 -6 10 35 7 -43 -26 -42 -8 -34 -7 -34 6 -16 -9 48 16 -11 -8 4
7021 4 24 2 -14 -21 -6 -7 -18 -32 -36 -6 -4 14 4 31 20 29 26 10 25 -13 1 -8 3 -16 -10 8 3 13 43 29 30 -29 27 -14 2 6
7057 6 -9 -19 -16 5 -22 12 -9 -6 -11 10 8 27 27 -4 -15 -6 -41 -17 -5 -4 -18 -9 -1 16 3 29 7 -22 8 15 11 3 -31 -5 -19 -47 -36
7094 -36 -31 -39 0 -1 -14 11 11 19 0 -17 0 9 -11 -3 -6 -22 -19 11 -4 -4 9 32 2 1 10 -2 -7 -1 -7 -18 -10 -1 19 -8 -11 13 1 -24 39
7133 39 15 -6 2 -14 -2 -21 -25 9 -14 -6 -41 -16 6 -27 25 47 33 17 42 26 -20 -38 0 -26 -15 -11 2 20 -1 17 31 -15
7165 -15 16 43 37 -9 -21 -13 -27 -31 -10 20 -13 -27 18 19 -2 -21 47 32 -10 7 7 -49 -14 -12 -35 -47 20 28 2 19 40 41 9 9 20
7200 20 31 9 27 -3 -25 -35 -19 16 -18 6 23 6 -10 18 32 -5 -8 4 5 -36 10 -7 -22 -61 2 -3 9 6 9 -8 16 2 7
7233 7 0 -4 -1 -28 2 10 8 0 -4 2 13 22 40 25 15 4 -5 18 -15 -14 7 -37 -49 6 7 -9 14 63 32 13 -2 -2 17 -21 -7 1 -16 -25
7271 -25 -15 6 0 12 30 24 13 31 16 19 41 -11 0 -3 3 2 9 -5 2 26 19 6 44 10 -16 -21 -1 3 -6 -21 -54 -21 -4 -1 -12 -9 -14 30
7309 30 36 -6 24 23 25 0 1 13 6 0 -6 -2 -5 3 20 -23 5 35 22 21 5 39 19 6 -5 0 9 -2 2 0 -11 -8 11 33 -1 70 18 0
7347 0 -16 9 -5 -28 -36 -27 -8 -17 -21 0 18 3 -1 20 -9 -2 9 14 -6 17 4 8 17 -14 10 -18 -5 8 17 6 -4 -6 -12 -12 1 -21 -32
7384 -32 -9 -32 -11 11 4 1 39 3 13 5 -2 15 -6 -20 -1 -36 -9 -2 18 3 9 15 17 23 4 33 -3 19 -5 -8 -15 -32 -34 -12 -4 -26 -22
7421 -22 21 37 37 29 25 -27 7 12 -33 -11 -22 -56 -19 1 -11 4 2 25 -12 -5 32 -8 2 11 -13 -2 7 -23 -6 0 7 -6 -9 6 30 42
7457 42 13 21 5 29 8 -6 -22 -27 -9 10 -21 4 -5 -13 6 23 16 22 22 -9 31 -19 -20 -19 7 -10 -4 22 1 2 5 35 51 9 4 -6 4
7494 4 -8 3 8 -28 -13 15 -6 17 13 -13 6 0 4 -11 12 3 -12 -22 -12 -1 -20 -43 18 14 11 5 3 48 9 19 3 13 -20 -13 17 -22
7530 -22 -17 -4 -24 -5 9 22 21 25 38 1 18 -7 -11 -19 -23 -14 -14 -21 -23 22 -5 4 10 26 -1 10 -15 -13 -28 -6 -25 -1 3 -7 -5 -4 -7 22 33
7569 33 19 33 17 5 -15 -7 -19 -21 -13 0 -16 17 6 2 12 6 31 14 26 -7 -28 -3 -57 -3 -33 -4 1 -37 7 7 -1 3 5 8 10 11 -4
7606 -4 25 -2 17 22 -29 6 2 -3 -14 45 16 -13 27 13 8 -18 -11 -7 -6 -21 -6 -4 18 -24 -11 1 3 0 13 -15 25 31 -29 -8 -14 2 -6
7643 -6 -43 -25 -9 10 10 20 29 14 53 23 7 -17 9 27 -17 11 -2 11 0 -20 19 19 -9 28 3 7 -19 25 9 -20 -12 -11 2 -16
7677 -16 -22 -1 -1 14 32 1 17 32 -1 -7 15 2 6 9 -15 -22 -6 -3 24 7 19 29 -9 25 15 -7 -7 0 -1 -37 -17 -12 -33 44 -20 16
7713 16 -11 13 -21 5 12 28 -4 6 17 -6 -27 -7 -21 6 -16 3 12 11 9 16 18 -2 5 2 -26 5 6 -11 -13 2 1 -11 6 20 15 12 -5
7750 -5 10 -17 8 11 -2 -9 -45 -2 -29 2 6 31 -6 13 30 -8 16 1 -35 23 6 -18 -31 3 -2 3 11 14 26 10 21 -6 23 7
7784 7 18 -1 1 25 -8 9 4 -4 -3 21 13 -24 -2 45 28 1 18 -19 -7 -12 -39 -31 -6 10 -2 2 0 -1 15 15 12 9 6 -14 2 -7 4 8 11
7823 11 -3 14 9 10 33 18 -23 -5 4 1 -21 -13 20 -10 -35 -2 -11 -23 3 26 -20 -1 24 10 10 5 6 -16 -35 -24 -13 -30 -6 -9 -8 -9
7859 -9 -6 4 23 6 -9 1 -10 -9 12 -19 -19 -12 2 -24 7 -4 -1 22 27 32 -6 7 -4 15 13 5 -24 -11 -38 0 7 -1 -16 -12 22 2 -1
7896 -1 -32 19 21 -9 18 1 21 -6 8 -12 1 -5 29 6 -1 41 21 11 21 -12 -6 -36 5 1 -9 -5 -31 13 21 -23 20 6 -7 -4 0
7931 0 17 -33 -17 6 4 0 -6 10 14 6 37 8 32 -3 -4 -15 3 28 -6 -6 -20 0 4 19 22 4 14 -3 20 25 -12 -5 1 -35 -10 -24 -7
7968 -7 -17 3 2 -17 6 13 14 -4 2 16 14 -9 16 1 11 -2 -6 -1 -16 2 2 6 6 3 -10 -33 24 4 -8 24 2 -15 -7 5 -5 -2 1 6
8006 6 11 16 -3 -32 -2 -15 22 -6 -26 -22 -14 -24 -17 -3 -15 10 26 20 -3 22 5 16 -6 10 3 -13 15 0 -15 -1 10 3 -5 13 14 -6
8042 -6 -6 -21 -18 17 -24 4 -30 -1 12 -13 -4 11 -2 -4 -15 13 7 3 -12 -12 -6 0 -28 -6 12 -1 -1 -3 -7 24 30 8 20 3 -11 2 -7 6
8080 6 1 -21 0 -10 12 25 -2 -10 12 -8 10 6 -11 -6 4 -15 -5 1 -35 -15 -11 13 -26 33 22 -11 51 -3 -6 4 -13 -8 21 -13 30
8115 30 2 26 9 39 26 2 3 21 17 -5 3 14 0 -22 -6 -19 23 -1 -33 21 4 12 6 23 0 2 5 -6 -14 -14 17 6 11 21 2
8150 2 -4 4 0 18 7 -4 18 33 -19 14 11 -10 -5 -14 22 -5 -24 16 -4 -17 37 -2 24 -15 -10 -25 -27 -7 3 -10 -34 7 6 -15 10
8185 10 -8 -20 -3 20 -20 3
8191C
$$ Imaginary data points
##PAGE= N=2
##DATA TABLE= (X++(I..I)), XYDATA
0 0 0 0 0 0 0 0 0 0 0 0 0 0 0 0 0 -8 8 -8 8 -8 10 -16 16 -16 24 -24 32 -32 40 -48 53 -59 69 -77 86 -96 109
37 109 -122 134 -150 167 -188 206 -229 253 -279 308 -340 373 -412 454 -498 552 -609 673 -746
56 -746 830 -927 1041 -1178 1342 -1546 1810 -2162 2657 -3404 4658 -7136 13888 -71307 -201574
71 -201574 -14000 37116 -67973 -7814 138943 54302 -57454 17358 31977 -122931 -100525
82 -100525 92980 81317 -67672 -9846 94385 -6512 -90869 10165 43693 -51029 -28418
93 -28418 63243 -25455 -139770 -38776 67301 -17221 -53499 59564 69062 -48969 -60552
104 -60552 -4419 -47065 -65386 58771 122687 31523 7155 86961 49170 -70361 -56898 21639
116 21639 5968 -14151 39742 42551 -29845 -28059 33490 4122 -58893 -13145 49327 5660
128 5660 -44276 -15176 7135 -12771 -826 35720 21352 -11718 10157 32693 -9260 -34973
140 -34973 15863 56017 30505 5391 13413 4646 -29616 -37035 -18482 -21670 -23123 17227 39885
153 39885 -124 -29212 -3982 7336 -24510 -32425 4217 18426 253 8610 24615 -3214
165 -3214 -21917 10269 17629 -25461 -30918 14480 21018 -12377 -699 37866 23696 -2895 16771
178 16771 15193 -33539 -36041 7636 -69 -34386 -5345 38452 12431 -21932 2095 10708 -28130
191 -28130 -23867 19207 8382 -17662 17914 45568 4380 -21742 10245 14521 -26476 -23675 13642
204 13642 2006 -19605 12348 28846 -9703 -19828 12269 4056 -33589 -21760 13328 3152
216 3152 -11463 18799 32415 790 -4746 17034 -1433 -32568 -15530 8716 -6046 -14073 13521
229 13521 22870 -2073 -5108 11290 -3899 -24300 -6569 8477 -6091 -6230 17219 19505 311
242 311 -381 10205 -1879 -16701 -4972 4005 -6625 -3498 13639 11531 -1142 979 5576 -4855
256 -4855 -14979 -8783 -3421 -10108 -8487 2731 1550 -4774 292 4950 819 -23 6943 11693 9051
271 9051 7966 11095 6561 -3243 -5616 -6571 -12025 -12454 -6859 -2689 -652 1682 4388 3810 -1182 -3161
287 -3161 -2134 -3817 -2644 3652 8219 10904 13326 12868 9606 3633 -2976 -6568 -9572 -11190 -7397
302 -7397 -2617 740 4820 6504 4987 2529 -1950 -5667 -6841 -7674 -5482 -177 3693 7138 9854
317 9854 9048 6674 2897 -2110 -4790 -6582 -7719 -4901 -1686 -18 2999 4455 3086 1787 -234
332 -234 -2582 -4149 -5653 -4910 -3411 -3745 -2154 267 -595 -24 2714 2492 2202 4453 5778 4898 3298
349 3298 2949 2036 -2342 -4522 -2927 -5336 -7576 -2851 -432 -3229 -1706 2719 2203 -681 1217 5086
365 5086 3019 1311 6811 7200 -540 -345 3321 -4128 -11437 -7203 -3659 -7489 -6030 3753 6536 2157
381 2157 7363 13601 4070 -3341 3941 3452 -8594 -8629 538 -1619 -7689 -865 5527 -2550 -4737 7156
397 7156 5804 -7064 -1463 10803 3377 -5189 3149 6646 -4775 -7384 1400 -3059 -13201 -2828
411 -2828 8813 -1860 -7373 7252 10723 -1850 -1553 8204 3963 -3742 3166 6558 -6409 -8928
425 -8928 5425 4800 -8362 -3744 7987 2514 -5879 -1596 1099 -4887 -3165 5802 1822 -8542
439 -8542 -3197 4751 -3878 -10994 -2060 6526 5198 4069 6478 4870 721 2893 6056 587 -3019
454 -3019 4288 7625 -2132 -11267 -8681 -1663 -1442 -3751 661 4308 13 -2437 -2097 -8722 -13024 -1611
470 -1611 10653 4714 -4720 3291 11207 -289 -7380 4709 9519 3153 8997 14066 -2993 -14651
484 -14651 641 8187 -9966 -12707 9941 9756 -13571 -12926 -1178 -12218 -14355 11446 17210 -5099
498 -5099 -1745 21029 6449 -22952 -7871 17352 2891 -6971 14004 10264 -18001 -9025 15135
511 15135 -2684 -19431 13170 32322 -2541 -19322 6464 3508 -23714 -7504 18240 -3128
523 -3128 -16264 14072 15021 -25882 -23112 18739 13871 -15739 2679 24000 -5154 -19634 9222
536 9222 8039 -19934 -35 34466 9305 -23905 -1228 15644 -15450 -22055 13542 15332 -8892
549 -8892 6167 22587 -10046 -28441 4554 15348 -16200 -15185 17744 9893 -19176 -6547 11026
562 11026 -8077 -10610 19734 17229 -14428 -8095 16898 1191 -20989 665 21653 4515 -3355
575 -3355 12743 4071 -18942 -7492 11015 -4230 -15094 7470 17203 -6594 -16301 150 1063
588 1063 -10547 -326 12496 951 -6068 7314 7407 -10896 -10631 8865 11015 -2657 -1327 7415
602 7415 285 -7265 690 4459 -2863 -406 10340 5610 -9548 -8781 3366 1588 -6899 -595 7722
617 7722 657 -6157 -2155 -3180 -10612 -5160 9119 7757 -2996 2300 11731 1122 -10209 -1368
631 -1368 5629 -2076 -2115 7610 3345 -8582 -2425 8145 -1990 -10559 3715 10367 -5139 -9257
645 -9257 3207 1125 -9134 -631 10120 -495 -8266 4673 6935 -10236 -9065 9592 7623
658 7623 -4418 4175 12789 -594 -8178 3821 4592 -9337 -4249 12057 4539 -9229 987 9256
672 9256 -4446 -8694 5443 5514 -6853 -1622 9708 162 -9499 3247 9892 -4094 -6222 7204
686 7204 4120 -8373 -2227 7409 -756 -6022 5347 7685 -5942 -6797 4128 -811 -11119 -3072
700 -3072 5573 -2000 -5223 4198 4633 -5312 -3781 4872 323 -7041 84 5487 -2857 -5706 1958
715 1958 1308 -6137 -3724 2584 -958 -5213 873 4781 -1295 -2468 4086 2915 -3451 -1494 2578
730 2578 -1061 -3882 730 3376 -525 -762 4276 3424 -1446 434 3832 700 -1262 2421 3696 445
746 445 -189 2443 1215 -2698 -1608 1216 -805 -1797 1976 3399 1166 1271 3048 1839 -1109 -990
762 -990 488 -1216 -2597 -39 1105 -746 -237 1626 786 -835 -374 496 -440 -1410 16 895 -668
779 -668 -797 375 -686 -2065 -1508 -1057 -1386 -1251 -152 832 400 133 993 463 -854 -575 -232 -744 -526
798 -526 180 667 764 510 873 969 26 -146 423 16 -151 366 471 258 -93 -270 -150 -820 -1181 -252 15
819 15 -298 560 1151 655 392 226 -235 -991 -1442 -926 -869 -1343 -398 614 -67 -88 638 98 -575 -329 -196
840 -196 -747 -967 -132 191 -973 -980 174 -591 -1404 -156 197 -544 310 1538 900 -83 630 1323 -361
859 -361 -1460 63 144 -1320 -10 1510 163 -11 2013 1898 -189 -101 1838 1088 -891 406 1750
876 1750 -290 -594 1501 303 -1870 -85 1756 -68 -1199 1123 2221 -63 -442 1234 -206 -2044
892 -2044 -79 457 -2301 -2038 903 755 -1316 -456 1684 832 -428 896 778 -1316 -274 1705 -173
909 -173 -1744 166 1235 -431 -1387 -477 -47 -380 554 1049 -375 -353 1256 147 -1856 -1486 -638 -490
927 -490 -149 -366 -846 -21 1383 1162 -221 394 2162 1491 317 744 -280 -1468 662 1504 -1466 -1852
945 -1852 1393 1308 -2213 -2151 544 -294 -1494 1574 1744 -2632 -1517 2739 -639 -5020 -819 3346 -478
962 -478 -2381 1923 1755 -2867 41 4679 -201 -3215 4075 5421 -3253 -4175 2781 884 -4164 -356
978 -356 3497 -1778 -3508 3313 2104 -5791 -2099 6049 1376 -4615 1113 4139 -3039 -3994 3245 1621
994 1621 -4370 1673 7632 -842 -5773 2724 4481 -4065 -2758 5455 2280 -3960 1130 3891 -4744
1009 -4744 -5912 4161 3489 -5598 -1892 5676 -432 -6499 173 3480 -2791 -1451 6475 2434 -5939
1024 -5939 -767 4937 -2535 -5756 3559 5982 -1429 -969 4200 -471 -5584 734 4802 -2018 -3097
1039 -3097 4687 3044 -5627 -3875 2471 -31 -2550 2872 4449 -1819 -2803 2136 -162 -5309 -650
1054 -650 5684 2220 -1687 1334 1828 -2703 -2663 1814 1619 -990 1733 3978 -1117 -4860 -1151 1271
1070 1271 -1286 -1071 2531 2164 -1542 -2037 -593 -2233 -3054 1384 4024 678 -1266 1135 642 -3195
1086 -3195 -3050 1097 1991 -111 1082 2377 -1461 -3651 197 1875 -1242 -496 3830 2506 -2881 -2665
1102 -2665 524 -1410 -2931 1815 3802 -822 -1377 2558 342 -4389 -1186 4023 1398 -1764 2022
1117 2022 2939 -2838 -3244 2087 798 -3069 1187 4921 -437 -3850 1007 2200 -3010 -1901 4084
1132 4084 1914 -2975 510 2979 -2776 -4172 2323 2832 -2572 -833 4137 585 -4128 145 2964
1147 2964 -2021 -2313 3586 2181 -3527 -1168 3002 -963 -4005 1059 3339 -1680 -1971 3008 1060
1162 1060 -3551 -315 3340 -615 -2557 2032 2615 -2281 -2092 2248 604 -2917 340 3230 -664
1177 -664 -2070 1804 1499 -2667 -1586 2026 234 -2528 243 2292 -1065 -1953 1629 1366 -1804 -308
1193 -308 2416 259 -1955 360 1656 -1022 -1478 1645 1453 -1287 -114 1934 -228 -1879 234 1129
1209 1129 -1079 -1213 1114 783 -1515 -650 1212 -369 -1607 376 1060 -864 -850 1003 712 -817 98
1226 98 1695 514 -792 613 991 -981 -1107 516 189 -942 -37 1194 293 -683 452 900 -703
1243 -703 -901 413 -134 -1354 -572 332 -358 -715 419 1029 10 -134 979 535 -617 35 722 -32
1261 -32 -396 424 577 -259 -419 300 91 -820 -369 325 -312 -596 220 444 -123 -88 450 249 -501 -443 91
1282 91 -381 -833 -28 377 -25 206 872 775 274 336 598 118 -487 -151 16 -623 -568 66 -72 -403 -10
1303 -10 346 32 -268 58 215 -287 -296 285 30 -366 164 358 -133 -190 199 129 -235 -118 315 33 -183 366
1325 366 460 -147 6 415 -118 -532 -252 -200 -562 -507 -22 -56 -368 166 578 -55 -202 439 167 -436 -109
1346 -109 167 -229 -320 229 263 -342 -122 610 87 -497 226 429 -302 -69 507 126 -315 234 558 -228 -463
1367 -463 447 419 -476 -44 652 -51 -259 508 277 -496 -101 594 39 -566 184 652 -189 -301 466 -31
1387 -31 -591 135 306 -555 -421 507 349 -399 -55 571 17 -346 326 93 -703 -55 500 -411 -752 223
1407 223 315 -495 -301 233 -248 -560 317 354 -712 -139 960 29 -771 230 489 -509 -264 626 -26 -765
1427 -765 410 882 -688 -790 1073 752 -645 350 1136 -363 -844 517 48 -1636 -610 1207 -153
1444 -153 -1421 595 1319 -730 -538 1407 345 -1157 383 1143 -1256 -1759 898 932 -1337 -240 1886
1461 1886 34 -1569 384 636 -1775 -885 1872 747 -1500 250 1733 -999 -2113 627 759 -1568
1477 -1568 -175 1907 -287 -1780 885 1816 -825 -619 2349 1341 -1555 -371 1094 -1217 -1657 1496
1493 1496 1613 -893 88 2155 140 -1997 158 1750 -213 -464 1738 700 -1838 -709 844 -904
1509 -904 -1375 1285 2004 -381 -806 763 -188 -1700 -116 1380 46 -315 1198 564 -1562 -1241 479
1526 479 133 -812 238 968 -518 -1187 -140 -146 -842 140 1305 453 -872 -761 -373 -1126 -1311 96 1060
1545 1060 643 570 820 19 -977 -734 160 103 -363 334 1007 -103 -1063 -301 253 -300 -105 1032 779 -531
1565 -531 -336 575 -296 -1062 617 1557 -22 -549 740 249 -1305 -431 1216 350 -514 1065 1334 -1105
1583 -1105 -1456 578 117 -1482 1 1603 -59 -1149 568 771 -1387 -836 1699 762 -1122 517
1599 517 1721 -666 -1511 755 695 -1474 -592 1478 -74 -1793 315 1476 -866 -1016 1548 994 -1422
1616 -1422 -452 1206 -564 -1767 585 1401 -809 -676 1631 635 -1584 -115 1450 -308 -1002 1147
1632 1147 1284 -1011 -756 1028 -198 -1896 -199 1144 -626 -984 1080 896 -1014 -403 1142 -42
1648 -42 -1323 219 1053 -731 -909 1007 700 -886 32 1327 82 -885 432 887 -589 -578 1055
1665 1055 668 -793 -65 809 -549 -1333 -91 270 -772 -434 1004 749 -439 196 978 -210 -894
1682 -894 263 468 -586 -373 669 284 -602 -17 783 -82 -568 398 532 -580 -544 333 -79 -835 -283
1701 -283 321 -417 -883 25 247 -596 -310 718 385 -321 190 516 -313 -698 20 217 -456 -255 550 171
1721 171 -540 -107 332 -257 -325 489 673 84 168 659 245 -455 -107 244 -347 -521 141 234 -208 30 659
1742 659 458 -30 240 475 -145 -489 90 225 -185 125 702 447 38 224 360 -151 -427 80 186 -283
1762 -283 -149 246 -149 -532 -241 -85 -437 -471 -45 80 -270 -64 387 178 -149 197 230 -194 -262 77 7
1783 7 -244 -48 332 50 -235 93 81 -374 -287 38 -170 -344 -95 5 -303 -383 -48 -30 -224 34 450 292
1805 292 222 557 438 75 52 93 -203 -430 -217 -40 -257 -176 212 171 -45 227 294 -65 -33 204 76 -129
1827 -129 33 155 -137 -310 -71 -99 -390 -91 239 43 79 477 434 105 123 252 -79 -402 -190 -133 -517 -347
1849 -347 165 -48 -239 158 325 -30 -2 341 232 -108 103 344 -96 -327 104 -11 -499 -243 170 -78
1869 -78 -135 351 419 52 109 395 11 -462 -94 27 -463 -408 123 -34 -271 141 405 -22 -49 416 327 -168
1891 -168 27 392 -92 -371 62 6 -522 -228 174 -202 -404 146 325 -132 -101 470 150 -347 133 305 -356
1912 -356 -299 380 158 -356 108 517 -61 -312 318 262 -366 -92 405 -244 -669 -6 63 -611 -474 348 153
1933 153 -290 309 771 15 -110 661 405 -427 -33 443 -311 -706 41 144 -531 -237 548 125 -489 204
1953 204 532 -381 -384 528 264 -435 24 462 -235 -527 235 342 -329 -63 713 210 -421 133 366 -365 -406
1974 -406 270 40 -595 -269 186 -332 -586 249 499 -35 189 737 294 -193 147 266 -218 -271 186 72
1994 72 -434 -266 92 -154 -238 224 299 -37 19 142 -70 -331 -142 102 -49 -73 153 85 -97 -48 57 77 179
2017 179 244 194 128 -30 -168 -228 -222 -268 -214 -30 67 -77 -71 170 197 5 257 455 138 -45 148 -9 -432 -328
2041 -328 24 -90 -385 -19 233 -210 -237 369 317 -85 305 616 16 -437 -38 -15 -655 -486 240 83 -388
2062 -388 172 563 -85 -175 520 470 -199 37 543 -64 -661 -48 153 -595 -508 329 63 -505 24 590 62
2083 62 -201 514 566 -254 -249 380 -147 -809 -166 293 -293 -336 432 412 -259 -61 569 69 -395 244 408 -339
2105 -339 -355 298 11 -648 -219 248 -197 -369 332 551 -26 91 687 290 -276 118 330 -207 -378 177
2125 177 191 -325 -177 340 33 -356 63 280 -263 -401 51 -23 -405 -163 291 63 -244 125 274 -140 -132
2146 -132 357 350 23 154 370 -86 -491 -293 -164 -466 -408 102 108 -150 17 243 7 -178 124 274 -29 -134
2168 -134 113 -19 -358 -215 146 -4 -88 183 236 -27 -54 242 258 26 141 311 -64 -419 -270 -230 -452 -297
2190 -297 221 324 186 316 458 230 -17 173 304 -24 -68 116 -54 -348 -310 -101 -186 -222 72 241 44
2211 44 41 288 262 99 186 291 6 -255 -200 -193 -412 -344 12 141 35 143 277 56 -91 27 79 -118 -89 74
2235 74 18 -247 -136 -2 -142 -140 98 182 61 140 311 233 65 102 134 -139 -344 -201 -184 -359 -205 79 71 65 187
2260 187 257 63 -44 55 3 -133 -33 88 -78 -155 -11 -22 -116 -59 141 120 95 192 295 108 22 118 -47 -263
2284 -263 -247 -191 -272 -229 -33 81 80 171 257 154 54 51 53 -97 -83 23 -70 -128 -46 -41 -104 -62 28 68 42 168 236 107
2312 107 69 93 -77 -237 -189 -209 -292 -232 -40 32 58 161 313 191 131 188 91 -108 -58 -14 -108 -141 -67 -73 -166 -139 -6
2339 -6 -29 -96 78 182 57 102 197 30 -128 -96 -70 -185 -198 9 88 48 153 316 175 50 194 105 -98 -119
2363 -119 -5 -79 -199 -31 55 -111 -96 122 77 -5 144 268 130 81 183 85 -118 -161 -122 -279 -329 -91 4 -115
2387 -115 47 251 147 6 155 107 -132 -152 -41 -145 -268 -112 -7 -162 -139 96 82 -4 132 242 109 51
2409 51 171 100 -145 -167 -103 -274 -404 -173 -71 -164 -7 288 225 135 267 264 56 -54 58 -15 -227 -135 2 -142
2433 -142 -178 -27 38 -63 56 251 187 104 201 240 4 -92 9 -114 -286 -163 -19 -183 -105 153 199 122 201 272
2457 272 132 -47 62 14 -154 -178 -55 -130 -219 -85 -21 -122 -45 104 130 48 143 172 37 -41 -8 -87 -204 -142 -84
2482 -84 -76 -62 57 102 80 139 210 131 26 88 -13 -138 -158 -78 -119 -122 -29 40 -43 -10 99 55 74 154 153 25 -12 -16 -113
2511 -113 -214 -180 -85 -157 -83 91 127 60 146 149 61 2 78 -5 -169 -125 -86 -164 -190 -20 34 -16 44 223 153 60 175
2538 175 171 10 -42 28 -50 -237 -188 -150 -175 -218 6 131 62 77 239 158 18 92 75 -54 -125 -49 -81 -202 -131 34
2564 34 -29 -20 109 185 81 138 188 130 -9 -5 8 -134 -202 -72 -103 -192 -71 65 78 61 186 221 101 84 92 3 -130
2591 -130 -178 -90 -191 -211 -85 -30 -78 -6 84 101 44 137 175 93 26 25 -25 -139 -164 -81 -85 -67 22 76 80 69 126 93 77 61
2621 61 73 -20 -118 -120 -104 -195 -133 -42 13 39 85 133 108 71 94 104 46 -12 -25 -89 -166 -189 -155 -93 -61 23 81 98 147 131 131
2652 131 52 61 8 -24 -94 -127 -111 -172 -129 -55 -3 57 107 138 143 68 61 25 16 -43 -70 -83 -125 -140 -110 -49 -45 12 77 148 110 115 88
2685 88 54 -12 -30 -40 -128 -117 -85 -94 -52 -36 28 83 97 156 176 94 68 50 -38 -100 -118 -97 -111 -111 -79 -42 -22 37 101 99 76 123
2717 123 75 -9 -27 -34 -112 -86 -106 -66 -81 -39 12 61 74 112 156 113 47 53 -2 -71 -70 -100 -109 -107 -93 -41 12 40 108 105 97 128 104
2750 104 42 17 -12 -74 -146 -170 -101 -93 -84 7 20 69 86 127 121 80 75 -13 -35 -83 -110 -105 -148 -94 -53 5 33 94 125 135 131 110 77
2783 77 28 -6 -47 -118 -110 -109 -141 -97 -42 33 25 79 148 92 96 83 47 6 -42 -86 -111 -125 -112 -39 -58 -13 63 58 100 90 143 78 36
2816 36 47 -19 -63 -74 -66 -109 -89 -38 -11 1 80 121 122 72 92 61 -17 -16 -50 -104 -122 -114 -89 -99 -52 0 57 52 61 92 104 38 46 -24
2850 -24 -65 -77 -83 -108 -114 -61 -27 6 40 95 88 107 106 80 23 -39 -15 -76 -118 -87 -73 -95 -66 -7 60 20 77 96 93 55 18 9 -67
2883 -67 -93 -77 -117 -131 -91 -24 -49 23 104 120 95 107 90 54 -28 13 -54 -100 -113 -78 -78 -75 -22 42 78 72 105 96 49 58 10 -47 -64
2916 -64 -87 -91 -147 -63 -57 -24 -7 39 96 87 93 96 43 -23 1 -25 -102 -114 -85 -93 -102 -39 37 47 38 121 109 87 59 66 -25 -38 -48 -89 -120
2951 -120 -103 -35 -40 -28 27 75 90 81 105 42 13 10 -13 -104 -93 -83 -88 -95 -35 -10 8 41 74 109 66 58 49 37 -15 -28 -59 -92 -78
2984 -78 -52 -52 -29 25 93 86 79 122 110 55 -1 0 -21 -72 -83 -68 -96 -53 -4 -3 8 71 78 60 67 60 -1 -26 -47 -71 -95 -88 -69 -53 -29
3019 -29 3 98 74 67 92 103 52 61 29 -10 -47 -83 -35 -96 -79 8 -13 19 46 68 96 93 92 37 11 -45 -52 -68 -115 -82 -62 -65 -17
3052 -17 -6 32 81 62 65 58 30 16 -4 -56 -76 -83 -69 -51 -18 -7 33 28 61 91 82 95 63 9 -20 -29 -63 -68 -83 -70 -35 -32 -4 48
3086 48 40 71 74 63 26 9 4 -47 -70 -59 -104 -84 -48 -25 -23 19 40 39 70 59 63 39 -16 2 -51 -86 -33 -29 -53 -18 4 62 59 71
3120 71 62 71 74 35 -6 -58 -49 -95 -95 -75 -63 -36 -9 8 5 45 45 78 80 31 29 -13 -55 -84 -84 -88 -46 -41 -5 7 23 20 55 61 26 50 55 17
3158 17 -21 -64 -51 -66 -83 -24 -32 -19 14 57 21 62 64 51 30 -15 -36 -42 -102 -92 -64 -53 -26 27 26 51 61 60 92 59 37 43 5
3191 5 -3 -50 -60 -50 -63 -21 1 49 56 71 71 56 53 29 24 -3 -33 -51 -41 -98 -87 -49 8 8 9 40 46 61 50 42 5 -15 0 -56 -65 -80
3227 -80 -42 -48 -16 16 40 53 77 105 69 58 18 4 -18 -11 -39 -84 -44 -30 -32 -2 36 39 46 68 49 49 50 -28 -32 -4 -48 -75 -49 -59
3261 -59 -56 -32 24 10 79 100 66 33 30 19 -21 -24 -23 -54 -39 -19 -24 20 14 40 90 66 69 67 32 9 5 -44 -42 -22 -52 -51 -56 -28 -5 21
3297 21 30 32 44 42 16 24 -24 -31 -45 -51 -61 -27 -29 -8 -2 24 76 59 30 46 37 -10 13 0 -41 -34 -11 -32 -15 -13 10 48 33 57 66 28
3333 28 38 51 -15 -22 -40 -23 -45 -60 -54 -24 -18 31 51 43 39 60 73 1 -7 -20 -26 -58 -35 -29 -31 -3 13 16 54 89 70 53 53 31 17 -1
3369 -1 -27 -29 -55 -39 -36 -50 -20 8 25 15 41 72 23 16 20 0 -12 -30 -47 -79 -53 -9 -11 -24 29 42 36 31 29 43 38 2 0 -10 -21 -32
3405 -32 -25 -19 -24 0 27 33 59 42 50 6 15 -17 -23 -28 -46 -43 -36 -19 -29 -18 -7 34 51 50 30 24 7 -16 -1 -12 -51 -37 -41 -27 -20 -8 7
3442 7 49 49 71 56 45 20 13 8 -15 -24 -30 -35 -40 -23 -3 1 24 35 30 43 54 40 -16 -9 -21 -46 -40 -67 -56 -49 -4 0 27 13 42 48 52 27
3480 27 31 -1 -12 -9 -34 -34 -37 8 2 10 15 27 27 38 53 24 11 2 -31 -33 -16 -56 -17 -38 -36 -16 1 50 8 16 37 2 16 3 -26 -43
3516 -43 -45 -32 -48 -22 -19 -8 35 4 62 55 56 64 24 -3 32 -26 -47 -41 -10 -37 -10 -20 25 28 40 33 9 29 13 22 -22 -30 -33 -49 -63 -45
3552 -45 -20 -5 18 33 21 15 49 22 15 -5 19 -4 -23 -9 -20 -11 1 37 -1 18 62 56 34 3 20 -14 -15 -28 -26 -11 -57 -16 -1
3585 -1 -23 -6 24 26 30 32 34 1 29 -15 -32 -35 -52 -50 -37 -40 -25 23 19 16 63 40 34 15 35 -13 -26 -9 -14 -10 -15 -10 13 -12 20 27 15 64
3623 64 18 10 -4 -2 -32 -20 -55 -52 -14 -23 -28 -32 7 -7 28 42 55 37 40 -27 10 -3 2 9 -18 -1 16 23 19 1 37 41 33 36 12 14 11 -5
3661 -5 -1 -19 -8 -9 -29 14 4 17 7 20 26 1 -4 18 3 -47 -40 -50 -42 -53 -9 -5 -12 15 23 40 28 28 48 23 9 -4 2 -11 -33 8
3697 8 32 4 24 37 33 59 19 45 -3 18 19 -29 -36 17 0 -8 -25 -16 33 17 43 19 29 26 -8 21 17 -27 -10 -28 -32 -16 16 -16 12
3732 12 9 19 26 44 52 12 -9 12 3 29 -45 1 -14 -51 4 -12 14 12 8 9 18 10 17 -12 -31 -30 -32 -27 -25 -22 -3 -28 11 17 44 25 42 23
3770 23 43 13 34 -9 -28 -27 -15 -35 -31 32 22 36 30 18 42 10 1 0 -35 -3 -28 -10 -33 -29 7 -9 18 9 38 47 -5 29 47 -23
3804 -23 -29 -19 -30 -33 -35 -24 -4 7 20 26 43 24 41 38 34 8 3 11 -1 -34 -23 -23 -11 -19 7 -8 40 22 20 32 3 3 -39 -15 -30 -31 -34
3841 -34 -26 -1 13 16 13 32 20 37 11 19 -24 2 -8 -16 -61 -31 -22 9 -12 3 16 31 25 27 38 34 -6 15 4 -30 -30 -27 -35 -14 -3 0 -6
3878 -6 28 19 -18 30 10 13 -15 -18 -26 -45 -57 -29 -33 -4 -7 46 25 27 60 51 18 40 44 -22 -6 -41 2 -34 -11 -3 17 17 33 43 16 14 31
3915 31 21 -19 24 22 -15 -31 -22 -47 -22 -26 13 12 8 63 18 13 30 19 -12 -26 -40 -19 -19 -16 -27 -10 28 23 48 35 24 25 16 7 0 12 1
3952 1 -35 -23 -4 -43 7 18 -5 25 14 40 35 4 13 -18 -21 -28 -74 -59 -52 -6 5 -18 13 22 35 48 20 13 31 7 9 0 -33 -20 -10
3987 -10 -28 -27 21 -11 5 20 18 37 8 -7 -15 -20 10 -37 -39 0 -34 -13 -30 12 38 0 16 18 26 -25 -38 8 -35 -49 -48 -25 -36 -34 4
4022 4 -6 2 45 49 40 44 80 21 3 -4 2 -32 -48 -20 -33 -29 -47 22 21 1 -1 29 0 -14 -3 -11 -50 -67 -34 -53 -31 -16 27 -13 17 35
4058 35 39 -13 39 5 -37 10 -17 -49 -69 -29 -10 5 -13 18 24 28 3 59 70 26 34 22 -1 -48 -28 -32 -73 -40 11 34 -2 3 28
4091 28 -15 3 31 1 -58 -34 4 8 -17 -25 22 5 12 67 46 55 36 26 36 -32 -21 -1 -23 -37 -23 -27 -49 -28 17 33 12 38 68
4124 68 25 -4 -5 3 -45 -62 -14 -45 -73 -47 6 -25 16 32 33 14 11 23 21 -36 -27 -5 -16 -29 -3 4 -18 -13 35 51 0 56 97 -2
4158 -2 5 24 17 -82 -43 -40 -41 -44 -34 21 -4 -14 38 49 18 32 51 26 -43 -45 -28 -67 -61 -23 20 -27 -16 41 59 -2 76 84 36 20 46
4193 46 5 -20 -54 2 -48 -59 -30 39 11 3 53 45 20 29 76 -6 -47 -15 3 -68 -98 24 -21 -54 12 15 -3 7 43 32 -24 -19
4225 -19 24 -28 -79 -17 -5 -55 -39 44 69 11 45 96 57 10 40 45 -19 -29 -6 -27 -59 -35 -26 -20 -51 33 21 8 5 21 11 -28
4257 -28 4 -14 -10 -37 -26 -42 -64 -18 10 36 -2 38 41 28 7 -15 -7 -37 -27 -39 -41 -31 -7 10 20 27 40 60 61 61 36 21 -22 -12
4291 -12 -54 -46 -44 -65 -23 -37 -4 -11 27 -4 -3 37 32 2 -17 -26 -54 -81 -30 -19 -32 -18 47 41 29 58 76 39 25 1 39 -2 -22 -39
4325 -39 -42 -50 -27 23 -25 -19 41 45 11 40 74 17 -16 8 -13 -52 -69 -47 -62 -57 -32 25 15 -19 43 32 29 2 33 3 -41 -20 -51
4358 -51 -31 -43 15 16 -1 60 54 33 40 42 43 7 5 1 -29 -66 -31 -34 -50 -38 1 27 -2 33 64 24 7 -2 -14 -31 -34 -10 -63 -52 -31
4393 -31 5 -36 13 42 56 -5 14 55 33 -9 14 -34 -58 -36 -62 -66 -34 3 25 38 39 52 71 4 27 29 -33 -20 -47 -67 -73 -51
4425 -51 -27 -32 -10 -23 33 -10 24 39 12 24 11 1 -64 -28 -39 -34 -53 7 11 4 48 61 43 28 54 34 -14 -34 -22 -51 -66 -40
4457 -40 -62 7 -7 14 33 24 42 61 35 3 19 -5 -28 -45 -45 -75 -17 -17 7 -9 25 41 36 1 24 44 -18 -23 -16 -37 -26 -3 26
4490 26 -24 22 37 53 13 35 36 2 -14 5 -24 -50 -65 -39 -45 -92 -30 -26 4 -12 65 39 30 39 55 20 -26 -15 -25 -60 -58 -28 -22 -47
4524 -47 37 47 33 19 83 33 12 22 37 -37 -55 -42 2 -82 -73 3 21 -16 46 92 21 23 27 -2 -48 -63 -22 -36 -83 -48 3 -21
4556 -21 -52 53 27 -3 33 86 45 -5 7 2 -42 -54 12 -4 -56 1 31 -12 -11 26 69 30 0 47 11 -48 -15 -28 -26 -57 -37
4587 -37 12 -22 -39 -11 5 -23 16 50 42 6 6 -3 -55 -79 -23 -15 -34 -4 37 13 2 52 61 23 13 37 25 -34 -28 -16 -8 -48 -23 53
4621 53 -18 -34 42 17 -1 20 72 26 -3 24 13 -100 -111 -38 -47 -63 -9 65 44 0 43 70 -11 -52 75 40 -74 -48 17
4650 17 -59 -88 -2 57 39 -10 88 87 -11 -15 35 0 -70 6 16 -89 -70 11 -50 -100 5 75 31 14 89 94 -21 8 60 -37
4680 -37 -90 -31 28 -82 -71 15 20 -40 -1 134 67 -40 54 34 -52 -53 34 20 -72 -25 37 -16 -58 25 60 7 -6 94 65
4709 65 -53 -21 -18 -99 -102 -29 -18 -83 -12 34 -9 -50 19 90 23 -4 58 15 -38 -42 -8 -43 -107 -7 5 7 6 73 47 -15 21 67
4741 67 26 9 19 13 -52 -79 -29 -37 -47 -16 29 8 16 20 38 8 -27 17 16 -41 -57 -56 -12 -70 -43 11 28 23 20 62 13 14 58 -2 -8
4776 -8 11 13 -39 -67 -31 -3 -31 -49 74 30 7 27 48 11 -35 25 32 -16 -70 0 -45 -82 -24 22 -16 2 37 38 2 4 61 14
4808 14 -38 -7 18 -32 -66 -5 18 -19 -1 84 52 7 59 42 14 -35 61 9 -53 -21 8 -37 -70 -12 37 -20 40 74 21 0
4838 0 35 38 -33 -50 -25 -5 -89 -52 -13 16 -34 35 53 21 48 45 40 7 -8 40 -33 -17 -31 -37 -27 -41 26 13 21 37 60 18 38
4871 38 18 14 -12 1 -24 -41 -51 -35 -42 -17 21 23 27 4 30 40 13 -22 -31 -20 -32 -52 -3 -1 -59 26 -4 29 58 32 48 49 16 7
4905 7 15 -2 -3 -49 -33 -7 20 -38 -12 36 15 32 33 47 53 10 29 -31 -6 -34 -32 -49 -46 9 -29 -7 46 37 20 33 56 31 -5 4 -8
4940 -8 -13 -3 -5 -7 -3 11 10 57 42 52 46 15 15 6 -32 -22 -1 -36 -75 -30 -10 -10 -21 14 40 -6 15 56 28 -5 -23 0 -37 -37 -21 -21
4976 -21 -58 -10 6 12 38 50 55 32 30 33 26 -12 5 9 -50 -15 17 -7 -35 28 35 12 -5 19 56 -30 -29 4 -31 -82 -48 -26 -64 -14
5010 -14 0 19 -20 -5 32 26 19 44 61 -5 -16 -4 -12 -49 -17 48 22 -15 45 30 14 38 65 30 3 -5 3 -9 -72 -14 -10 -23 -33
5043 -33 15 36 8 9 50 11 7 31 22 -33 -47 -27 -24 -74 -35 28 4 19 37 75 9 25 73 30 -8 36 17 -22 -47 -6 11 -58
5075 -58 -22 44 49 27 36 37 35 -14 23 45 -43 -45 -19 -36 -71 -11 43 9 3 52 66 -3 -2 45 25 -38 -37 36 3 -53 -19 -1 -34 -26 62
5110 62 63 3 67 64 39 -35 9 8 -76 -50 -28 -6 -75 -41 11 -12 2 49 69 -6 0 46 -23 -74 -49 25 -58 -65 29 28 -76 15 36
5143 36 46 -19 43 85 -18 -37 21 18 -110 -26 35 -12 -60 28 38 -26 -18 68 50 -16 38 75 -11 -87 -49 -17 -105 -68 58 -4
5173 -4 -50 27 66 -3 -30 67 45 -44 -21 29 -31 -110 -28 8 -48 -50 40 89 3 32 87 38 -26 42 32 -23 -33 2 -6 -47 -21 32
5205 32 23 -31 47 65 6 -18 45 6 -53 -16 8 -35 -77 -46 0 -58 -46 35 39 -20 13 79 12 -15 4 30 -41 -38 -5 -2 -58 -36
5237 -36 32 4 15 38 66 19 -15 51 23 -66 -35 26 -26 -79 -2 -1 -36 -48 57 37 9 -1 75 27 -47 -12 31 -42 -57 17
5267 17 4 -44 -13 25 35 -8 60 92 35 -26 54 -24 -24 14 40 -35 -67 11 41 -31 -38 49 76 -23 30 46 -7 -59 -18 -39 -63
5298 -63 -35 23 -12 -36 -11 41 -19 -7 20 39 14 17 54 -7 -68 -15 10 -44 -39 27 22 -22 16 33 6 -7 65 67 -11 -45 -2 -18
5330 -18 -68 -45 2 -52 -41 26 22 2 -6 26 9 3 20 17 -41 -61 -27 -25 -44 -14 12 32 -3 32 62 6 22 33 19 -17 8 -30 -17
5363 -17 -27 -13 -23 -11 -14 6 38 -4 30 40 37 -8 25 -17 -11 -27 -16 -32 -35 -22 14 9 0 18 13 26 -7 25 -12 -1 -8 -45 -14 -45
5397 -45 -21 3 9 25 3 48 19 10 33 24 11 -3 -8 -34 -37 -43 -30 -15 -11 -5 -1 19 16 14 24 -8 -8 9 -13 -31 -16 -17 -9 -46 4 -23 -12
5434 -12 18 27 26 -3 22 16 3 -9 0 -27 -14 -15 42 -19 -3 58 45 -10 38 16 32 5 -16 3 -15 -23 -27 -27 -54 9 -25 15 10 25 9
5469 9 -6 23 23 8 -20 -1 -11 -31 -25 -16 11 -28 14 33 26 -22 48 19 -12 0 -9 -8 -58 -26 -19 -34 -6 7 -2 -9 3 -11 14 16 18 -1
5505 -1 -17 -10 -1 -35 -72 -21 -9 -34 -10 19 18 7 22 11 -4 4 9 15 -19 -16 -5 -47 -30 2 5 32 -1 40 58 34 -19 23 15 -18 3
5540 3 -18 -6 -48 -33 -18 1 -32 10 -2 -9 15 9 6 -33 -2 -13 -46 -16 -2 -4 -7 0 2 3 -14 44 58 3 23 42 29 -19 -34 6 5
5575 5 -40 20 13 -18 5 20 25 -5 7 27 13 -58 -26 13 -35 -52 2 -7 -21 -5 35 -12 -21 13 40 -20 -4 57 7 -70 -18 31 -32
5608 -32 -41 33 31 -18 -32 74 48 -26 17 71 -33 -46 24 5 -53 -31 7 -4 -9 -10 53 -12 -37 34 27 -48 -20 23 14 -66 15 19 -59
5641 -59 -28 31 47 -18 3 81 21 -25 31 15 -36 -25 19 -6 -75 -51 22 -18 -15 62 50 6 -2 20 23 -34 -5 24 -33 -73 -15 15
5673 15 -50 -48 12 1 2 31 69 20 3 15 7 -21 -9 18 4 -12 -4 17 -4 2 82 64 6 11 65 28 -48 -37 21 -25 -49 1 11
5706 11 -24 -29 22 15 -20 9 74 19 -18 13 16 -50 -59 0 -2 -32 8 45 -17 -31 11 22 -9 23 79 23 -26 -22 13 -20 -46 52 22
5739 22 0 -15 62 24 -49 38 62 4 -32 37 -7 -67 -57 -23 4 -56 18 57 -14 -31 28 24 -29 -6 46 -35 -61 24 18 -21 -63
5770 -63 33 5 -11 38 73 15 -14 6 28 5 9 43 19 3 -6 19 -28 -26 14 47 9 -11 50 10 0 20 48 -37 -51 -19 -5 -84
5802 -84 -67 -13 -12 2 39 42 -36 12 22 24 -34 -8 38 4 -6 -20 -2 -36 -23 32 15 26 17 43 -4 -2 33 15 8 -15 -29 -39 -6
5835 -6 -28 -7 -4 12 25 43 0 35 -7 3 11 -45 -14 -25 -24 -22 -10 -11 9 22 49 10 42 61 22 9 7 -7 12 -12 -15 -27 -10 -11 -2
5870 -2 31 -20 5 57 28 22 -13 -18 -19 -27 -8 -5 -38 -17 -10 -11 -3 30 13 15 7 21 -5 -3 -12 0 3 -19 0 19 19 22 27 8 34 39 28 -4 21
5909 21 3 5 -24 -9 -12 -6 -11 -16 26 7 -6 20 1 -18 24 10 -5 -15 3 -5 -38 -27 -11 0 -3 28 21 10 28 27 49 -9 12 14 -14
5944 -14 -27 -7 16 18 -8 5 -6 30 38 10 0 42 -19 7 -33 -60 0 -42 -51 -7 -18 -38 -19 15 3 6 -5 15 13 8 -23 6 -31
5977 -31 -18 1 14 -21 -2 29 25 7 3 22 7 13 -3 2 -41 -21 -35 -22 -15 -10 -18 -16 -3 8 17 7 23 3 -3 -8 -16 -29 -33 -26 -15 -62 -20
6014 -20 17 25 0 24 3 8 16 17 11 12 -52 -7 4 -2 -39 -8 7 7 34 4 14 10 38 -3 -26 -29 9 -14 -41 -52 -29 -48 -11 -35 22
6049 22 2 -11 9 31 6 -24 27 -10 -56 -31 -1 -33 -35 -5 25 1 -8 36 11 0 42 27 -2 -30 -12 10 -24 -28 27 -15 -30 2
6081 2 47 -12 -12 36 20 -22 -15 15 2 -48 -10 -17 -53 -35 -1 5 -31 -1 62 28 -25 28 7 -24 -30 -4 6 -32 -3 39 -20 -57 10
6114 10 23 -38 -2 55 33 -29 -5 -9 -40 -36 -11 7 -15 -6 33 -38 -39 14 53 4 -18 22 9 -50 -52 -1 -49 -35 18 40 -11 -20 9
6147 9 45 -29 25 79 17 16 -2 29 -29 -38 2 -11 -28 17 69 14 -39 37 22 -4 -24 38 5 -38 -41 4 -20 -80 -9 45 1 13
6179 13 9 11 -25 8 62 30 -51 18 25 -33 -39 5 -15 -55 15 64 26 -52 -2 25 -29 -55 47 30 -54 -40 6 -6 -34 -9 20 -9
6211 -9 15 44 17 -12 18 46 -19 -41 4 14 -46 -1 36 -3 -56 33 48 20 -1 30 47 -59 -36 34 -3 -47 30 36 -4 -56 24
6242 24 8 -32 24 87 25 -29 14 22 -52 -38 49 -31 -47 -39 20 -8 -40 16 43 -10 3 58 16 -40 -10 30 -8 -7 7 16 -20 -8
6274 -8 30 0 -27 4 67 11 -21 14 0 -22 -18 14 6 -27 -4 21 -43 -6 34 11 -15 -7 26 -11 -21 -33 -15 -41 -47 -10 -27 -21 -24 -7
6308 -7 3 2 19 40 -5 18 1 -8 9 -5 15 2 14 17 35 3 -7 17 9 0 9 -10 14 -42 -17 -16 -14 -50 2 23 -19 -23 15 20 -14 18
6344 18 23 -1 -16 14 -18 -26 -36 -5 -6 -34 -4 35 -6 30 18 42 4 -8 23 17 -2 -18 -7 -5 -48 2 -4 -15 2 6 -30 13 -19 -2
6378 -2 -16 -43 0 -23 -53 -45 -10 -7 -46 19 14 6 -3 31 -1 -9 24 9 3 -33 11 -13 -20 -8 -14 6 -16 29 19 8 11 53 7 -8 19 -22
6414 -22 5 -34 -7 19 0 -19 -9 -3 -16 -11 39 -20 -22 -5 -8 -12 -52 -4 -44 -21 28 26 -15 29 54 11 13 1 5 19 1 -15 4 -21
6448 -21 0 -14 17 14 10 35 7 7 -19 40 -4 -26 -22 -16 24 -9 -44 -36 -36 -18 -29 -6 -3 4 -5 2 6 9 8 -1 -20 4 -31 -10 -10 21 2 11 19
6487 19 28 31 13 54 34 1 -15 -28 -14 -47 -23 -7 -20 -24 6 -3 -15 4 1 -6 -30 -15 -29 -18 -38 6 -24 -34 7 -14 -12 -28 26 26
6521 26 15 -1 36 11 -16 -10 -10 -13 -19 3 -14 -19 22 15 16 -21 19 9 -8 -22 -2 -9 -14 -8 -44 -21 -43 -28 -6 -6 -24 19 -19 2 23 -20
6557 -20 -30 -16 -21 -15 -23 -2 14 10 -4 10 29 -5 17 55 19 3 32 2 -2 -16 -2 -6 -27 -13 10 8 -19 40 10 2 13 22 7 -25 -12
6592 -12 -12 -36 -40 -4 26 -32 -19 24 21 -11 16 31 34 0 -3 -1 -20 -9 -10 4 -29 13 11 9 17 25 26 -22 -13 -5 11 -15 -17 1 -20 -41 6 -30
6630 -30 6 -11 2 20 -3 31 13 -6 -3 0 2 -6 -39 1 -12 -24 -5 31 8 11 36 55 -1 -11 27 -5 -43 0 11 -25 -44 -3 -14
6663 -14 3 0 22 -6 -23 29 17 -16 -36 -16 -20 -11 -37 -32 -46 -22 1 16 -10 -11 27 -26 -25 -5 7 -16 -41 -49 8 -33 -37 -18 2 -2 14
6698 14 71 12 -23 24 43 -21 -26 -15 -35 -32 -19 -7 -49 -31 17 6 -21 -21 25 51 -28 -50 30 -15 -60 -45 19 -61 -17 69 22 -15
6730 -15 -8 25 4 -12 21 12 -36 25 -31 -24 -43 11 19 -6 21 43 30 -7 3 4 -6 -16 -5 3 -38 -43 -9 -32 -33 11 32 5 -34 -7
6764 -7 43 -22 -8 -29 -19 8 6 0 -30 -40 -7 23 15 -3 37 43 -7 1 -7 -1 -27 -17 -7 -28 -25 -16 -31 -42 -2 46 21 0 4 0 2 -15 16
6801 16 -18 -27 -14 -22 -25 -39 -2 22 8 24 31 37 4 14 58 -22 -18 -11 -1 -12 -25 20 12 10 9 18 26 31 26 28 -35 -3 -2 -41 -48 -30 5 -54 -29
6840 -29 7 11 -5 -2 2 30 -3 -14 4 -5 -27 24 -16 -25 -18 9 -4 -17 24 24 7 1 29 -9 -28 -34 -4 4 -13 -17 16 -5 -22 18 -1 -20
6876 -20 15 25 -9 -26 -27 -9 -38 -23 -26 -9 -23 -18 -2 -43 8 25 13 -3 17 18 -13 -9 -17 16 -40 -16 -4 2 -6 21 19 40 0 27 26
6911 26 25 0 3 -9 -16 8 -29 -14 -22 -12 -1 1 -5 6 -4 -2 -3 -15 -25 -15 -13 -23 -17 3 -27 -3 -10 5 2 45 27 13 40 33 33 8 -9
6948 -9 -19 -15 -16 0 -13 -23 5 -17 3 -5 10 -1 -9 1 3 -34 19 -46 -21 -49 -13 -25 -12 7 4 22 3 0 42 29 -3 -26 -4 -3 4
6983 4 -6 -26 10 -8 -3 33 19 56 21 17 -5 -6 -9 -30 -22 -9 -22 -2 -5 -4 -44 -16 -13 1 10 -7 10 -12 -17 -42 -21 -22 -18 3 1 -23 5
7020 5 10 -5 11 44 -15 -9 25 16 20 -2 9 -29 -17 9 7 25 7 12 18 1 35 10 11 -43 -16 -42 -46 -38 -8 -47 -19 -30 19 5 -2 15
7056 15 57 -4 -8 0 -19 6 15 -7 -22 -21 -16 -8 -18 30 32 9 28 30 6 -2 -19 7 7 -23 -7 15 -16 5 -18 12 8 13 15 13 4 -8 -40 1
7094 1 -16 -36 -12 -17 -14 -28 6 0 24 -7 7 -10 -1 16 9 -9 -5 -2 18 -4 -13 -3 26 -9 15 11 11 12 42 -14 -29 -25 -6 -40 8 -24 -5
7131 -5 -12 -10 0 -14 3 4 37 12 24 20 -22 -29 -16 -31 -47 -23 2 7 -17 5 31 -1 17 60 18 -5 -28 18 -46 -32 -15 8 -2 -35
7165 -35 17 1 -6 4 23 -27 -56 13 4 -44 -37 -24 -7 -41 18 6 -13 -19 -22 15 17 -2 7 27 11 -1 15 -11 -52 15 0 -24 -17 -3
7199 -3 27 17 24 15 10 -8 1 6 -33 -27 -13 -16 -38 -37 -10 -12 -25 17 -3 -7 -12 5 -17 -16 -13 -3 -28 -26 -22 10 7 23 37 19 28 11 54 -28 -20 1
7239 1 12 -39 -12 -6 -36 -18 -2 10 -9 -9 12 12 -27 -15 -18 5 -3 -12 -23 -18 -32 3 14 3 13 -5 -1 9 23 -9 -14 -1 0 24 -8 2
7275 2 30 -34 -4 20 5 32 13 0 -1 0 21 1 8 -39 3 -9 -31 -14 -3 -10 -27 26 4 6 9 -1 7 0 3 7 -16 -7 -18 -14 -25 11 -6
7312 -6 11 4 11 17 6 17 3 38 -26 -15 19 -7 -4 3 20 -10 -10 -6 -2 -1 -15 18 -23 -31 -29 -19 -34 -23 -21 -24 -43 -18 -10 -18 -20 -2 25 15 -1
7351 -1 -8 -25 -22 -27 12 -14 -3 -3 19 16 -4 32 19 -5 1 -8 -4 -22 4 -8 -33 3 6 -13 -25 0 -7 -5 8 7 -3 0 22 -20 -54 -42 -7
7388 -7 -27 -15 4 5 0 -14 -30 26 8 18 33 1 -13 -10 1 -17 -10 -34 2 -24 -10 9 12 -11 33 13 2 -20 10 -12 -42 -26 -46
7421 -46 -3 -22 11 -10 12 2 -5 -6 -8 -3 -4 -13 -30 -41 -28 -36 -7 -7 1 11 13 30 44 19 7 -2 17 14 -3 21 -8 -11 -21 6 -5 4 -17
7458 -17 6 18 -5 -10 7 14 0 -27 -31 -51 -28 -30 -3 -20 1 4 -14 13 8 5 14 -9 -2 -16 -17 -33 6 -29 -7 -2 20 25 17 15 5 10 43 -10
7496 -10 8 -8 5 -25 -40 -33 -43 -22 15 0 -16 -4 22 -16 2 23 12 11 5 -8 -26 -21 -4 0 11 -8 9 40 22 16 17 6 18 -12
7530 -12 7 -5 -3 1 -13 -5 -33 -24 24 2 1 24 10 1 -6 -22 -8 -2 -14 0 -32 -12 -25 -4 14 -9 -27 1 1 20 -42 -17 -16 -12 13 -47
7566 -47 -28 1 -7 8 11 33 27 12 16 43 22 8 -10 -23 7 -9 -52 -10 -23 -17 16 -12 -4 2 -4 7 18 10 26 -28 -5 8 -28 5 6
7601 6 -4 14 26 15 2 5 23 9 9 -1 20 -4 -18 2 -36 -26 -4 22 -27 2 19 20 -7 -23 -13 2 -27 -12 -9 -47 -48 -32 11
7634 11 -1 -28 11 21 27 -1 34 11 4 -29 11 -34 -56 20 -5 4 -19 21 5 27 49 30 -11 5 -19 -18 -9 6 -24 -28 -51 -3 -19
7667 -19 -3 -20 19 4 11 -20 -36 -29 -22 -29 -17 -2 14 -24 4 7 1 14 19 5 10 25 -10 14 23 -11 -17 0 -4 -23 5 20 25 -6 23 8
7703 8 -7 -14 13 -2 -11 -6 -7 -18 -25 -6 -1 -8 -24 14 -2 2 -19 -25 3 -7 0 13 -27 -2 -10 4 -39 -8 11 13 -5 1 28 16 6 31 21
7740 21 -1 -11 -22 -18 -17 3 19 14 -9 4 -18 13 6 -14 -8 -7 -33 -28 -24 -29 -4 -13 -47 -16 10 5 -7 10 21 3 12 41 34 -9 -20 25 -5
7777 -5 -12 10 11 19 18 28 21 24 -4 -2 25 13 -25 5 -16 4 -6 -20 -17 -13 0 -25 -27 22 15 13 8 20 -20 8 -27 -4 -14 6 -15 -1 6 -1
7815 -1 28 19 38 3 5 -3 7 7 -11 -24 6 -2 -1 26 -7 0 -23 -20 14 -14 -12 -1 -14 -25 -19 -44 -15 -7 0 -8 -37 8 -5 -8 18 30 -7 -15
7853 -15 3 2 15 -15 -14 -13 -10 -18 21 3 15 5 -3 24 16 10 -1 -18 -1 -15 1 -30 -24 -53 -17 -28 14 -21 16 -3 -15 30 15 -9 10
7888 10 0 -11 0 9 4 7 10 16 36 34 7 38 41 15 24 1 29 -13 13 -1 -37 3 3 9 14 0 -1 6 -36 -11 -23 -28 -31 6 10 -10 -25 -2
7926 -2 12 -13 2 9 5 11 11 -3 -4 -21 -1 -18 -17 1 -25 -16 6 14 2 9 18 28 23 -12 -9 -1 -10 15 -7 -12 1 -8 -20 -22 -16 4 14 -19 0 3
7966 3 -7 -5 4 -2 10 -7 -25 22 0 -7 16 21 -15 3 54 20 39 -11 3 6 8 9 3 -5 -14 36 6 30 35 -9 31 17 3 18 6 -6 -2
8003 -2 -15 4 -15 -49 3 -6 -16 -44 -4 11 3 -7 -15 -17 -31 -50 1 -6 11 22 5 12 -4 46 41 24 22 13 17 -21 -13 -17 -22 -5 6 -6 -21
8040 -21 1 1 -20 2 15 -8 14 -12 22 -35 4 -5 -18 -45 -3 -1 -4 8 21 17 21 -22 -17 32 8 -1 -17 22 -19 3 1 8 22 -1 21
8075 21 1 -1 16 13 14 -14 13 -20 -34 -25 -18 -18 -20 -21 0 1 -3 0 28 7 -4 7 1 8 1 5 9 -15 -10 -1 -14 10 11 19 9 -13 14 6 1 9 -2 -7
8117 -7 -10 1 -24 -9 20 -21 13 -4 0 20 -25 20 5 -11 -55 -17 -49 -36 5 8 -25 -24 16 5 -8 -4 14 31 -22 11 -9 7 -32
8150 -32 -35 55 -31 -7 48 14 2 18 10 1 10 -5 15 -20 -28 -7 -15 1 0 -11 -2 -43 -24 -6 4 -46 -12 -22 -20 5 -16 -26 -21 -13 -11 -20 18
8187 18 15 26 15 20
8191B0
##END NTUPLES=NMR FID
##END=
