##TITLE=1H_104-2025-Bay
 200.13MHz, CDCl3,
 8 sc
 
 1.9.2025
##JCAMPDX= 6.0         $$ Bruker NMR JCAMP-DX V2.0
##DATA TYPE= NMR FID
##DATA CLASS= NTUPLES
##ORIGIN= UXNMR, Bruker Analytische Messtechnik GmbH
##OWNER= pz
$$ XWIN-NMR		Version 3.5
$$ Mon Sep  1 14:49:57 2025 Russian Standard Time (UT+4h)  she@DPX200
##.OBSERVE FREQUENCY= 200.1313
##.OBSERVE NUCLEUS= ^1H
##.DELAY= (6, 6)
##.ACQUISITION MODE= SIMULTANEOUS
##.ACQUISITION SCHEME= undefined
##.AVERAGES= 8
##.DIGITISER RES= 18
##SPECTROMETER/DATA SYSTEM= spect
##.PULSE SEQUENCE= zg30
##.SOLVENT NAME= CDCl3
##.SHIFT REFERENCE= (INTERNAL, CDCl3, 0, 14.3821)
##AUDIT TRAIL= $$ (NUMBER, WHEN, WHO, WHERE, WHAT)
$$ ##TITLE= Audit trail, XWIN-NMR		Version 3.5
$$ ##JCAMPDX= 5.01
$$ ##ORIGIN= Bruker BioSpin GmbH
$$ ##OWNER= she
$$ F:/spectra/data/she/nmr/H-C/1/audita.txt
$$ ##AUDIT TRAIL=  $$ (NUMBER, WHEN, WHO, WHERE, WHAT)
(   1,<2025-09-01 14:48:32.40 +0400>,<she>,<DPX200>,
      <created by zg, POWCHK disabled, PULCHK disabled
       configuration hash MD5:
       00 E9 B6 7A A2 85 ED C7 34 08 36 98 17 FE 4E 26
       data hash MD5: 16K
       FD B0 4B 91 80 2F E5 95 76 19 BB 68 8A 64 8E 95>)
$$ ##END=
$$ 
$$ hash MD5
$$ 1F 7C FA 4F 66 B6 09 3A 84 24 EB ED 5C 50 E4 53
##$RELAX= 
##$RELAX= 
##$RELAX= 
##$RELAX= 
##$RELAX= 
##$RELAX= 
$$ Bruker specific parameters
$$ --------------------------
##$DU= <F:/spectra>
##$EXPNO= 1
##$NAME= <H-C>
##$PROCNO= 1
##$TYPE= <nmr>
##$USER= <she>
##$AMP= (0..31)
100 100 100 100 100 100 100 100 100 100 100 100 100 100 100 100 100 100 
100 100 100 100 100 100 100 100 100 100 100 100 100 100 
##$AQSEQ= 0
##$AQ_mod= 1
##$AUNM= <au_zg>
##$AUTOPOS= <>
##$BF1= 200.13
##$BF2= 200.13
##$BF3= 200.13
##$BF4= 200.13
##$BF5= 200.13
##$BF6= 200.13
##$BF7= 200.13
##$BF8= 200.13
##$BYTORDA= 1
##$CFDGTYP= 0
##$CFRGTYP= 5
##$CHEMSTR= <none>
##$CNST= (0..31)
1 1 145 1 1 1 1 1 1 1 1 1 1 1 1 1 1 1 1 1 1 1 1 1 1 1 1 1 1 1 1 1 
##$CPDPRG= <>
##$CPDPRG1= <>
##$CPDPRG2= <>
##$CPDPRG3= <>
##$CPDPRG4= <mlev>
##$CPDPRG5= <mlev>
##$CPDPRG6= <mlev>
##$CPDPRG7= <mlev>
##$CPDPRG8= <mlev>
##$CPDPRGB= <>
##$CPDPRGT= <>
##$D= (0..31)
0 0.7 0 0 0 0 0 0 0 0 0 0.03 0 0 0 0 0 0 0 0 0 0 0 0 0 0 0 0 0 0 0 0 
##$DATE= 1756723712
##$DBL= (0..7)
120 120 120 120 120 120 120 120 
##$DBP= (0..7)
150 150 150 150 150 150 150 150 
##$DBP07= 0
##$DBPNAM0= <>
##$DBPNAM1= <>
##$DBPNAM2= <>
##$DBPNAM3= <>
##$DBPNAM4= <>
##$DBPNAM5= <>
##$DBPNAM6= <>
##$DBPNAM7= <>
##$DBPOAL= (0..7)
0.5 0.5 0.5 0.5 0.5 0.5 0.5 0.5 
##$DBPOFFS= (0..7)
0 0 0 0 0 0 0 0 
##$DE= 6
##$DECBNUC= <off>
##$DECIM= 32
##$DECNUC= <off>
##$DECSTAT= 4
##$DIGMOD= 1
##$DIGTYP= 9
##$DL= (0..7)
0 120 120 120 120 120 120 120 
##$DP= (0..7)
150 150 150 150 150 150 150 150 
##$DP07= 0
##$DPNAME0= <>
##$DPNAME1= <>
##$DPNAME2= <>
##$DPNAME3= <>
##$DPNAME4= <>
##$DPNAME5= <>
##$DPNAME6= <>
##$DPNAME7= <>
##$DPOAL= (0..7)
0.5 0.5 0.5 0.5 0.5 0.5 0.5 0.5 
##$DPOFFS= (0..7)
0 0 0 0 0 0 0 0 
##$DQDMODE= 0
##$DR= 18
##$DS= 0
##$DSLIST= <SSSSSSSSSSSSSSS>
$$ [...]
##$SUBNAM0= <"">
##$SUBNAM1= <"">
##$SUBNAM2= <"">
##$SUBNAM3= <"">
##$SUBNAM4= <"">
##$SUBNAM5= <"">
##$SUBNAM6= <"">
##$SUBNAM7= <"">
##$SUBNAM8= <"">
##$SUBNAM9= <"">
##$SW= 18.0517328524113
##$SWIBOX= (0..15)
0 0 2 0 0 0 0 0 0 0 0 0 0 0 0 0 
##$SW_h= 3612.71676300578
##$TD= 16384
##$TD0= 1
##$TE= 0
##$TE2= 300
##$TE3= 300
##$TEG= 300
##$TL= (0..7)
0 120 120 120 120 120 120 120 
##$TP= (0..7)
150 150 150 150 150 150 150 150 
##$TP07= 0
##$TPNAME0= <>
##$TPNAME1= <>
##$TPNAME2= <>
##$TPNAME3= <>
##$TPNAME4= <>
##$TPNAME5= <>
##$TPNAME6= <>
##$TPNAME7= <>
##$TPOAL= (0..7)
0.5 0.5 0.5 0.5 0.5 0.5 0.5 0.5 
##$TPOFFS= (0..7)
0 0 0 0 0 0 0 0 
##$TUNHIN= 0
##$TUNHOUT= 0
##$TUNXOUT= 0
##$USERA1= <user>
##$USERA2= <user>
##$USERA3= <user>
##$USERA4= <user>
##$USERA5= <user>
##$V9= 5
##$VALIST= <valist>
##$VCLIST= <CCCCCCCCCCCCCCC>
##$VD= 0
##$VDLIST= <DDDDDDDDDDDDDDD>
##$VPLIST= <PPPPPPPPPPPPPPP>
##$VTLIST= <TTTTTTTTTTTTTTT>
##$WBST= 1024
##$WBSW= 4
##$XGAIN= (0..3)
0 0 0 0 
##$XL= 0
##$YL= 0
##$YMAX_a= 122509
##$YMIN_a= -173918
##$ZGOPTNS= <>
##$ZL1= 120
##$ZL2= 120
##$ZL3= 120
##$ZL4= 120
##$ABSF1= 10
##$ABSF2= 0
##$ABSG= 5
##$ABSL= 3
##$ALPHA= 0
##$AQORDER= 0
##$ASSFAC= 0
##$ASSFACI= 0
##$ASSFACX= 0
##$ASSWID= 0
##$AUNMP= <proc_1d>
##$AZFE= 0.1
##$AZFW= 0.1
##$BCFW= 1
##$BC_mod= 2
##$BYTORDP= 1
##$COROFFS= 0
##$CY= -3
##$DATMOD= 1
##$DC= 2
##$DFILT= <>
##$DTYPP= 0
##$F1P= 0
##$F2P= 0
##$FCOR= 0.5
##$FTSIZE= 0
##$FT_mod= 4
##$GAMMA= 1
##$GB= 0.15
##$INTBC= 1
##$INTSCL= 1
##$ISEN= 128
##$LB= 0.25
##$LEV0= 0
##$LPBIN= 0
##$MAXI= 10000
##$MC2= 0
##$MEAN= 0
##$ME_mod= 0
##$MI= 1.114404
##$NCOEF= 0
##$NC_proc= 0
##$NLEV= 6
##$NOISF1= 3.799351
##$NOISF2= 2.8
##$NSP= 1
##$NTH_PI= 0
##$NZP= 0
##$OFFSET= 14.38212
##$PC= 1
##$PHC0= -1473.586
##$PHC1= 12.19228
##$PH_mod= 1
##$PKNL= yes
##$PPARMOD= 0
##$PSCAL= 0
##$PSIGN= 0
##$REVERSE= no
##$SF= 200.129724274929
##$SI= 16384
##$SIGF1= 3
##$SIGF2= 2
##$SINO= 400
##$SIOLD= 16384
##$SREGLST= <1H.CDCl3>
##$SSB= 0
##$STSI= 0
##$STSR= 0
##$SW_p= 3205.1282051282
##$SYMM= 0
##$S_DEV= 0
##$TDeff= 0
##$TDoff= 0
##$TI= <>
##$TILT= no
##$TM1= 0
##$TM2= 0
##$TOPLEV= 0
##$USERP1= <user>
##$USERP2= <user>
##$USERP3= <user>
##$USERP4= <user>
##$USERP5= <user>
##$WDW= 1
##$XDIM= 8192
##$YMAX_p= 0
##$YMIN_p= 0
$$ End of Bruker specific parameters
$$ ---------------------------------
##NTUPLES= NMR FID
##VAR_NAME=  TIME,          FID/REAL,        FID/IMAG
##SYMBOL=    X,             R,               I
##VAR_TYPE=  INDEPENDENT,   DEPENDENT,       DEPENDENT
##VAR_FORM=  AFFN,          ASDF,            ASDF
##VAR_DIM=   8192,          8192,            8192
##UNITS=     SECONDS,       ARBITRARY UNITS, ARBITRARY UNITS
##FACTOR=    0.0002768,     1,               1
##FIRST=     0,             0,               0
##LAST=      2.2672688,     0,               0
##MIN=       0,             -173918,         0
##MAX=       2.2672688,     122509,          0
$$ Real data points
##PAGE= N=1
##DATA TABLE= (X++(R..R)), XYDATA
0 0 0 0 0 0 0 0 0 0 0 0 0 0 -8 8 -8 8 -8 16 -16 16 -24 24 -32 36 -40 48 -56 65 -80 88 -104 113 -129 149 -169
35 -169 189 -212 238 -265 297 -329 367 -407 450 -498 551 -608 671 -739 815 -896 989 -1089
53 -1089 1201 -1327 1471 -1632 1817 -2030 2286 -2588 2959 -3428 4033 -4861 6055 -7943 11403
68 11403 -19811 85437 53274 -66670 67227 26902 -93078 -42813 76279 -5585 -58901
79 -58901 36514 37861 -115144 -91388 61407 43821 -59569 9401 82324 -2913 -60221 15171
91 15171 23180 -46061 -6497 78495 3899 -96553 -34777 30266 -40607 -57332 45673 73477
103 73477 6142 9857 39696 -28476 -76791 5496 49926 -24293 -32932 45916 21704 -71206
115 -71206 -62759 -12846 -30834 -28350 40069 52870 -2242 5574 53187 15116 -46169 -15814 26453
128 26453 -3460 -30062 -10374 -4699 -19324 -2896 28326 20909 1196 21072 37728 1341
140 1341 -30934 -7996 21281 15146 5814 17335 17047 -10392 -24636 -18934 -33286 -44381 -7358
153 -7358 27803 12269 -1531 22368 32322 3425 -12694 3198 3627 -13110 -1440 14426 -6515
166 -6515 -17119 12765 23063 -6879 -15925 9749 12027 -15729 -13796 11755 4409 -9050 13771
179 13771 19491 -16858 -25092 3376 -2500 -33375 -17796 21611 14417 -5082 17836 27262 -7767
192 -7767 -12989 14639 564 -27033 -1869 27176 4876 -12286 14820 22744 -9518 -12532 11497
205 11497 -3068 -24673 -71 16895 -8155 -13945 13168 11990 -17106 -15931 4922 -5661 -20780
218 -20780 1481 17134 -383 706 23870 16416 -8040 -3160 10643 -2495 -15647 379 10963
231 10963 -4764 -6436 10024 1910 -16160 -7021 3915 -7552 -11989 4171 10992 -363 -1471
244 -1471 9077 2214 -11447 -4736 2344 -5954 -4129 10846 14108 7733 8769 12252 4477 -7413
258 -7413 -8186 -6432 -12804 -12312 -2105 764 -803 3263 5710 1465 -3908 -4796 -3018 -4105 -3601 3819
274 3819 8233 7101 8876 9516 4060 -1309 -4604 -7002 -8535 -8899 -5146 -343 306 1907 4352 1656
290 1656 -1826 -2978 -5119 -6108 -5024 -3252 483 3357 4717 7528 8004 5879 5441 3904 1328 611
306 611 -851 -2257 -2433 -4333 -5415 -4673 -5776 -5297 -2371 -762 1651 4644 5661 6544 6188 4048 3114
323 3114 1045 -1643 -1235 -1168 -2011 -282 543 -517 -476 -1033 -1635 -1426 -1559 241 2634 2673 4012 5189
341 5189 1982 -663 -1753 -5471 -8614 -8350 -6402 -3743 -942 3652 8604 8724 8190 9886 5913 -502
357 -502 -1152 -2196 -6973 -8208 -5244 -3869 -5135 -3996 124 -681 -3366 1388 4662 511 1903 8584
373 8584 7238 2364 3400 4737 -504 -5674 -3470 -2959 -8900 -7021 1791 170 -3843 3797 9263
388 9263 3604 970 5713 4757 -2844 -2876 1736 -4413 -10780 -2768 1090 -8086 -7767 3120 3468 -1854
404 -1854 3415 10453 5872 2075 8523 7648 -4499 -4265 4861 -1066 -10392 -3958 1837 -4573 -6892
419 -6892 29 824 -4355 376 8000 1410 -5480 2640 6342 -3241 -5376 2045 2606 -1782 -214 2436
435 2436 -1770 -3589 3920 6504 -738 -223 7723 5579 -2869 -4038 -1332 -1652 -2550 -592 -180 -4060
451 -4060 -4171 253 -1721 -6678 -2253 6218 7313 2567 -110 1381 1032 -2640 -2375 632 281 1643
467 1643 5648 2717 -5641 -5881 2938 5468 -1720 -1347 7343 4269 -5729 -4366 -1893 -7253 -3608 8859
483 8859 6561 -6060 -2848 7778 -1195 -13772 -2700 8858 54 -2304 7252 -150 -13343 -2750
497 -2750 10144 -1246 -7897 11094 17831 -3706 -10284 4801 1399 -9815 4448 15520 -1796
510 -1796 -8504 8369 4037 -21536 -16967 8905 4467 -11674 2312 13018 -6610 -10519 10497
523 10497 6550 -12416 2409 23241 3240 -18266 -188 11627 -8408 -8501 16146 11149 -8161
536 -8161 4330 13823 -12158 -22390 5262 13055 -10217 -8245 13927 3544 -17283 -4633 6218
549 6218 -10699 -9074 16524 12502 -11931 -4586 15080 2181 -13637 3796 16209 -287 -3910
562 -3910 10114 449 -17254 -3489 12617 -1703 -11155 7062 12926 -7540 -12317 2798 436
575 436 -9236 2863 11226 -4518 -10301 4457 4072 -11809 -7437 11155 10139 -929 3847 8028
589 8028 -3428 -6747 3519 2103 -6853 -425 10059 2862 -8585 -4102 3660 -922 -4224 2553
603 2553 3620 -2901 -1976 2002 -2933 -7460 -234 7614 2633 -4700 -948 2819 -3389 -5627 1641
618 1641 4728 2665 5685 8904 2067 -5889 -1805 3437 -3452 -7496 1843 5519 -2866 -4594 1178
633 1178 -1027 -5479 858 6961 120 -4162 4637 6120 -5560 -5860 5109 3398 -4695 -400 4272
648 4272 -3658 -7259 2378 4777 -4133 -1011 10448 4774 -6996 -1818 4024 -4703 -7533 2627
662 2627 3699 -5311 -2628 5916 -1054 -9740 -255 6980 -2359 -4432 6157 5037 -4853 -1845 5121
677 5121 -1515 -7294 1461 5179 -5235 -6042 4840 3227 -5070 729 8026 1476 -3079 3656 4307
692 4307 -4579 -3944 4871 2167 -5116 520 5966 -1298 -4601 2418 3330 -2631 -413 6080 3135 -2275
708 -2275 1822 5038 -1730 -4303 1807 1888 -3407 -1073 3772 1260 -1900 1709 3938 -854 -2560 1893
724 1893 1236 -3646 -1916 1861 -673 -2794 243 1494 -1713 -2527 683 592 -2536 -873 2514 440
740 440 -1538 719 865 -2316 -3217 -1493 -1722 -3494 -2143 780 197 -900 1604 2353 -126 -458 897
757 897 186 -1368 -888 424 -218 -1396 -105 848 -764 -773 1002 714 -96 924 1762 1275 532 723 872
776 872 -644 -1553 -618 -788 -1566 -402 725 618 977 1613 1768 1367 763 991 878 -123 -142 292 -519
795 -519 -897 -658 -1053 -1160 -1051 -821 -111 151 359 1247 1307 682 730 254 -651 -1059 -1370 -1335 -1087 -1088 -257 640
817 640 389 730 1404 962 714 939 659 394 226 144 168 -440 -673 -175 -665 -1068 -93 280 186 975 1421
838 1421 1244 1185 1089 868 -55 -767 -267 -455 -1337 -589 227 -302 66 998 605 57 496 972 351 -556 139
859 139 573 -921 -1235 -185 -1128 -1965 -609 -141 -1149 -665 1077 1272 35 283 1413 120 -1330
876 -1330 -285 -522 -2302 -1374 196 -896 -1657 -29 1086 50 -487 983 1190 -105 582 1465 -369
893 -369 -880 789 381 -1395 -1142 291 230 -620 56 1029 427 581 1896 901 -785 91 551 -1039 -1785
912 -1785 -1001 -378 -373 -262 153 -150 -122 1199 1184 -110 584 1767 995 382 139 -713 -729 40 -280 -1443
932 -1443 -1177 508 456 -1000 -322 808 -17 405 1738 -236 -1883 224 836 -1952 -2447 497 1224
949 1224 -715 99 1923 -174 -818 2745 2477 -1423 154 3792 953 -2927 -816 1089 -1824 -2252
965 -2252 1668 761 -3004 233 3627 -1343 -3863 1887 3489 -1698 -1779 2585 443 -3661 -5 2846
981 2846 -2424 -2907 4360 3430 -3904 -1588 4333 650 -3330 1838 4159 -1829 -2240 3362 -285 -7034
997 -7034 -1607 4393 -1516 -4485 2647 3724 -3056 -2127 3555 329 -3777 2343 5327 -2699 -4576
1012 -4576 2998 2058 -4804 -1382 5011 1536 -2088 2522 3171 -3617 -3114 4067 1849 -4260 182 4868
1028 4868 -1287 -5292 -302 996 -3317 -1224 4231 1270 -3511 718 3641 -2374 -3833 2938 3892
1043 3892 -1151 -625 2160 -1248 -4295 -454 2046 -1406 -930 4313 3026 -2664 -2013 1264 -516 -2100
1059 -2100 699 2020 -861 -1915 82 -970 -3754 -1214 3164 2215 -61 1224 2028 -562 -2123
1074 -2123 -246 1192 127 738 2786 712 -2909 -1729 736 -573 -1506 1477 3446 951 -1127
1089 -1127 298 -3 -2459 -670 2700 850 -1756 325 1345 -2276 -3639 463 2498 125 746
1104 746 3737 1197 -2743 -368 1657 -1826 -2394 2340 2604 -2346 -2492 1307 -463 -3556 523 3767
1120 3767 -174 -1228 3012 1542 -3834 -2063 2604 226 -3032 868 3021 -2099 -3232 1744 961
1135 961 -3078 440 4643 636 -2603 1305 2389 -2744 -2965 2214 1204 -3074 -179 2957 -1465
1150 -1465 -3439 1606 2671 -1678 -779 3759 1797 -2613 -180 2583 -1492 -3002 1638 1731 -2720 -1434
1166 -1434 2294 -10 -3002 298 2947 -314 -1430 2436 1924 -2272 -1059 1847 -687 -2825 328
1181 328 1878 -1078 -1578 1704 1532 -1418 3 2666 462 -1444 921 1389 -1586 -1830 600 281
1197 281 -1947 -780 1503 -103 -1714 554 1411 -866 -669 1657 1077 -849 -8 1401 -140 -1600
1213 -1600 81 907 -1081 -1035 1087 533 -927 231 1472 360 -493 686 1057 -775 -1287 85 -448
1230 -448 -1799 -749 513 -269 -560 668 1154 105 -114 1023 795 -607 -128 813 -287 -929 161
1247 161 467 -455 -382 566 479 -514 -234 690 -34 -692 328 612 -420 -413 241 -149 -882 -613 25 -294 -708
1268 -708 185 720 112 255 1114 762 182 305 444 -94 -702 -425 -35 -552 -610 290 344 -170 226 580 158
1289 158 -273 -86 103 -429 -720 -124 -46 -645 -238 370 -31 -167 419 502 106 54 425 441 -105 40 457
1310 457 -132 -471 55 -119 -676 -445 -45 -194 -327 24 410 142 40 518 343 -317 -55 145 -475 -543
1330 -543 -71 -64 -212 70 547 469 238 620 727 -57 -86 402 -149 -632 -122 0 -420 -284 199 129 -244 184
1352 184 729 106 -213 590 521 -314 -24 319 -330 -609 -71 -14 -610 -424 468 283 -349 301 810 5 -97
1373 -97 492 -56 -657 -173 60 -544 -851 -64 188 -524 -365 497 102 -274 578 540 -306 -42 552 -76 -778
1394 -778 -417 5 -570 -742 82 -4 -441 444 976 21 73 953 609 -243 -104 174 -449 -698 64 1 -850
1415 -850 -87 886 -26 -452 743 783 -152 171 785 -97 -779 157 266 -1192 -913 696 130 -1003 196
1434 196 953 -384 -356 984 531 -730 308 1506 -152 -1418 325 636 -1398 -1011 831 -160 -1220
1451 -1220 487 1177 -699 -690 1724 1373 -947 -134 1432 -619 -2058 35 375 -1477 -344 2048 743
1468 743 -1144 645 1903 -512 -1214 1396 1299 -1060 -50 1495 -738 -1866 622 1289 -1069 -781
1484 -781 1714 726 -1635 -279 1364 -433 -715 1723 1251 -1353 -776 746 -926 -2391 -183 1415
1500 1415 -231 -571 1301 575 -1412 -212 1292 -206 -801 977 1035 -1344 -1805 -249 -521 -1542 -40
1517 -40 1306 67 -431 774 243 -1241 -603 884 534 -468 52 474 -675 -1175 -81 276 -109 613
1535 613 1290 455 -509 -401 190 1 -217 601 1124 366 -346 -343 -669 -1104 -561 476 785 321 592 1225
1555 1225 373 -671 60 745 13 -264 427 146 -1026 -864 256 -60 -753 588 1554 11 -780 434
1573 434 343 -985 -370 1097 401 -830 178 703 -1221 -1562 632 764 -787 197 1728 299 -1097
1590 -1097 255 756 -1078 -1086 1069 499 -1514 -401 1154 -614 -1500 732 1191 -659 -337 1572 593
1607 593 -1290 154 1488 -512 -1226 891 778 -1441 -866 946 -89 -1278 507 1641 -252 -773
1623 -773 1137 653 -1561 -671 1002 -310 -1330 396 1022 -748 -868 901 541 -1036 105 1603
1639 1603 196 -748 753 925 -875 -821 603 56 -1221 -253 900 -285 -872 695 944 -535 -241
1656 -241 995 187 -965 -173 552 -450 -846 512 678 -578 -303 819 82 -748 218 872 41 -154
1674 -154 775 694 -594 -580 131 -516 -1275 -370 287 -405 -423 556 588 -162 7 699 219 -597 -45 343 -495
1695 -495 -704 153 137 -505 -170 480 140 -410 104 610 5 -165 642 575 -243 -114 283 -262 -739 -228 245
1716 245 -146 -252 488 539 -168 43 582 170 -179 303 458 -54 -272 119 107 -467 -243 397 134 -155 384
1737 384 688 238 164 536 409 -140 -263 -12 -379 -836 -434 -70 -379 -293 232 203 -171 -129 177 -12 -268
1758 -268 47 377 20 -95 287 94 -293 -227 14 -178 -340 -40 226 -28 -135 241 164 -287 -206 -50 -401
1779 -401 -549 -261 -64 -183 -55 344 422 107 270 447 126 -17 264 182 -129 7 52 -92 -301 -175 1
1800 1 -172 -141 229 240 20 245 294 68 -9 51 -68 -256 -193 -22 -80 -158 147 254 33 125 281 92 -5 183
1824 183 166 -41 -65 3 -101 -336 -240 -137 -312 -238 109 96 -7 309 428 181 82 153 25 -251 -252 -80 -263
1847 -263 -379 9 70 -186 13 300 117 0 240 311 62 18 226 39 -324 -183 -9 -380 -428 27 15 -168
1869 -168 166 413 215 118 355 299 -149 -155 115 -198 -428 -94 -25 -356 -209 137 -29 -197 126 345 60 -6
1891 -6 377 283 -147 62 243 -225 -364 37 -52 -377 -128 302 80 -138 240 358 -128 -136 265 -127 -511 -39
1913 -39 132 -366 -286 209 124 -249 69 509 113 -76 505 408 -294 -100 290 -200 -544 -63 111 -389 -366 254
1935 254 29 -424 120 526 -55 -146 510 327 -312 -87 321 -115 -385 133 288 -325 -318 351 58 -444 162
1956 162 515 -94 -244 237 73 -545 -315 172 -156 -467 239 402 -222 -92 505 242 -137 300 499 -9
1976 -9 -255 102 -24 -601 -370 145 -140 -375 101 209 -211 -96 305 182 -24 239 442 64 -191 63 53
1997 53 -318 -161 122 -88 -178 29 43 -153 -37 199 203 23 110 89 -159 -242 -162 -204 -150 36 73 70 101 70 10 31
2023 31 81 95 62 116 110 -160 -171 -33 -218 -254 26 77 -134 -45 164 10 -103 176 385 78 -99 194 54 -416
2047 -416 -199 158 -124 -235 258 279 -211 -179 240 30 -353 41 395 -86 -244 262 92 -458 -172 275 -34
2068 -34 -276 225 434 -142 -182 423 200 -342 23 353 -217 -495 58 123 -356 -178 440 189 -335 117 384
2089 384 -221 -347 278 182 -344 -87 384 -56 -453 56 272 -237 -186 486 355 -89 236 534 17 -283 76
2110 76 104 -471 -428 89 -106 -472 -52 280 -97 -186 288 306 -59 81 413 203 -145 69 242 -171 -346 59
2132 59 -18 -401 -253 97 -55 -160 181 360 46 -162 75 -58 -482 -322 22 -108 -201 105 168 -64 -150 130
2154 130 130 -7 154 431 206 -42 64 2 -263 -313 -101 -106 -293 -229 2 -57 -194 183 386 203 186 311 158
2177 158 -107 -141 60 40 -115 113 204 -110 -195 -34 -79 -121 48 299 253 140 179 190 -71 -215 -31 36 -166
2200 -166 -29 111 -6 -116 22 158 24 -31 121 79 -224 -206 25 -88 -167 48 151 -34 -157 -46 -31 -155
2222 -155 -24 273 201 51 181 150 -124 -212 -86 -87 -217 -128 71 24 -146 59 161 -58 -56 118 -9 -157 -44
2245 -44 71 -14 -59 85 169 -44 -93 60 26 -117 62 198 100 78 159 75 -164 -197 -101 -168 -248 -31 100 -38 14
2270 14 199 103 3 61 110 -31 -71 23 99 -53 -41 89 -36 -113 -36 -27 -91 -28 117 128 93 162 185 17 -135 -121
2296 -121 -152 -251 -157 -39 -80 -16 110 102 72 82 109 51 -23 116 100 5 -1 111 -18 -123 -53 -90 -165 -126 -5 -17 -33
2323 -33 113 182 6 -41 56 -78 -194 -57 4 -85 -11 140 112 5 29 136 -36 -114 72 50 -105 -10 110 -27
2347 -27 -128 10 -24 -155 -123 75 83 -13 204 331 108 80 204 56 -132 -54 34 -112 -118 44 120 -64 -24 153
2371 153 1 -160 25 72 -109 -54 141 41 -130 -3 35 -183 -203 6 30 -104 75 273 62 -8 136 20
2393 20 -215 -223 -105 -215 -329 -110 82 -113 -76 197 68 -140 126 205 -32 9 178 163 -74 -34 96 -184 -345
2416 -345 -93 -61 -260 -60 206 105 14 213 260 -1 -51 124 45 -231 -23 144 -73 -83 111 72 -143 17
2438 17 152 71 -44 134 254 10 -24 178 0 -237 -83 -5 -228 -188 40 55 -17 88 231 93 -34 100
2460 100 64 -153 -61 100 -45 -129 4 -42 -163 -149 -13 -47 -90 68 175 50 24 144 70 -89 -26 11 -74 -86
2484 -86 -15 -34 -65 52 114 81 40 131 72 -99 8 63 -33 -12 100 40 -62 -57 -5 -108 -165 7 91 -17 50 192
2510 192 -4 -102 12 5 -139 -62 103 32 -92 22 122 -55 -114 142 62 -139 -3 63 -93 -183 14 69 -149
2533 -149 -48 150 8 -200 -4 173 -79 -30 202 151 -114 -19 104 -97 -266 -23 64 -126 -75 231 92 -115
2555 -115 73 180 -55 -78 205 124 -73 -30 155 -66 -211 20 108 -119 -90 165 66 -82 24 164 6 -104
2577 -104 113 123 -183 -149 63 -70 -219 -29 128 -10 13 184 161 -51 -36 128 -14 -113 68 110 -122 -142 -50
2600 -50 -133 -229 -100 82 25 10 138 168 -33 -36 87 44 -57 38 69 -26 -167 -50 -1 -99 -27 163 102 -22 22 31
2626 31 -101 -89 2 62 -2 -65 -5 -62 -178 -114 14 39 58 184 167 47 -47 -9 22 -48 -3 75 25 -89 -43 -40 -104 -78
2654 -78 64 112 64 49 88 30 -103 -39 36 -49 -68 12 -10 -147 -115 -7 30 -24 92 194 69 5 92 47 -126 -50
2680 -50 40 -42 -93 -23 22 -80 -133 34 84 1 77 168 32 -65 -1 43 -52 -99 6 6 -119 -79 31 -45 -62 82 138
2707 138 71 50 117 77 -75 -47 25 -60 -144 -47 -3 -135 -84 3 22 -26 69 144 88 0 50 72 -59 -67 21 -64 -109 -52 20
2736 20 -79 -55 61 38 20 66 145 62 -38 58 45 -83 -49 16 -50 -92 -47 -28 -43 -59 37 49 -26 29 81 -33 -47 51
2764 51 -26 -64 -25 4 -24 -82 -25 21 -11 -5 100 33 -15 59 45 -64 -25 -3 -45 -64 -8 4 -71 -33 28 36 -46 24 73 -23
2794 -23 -7 59 -13 -73 -23 33 -55 -66 29 38 -26 13 99 -5 1 76 57 -26 -16 26 -40 -84 -4 44 -42 -23 128 48 -41 72
2824 72 105 -23 -22 64 6 -73 -20 18 -51 -139 8 27 -95 -9 128 16 -29 89 111 22 -13 34 -5 -121 -64 12 -109
2851 -109 -123 76 29 -85 34 136 37 -36 92 81 -76 -58 66 -36 -154 -37 35 -131 -79 99 49 -52 71
2874 71 154 35 -21 108 50 -115 -29 50 -89 -151 25 22 -85 -15 122 33 -52 94 160 -32 -25 127 54 -124 -16
2899 -16 51 -110 -142 17 20 -101 8 162 33 -56 109 106 -75 -45 101 -44 -142 18 21 -84 -120 106 57 -86 13
2924 13 153 -1 -48 144 87 -64 -25 66 -77 -140 16 13 -122 -45 139 47 -68 97 171 -69 -5 121 24 -86
2948 -86 -4 41 -85 -121 22 47 -72 -6 135 6 -29 100 50 -76 -26 110 -39 -132 -25 5 -151 -69 85 32
2972 32 -51 91 149 -25 -20 66 51 -45 -19 41 -56 -101 20 28 -100 -19 105 -19 -10 95 103 -8 -38 59 13 -130 -36 22
3000 22 -97 -120 37 -35 -99 41 108 0 -15 83 103 -79 -41 84 -39 -134 3 26 -120 -74 64 -6 -77 2 79
3025 79 28 -1 102 56 -55 -47 33 -77 -106 40 -27 -76 -37 68 10 -65 37 121 21 7 88 44 -92 -1 24 -81
3051 -81 -80 22 26 -35 -47 79 46 -36 57 112 46 29 61 -6 -98 -39 34 -31 -74 51 65 -30 -9 76 24 -19 70 62 -6 -20
3081 -20 21 -35 -82 -84 -2 -39 -51 57 18 -21 18 32 -10 2 58 21 12 -34 -39 -35 -94 -44 61 -22 29 63 47 13 27 31 29 18
3113 18 19 16 -12 -104 -38 -60 -80 1 44 22 70 60 26 27 -22 -13 21 33 44 31 -50 -32 -56 -49 -20 51 61 71 19 -18 -20 -27 -1 34
3147 34 -8 -22 -16 -56 -86 -98 -68 -54 15 62 72 28 11 -28 -35 -29 22 39 -8 -6 -52 -97 -97 -92 -23 62 60 93 75 9 -29 4 -25 -1
3181 -1 45 66 7 -21 -87 -45 -13 38 56 78 82 102 29 6 42 28 -5 23 47 -3 -18 -54 -39 -20 15 64 44 24 82 31 -44
3212 -44 -52 -26 -26 7 9 -11 -66 -88 -41 -24 -48 31 98 7 25 48 -5 -40 -58 16 -41 -51 -20 2 -85 -73 15 2 -34 49 110 2
3244 2 -19 40 6 -32 -12 -13 -30 -90 -10 -9 -60 -13 88 21 -4 104 60 4 -14 24 15 -67 -26 37 -39 -65 34 26 -44 35 64 32
3276 32 -3 95 62 -10 -20 60 -17 -92 -6 -10 -60 -54 47 43 -14 46 112 18 -19 63 48 -55 -26 35 -73 -84 0 -34 -70 24
3306 24 48 53 -7 53 84 -19 -33 59 36 -53 -3 21 -53 -52 24 25 -45 15 72 21 -7 55 115 -45 31 79 -52 -80 -9 27
3336 27 -77 -53 10 24 -44 28 89 -30 3 77 22 -76 -24 27 -79 -103 -4 29 -78 -43 93 33 -73 79 94 -26
3362 -26 20 75 7 -77 -19 27 -32 -66 45 29 -72 -41 86 -2 -24 90 46 -60 -14 50 -20 -85 -18 26 -93 -61 27
3389 27 -12 -72 27 78 -8 -14 69 32 -54 -18 34 -10 -110 14 9 -98 -23 66 -3 -57 78 71 -22 -23 67 28 -98 -36 18 -78
3419 -78 -102 30 10 -108 -4 68 -10 -14 73 76 -33 -21 82 -27 -63 32 31 -73 -38 26 3 -39 21 87 25 -43 84 79
3447 79 -30 -9 54 -57 -86 -4 13 -82 -41 56 7 -53 19 88 -11 -22 62 46 -63 -5 47 -47 -80 -9 14 -48 -36 76
3475 76 56 -15 57 86 -43 -15 68 -7 -39 8 -5 -36 -49 -3 43 -36 2 63 28 2 74 28 -20 15 26 -10 -31 -52 -25 -36
3505 -36 -2 35 7 -35 21 17 16 19 38 17 -12 -7 1 -30 -49 -3 -8 -44 26 45 29 -7 92 19 -13 18 33 -9 -71 -7 22 -57 -27
3538 -27 23 -33 -26 38 42 -30 -3 78 60 -24 7 -2 -64 -94 41 24 -44 -18 25 -29 -41 57 34 29 22 88 43 -45 -14 52 -54 -63
3570 -63 54 45 -61 -29 38 -32 -39 25 101 -13 -32 72 8 -121 -30 38 -20 -27 57 73 -49 -29 43 -19 -42 38 126 2
3598 2 -46 -12 -63 -109 -47 46 24 -16 43 55 -25 -54 56 88 -18 72 110 -18 -57 -45 -52 -50 -56 46 56 -19 9 53 -47 -85
3628 -85 45 93 13 37 55 -29 -118 -81 -18 -36 -13 56 71 -47 -7 29 -1 25 22 75 56 -54 0 -2 -109 -72 4 35 9
3657 9 21 14 -1 -31 -19 55 33 39 48 4 -60 -73 -65 -74 -68 -4 53 -3 -45 34 47 -7 -2 80 39 -31 -5 4 -37 -56 1 34 -12 5 60
3692 60 42 -38 12 86 -12 -16 41 19 -42 -41 29 -15 -71 -28 74 -2 -13 32 43 5 -12 57 30 -79 -16 52 -38 -65 33 33 -63
3723 -63 -21 52 -12 -26 33 64 -6 -23 80 -10 -87 -3 81 -26 -50 11 31 -24 -49 64 52 -20 52 75 -32 -37 36 -15 -98
3752 -98 3 53 -19 -67 13 34 -26 -61 71 30 -54 55 93 -38 -35 17 5 -65 -41 21 -40 -41 17 53 -34 1 63 7 -29
3781 -29 13 -15 -25 -42 -12 -9 -50 -39 -15 -54 -20 34 14 -12 46 50 -20 -14 5 -22 -49 -50 -7 -49 -53 -4 25 -14 36 62 22 31 73
3814 73 45 -16 11 29 -14 -56 7 15 -47 -26 46 10 -5 66 94 -3 -8 72 32 -49 -10 23 -25 -48 34 22 -56 31 64 12 -10
3845 -10 42 64 -45 7 -8 -3 -80 17 8 -81 -52 0 -20 -39 24 42 9 -39 52 71 -48 -5 40 -36 -74 -1 -28 -98 -53 35
3875 35 -6 -55 14 19 -30 -92 35 38 -77 -9 22 -33 -52 27 5 -34 17 50 30 -5 51 85 -14 -20 78 -1 -29 -1 -14 -51 -30
3906 -30 25 36 -24 -23 72 28 -28 47 60 -58 -12 24 -6 -60 -17 11 -41 -48 2 10 -33 -15 57 -10 -11 41 13 -35 -50 -15 -16 -66
3938 -66 4 26 -27 -19 34 28 -27 29 46 -7 -24 18 -4 -30 -24 12 -35 -21 13 12 -46 -4 45 16 25 20 12 -15 -17 -22 -7 -32 -30 0 -34
3973 -34 1 61 28 39 45 10 17 22 47 -11 -6 -1 26 -63 -54 -11 -31 -47 -4 18 -14 24 43 18 -4 -5 -2 4 -20 6 9 -65 -49 -4 -34
4008 -34 -53 -20 16 -17 -19 6 23 -40 -14 49 -42 -43 17 -14 -40 -18 54 22 17 54 82 15 -41 56 14 -66 -35 8 -70 -93 -15 2
4040 2 -44 -52 23 17 -17 26 78 -6 -51 30 48 -49 -22 26 -29 -70 -4 48 -22 -38 81 35 -46 -4 62 -3 -60 -6 75 -24 -7
4071 -7 49 45 -45 -22 78 20 -6 84 72 -25 7 14 -12 -106 -20 8 -47 -69 37 17 -47 -16 91 46 8 71 122 -12 -65 43
4101 43 38 -48 -27 37 -21 -65 -15 27 -26 -44 49 112 13 16 40 -4 -96 -18 4 -48 -62 16 39 -73 -36 38 20 -64 9 68 -9
4132 -9 -60 21 14 -41 -59 35 10 -74 -5 42 -22 -78 24 48 -3 14 63 29 -35 -31 38 -6 -95 14 43 -52 -44 79 0 -74 11
4163 11 63 16 -49 44 46 -56 -38 42 16 -49 -4 85 -16 -52 30 39 -32 -12 91 43 -79 14 44 -42 -72 25 41 -46 -19
4192 -19 58 25 -70 9 92 -58 -53 73 43 -74 -31 59 -12 -71 10 67 -13 -51 83 55 -54 16 83 -15 -75 46 25 -84
4220 -84 -79 26 -11 -110 -4 89 -7 -47 81 58 -6 19 101 36 -64 1 52 -40 -74 36 23 -39 19 62 6 -32 46 40 -40
4249 -40 -32 31 19 -42 -11 0 -32 -67 19 27 13 19 44 27 -6 14 18 -19 -29 -12 -35 -25 -28 -25 -11 -38 20 26 44 8 30 54 56 -3
4283 -3 21 9 5 -27 -35 21 -41 -42 -8 -10 -25 -2 21 31 -3 0 41 -8 -63 39 13 -21 -24 29 -13 -37 3 20 14 17 30 45 -37 -19
4317 -19 -4 4 -52 -1 20 -42 -27 19 42 -5 6 78 12 -33 76 41 -28 14 37 -15 -27 25 7 0 -41 29 20 -21 36 62 -13
4348 -13 -35 28 26 -71 9 28 -6 -67 -9 51 -17 -14 70 44 -28 55 50 -23 -14 32 -15 -75 -27 23 -53 -39 42 23 -53 -3 74 10
4380 10 -38 39 33 -17 -39 30 -17 -55 -29 22 -28 -9 58 9 1 15 34 13 12 26 21 -23 -31 15 -37 -22 -26 13 -34 -11 29 19 -5
4413 -5 36 58 34 -3 -2 39 -77 -41 4 -47 -33 -6 -6 -32 8 13 31 10 24 40 -7 -22 13 11 -6 3 7 -21 -16 24 -3 10 3 50
4447 50 28 25 34 4 -31 -3 0 -54 1 45 -18 3 9 41 35 5 47 60 2 -19 24 -4 -21 10 19 -46 -15 -5 0 -15 40 36 13 -11
4481 -11 63 22 -31 -9 8 -46 -30 11 -7 -18 -21 45 28 8 17 24 -26 -6 10 -7 -33 -18 11 -35 -73 -9 7 -7 -4 66 43 -12
4513 -12 24 56 -14 3 35 8 -84 -46 -9 -36 -61 -21 36 -1 -6 55 88 25 25 19 6 17 18 37 -23 -63 -7 17 -63 -9 40 15
4545 15 -1 52 66 -8 -12 20 -19 -57 1 16 -35 -45 34 14 -30 -9 61 40 20 54 75 6 19 27 14 -65 -54 -5 -9 -42 -31 32
4577 32 -26 12 74 71 4 28 51 19 -33 27 47 -52 -66 -8 26 -38 -17 74 37 15 46 53 8 0 9 14 11 -13 50 -3 -80 -17 3
4610 3 -32 1 42 67 3 -16 49 13 -31 -21 36 -41 -42 -25 23 -62 -59 1 26 -20 41 89 -33 -40 8 14 -38 -42 16 -6 -29 -9 36
4643 36 -24 -45 56 75 -10 17 91 6 -60 -12 38 -53 -47 58 46 -69 -18 39 5 -20 59 88 9 -5 56 2 -48 -43 35 -12
4673 -12 -79 26 57 -42 -22 39 26 5 19 86 12 -25 51 11 -87 -54 40 13 -42 38 62 1 -30 69 46 9 -14 74 16 -69
4703 -69 -19 17 -80 -66 22 14 -39 -10 5 18 -22 55 78 0 23 40 5 -34 -7 -2 -23 -47 5 21 -11 -6 45 5 -45 28 53 9
4735 9 -12 30 -10 -60 -49 -11 -1 -8 21 47 34 16 3 16 22 -13 33 12 -16 -32 -10 -26 -77 -5 -5 16 14 37 38 41 29 42 11 -38
4769 -38 6 18 -1 -57 1 20 -15 -21 33 41 -8 25 46 -7 -13 33 38 -27 -33 18 -10 -68 3 35 -2 -21 55 30 -38 -10 59 8 -26
4802 -26 15 21 -47 -47 -8 -12 -47 -23 53 15 -26 24 55 6 11 17 24 -11 -16 -4 -29 -67 9 15 -50 -16 33 9 -7 35 48 35 -13 26
4836 26 28 -60 -32 -7 -38 -21 -4 -1 5 1 48 43 31 42 55 4 -11 7 -2 -50 -6 -3 -39 -36 13 15 10 21 31 20 4 9 37 0 29 -17
4872 -17 -17 -23 -27 -16 -37 -17 -4 7 -1 -15 17 25 -18 -12 -1 -2 -11 -12 -20 -7 -16 -12 0 24 33 23 2 26 36 5 2 11 -13 -27 -4 -11 -35 -43 -16
4911 -16 3 0 2 28 19 14 29 9 -22 8 -10 -38 -30 -45 -7 -20 -11 40 12 38 14 19 7 -15 19 0 -17 -9 -14 -26 -19 -32 23 -24 -11
4946 -11 7 21 20 27 -2 -25 -26 -5 -18 -12 7 -18 -3 -30 1 8 4 16 44 7 18 11 5 -13 -31 -11 -18 -45 -38 14 -33 25 19 25 20 22 50
4983 50 2 21 15 15 -15 -3 -3 5 -8 -8 9 0 8 4 41 26 12 40 7 -38 1 -3 -37 -25 -10 -29 -14 -20 10 -22 14 44 13 12 38 22
5019 22 -22 -12 -16 -14 -14 -22 -22 20 -41 19 13 28 0 30 27 19 26 -11 18 -20 8 -31 -5 -46 5 3 14 -8 15 36 12 -3 35 8 -12
5054 -12 2 2 -27 -36 1 10 -21 9 26 36 5 3 47 14 1 24 5 -52 -10 -17 -25 -29 8 2 2 -1 30 44 24 2 15 -3 -6 -28 -16 -13
5090 -13 -42 -18 -19 -44 13 13 19 -24 11 44 12 -15 22 15 -38 -10 15 -17 -50 -15 31 -5 -21 47 24 -19 21 63 3 -25 -12 23
5122 23 -44 -34 -26 -35 -49 -39 -10 29 -5 31 59 -36 -12 25 -23 -57 -29 13 -5 -53 6 28 -38 -29 30 27 -10 -8 18 27 -23 21 16 -37
5156 -37 -46 2 -19 -59 -7 43 -24 -40 54 45 -11 0 50 3 -51 -30 0 -54 -54 2 19 -57 -8 21 1 -9 48 53 1 -18 -2 -6 -30
5189 -30 -29 -9 -14 -37 5 -3 0 -21 37 26 10 -13 40 38 -15 -23 15 -18 -44 18 26 -50 -28 25 6 -14 6 44 13 -17 -10 8 -55 -27
5223 -27 -7 -18 -31 19 11 0 -10 23 44 11 -2 35 31 -24 0 3 -49 -37 6 23 -31 9 14 14 -37 24 59 -5 -22 38 16 -46 -35
5256 -35 -11 -6 -48 -11 -2 0 -10 8 24 -31 55 43 -15 6 1 4 -13 -53 -3 10 -55 -12 19 5 -1 2 42 1 -5 10 28 -44 -14 15
5290 15 -34 -21 4 36 -13 -11 18 5 14 -1 24 23 -1 18 23 -37 -15 4 -24 -14 -10 -3 -7 -24 41 46 6 17 33 29 -15 26 29 -11 -13 -4
5326 -4 -13 -29 11 8 14 -16 19 20 -11 -12 -1 -39 -26 -36 -36 -45 -24 16 0 -21 25 27 16 15 11 32 39 12 -6 -13 -23 -7 8 -41 -6 4 -24
5363 -24 17 38 14 12 -16 5 18 -25 7 -15 -31 -42 -19 -33 22 0 -14 4 21 11 -7 6 0 7 -17 -25 -5 -2 -41 16 -14 5 47
5396 47 19 21 34 9 16 30 10 14 9 -27 -36 -4 -15 -5 0 -13 -7 30 39 16 -3 9 7 9 -9 -12 -10 -21 2 -39 -16 -23 36 0 30 32 56
5433 56 1 21 22 8 -14 -13 -10 -10 -20 -21 12 13 -13 -25 3 12 -16 9 11 32 41 -12 -24 -51 -36 -14 -25 -9 -9 -28 0 27 17 -7 3
5468 3 33 28 4 -4 -21 -28 -5 -6 5 1 -27 33 9 4 16 10 3 11 11 -5 -21 -23 -10 -17 -28 -30 -8 -25 20 20 -23 1 3 17 7 -22 -1 -32
5506 -32 -30 -16 -16 -32 -45 -29 4 32 -11 -4 23 23 3 28 -21 -18 -7 -7 -31 -16 15 -3 32 -2 31 38 39 26 19 41 -15 19 29 -43 -30
5541 -30 7 -15 -21 -13 -6 3 8 20 40 11 20 10 16 4 -34 1 -5 -5 -3 25 -14 11 26 -12 19 10 26 10 -8 -29 -5 -29 -7 12 -35 -39
5577 -39 -6 -12 2 0 11 7 -10 -21 18 3 -26 -1 -14 -42 -43 10 -38 -32 -2 23 -1 2 41 36 0 -1 29 -9 -31 -21 -21 -39 -12 -9 49
5612 49 4 4 25 10 -10 2 31 -20 -7 11 -14 -62 -34 -8 -26 -33 -23 15 -3 3 49 -3 -15 -12 44 -5 3 -18 -24 -30 -28 13 -6 -27
5646 -27 -14 71 29 5 30 8 -3 0 26 -17 -38 -25 21 -26 -20 9 3 5 -13 19 16 -4 -20 6 -16 -23 7 10 -23 -14 -11 6 -9 -10 34
5681 34 30 6 17 52 16 -32 20 -19 -13 23 -10 2 -43 -3 -14 -7 -8 28 15 -29 3 17 -5 -52 -1 24 12 -55 -17 1 -49 -22
5713 -22 3 -8 -8 31 16 -11 -40 6 5 -54 -8 22 -7 -56 11 13 -26 0 28 28 13 13 30 18 -48 -8 -13 -38 -24 39 6 -52 -11
5746 -11 37 -6 -33 32 56 -26 -18 24 11 -46 -19 -10 -25 -10 9 23 -43 -32 60 24 7 29 49 -16 -46 -10 -13 -37 -35 23 -9 -23
5778 -23 3 11 -19 34 42 9 8 49 41 -3 -13 -1 10 -39 -21 23 -39 -42 -19 7 -34 -29 29 25 -4 3 37 -18 -32 -25 -10 -43 -27 25 13
5813 13 8 0 14 9 24 26 43 -9 -15 -6 3 -32 -9 -7 -30 -18 -2 36 4 -9 -11 42 8 -9 0 13 -30 -14 -2 -17 -33 -26 25 -17 5 15
5849 15 21 28 4 -12 -2 22 28 -1 -13 -26 -22 -10 -14 2 -16 1 4 15 19 10 24 -6 12 -42 -27 -3 -17 -20 -17 -7 -26 3 -2 13 -3 -12
5885 -12 20 12 -7 -3 6 -18 -18 2 4 -16 5 13 45 -13 26 52 -1 5 6 0 -2 -15 -17 -3 -6 -21 -3 -48 -40 30 27 -12 25 50 -19 29 12
5922 12 -15 -60 -32 -30 13 -13 0 12 1 12 36 -8 8 33 17 -14 -13 -10 0 -21 -20 -10 -8 -1 20 31 36 9 7 -11 -6 6 19 -22 1
5957 1 -11 -20 -28 -23 -7 20 -13 9 9 8 8 17 28 1 3 -17 -17 -13 9 11 -26 -12 28 26 43 31 31 11 22 5 -10 -15 -27 4 5 -43 -20 -18 33
5996 33 -6 18 15 9 -17 5 -5 5 -18 -39 -28 -23 -33 17 31 -19 -25 23 5 -8 11 -11 4 20 14 -10 -5 -29 -5 -8 -24 -2 -3 18
6030 18 29 45 20 26 2 13 -4 -9 -17 6 -38 -34 10 -18 -22 16 24 3 -16 2 22 0 -3 0 -37 -24 -15 3 -11 -37 -20 15 6 -29 30
6065 30 -1 3 41 49 9 1 -6 16 -50 -18 -3 -37 -33 12 25 -14 12 -4 -26 -15 19 28 -20 -16 14 -7 -25 -30 11 -2 -18 1 39 -2
6099 -2 -32 18 24 18 23 54 24 -57 11 -13 -22 -24 44 17 -15 11 25 25 -29 40 41 20 -5 23 -9 -28 -3 16 -45 -35 5 44 -17 -14 -2
6134 -2 -16 -9 -6 60 -25 -22 13 4 -43 -59 9 -33 -25 21 52 23 13 34 16 -10 -12 36 11 -51 -29 -14 -30 -44 8 17 21 31 15 14 -11
6169 -11 -8 50 -12 -26 22 7 -12 -32 -9 -18 -10 23 89 15 29 39 16 18 -25 31 13 -36 3 29 3 -41 -6 30 21 -28 46 42 -22
6202 -22 -7 34 -29 -33 23 6 -34 -26 7 -28 -45 -7 66 -7 -11 35 33 -50 -13 47 6 -26 25 13 -39 -19 11 8 -16 13 55 43 -29
6235 -29 41 54 -20 -58 8 22 -44 2 13 -10 -44 6 39 -9 25 42 9 -38 33 25 -32 -33 38 9 -61 -15 9 5 -14 25 47 26
6267 26 -8 12 46 -26 -4 21 -3 -45 -27 -8 -4 -19 6 18 -13 -4 29 37 -18 1 28 -14 2 12 34 -51 -52 -11 -13 -19 -7 18 6
6300 6 6 25 9 10 2 -9 12 -17 9 -29 7 -42 25 22 -20 9 10 26 -12 -2 4 32 -7 9 -7 -58 -6 18 19 -2 -8 5 15 -7 8
6335 8 32 9 -9 8 -4 -16 -27 -25 -19 -6 -1 9 -4 -2 32 6 12 -1 12 20 14 32 10 -7 -27 -2 22 9 18 17 -2 -10 41 54 -10 24
6371 24 20 -6 7 -30 15 -28 -18 17 -13 -13 10 29 18 -3 10 22 18 -39 6 7 -24 -5 22 23 -23 -8 -10 -8 -26 17 31 -7 11 20
6405 20 -13 -10 7 -10 -9 -9 0 -25 -9 -3 11 11 2 -7 17 0 16 17 -1 -29 -15 -18 -8 -16 10 5 1 -15 15 30 5 18 -25 -18 -28 -14 1
6442 1 -6 -5 -12 -22 25 7 23 -16 23 14 -14 6 26 10 -26 5 16 -19 -51 7 -8 3 -4 9 18 -6 24 1 5 11 2 -7 -15 -23 -27 -19 -11 -9 -2
6481 -2 24 21 14 25 18 21 -11 15 -13 6 -12 -5 -33 -24 -19 -29 5 -26 -2 19 -9 16 18 -43 12 -2 -11 -7 -23 -12 10 -12 -8 7 -5 -6 8
6518 8 -9 4 33 18 -10 -23 13 8 -17 -13 6 18 -20 -11 25 -3 4 20 4 -16 7 8 4 -12 -22 15 -12 -12 5 20 1 -8 -8 20 18 11
6554 11 35 -8 -21 13 27 9 -12 12 29 -5 -14 24 11 11 17 29 -22 -33 18 -16 -7 -9 19 -23 -33 -9 -10 11 -36 49 -19 -28 37 27
6588 27 -31 -20 2 -2 0 -5 -19 -3 -22 5 -11 -9 -8 10 3 12 16 39 15 -16 -17 -10 -32 -24 16 10 5 2 29 10 -9 1 10 -5 -8 3 -1 -26 -6
6627 -6 -3 5 -22 41 2 -21 -2 6 8 9 -2 26 -7 -39 -15 26 -52 -58 -13 9 8 -10 37 16 -36 34 47 -21 -5 6 2 -15 -30 -19 -6
6662 -6 -38 -43 21 -1 -22 13 16 -6 0 53 15 -31 30 5 -24 -30 11 4 -15 -3 52 -7 -12 3 35 2 -23 23 16 -21 -18 39 -25 -57 19
6697 19 -6 -24 -6 16 7 -35 -6 35 4 -12 14 31 -54 -22 4 8 -42 -6 40 22 -24 17 45 -36 -24 25 23 -15 8 6 0 -28 -22
6730 -22 -3 -9 -3 35 19 6 8 14 -16 -10 6 8 -27 -26 13 7 -38 4 29 -6 5 12 14 -10 16 -20 -29 -31 -7 -9 -18 -23 -40 14 -19 -34 15 17
6768 17 11 -1 23 0 -14 30 36 -9 -34 1 -5 -47 -10 10 20 9 45 25 -28 1 -8 11 -8 12 16 -5 -10 -14 2 -19 -29 10 11 -34
6802 -34 3 21 -14 -38 -14 12 -27 -25 7 3 -21 6 18 32 -1 26 37 36 10 11 24 -32 -18 20 -12 -23 -4 18 -28 -24 -7 -5 -22
6835 -22 4 -13 11 -28 5 44 -12 -16 24 -1 -32 -2 21 -21 -3 -1 -8 3 -9 41 13 -37 -12 25 -14 -24 1 9 10 -1 11 13 24
6868 24 -13 18 17 -6 15 -5 -38 13 -13 -24 -50 -15 -11 -23 -26 33 -37 -25 15 43 5 -19 -6 22 -1 -33 10 7 0 -1 40 -15 -19 4
6902 4 14 -18 3 16 -6 -16 -32 -7 -15 -24 4 6 -15 4 -1 10 11 1 8 -30 -42 -26 -37 -3 -36 -18 -23 -5 15 -9 18 6 1 14 9
6937 9 5 -13 11 -23 -22 7 -11 11 -21 -34 9 11 5 -20 6 -5 11 10 21 -3 -9 -10 -8 -18 -16 -10 -30 13 -26 -1 20 2 6 -10 8 -5
6973 -5 -9 -28 5 4 -7 -11 -2 -34 -23 27 -2 -9 8 28 7 -6 20 -17 8 -46 16 -3 -10 -43 1 -3 -14 29 27 -9 19 -5 -4 -23 -17 -19
7009 -19 3 6 -35 -5 -35 -17 20 25 -17 5 22 12 3 16 -23 -18 27 -1 -9 -22 -19 20 -6 -31 5 23 -34 -10 24 -8 -21 16 -9
7042 -9 -25 -5 -16 -25 -15 -7 -9 4 -2 15 21 23 -3 -16 -8 2 11 -4 15 1 -14 -4 -2 7 -10 0 -8 14 3 2 14 24 -30 -28 -29 -18 11 -32
7080 -32 -27 14 -5 31 5 6 -10 8 2 -6 -53 -8 2 -31 -8 0 -7 -12 3 -26 16 11 11 43 34 1 6 -31 16 22 9 -16 -12 -22 9 5 -8
7117 -8 11 -16 4 -27 -14 21 -12 -22 34 4 -65 17 -6 -8 -17 19 -1 -9 4 15 -7 -4 23 12 -42 -22 -22 -34 -28 6 15 0 -9 12 45
7152 45 -9 1 51 -12 -20 -6 23 -49 -28 17 19 -7 -6 43 6 -19 -15 32 -47 4 30 8 -31 4 -7 -10 -36 -9 39 -21 -24 33 42 -26
7186 -26 -24 41 4 -33 23 28 -36 -28 -4 14 -26 -11 29 2 -11 29 20 -24 -8 -3 8 -1 19 3 -12 -59 10 -5 -43 -3 22 7 -34
7219 -34 -6 -19 4 -1 39 46 7 -26 -4 1 -5 -1 26 2 14 7 -10 18 -26 16 18 -12 -7 27 -12 -25 -16 -12 -36 11 20 31 10 16 1 -13
7255 -13 -60 37 -2 -20 14 -2 -10 -8 5 -5 -19 -37 33 10 -23 -28 -5 -13 -31 11 15 -12 -17 -10 -1 -2 -24 20 17 -9 12 24 10 -25 9
7290 9 -25 -6 -19 24 28 -21 -13 4 -15 2 32 14 1 -13 15 35 -24 6 38 -27 -28 17 23 0 -32 14 24 -31 -16 26 -17 -9 4
7323 4 -13 -11 18 30 -23 -43 -3 7 -17 -23 -9 3 -21 -10 47 -14 -16 -10 -2 -1 -8 13 9 -25 4 24 13 -8 10 34 -9 -7 36 -20 -20 -9
7359 -9 4 -22 -23 -3 -18 -8 -12 4 28 -13 9 16 -3 -5 33 28 -39 -12 31 -5 -24 18 -3 -23 3 4 22 25 3 37 6 17 -8 11
7393 11 9 -16 20 21 24 -3 -1 -6 -3 8 -6 19 -9 -3 -10 -4 -8 -23 16 21 11 0 30 1 -14 7 24 -1 17 -26 -12 -19 -32 6 -8 -19
7429 -19 -18 -21 -12 6 5 8 -4 -3 19 -9 10 9 -2 11 -8 -25 -2 27 15 10 21 8 4 11 5 -6 1 -11 8 13 -12 -26 -33 -21 11 1 -2 -11
7467 -11 11 -1 19 21 -1 7 -19 22 -17 8 4 -8 15 33 -3 3 -13 11 5 4 21 -15 4 -15 -1 11 -28 -3 -13 -2 -14 14 3
7500 3 -7 -3 11 0 -21 7 -16 -20 -2 28 -16 -23 2 4 -5 -6 12 0 -4 2 23 -15 10 -7 27 -24 -18 -2 -18 -15 0 10 -12 -25 2 5
7536 5 -13 4 13 -3 0 0 -18 -22 -28 -2 -37 -10 -1 8 -13 -16 29 18 -15 -21 -2 -26 -18 -3 -3 -3 11 -6 2 1 7 6 -13 18 22 5 -8 -9 -4 -39
7576 -39 -16 17 12 3 12 13 -4 -4 10 27 9 4 -10 6 -5 -7 -18 10 -11 -16 19 1 -10 -45 12 7 -11 2 13 33 -8 -16 -11 -13 -9 8 14
7613 14 -11 25 -1 10 -35 -38 12 -4 7 4 19 -30 7 -11 -20 -20 2 10 -18 -25 25 -3 -34 6 -4 -13 -1 -24 21 -17 -4 13 -6 -18
7647 -18 3 26 -2 -6 5 30 -12 12 17 -5 -12 -17 -3 -6 19 -3 10 8 -19 -17 -16 3 2 -9 17 -4 -23 -12 -18 -15 3 10 -46 13 -8 -2 -9
7684 -9 34 30 -10 36 7 -8 -55 12 26 -24 -9 18 3 -4 -8 10 13 -16 17 23 -25 10 14 -14 -24 13 13 7 -17 -3 -41 -25 10 -3 4
7719 4 -14 3 8 4 -41 4 23 3 -14 16 -2 -26 -23 14 36 23 16 3 8 21 56 9 -23 -5 9 -10 -39 -8 9 -11 13 22 23 -13
7753 -13 -21 0 27 -14 4 3 -5 0 0 5 -23 -5 15 5 -4 -7 26 15 4 12 14 -2 14 25 -6 -30 -2 -8 11 -22 18 6 -22 20 20 21 -12
7790 -12 -25 29 -25 -12 3 -39 -48 8 20 -18 -2 7 -7 -17 -12 44 -7 22 -24 7 -14 0 -6 -8 -20 6 20 -9 14 26 29 12 -41
7823 -41 5 6 -13 -25 0 -30 -18 -5 -8 -10 -44 -5 2 10 -17 3 -7 -13 25 0 -11 -14 -10 7 -6 12 -8 -16 -20 24 45 -8 17 12 1 -16
7859 -16 -22 -12 6 3 -20 -24 -3 -6 10 -12 -12 26 13 33 14 3 -22 -7 -7 -22 -13 -29 -4 -20 20 -8 -6 3 -4 -62 -16 5 19 6 16
7894 16 12 7 -16 -6 26 6 19 16 22 28 27 13 1 -18 8 -15 8 0 -15 -11 0 -12 -8 -10 -11 19 23 -22 -15 11 4 8 14 -7 -7 5 0 7 -27 -2
7934 -2 -11 -1 2 7 15 -13 2 -2 14 -1 18 -11 20 6 5 -4 13 8 -11 4 2 23 19 -4 -35 32 0 -3 -10 -7 -21 -1 -24 -2 2 -6 -9 -12 11
7973 11 11 5 -6 8 7 4 -28 35 -17 -6 1 8 6 35 1 -29 4 6 8 16 -2 -19 -4 5 9 -21 22 27 -14 -1 0 7 2 8 14 7 17 -12 -25 -3
8013 -3 1 -4 -11 3 6 1 40 6 35 10 6 22 20 0 6 16 -2 -2 4 0 -10 10 26 10 25 -8 -12 -1 5 1 8 -6 -23 8 -13 -4 18 11 5 -2
8053 -2 -7 7 12 -11 -9 -22 -8 1 -5 -9 24 -30 4 23 -11 29 22 27 7 -19 -8 17 0 13 -5 -17 -19 0 -22 -16 -19 21 6 8 12 27 -28
8090 -28 12 14 21 -11 -8 1 -5 2 25 -18 -10 2 31 -7 13 11 5 -15 -7 28 1 -20 -1 13 -24 2 0 7 -6 5 19 -2 22 20 -12 -25 7
8127 7 -15 -2 -17 24 -26 -24 -9 21 -20 -2 -11 26 3 1 9 3 -14 -21 11 -13 5 -13 16 6 10 -4 19 5 -9 40 31 -6 -25 8 -5
8162 -5 -5 -13 13 0 -32 -17 3 -11 -13 9 8 3 -10 -4 -14 -6 -12 5 -19 6 -5 -10 1 16 17 26 31 20 16
8191A6
$$ Imaginary data points
##PAGE= N=2
##DATA TABLE= (X++(I..I)), XYDATA
0 0 0 0 0 0 0 0 0 0 0 0 0 0 0 0 0 -5 8 -8 8 -8 8 -13 16 -16 18 -24 24 -32 33 -40 47 -53 57 -65 73 -85 94
37 94 -105 117 -133 145 -160 181 -198 220 -243 268 -293 324 -356 394 -434 476 -528 584 -647 720
57 720 -805 902 -1020 1163 -1343 1570 -1878 2308 -2958 4053 -6212 12109 -62083 -173918
71 -173918 -3222 38598 -61674 -7813 122509 45207 -52594 16878 32605 -101555 -85187
82 -85187 77024 66374 -58831 -11232 75091 -5533 -74690 5327 36431 -36234 -23139 50548
94 50548 -12670 -108562 -37828 51775 -10007 -47019 40857 58980 -34101 -51488 -2963 -30821
106 -30821 -54714 39804 101829 29829 924 69096 45943 -56776 -51352 15220 1324 -19400
118 -19400 27259 34535 -25747 -25670 29090 8454 -44624 -8575 42659 8042 -31281 -10224 3956
131 3956 -11403 -2215 24051 14770 -9086 5075 23481 -4290 -26460 7914 42939 30267 9285
144 9285 12579 9894 -16902 -30674 -17822 -18485 -25765 2406 27234 617 -24106 -3451 10334
157 10334 -12546 -21378 5586 17939 2941 7313 20526 -726 -18754 3434 11300 -19734 -28040
170 -28040 3224 13817 -7571 -3065 27726 25125 4038 15492 19475 -16994 -29271 -23 -506
183 -506 -29962 -17451 20228 10867 -18007 -2292 13644 -14050 -18844 16457 14950 -10640 10456
196 10456 37815 10597 -17068 3126 12087 -20204 -26455 3624 687 -19002 4373 25897 869
209 869 -11450 12642 11930 -18784 -19088 5928 1381 -14975 3471 20430 295 -7821 11446 5355
223 5355 -19342 -12310 8751 2481 -8168 8336 20957 3516 -6029 6148 -1405 -22247 -14533
236 -14533 1053 -6553 -9698 9063 18752 7477 3851 13364 7423 -8867 -5632 2112 -7274 -9786
250 -9786 3386 5783 -2793 -1979 3886 -79 -8079 -5450 564 -3177 -4541 3588 4588 -1354 -187
265 -187 2282 -1436 -4445 -2113 2242 2867 2318 6520 8177 3120 1275 1655 -2599 -5703 -4840 -3913 -3605
282 -3605 -3645 -2379 -816 -3110 -4608 -2160 -1809 -1293 3644 7670 9952 12162 11751 9471 5337 -1084
298 -1084 -5410 -8415 -11555 -10226 -6330 -3293 1406 5114 6057 6439 4241 849 -563 -2855 -4149 -1740
314 -1740 -78 1294 3811 4011 3110 1981 -887 -2432 -3095 -4149 -2111 765 1605 3812 5187 3104
330 3104 1189 -1025 -4243 -6150 -7474 -7035 -4430 -3072 -552 3587 4065 4044 5925 4660 1882 1460
346 1460 1068 -350 -1837 -2170 -1155 -2584 -3995 -1178 -782 -3257 -163 3267 959 319 3035 2900
362 2900 -429 -1776 219 -880 -4195 -966 2941 -1030 -1500 4562 3320 -2370 -889 2508 -364
377 -364 -3406 288 3080 -1619 -2004 4449 1513 -5977 -1523 3606 -2200 -4642 2423 4975 162 1066
393 1066 6847 2671 -4857 67 3191 -7417 -10212 62 805 -5899 -1535 6495 3342 -927 5126
408 5126 6853 -2881 -2995 7136 2837 -7777 -2574 3989 -3311 -7633 -744 1577 -3272 44 7860
423 7860 3239 -3463 4558 9825 90 -3925 3215 2680 -5007 -6100 -3737 -6705 -8240 -942 3149
438 3149 -2627 -2129 6975 6281 -1578 -686 5087 5541 3412 3409 2595 -1873 -3674 -406 -1766 -6401 -2335
455 -2335 5313 4137 -2047 -3659 -289 1508 -770 -635 2262 754 -1827 -1442 -5050 -11643 -9031 1786
471 1786 5997 625 1344 10572 9232 -828 587 6206 1985 1580 9124 4219 -10204 -8738 2439
486 2439 -3397 -14547 -3461 9741 -209 -7824 971 -1669 -12357 -1620 13447 3870 -5255 9644
500 9644 15272 -6863 -15055 3225 5659 -6528 3590 15549 -385 -9636 7132 7841 -13818
513 -13818 -9446 16262 10808 -12357 -5078 7064 -10376 -17063 5370 7510 -10643 90 20209
526 20209 1735 -20758 -2187 14888 -3788 -9256 13918 11533 -11103 -2639 11713 -7508 -16568
539 -16568 11521 20844 -5575 -9992 11318 3766 -18800 -6869 10230 -3607 -7378 14102 10085
552 10085 -16602 -11730 10274 663 -16054 733 16364 -48 -8154 6997 3593 -12489 -353
565 -353 16620 1931 -11650 4091 11306 -8227 -12957 6400 9139 -2602 4550 12305 -3973
578 -3973 -13110 865 2755 -12410 -8981 9632 7932 -6590 -3682 4123 -3801 -6921 4903 6374
592 6374 -3084 940 10145 2349 -9177 -3486 6491 2382 -3097 2464 4142 -3082 -3461 1780 -906
607 -906 -4295 2438 8656 1994 -6691 -3386 1552 -3788 -6619 761 4097 -98 114 2805 -2035 -6977
623 -6977 -664 6998 2298 -2344 5467 8462 -1904 -5896 449 -55 -4854 -73 5604 -622 -5732
638 -5732 2210 5256 -5090 -5944 5653 4700 -5493 -3185 2586 -3887 -7903 1367 5134 -3514 -2708
653 -2708 7978 3710 -8036 -2166 7246 724 -3344 6051 7351 -3323 -3737 3990 -1575 -10477 -1759
668 -1759 7071 -1701 -5674 5044 5838 -4267 -1945 6495 1575 -4944 2474 6874 -3331 -5991 4679
683 4679 4324 -5251 -1188 7006 1016 -4604 2420 5342 -2168 -2021 6882 4795 -4187 -1011 4408 -3067
699 -3067 -7952 -704 1833 -3856 -2175 4932 3088 -2558 1101 5374 -566 -4061 1982 2658 -3716
714 -3716 -3023 1656 -1060 -5134 -1998 945 -2837 -4397 759 1875 -2490 -928 3559 1253 -1943
729 -1943 418 1513 -2186 -3548 -597 -168 -3085 -1751 2155 856 -1405 1226 2499 -219 -756 1448
745 1448 1352 -776 -483 1432 65 -2252 -718 442 -1641 -1467 1255 1723 926 1838 3225 2448 693
762 693 976 1465 -585 -1455 177 90 -985 81 1244 809 228 608 1076 152 -581 562 722 -510
780 -510 14 660 -347 -973 -752 -924 -1249 -1250 -434 454 328 735 1719 1163 386 496 -154 -886 -1016 -1109 -803
801 -803 -593 -602 127 516 83 412 655 206 231 341 288 363 -16 -58 157 -597 -894 -293 -451 -510 387 819 1002
824 1002 1328 1427 1375 772 99 154 -486 -1388 -852 -508 -981 -496 104 -80 15 345 413 167 -141 445 525 -559
846 -559 -444 73 -950 -1480 -875 -1274 -1779 -973 -19 -28 -231 749 1637 507 -117 837 93 -1404 -570 -225
866 -225 -1536 -1434 111 286 -786 -359 1240 841 -286 1010 1617 -26 290 1607 107 -1494 -409
883 -409 299 -1093 -1753 -190 642 -317 402 1893 772 124 1844 1642 -545 -562 691 198 -1142 -923
901 -923 132 -292 -421 884 625 -689 563 1749 455 -323 629 933 78 -699 -902 -1320 -1631 -728
919 -728 -409 -1388 -531 1231 770 127 579 449 525 1235 742 -480 -438 678 340 -1357 -991 581 84
938 84 -13 1349 280 -1138 970 2041 -591 -1437 1071 1341 -1513 -1889 -168 -1513 -2500 876 1704
955 1704 -1602 -201 3926 1710 -2177 157 2852 117 -1403 1678 1166 -3024 -1112 2555 -1508
970 -1508 -4310 1427 3721 -1718 -2592 2132 1068 -3282 -461 3090 -1475 -3297 2926 2453 -5136 -3450
986 -3450 3560 900 -3632 1352 4861 -545 -1939 3835 2032 -4505 -105 6045 -200 -5195 1085
1001 1085 2885 -4174 -3959 2760 1268 -3214 1700 5243 -2165 -4961 2690 2994 -4397 -2172 4595
1016 4595 1115 -3935 149 2481 -3028 -2690 4740 3612 -3134 60 5219 -536 -5226 356 3068
1031 3068 -1616 -1333 3344 385 -5120 -1634 2445 -2395 -3991 3119 4680 -1250 -1612 2035 -291
1046 -291 -3291 328 3097 -625 -1743 2535 1554 -3943 -2545 2573 1875 -142 2269 3329 -102 -1982
1062 -1982 -119 -443 -2862 -815 3076 1333 -2093 -966 549 -1223 -2033 656 2575 1309 779 1944
1078 1944 170 -3035 -1474 1708 555 -1037 1115 2368 -647 -2832 -817 504 -972 478 3661
1093 3661 1692 -1804 -342 880 -2328 -3567 392 2339 -751 -1456 1317 -142 -3394 -506 2959
1108 2959 313 -798 3122 3035 -2376 -3090 1005 173 -3183 18 3479 -514 -2723 1503 1341 -3284
1124 -3284 -1317 3967 2028 -2097 733 3075 -1933 -3842 1160 1413 -2972 -518 3819 98 -3551
1139 -3551 599 3014 -1364 -1845 3344 2807 -2332 -776 2629 -1411 -4062 754 2472 -2042 -1876 2746
1155 2746 1515 -2922 -572 3247 102 -2006 2331 2931 -2045 -1770 2070 11 -3437 -608 2419
1170 2419 -706 -2355 1464 2004 -1893 -931 2716 746 -1985 602 2080 -1307 -2589 438 740 -2145
1186 -2145 -1050 2204 711 -1408 1050 2268 -502 -1012 1552 1285 -1256 -707 1378 -141 -2201 -266
1202 -266 1023 -1190 -1395 1081 815 -1188 -328 1429 319 -1107 516 1584 -441 -1084 751 210
1218 210 -1669 -715 839 -30 -683 766 1580 238 -264 1206 916 -861 -405 545 -676 -1566 -501
1235 -501 12 -820 -828 537 800 -335 43 1169 293 -722 261 616 -410 -457 467 421 -537 -331 642 110
1255 110 -708 242 780 -230 -268 631 397 -280 -98 404 -91 -916 -481 -88 -876 -946 91 190 -228 323
1275 323 860 635 218 368 620 -51 -580 -9 -38 -696 -344 330 74 -68 357 659 279 -138 207 208 -590
1296 -590 -542 61 -387 -702 -112 83 -310 -296 160 238 -140 25 622 317 -37 567 591 -66 13 272 -120 -457
1318 -457 -306 -42 -203 -317 266 438 -49 268 711 105 -213 123 -61 -535 -484 -196 -242 -490 -16 413 -15
1339 -15 64 799 526 -73 370 468 -179 -339 -10 -235 -656 -441 100 -300 -648 190 467 -278 -12 600 58
1360 58 -305 184 200 -471 -517 133 -75 -836 -362 340 -268 -398 497 354 -195 358 713 18 -396 122 266
1381 266 -622 -739 110 -153 -648 176 463 -213 99 907 497 -122 294 690 88 -402 167 43 -734 -266
1401 -266 241 -575 -618 496 553 -148 274 907 418 15 494 376 -716 -458 366 -528 -1180 96 571 -300
1421 -300 -5 878 327 -354 401 693 -656 -718 781 340 -1228 -387 583 -692 -1025 397 264 -881
1439 -881 7 1436 194 -965 796 1569 -405 -564 1149 227 -1477 -242 617 -1075 -1108 1302 1437
1456 1437 -758 -71 1902 324 -1392 505 1178 -1042 -836 1161 -131 -2245 -553 1249 -550 -1268
1472 -1268 1445 1879 -728 -297 1511 -291 -1730 631 1472 -1036 -1211 1094 318 -2213 -1009 1190
1488 1190 -266 -1109 1163 1141 -1427 -869 1222 44 -1508 369 1715 -495 -1691 -85 -282 -2023
1504 -2023 -636 1560 511 -243 1498 1634 -730 -1234 463 392 -958 -100 1047 -335 -1264 80 279
1521 279 -843 18 1676 1200 -140 111 656 -285 -792 398 883 112 267 613 -364 -1260 -718 270 358
1540 358 208 880 1315 402 -400 -145 -156 -396 -59 605 390 -475 -610 -11 -451 -1101 -17 1114 530 54
1560 54 585 362 -824 -800 280 10 -908 -39 805 -624 -1394 132 651 -440 77 1498 755 -761
1578 -761 -89 621 -951 -1445 686 990 -899 -467 1098 -153 -1585 -57 1055 -390 -505 1538 1197
1595 1197 -1099 -392 1280 -385 -1691 261 1012 -985 -990 1022 489 -1310 50 1779 43 -1088
1611 -1088 922 1110 -1260 -981 1002 179 -1303 163 1384 -455 -1257 715 875 -1122 -346 1644
1627 1644 526 -893 442 1043 -906 -1438 282 199 -1387 -505 1263 153 -942 630 1234 -461
1643 -461 -514 1004 570 -889 -213 910 -209 -1078 333 838 -687 -618 817 271 -856 -23 931 4
1661 4 -562 521 697 -740 -789 286 -250 -1186 -273 622 -125 -429 590 706 -310 -255 684 341 -519 169
1681 169 738 -216 -665 124 170 -605 -423 455 290 -358 194 779 7 -412 352 294 -583 -477 165 -110 -572
1702 -572 -9 692 244 6 767 816 -61 10 554 146 -355 138 505 -22 -399 32 12 -775 -667 37 -131
1723 -131 -414 227 617 131 -88 279 294 -356 -414 63 -214 -686 -202 237 -75 -79 411 470 -14 -62 253 0
1745 0 -540 -266 42 -381 -556 -116 -158 -573 -403 -14 36 -137 235 641 289 31 345 216 -306 -224 33 -205
1767 -205 -408 -165 75 -106 -216 246 368 44 207 554 308 93 314 325 -6 -183 -40 -116 -531 -406 4
1788 4 -128 -139 336 471 241 290 367 125 -135 -105 -29 -240 -325 -24 28 -195 -19 210 -6 -34 173 162 72 83
1812 83 221 146 -135 -60 -57 -384 -451 -231 -327 -348 -2 152 97 189 375 313 119 109 189 -64 -206 30 -11 -257 -84
1837 -84 45 -134 -172 76 82 -51 43 282 178 -73 110 190 -261 -301 -42 -212 -351 -65 125 -17 32 339 290
1860 290 16 115 337 -34 -237 97 42 -247 -97 124 -83 -226 51 149 -154 -110 278 111 -210 82 204
1881 204 -227 -241 65 -158 -352 -71 196 -34 -90 319 359 -51 99 404 20 -243 146 54 -402 -271 65
1902 65 -157 -431 -59 256 -148 -122 415 282 -77 319 526 -70 -229 152 67 -464 -260 171 -131 -361 197
1923 197 330 -279 -113 400 43 -397 71 298 -279 -381 151 72 -428 -68 444 -33 -271 409 413 -224 -8
1944 -8 529 186 -267 124 248 -420 -590 67 -106 -654 -128 425 -76 -264 381 399 -131 67 582 231 -269
1965 -269 129 306 -428 -484 154 19 -379 -15 370 -78 -276 150 170 -282 -135 391 62 -336 44 197 -263
1986 -263 -220 248 181 -64 166 371 61 -189 120 190 -134 -89 166 -151 -378 -223 -165 -316 -158 147 241 82
2008 82 154 272 73 -10 111 104 5 63 -8 -170 -190 -215 -202 -91 34 111 135 175 157 -18 -51 122 -1 -177 -27
2033 -27 19 -270 -238 21 -74 -158 125 409 123 -27 295 261 -163 -35 344 -6 -259 20 20 -487 -480 42 5 -298
2057 -298 105 578 116 -132 332 265 -304 -134 329 -48 -424 -54 218 -312 -403 290 293 -247 100 561 69
2078 69 -242 257 403 -196 -225 282 24 -626 -306 143 -361 -461 286 393 -147 68 528 172 -259 127 381
2099 381 -161 -324 284 183 -453 -137 248 -150 -400 76 252 -149 -160 371 256 -223 -2 314 -152 -389
2119 -389 58 118 -296 -146 219 90 -213 56 305 -32 -252 105 97 -323 -241 117 -25 -210 58 253 -53
2140 -53 -240 68 149 -192 46 419 254 -6 104 129 -217 -293 -24 49 -143 -16 270 100 -169 24 126 -64
2162 -64 -74 162 205 -27 -55 202 49 -56 147 344 81 -50 169 56 -169 -83 154 131 -99 -33 -17 -329 -498
2185 -498 -205 -123 -138 88 361 281 83 148 235 18 -69 148 217 -83 -94 79 -92 -272 -160 -23 -89 -166 5
2208 5 100 -95 -42 178 143 -55 91 98 -180 -309 -205 -126 -143 -28 278 255 24 145 200 -37 -108 86 111 -35
2232 -35 -34 98 -26 -240 -136 6 -132 -172 93 111 -10 154 268 207 78 102 142 -124 -259 -64 -94 -241 -29
2255 -29 172 55 -3 93 93 -66 -54 66 88 -45 63 147 -43 -164 -23 -88 -209 -106 27 6 7 106 203 139 80
2280 80 183 11 -145 -58 -81 -141 -81 44 33 13 32 76 15 -44 33 55 -22 49 145 7 -56 7 -83 -201 -145 -47 -11
2307 -11 -34 92 201 86 92 177 33 -110 -75 -102 -202 -131 -12 0 0 46 182 59 7 131 123 12 147 224 49
2332 49 -9 96 -23 -186 -184 -76 -141 -194 10 122 22 87 268 94 -37 64 71 -115 -97 33 13 -65 -9 140
2356 140 -65 -140 50 36 -124 -14 155 53 -28 56 64 -134 -223 -83 -147 -294 -61 100 -69 -4 241 136 -30
2379 -30 54 113 -70 -169 9 20 -194 -115 63 -101 -260 -52 -9 -190 -78 155 112 -2 162 283 45 -34 154
2402 154 30 -203 -14 134 -29 -18 178 153 -67 19 151 13 -164 42 114 -98 -34 213 76 -111 52 127
2424 127 -67 -120 140 122 -79 57 208 -6 -145 30 -9 -199 -134 67 -35 -123 72 163 -2 -57 145 58 -194
2447 -194 -53 90 -134 -156 83 112 -88 -9 136 -27 -139 52 120 -32 -3 194 27 -124 -23 -14 -183 -207 -32
2470 -32 -19 -73 40 178 72 11 169 142 -21 19 94 -39 -85 -44 -22 -99 -62 43 -31 -84 40 85 -17 76 184
2495 184 111 51 144 64 -127 -162 -106 -159 -191 -37 93 -37 19 150 43 -62 114 158 -21 6 108 -1 -146 -123
2519 -123 -7 -166 -243 38 39 -129 -3 194 66 20 229 283 34 -17 142 -23 -239 -97 70 -97 -117 170
2541 170 117 -150 -49 125 -20 -119 73 200 -61 -109 123 -29 -243 -93 122 -73 -138 125 210 -49 17 223
2563 223 97 -123 62 159 -126 -157 95 10 -232 -67 89 -8 -126 96 174 -55 -83 172 78 -108 82 158 -29
2586 -29 -118 30 -31 -194 -146 83 43 -39 91 174 -50 -107 5 -50 -138 -62 80 41 -81 6 59 -80 -77 129 132 33
2612 33 75 130 -9 -59 -23 37 -62 -75 68 1 -156 -58 39 -6 36 158 194 100 -6 7 11 -138 -83 25 -14 -74 3
2639 3 0 -98 -108 -30 53 30 68 146 84 -70 -18 -1 -76 -66 8 44 -22 -52 25 15 -47 64 181 79 25 80 31 -126 -94
2668 -94 -35 -6 -85 -20 52 -75 -157 -14 37 -47 47 137 82 -26 -27 37 -54 -135 11 80 -52 -46 77 -21 -64 39 95 40
2696 40 24 85 88 -53 -83 68 -8 -122 -3 49 -29 -52 24 16 -42 69 127 84 -20 41 54 -106 -104 3 -7 -84 -24 29
2724 29 9 -58 15 76 -17 -32 119 41 -100 0 36 -102 -96 16 62 -17 -12 114 58 -5 77 88 21 -18 61 -24 -85 -82 -21
2753 -21 -79 -106 -9 6 -44 -10 83 32 1 106 61 2 29 4 -37 -120 -49 -37 -101 -56 43 33 7 64 110 59 40 107 50 -20
2783 -20 8 -29 -42 -90 -39 2 -80 3 57 33 30 112 94 30 82 58 13 -53 -24 -9 -125 -106 -3 -35 -72 47 103 -12 39
2812 39 150 81 5 57 89 -30 -75 28 -26 -140 -60 -2 -108 -39 80 73 0 35 120 49 -90 81 56 -132 -96 42
2838 42 -54 -158 3 50 -44 -53 81 53 -64 27 129 -18 -74 60 55 -165 -32 50 -36 -111 30 83 -29 6 154
2863 154 90 -24 72 124 -61 -61 64 37 -80 -4 54 -49 -85 71 92 -68 3 166 22 -61 55 62 -81 -57 53
2888 53 -44 -144 -26 92 -12 -75 148 77 -80 59 160 -56 -68 51 25 -111 -57 102 0 -122 69 140 -62
2911 -62 -5 152 73 -34 79 78 -45 -81 45 -20 -145 -55 77 -51 -68 118 119 -40 16 109 -11 -88 27 73 -108
2936 -108 -102 58 -4 -152 -14 105 -61 -25 144 105 2 54 103 4 -102 38 41 -131 -67 83 -31 -122 32 73
2960 73 -29 15 136 47 -43 42 74 -64 -94 62 6 -148 -28 68 -61 -94 47 66 -25 18 137 44 -50 61 87
2985 87 -129 -79 78 -19 -110 49 80 -59 -14 95 74 -5 28 121 -29 -95 36 -3 -132 -37 14 -55 -121 -9 41 -43
3011 -43 -23 113 63 -49 88 122 -66 -80 54 -32 -129 -21 65 3 -70 69 87 -22 29 131 39 -24 90 78 -50
3036 -50 -72 -35 -17 -102 -4 100 -4 -16 110 71 -1 36 93 32 -7 13 7 -106 -87 12 -27 -79 -2 89 11 -15 101 58
3064 58 -25 14 62 13 -31 -4 9 -96 -113 11 -11 -67 72 76 22 30 43 30 -10 12 15 8 -75 9 -54 -126 -53 -4 -8 -17 62 69
3096 69 28 10 -4 7 -40 22 70 -31 -25 -49 -41 -86 -7 45 60 49 92 117 47 -26 32 33 -26 37 15 -49 -52 -39 -73 -69 8 23
3128 23 39 74 41 9 -28 -38 -47 -48 -20 23 -23 -81 -68 -114 -63 -36 44 85 63 55 59 -19 -50 1 8 17 38 12 -15 -63 -50 -25 13
3161 13 27 92 130 69 63 0 -31 -12 20 18 28 -10 -23 -7 -63 -44 51 53 85 121 93 18 -23 -48 -68 -48 0 26 11 -30 -29 -46
3193 -46 -55 58 84 53 110 107 -20 -40 -32 -41 -26 -54 36 2 -45 -77 -29 -27 -32 82 22 19 41 -16 -56 -68 -33 -59 -75 -41 26 -29
3225 -29 -48 0 1 -27 44 106 52 20 24 24 -68 -52 5 28 -69 20 49 -38 -35 40 64 47 59 92 61 -9 26 43 -52 -58 51 -7
3257 -7 -86 24 -3 -24 -27 43 32 4 18 82 -13 -48 19 -3 -80 -44 16 2 -76 14 33 -2 8 128 86 -15 46 68 -44
3286 -44 -35 12 -8 -94 -48 4 -54 -26 28 43 -37 -9 70 22 -87 25 49 -71 -73 4 -46 -134 -57 34 -24 -26 78 53 3 8
3316 8 79 -17 -10 61 -7 -58 -55 4 -33 -62 1 74 -16 22 84 36 2 45 86 -27 -39 -2 -19 -102 -63 21 -39 -101 74 42 -36
3347 -36 24 63 21 -26 28 37 -62 -46 13 -20 -113 -3 56 -33 -31 114 68 -11 48 88 2 -44 47 36 -108 -52 74 -59 -96
3376 -96 50 51 -30 8 82 27 -69 21 70 -32 -81 40 18 -111 -22 17 -76 -61 68 52 -17 26 106 42 -41 53 68 -55
3404 -55 -39 80 -35 -75 12 31 -9 1 70 104 -13 32 133 -14 -68 44 31 -117 -45 59 -32 -75 4 45 -38 -34 57
3431 57 62 -47 4 97 -34 -38 40 -22 -69 -25 29 -23 -53 37 68 -39 -23 122 46 -28 56 55 -56 -43 39 3 -59 -61 37 4
3461 4 -61 24 57 -52 41 73 -19 -38 19 -2 -44 -76 -11 -32 -54 -38 63 -25 -42 91 34 -20 19 63 -1 -18 15 43 -53
3490 -53 -42 35 -6 -46 41 65 1 10 82 49 11 49 19 -29 -81 -5 -26 -83 -33 10 -56 9 39 -2 -9 40 25 -15 4 12 3 -48
3522 -48 -26 17 -46 -59 14 19 -27 31 58 65 2 37 59 -3 13 36 -13 -79 -37 4 -43 -7 43 9 -65 25 67 -14 -31 61 55 -44
3554 -44 -48 19 -61 -72 -36 23 0 -31 56 65 -4 16 76 5 -44 63 34 -62 -21 2 0 -38 19 87 19 -26 84 45 -27 8 76
3585 76 30 -13 5 -11 -104 -111 9 14 -35 8 103 14 -54 3 30 -76 -2 97 56 -36 -9 -7 -83 -114 32 88 -12 35 73 4
3615 4 -63 30 42 9 0 60 65 -63 -74 5 -36 -67 84 94 3 -1 -2 -4 -59 -22 68 5 -32 12 28 -88 -88 -13 -21 -5 39 81 33
3648 33 -34 34 37 -8 2 82 41 -29 -17 -35 -72 -43 -19 46 35 7 63 49 -26 -28 47 5 15 5 10 -19 -68 -53 2 -47 -16 62
3680 62 14 -15 38 44 12 -46 9 56 -43 -70 -4 -17 -59 -10 43 20 4 39 61 10 -29 61 45 -50 -3 58 -69 -83 3 23
3710 23 -55 -23 41 23 -42 -6 96 20 -83 38 10 -100 -92 17 -36 -103 -9 51 -20 -28 48 63 -18 -2 115 28 -41 72
3738 72 60 -44 -35 42 18 -29 12 64 3 -45 56 40 -37 6 83 15 -71 -4 18 -74 -84 37 0 -61 -3 15 -48 -48 42 46
3768 46 -25 -23 38 -3 -53 -24 -2 -58 -28 43 -4 -8 34 51 13 19 97 25 10 35 37 3 -49 -7 10 -30 10 71 8 -7 20 30
3800 30 4 -5 43 6 -22 4 11 -64 -14 33 -18 -5 38 59 31 37 60 54 -21 43 47 -37 -40 25 -14 -61 36 32 -20 -4 39 20 -11 -10
3834 -10 66 -5 -49 18 3 -92 -46 -1 -35 -96 -13 10 -44 -60 20 8 -78 17 41 -55 -55 -5 -2 -102 -14 1 13 -18 22 72 -10
3865 -10 13 76 29 -34 39 57 -29 -49 4 -17 -89 -12 52 -15 -34 69 70 -52 11 105 19 -33 40 17 -79 -78 3 15 -74 -3
3895 -3 72 9 -17 71 47 -43 71 60 2 -2 40 23 -29 -28 61 11 -52 41 87 -10 15 72 24 -26 -5 17 -34 -93 -29 12 -63
3926 -63 -40 19 -23 -52 15 41 -25 32 63 8 -12 5 49 -11 -42 -10 2 -74 17 62 8 -2 38 49 43 19 35 6 -39 -11 12
3957 12 -9 -11 15 -4 -37 -20 4 13 13 3 23 9 31 39 -29 -36 -9 -12 -46 -16 -11 -27 7 17 20 2 36 68 14 -12 43 20 -46 -17
3991 -17 27 -14 5 7 13 -10 -1 46 12 -15 32 44 -41 -32 15 -42 -63 -17 -2 -20 -25 45 22 -6 -8 79 48 -41 48 41 -63 -16 18
4024 18 6 -56 12 46 -50 -60 16 52 -29 5 122 23 -53 5 47 -30 -35 54 8 -39 -26 68 6 -32 45 70 -28 -35 55 -6 -98
4055 -98 -35 24 -31 -67 39 24 -52 -6 50 -1 -15 80 105 39 9 81 36 -67 -40 77 0 -59 29 58 -27 -39 38 36 -52
4084 -52 -7 83 42 -47 21 25 -74 -48 54 4 -25 -19 21 -15 -47 37 44 -38 -42 41 2 -90 -44 -7 -46 -40 9 68 -8 -2 60 45 -21
4117 -21 33 101 7 -24 20 31 -38 -47 7 27 -32 -24 54 -10 -69 30 57 -35 -47 49 17 -46 -63 40 -29 -89 5 46 -10 -21 75
4148 75 32 -28 7 62 29 -39 31 69 -47 -67 31 -10 -55 -14 78 47 -6 49 84 -19 -39 68 27 -38 -21 33 -44 -118 -7
4177 -7 42 -48 -16 55 54 -48 8 89 -13 -66 55 49 -58 -88 24 6 -88 -29 88 2 -22 109 79 -20 13 105 33 -56
4205 -56 17 70 -19 -83 5 18 -116 -57 38 7 -66 44 81 -25 -71 52 56 -86 -10 51 -19 -89 -17 27 -60 -4 62 27
4233 27 -32 7 65 -31 -70 46 74 -38 -18 46 -31 -61 5 65 -3 12 48 53 -15 10 49 -1 -53 21 -28 -40 -17 9 -3 -54
4263 -54 -46 12 -4 5 27 9 -7 -1 18 -2 9 10 28 -2 28 16 6 5 41 -32 15 21 20 -7 18 -48 -42 -5 2 -7 -9 9 -21 3 -4 47
4299 47 18 1 22 57 -24 -41 -6 -51 -87 -5 18 -41 -56 17 13 -12 -6 91 24 -16 56 88 -23 -16 42 -9 -45 -22 64 -14 -30
4330 -30 28 50 -17 -11 70 33 -25 18 50 -43 -51 -4 0 -63 -27 33 -9 -38 32 38 -28 -7 63 17 -34 -4 57 -62 -43 19 -5 -32
4362 -32 12 56 -18 -3 48 63 -15 -15 45 17 -51 -6 8 -37 -46 26 -4 -44 30 37 5 -28 50 36 -33 -31 24 -41 -54 5 -13 -40
4394 -40 -18 30 -12 -25 5 33 36 1 64 4 -13 22 18 -56 -28 32 -13 1 21 29 4 9 21 43 -3 7 24 -7 -56 -18 -27 -58 -45
4427 -45 -19 -18 -14 0 24 31 10 87 41 -9 11 29 -34 -50 -45 -38 -32 0 20 5 4 44 48 28 68 78 16 18 18 -6 -28 -32 -42 -24 -57 -38
4463 -38 12 -27 15 8 21 -6 1 19 1 -39 -11 -33 -41 -41 -22 -32 -53 13 29 10 50 59 5 28 35 27 4 -27 27 -7 -66 -41 -10 -37
4497 -37 -31 46 22 -9 27 41 33 -5 22 29 -15 -62 -5 -10 -57 -19 34 -22 -26 33 41 12 21 67 20 -19 -3 35 -43 -46 33 33 -17 10 80
4532 80 -3 -26 44 64 23 -35 50 12 -47 3 39 -24 -49 -16 23 -40 -11 29 34 -2 21 22 -44 -38 -25 -6 -46 -49 32 1 -54 -23
4564 -23 33 6 -1 49 25 -12 -4 22 18 -22 3 4 6 -22 13 35 -51 1 62 56 30 47 53 16 -33 -25 -33 -45 -50 20 -7 -43 -26 17 -5
4599 -5 -39 36 44 7 -5 37 -2 -61 -31 11 -19 -66 30 31 -24 -41 30 41 -7 29 115 30 -71 16 11 -58 -78 4 6 -28 -1 10
4631 10 -14 -57 38 53 13 32 57 45 -32 -33 2 -25 -81 -3 25 -41 -28 53 35 -34 35 93 25 -6 49 33 -58 -55 37 21 -44
4662 -44 41 61 16 -2 54 53 -10 -12 85 -6 -34 20 21 -83 -103 5 17 -52 22 36 17 -55 25 56 -50 -18 63 23 -45 3
4692 3 47 -34 -41 13 38 -34 18 85 26 -62 14 82 -2 -11 68 44 -56 -52 -1 -5 -72 6 60 9 -25 78 51 -28 14 17 -13 -46
4724 -46 12 23 -38 -61 -9 -2 -14 -1 74 20 24 61 39 9 10 36 36 -24 -29 25 -34 -44 -7 16 2 22 65 53 5 -3 24 -8 -16 -12
4758 -12 15 -34 -39 -29 -26 1 -48 34 39 23 3 33 9 -31 1 -2 -22 -41 16 -20 -66 -65 32 -10 -21 47 85 34 30 60 24 -24 5
4791 5 33 -2 -43 -19 14 -75 3 40 5 -1 30 51 15 -32 34 3 -25 -27 5 -38 -73 -12 21 -40 -12 40 30 15 42 63 30 -10
4823 -10 14 27 -40 -10 -3 -38 -39 -6 13 35 -17 10 61 -16 20 59 -13 -42 -23 -34 -40 -44 -26 -7 -9 26 17 16 -2 10 46 -34 12 -1
4857 -1 -24 -20 10 -11 -35 -8 4 50 -6 5 50 36 24 43 12 -19 13 -9 -14 -47 -10 -17 -14 -25 19 13 33 18 -4 4 17 28 -10 11
4891 11 -38 -15 -18 -44 -23 4 6 -11 21 3 26 39 16 28 8 6 6 11 -12 -8 -44 -29 23 -1 -27 18 32 27 30 10 24 26 1 -13 -35
4926 -35 -34 14 -12 -22 -28 -19 -1 0 39 25 29 30 43 34 -1 0 -13 -31 -51 18 -7 -21 22 35 41 29 65 52 38 35 31 2 3 -19 -33 -57
4962 -57 -21 -5 -14 -9 25 -4 -2 13 47 8 8 -17 11 -31 -13 -30 -34 -16 -2 3 -4 26 29 62 10 11 28 12 -8 -9 20 -49 -22 29 -8
4997 -8 12 20 26 42 17 35 35 -4 -5 3 2 -36 -44 -35 -30 -20 -12 5 -11 -9 16 18 -7 1 5 18 3 2 -2 -16 -48 4 10 -28 13 22 17 12 42 42 -1
5038 -1 9 37 5 2 2 -17 -33 -40 0 -9 -22 5 40 26 14 11 30 -23 -10 4 9 -30 -48 -13 -39 -44 4 26 -5 10 50 47 3 -10 33
5073 33 13 -14 4 -3 -25 -22 -3 -3 -18 -22 52 -7 9 27 46 26 -23 -16 -3 -23 -48 24 -25 -34 -24 18 -38 -33 31 31 -9 -18 0 15 17
5108 17 -15 46 -25 -33 18 3 -39 -8 39 5 -15 44 72 -4 14 25 12 -40 -33 8 -7 -22 -18 20 -14 -20 33 22 -10 15 45 -11
5140 -11 -58 -5 0 -39 -49 15 -12 -40 -19 14 2 5 33 75 -1 -15 26 17 -34 -10 14 -19 -29 5 20 4 -6 56 40 0 30 35
5172 35 6 -61 -17 6 -31 -47 -31 -28 -39 -12 12 -17 -7 26 26 23 4 30 11 -17 -7 -11 -17 -46 19 16 21 19 52 33 -18 3 52 20
5206 20 -3 24 14 -72 -25 -23 -37 -45 -14 38 8 -21 -7 32 18 -32 57 26 -15 -20 14 -17 -27 -3 18 -12 -16 45 45 -7 35 46 3
5239 3 9 33 69 -32 -41 12 -7 -28 -9 29 18 -5 31 27 2 10 34 35 -33 -6 12 -18 -39 -16 -25 -37 1 19 29 -23 10 47 -13
5272 -13 -12 17 16 -26 -25 30 -24 -31 -1 43 -19 34 74 27 48 47 40 12 -4 35 13 -19 -51 11 12 -42 -32 20 2 -43 7 33 -32 14
5306 14 45 -20 -13 9 -11 -33 -32 -16 20 -9 6 57 40 38 38 29 12 3 25 1 -24 -2 -11 -6 -26 19 1 -2 39 10 5 17 40 11 14 -17
5342 -17 14 -14 -54 -23 -25 -34 -6 -2 17 14 24 12 23 26 5 34 9 3 -5 -40 -23 5 5 33 -21 13 8 21 30 30 17 13 -19 -14 7 -23 -10
5379 -10 -24 -37 -10 -15 -21 -5 -6 17 14 12 6 -5 -5 -38 -28 -26 -34 -28 -8 14 27 2 3 23 36 7 33 -11 1 -14 -8 -16 -19 -10 0 -18 11 22
5417 22 16 23 34 33 13 25 17 11 -40 -17 -10 -21 -15 -45 -27 0 16 9 13 3 20 14 6 -13 -1 24 -14 -14 -20 -5 2 4 -2 21 -13 20 48 20
5455 20 18 7 14 -9 -9 14 9 -25 -21 -32 -18 20 36 9 -19 17 17 38 -2 -19 -11 -18 -44 -48 -23 -18 -20 -13 -6 -37 19 11 25 28 25 -2 1 -21 -4
5494 -4 -19 -19 -11 -30 18 19 4 10 7 14 41 -20 4 16 -20 -27 -34 -32 -30 -4 -19 -2 10 -24 10 12 14 27 32 -5 15 10 -6 -24 -8 -9 -15 -15 24
5533 24 25 40 18 30 26 22 14 22 -22 -36 -16 12 -26 -25 15 -16 4 -14 24 38 8 -5 28 27 -30 -3 -15 -53 -44 -13 3 -23 -11 8
5567 8 23 -20 34 40 29 28 37 23 -31 26 41 -14 -16 22 -1 -8 25 23 -4 1 16 12 10 -1 8 5 -45 -39 2 -15 -19 -32 -3 8 -37 22 20 18
5605 18 16 10 -20 -16 34 -7 -21 -39 2 7 -33 3 35 16 0 33 45 -12 3 5 10 -16 -18 5 -32 -13 18 6 -17 8 47 5 6 15 36
5640 36 -33 -18 7 8 -20 -24 -2 -21 -56 9 9 -28 31 35 21 7 -4 34 17 -10 31 18 8 -1 14 6 -5 8 24 9 5 36 28 -29
5674 -29 -4 13 -18 -8 -1 4 -52 -37 20 7 -11 9 17 39 1 -7 43 -12 -24 -1 34 -21 -5 22 -12 -5 3 34 21 17 31 58 24 12
5708 12 34 -2 -41 -26 36 5 -1 -3 4 -3 -18 29 46 10 3 28 -11 -37 -10 8 -39 -33 26 38 -12 -22 22 -10 -34 29 58 5 -21
5741 -21 37 -14 -44 -14 -5 -32 -38 12 26 -23 -14 21 -18 -45 18 48 4 -33 -6 3 -63 -33 27 11 -13 16 23 -29 -23 8 42 -5 38
5774 38 43 6 -2 -28 19 -63 -7 34 25 -40 4 26 8 10 46 39 11 -14 10 -1 -34 8 5 -16 -1 0 4 -13 -15 38 7 -35 -2 8 -15
5809 -15 -19 -12 4 -49 -73 -1 2 14 24 12 7 -17 14 15 24 9 14 -2 -27 14 -13 1 -28 18 26 4 -4 22 -11 -8 42 -6 -1 -7 -2 -29 -21
5846 -21 -37 -9 2 -29 3 7 24 -5 -1 20 21 20 20 5 0 20 10 -9 8 15 19 24 42 23 26 11 12 37 49 -8 -1 1 -32 -20 -21 -12 -9 -20
5884 -20 14 7 24 32 19 1 0 3 -18 -4 -13 -34 -33 -21 -16 17 3 -3 31 25 25 42 37 -5 3 42 28 4 -23 9 13 -21 10 30 2 0 8 17
5922 17 3 1 42 8 4 -18 -8 -37 -15 1 -19 -30 15 33 30 19 -2 -14 7 7 -5 -3 -22 -4 9 9 -15 13 26 50 38 28 16
5955 16 30 21 19 12 -4 15 -17 6 -16 0 1 1 -13 8 21 7 14 -15 -14 15 1 -20 19 -23 -10 -21 -20 -47 36 -12 1 31 10 12 29
5990 29 31 21 5 20 -5 17 32 5 3 7 8 10 -2 7 3 -5 26 -4 10 -3 -22 -16 -5 -1 -3 -18 11 -18 -26 7 24 -9 15 19 3 -11 -1
6027 -1 -3 -13 -9 26 39 -29 20 17 22 3 44 34 -2 23 -20 21 -13 7 -8 -31 -12 17 14 -17 21 32 8 12 7 12 -21 2 -9 -18 -38
6062 -38 -48 -3 -27 -52 11 13 -2 18 48 19 -9 7 39 33 2 23 31 -4 11 56 -14 -9 13 25 4 -8 14 7 -14 -7 25 2 -70
6095 -70 10 -17 -65 -29 -16 7 -24 12 52 7 -34 13 40 -36 -20 30 8 -36 -16 -1 -3 -19 37 19 21 11 23 47 -17 18 49
6126 49 -1 -29 1 39 -44 -72 -19 1 -14 0 42 14 -1 16 33 -24 -2 25 17 -24 -34 24 -30 -26 0 1 -1 0 46 33 -15 10 21
6159 21 8 -37 1 30 -5 -14 28 27 -15 32 40 40 -8 21 8 -2 -8 11 10 -45 -33 -11 -20 -38 -22 24 -14 4 43 46 -12 13 2 -28
6193 -28 -44 -12 14 -26 -22 27 0 -14 -11 34 2 7 45 52 -19 -22 32 5 -46 -3 10 6 -30 7 5 -43 1 28 19 -13 19 34 -33 -50
6227 -50 2 -23 -30 -39 14 -6 -57 -7 35 5 0 44 50 18 11 29 -4 -33 15 44 16 -43 7 9 -29 13 61 16 -7 29 28 -15 -27 6
6261 6 22 -61 -20 -3 2 -26 3 36 -18 -6 24 41 -49 28 23 -7 5 14 23 -19 -3 41 17 0 31 -15 20 16 25 41 5 19 0 -19
6295 -19 -37 -2 47 -32 -30 3 17 4 -15 10 -2 -4 -7 22 -5 10 -2 16 -42 2 45 -8 -29 13 34 14 14 50 22 33 4 2 -2
6328 -2 -10 16 6 -8 -19 31 38 -35 4 35 28 13 -2 21 2 -6 -24 -34 -37 13 2 -26 -42 -5 23 34 -26 -10 34 -19 -21 1 3 -39
6362 -39 -11 -16 5 -3 25 29 1 10 27 47 13 19 31 14 -28 -2 17 -31 -43 8 -10 -30 -17 20 8 -8 5 -4 -26 18 12 12 -24 -27 -14
6397 -14 -24 -22 10 25 -12 3 18 4 1 22 29 2 -35 7 -23 -19 -1 -5 -3 -4 7 -1 3 -10 19 3 23 25 1 0 -8 2 -31 -31 -40 -3 5 -15
6435 -15 7 -5 -2 25 42 16 12 15 18 8 6 24 -26 13 -37 25 15 13 21 39 47 30 33 -8 14 16 -6 -20 -8 -1 -3 -26 -19 -11 -4 19 28 -12
6473 -12 12 -17 1 -30 -4 -14 -22 7 -31 -9 -14 -5 53 17 9 8 13 -10 8 -12 3 -4 7 -2 -6 19 3 1 -12 25 27 -7 4 -23 -2 -6
6509 -6 6 7 -1 -2 9 -5 -16 -14 -7 -19 -11 -6 4 -20 -5 36 13 -21 -22 2 9 -7 15 -8 -6 13 37 0 32 46 38 18 14 34 5 3 -29
6546 -29 -10 -23 -38 -6 3 3 9 31 -3 -21 2 27 -2 -14 -1 4 -21 3 -4 -30 -12 -11 27 13 5 6 30 -13 44 33 -7 -10 29 27 -37
6581 -37 18 12 4 7 34 36 27 4 25 35 8 11 23 -5 -33 -2 14 -32 -11 34 -14 0 10 19 -7 11 17 14 11 -9 15 1 -7 -9 31 7
6617 7 -10 33 27 14 40 45 30 16 -4 8 -2 -2 25 -1 -36 3 -8 -18 -11 -14 13 3 5 -6 19 -7 -16 22 29 -33 -16 34 19 -52 -21
6652 -21 7 0 2 27 49 0 1 24 36 6 7 47 -8 -37 21 3 -2 -39 37 30 3 23 48 -2 -19 -7 6 -51 -33 26 -11 -30 -19
6685 -19 19 1 -51 7 38 -18 -22 18 -6 -60 1 23 -23 -27 5 18 -14 18 60 39 -11 22 69 -15 -6 25 -21 -28 -18 26 9 -43
6717 -43 -3 1 -31 -10 53 21 -10 -10 4 -27 -44 1 24 -33 -32 7 10 -17 -13 14 -5 -11 29 40 3 8 15 18 31 0 45 0 5 10 19 -21
6753 -21 12 48 49 30 -8 26 -19 -22 -31 22 -53 15 22 -19 -18 -39 21 -2 -23 18 10 13 -18 -18 -12 -33 -15 28 4 15 1 24 21 -30 32
6788 32 16 8 -8 25 6 -9 5 12 -34 -46 33 10 0 -13 9 7 8 16 16 -9 -1 -1 -5 -17 -52 23 -10 -1 22 11 -6 0 -3 19 17 23 25 15
6826 15 -13 -12 41 5 -7 2 31 5 1 -1 1 12 21 21 -7 -4 7 -5 -40 -1 24 18 -19 30 -4 -19 -34 5 -10 -17 5 12 17 -11 16 16 -17
6863 -17 -3 17 16 -30 -30 -5 19 -2 39 32 6 -6 28 27 16 24 8 0 -25 6 2 -24 -25 1 -3 -11 11 -1 -3 -10 -7 24 -28 -31 -21 0 -28
6900 -28 -8 4 -11 21 38 0 21 29 19 7 -2 0 6 10 -15 10 28 26 22 0 18 27 4 4 6 23 6 -34 -3 -34 5 -21 -25 -8 -2 -3 -15
6937 -15 -1 9 29 7 7 10 -4 5 -2 -4 2 -7 8 -12 20 9 20 21 16 -3 13 5 -3 25 -24 20 15 5 -20 15 20 -8 12 10 5 5 -6 -1 14
6976 14 -18 10 -19 10 -22 -30 -18 5 -12 -18 24 -3 2 9 4 25 9 25 -11 19 26 12 16 -3 15 -5 13 38 17 -2 15 15 -14 -17 -17
7011 -17 -14 -27 -33 -17 3 -31 8 23 20 -7 21 -3 -11 -5 16 -15 0 -23 15 8 -31 1 14 0 -4 23 23 26 4 58 12 2 0 -22 -8
7046 -8 -25 19 8 -20 13 -11 -5 -26 18 7 -15 -6 -6 1 -4 -1 2 -12 -15 15 5 29 -5 16 -7 -4 9 17 16 20 39 28 12 5 -8 8 -8
7083 -8 15 -8 -3 15 0 43 -4 5 7 4 3 -5 -26 5 -11 -4 -20 -36 8 11 16 -14 1 7 -1 -20 18 14 -12 -28 12 -10 -12 12 14 6 9 23 13
7122 13 17 19 42 32 -22 1 16 -13 -25 35 10 -5 -17 26 16 -11 -8 6 -31 -45 -10 10 -30 -20 13 9 -33 -6 -4 -12 -10 32 12 -13
7156 -13 12 8 -18 -47 25 -9 20 4 39 12 -36 -13 36 -9 -21 23 41 -39 -12 33 -11 -13 10 9 -21 -10 -32 -22 -56 -35 8 20
7188 20 -9 15 46 -9 -20 12 22 -15 16 50 -16 -34 18 -1 -11 -22 41 36 3 37 65 10 -52 29 13 -11 7 48 0 -19 29
7219 29 31 2 1 8 21 -34 17 -3 -2 -20 10 4 1 -24 6 3 -5 16 5 19 28 19 37 6 -7 13 11 -12 25 27 35 -12 13 17 26 -14 14 51
7257 51 -38 22 31 -20 -43 -25 -8 1 2 33 -2 -16 -33 26 15 -14 -19 8 19 -20 -4 18 -3 -21 9 5 -10 -25 26 11 -11 0 38
7290 38 -14 2 39 31 -24 10 5 -10 -19 -4 -7 -22 23 29 -10 -32 -17 46 25 -23 18 -6 -26 -14 7 -2 -21 -30 -6 -6 -4 5 2 4 5 44 12
7327 12 -12 33 -11 14 9 37 1 -38 25 28 -13 -29 42 23 -10 -38 41 7 -26 4 -12 -5 -6 20 -4 -28 2 25 3 4 4 12 -19 -11
7361 -11 0 -18 -29 -3 49 8 -14 16 11 25 -12 4 10 29 -1 12 8 -16 28 -18 17 10 -5 0 -13 -4 15 -11 -33 12 7 -21 -14 0
7395 0 -18 -14 5 19 8 -10 -11 -9 4 28 -7 -13 5 11 30 28 2 35 16 -12 2 -11 5 0 12 24 14 41 12 -1 38 -55 -23 -21 9
7430 9 -27 -30 2 -27 -4 15 3 -4 0 12 -14 5 13 21 13 -4 -12 -2 -2 8 27 16 -42 23 -14 -6 -24 36 23 14 28 -4 6 2 -31 10
7466 10 -20 -8 33 9 3 -6 19 -7 -25 3 -32 -16 -7 -24 -13 -16 1 -8 7 -26 -6 10 4 26 -7 -14 -22 4 21 1 -17 18 18 -20 -1
7501 -1 1 21 -21 24 17 3 11 4 18 21 29 17 -12 8 28 -24 -28 -23 5 -20 -16 2 1 15 8 2 -1 4 20 -6 -10 5 -2 4 -9 -7 18 -4 -13 29
7541 29 32 -6 24 24 0 28 27 -5 -46 -27 2 8 -18 -27 -5 23 -25 -10 -15 12 -31 -4 -12 -35 -15 -12 -2 -10 -26 -1 24 -18 13 8 -10
7576 -10 18 -5 -17 -12 16 12 -21 9 12 -3 13 14 -9 -6 -1 -12 0 9 2 -15 13 -17 -11 -10 -9 19 4 -16 -22 -11 0 -20 -6 9 1 -2 -4 -19
7614 -19 -40 11 -10 20 8 9 -15 26 12 1 13 8 -7 -32 -15 41 24 -26 10 -5 -14 1 24 5 -7 5 42 -31 -17 -22 9 -13
7646 -13 -13 0 -40 -4 -3 -22 -29 -6 0 8 -8 -16 28 11 -12 22 1 4 -15 13 16 -10 22 7 1 7 19 10 -9 -5 11 12 -26 -3 -2 -17 -42
7683 -42 -17 -41 -20 -20 28 6 -11 7 3 -41 -17 -5 0 1 12 8 -11 -31 2 38 -4 8 14 17 9 1 5 15 8 -3 7 -4 -8 18 -11 -24
7719 -24 -15 -16 6 13 -3 -9 -4 -5 6 -5 -27 -25 -11 -15 -15 -27 -10 -15 -19 4 8 9 1 15 -15 -29 1 39 3 -33 41 3 6 12 10 -10 -3 -7 18 -8
7759 -8 -14 -13 -28 -50 -36 12 -41 -14 -7 5 -25 -23 22 1 -21 -8 38 5 -17 -7 -11 4 -22 2 29 -10 5 7 2 18 -13 23 -5 10
7793 10 14 22 -32 0 7 16 -26 2 2 -9 -5 -1 2 -10 10 25 8 -15 15 13 -10 -3 2 5 -3 -21 32 8 -10 9 16 1 8 -3 11 -1 -15 16
7831 16 -1 0 16 -10 3 -25 -17 6 18 -18 -10 16 -2 22 -30 -6 -12 12 -16 1 -2 -17 -29 5 -14 -9 9 -5 18 7 -8 3 -4 -5
7865 -5 7 -9 -17 11 21 27 20 -23 -4 18 10 17 -23 27 -11 25 -14 -10 -9 -2 -19 -12 3 27 9 -11 1 -36 -4 -2 -1 -3 -5 -27 -2 -28 -16
7902 -16 9 8 -9 10 -9 8 21 21 30 3 12 8 12 37 6 -24 13 4 -22 3 5 -34 19 9 7 -8 10 -2 -2 1 -4 -6 -17 11 -28 -20 -24 -13
7940 -13 -12 28 -16 1 20 -12 -17 0 13 -20 -3 11 9 -9 -10 5 3 -1 14 -5 12 19 10 -3 5 22 5 7 -29 4 -8 -6 4 0 7 -14 17
7977 17 -28 -50 -12 -12 -25 -6 -12 -10 -15 -19 6 21 -15 -20 8 18 17 23 46 15 6 -5 1 24 6 21 15 6 -10 -6 -3 12 -1 -14 11 -19 -16 -2
8015 -2 -16 -19 -10 -15 2 -16 -19 -12 -19 -9 -6 -5 -8 11 -8 -22 19 -19 -13 -18 2 7 -7 8 25 -4 29 11 18 -19 19 -1 3 -9 -29 20 -10 13
8053 13 -26 10 -5 -26 9 25 -32 -7 -16 -5 -1 -11 -26 4 -11 9 -22 -6 9 -2 18 32 59 47 -11 -7 26 6 -16 -12 1 9 -32
8086 -32 22 -6 -6 7 24 9 -10 16 6 -5 -6 6 -2 -32 -4 13 -7 -23 -2 -13 -2 -2 1 2 -15 20 9 -23 -13 -2 14 10 -18 14
8120 14 23 27 16 3 1 -24 13 22 6 21 2 -3 -11 -13 19 -11 -28 13 -11 -3 -29 5 -20 -6 22 26 0 -30 -5 -26 -25 -17 16 -7 -5 2 -2
8157 -2 -5 -32 19 44 -15 1 15 13 5 4 -5 -13 12 0 5 12 32 -1 3 6 6 13 -37 -20 -28 -17 -33 -4 11 11 -23 -1 16 14
8191A4
##END NTUPLES=NMR FID
##END=
