##TITLE=1H_103-2025
 200.13MHz, CDCl3,
 8 sc
 
 22.8.2025
##JCAMPDX= 6.0         $$ Bruker NMR JCAMP-DX V2.0
##DATA TYPE= NMR FID
##DATA CLASS= NTUPLES
##ORIGIN= UXNMR, Bruker Analytische Messtechnik GmbH
##OWNER= pz
$$ XWIN-NMR		Version 3.5
$$ Fri Aug 22 15:19:31 2025 Russian Standard Time (UT+4h)  she@DPX200
##.OBSERVE FREQUENCY= 200.1308
##.OBSERVE NUCLEUS= ^1H
##.DELAY= (6, 6)
##.ACQUISITION MODE= SIMULTANEOUS
##.ACQUISITION SCHEME= undefined
##.AVERAGES= 8
##.DIGITISER RES= 18
##SPECTROMETER/DATA SYSTEM= spect
##.PULSE SEQUENCE= zg30
##.SOLVENT NAME= CDCl3
##.SHIFT REFERENCE= (INTERNAL, CDCl3, 0, 14.3821)
##AUDIT TRAIL= $$ (NUMBER, WHEN, WHO, WHERE, WHAT)
$$ ##TITLE= Audit trail, XWIN-NMR		Version 3.5
$$ ##JCAMPDX= 5.01
$$ ##ORIGIN= Bruker BioSpin GmbH
$$ ##OWNER= she
$$ F:/spectra/data/she/nmr/H-C/1/audita.txt
$$ ##AUDIT TRAIL=  $$ (NUMBER, WHEN, WHO, WHERE, WHAT)
(   1,<2025-08-22 15:18:12.39 +0400>,<she>,<DPX200>,
      <created by zg, POWCHK disabled, PULCHK disabled
       configuration hash MD5:
       00 E9 B6 7A A2 85 ED C7 34 08 36 98 17 FE 4E 26
       data hash MD5: 16K
       62 06 DF 68 34 03 2A A8 7F 9D 8F C5 E6 15 3C 80>)
$$ ##END=
$$ 
$$ hash MD5
$$ FF 25 5B C0 C1 48 6E 74 1F 52 EF D7 3C 79 A5 CB
##$RELAX= 
##$RELAX= 
##$RELAX= 
##$RELAX= 
##$RELAX= 
##$RELAX= 
$$ Bruker specific parameters
$$ --------------------------
##$DU= <F:/spectra>
##$EXPNO= 1
##$NAME= <H-C>
##$PROCNO= 1
##$TYPE= <nmr>
##$USER= <she>
##$AMP= (0..31)
100 100 100 100 100 100 100 100 100 100 100 100 100 100 100 100 100 100 
100 100 100 100 100 100 100 100 100 100 100 100 100 100 
##$AQSEQ= 0
##$AQ_mod= 1
##$AUNM= <au_zg>
##$AUTOPOS= <>
##$BF1= 200.13
##$BF2= 200.13
##$BF3= 200.13
##$BF4= 200.13
##$BF5= 200.13
##$BF6= 200.13
##$BF7= 200.13
##$BF8= 200.13
##$BYTORDA= 1
##$CFDGTYP= 0
##$CFRGTYP= 5
##$CHEMSTR= <none>
##$CNST= (0..31)
1 1 145 1 1 1 1 1 1 1 1 1 1 1 1 1 1 1 1 1 1 1 1 1 1 1 1 1 1 1 1 1 
##$CPDPRG= <>
##$CPDPRG1= <>
##$CPDPRG2= <>
##$CPDPRG3= <>
##$CPDPRG4= <mlev>
##$CPDPRG5= <mlev>
##$CPDPRG6= <mlev>
##$CPDPRG7= <mlev>
##$CPDPRG8= <mlev>
##$CPDPRGB= <>
##$CPDPRGT= <>
##$D= (0..31)
0 0.7 0 0 0 0 0 0 0 0 0 0.03 0 0 0 0 0 0 0 0 0 0 0 0 0 0 0 0 0 0 0 0 
##$DATE= 1755861491
##$DBL= (0..7)
120 120 120 120 120 120 120 120 
##$DBP= (0..7)
150 150 150 150 150 150 150 150 
##$DBP07= 0
##$DBPNAM0= <>
##$DBPNAM1= <>
##$DBPNAM2= <>
##$DBPNAM3= <>
##$DBPNAM4= <>
##$DBPNAM5= <>
##$DBPNAM6= <>
##$DBPNAM7= <>
##$DBPOAL= (0..7)
0.5 0.5 0.5 0.5 0.5 0.5 0.5 0.5 
##$DBPOFFS= (0..7)
0 0 0 0 0 0 0 0 
##$DE= 6
##$DECBNUC= <off>
##$DECIM= 32
##$DECNUC= <off>
##$DECSTAT= 4
##$DIGMOD= 1
##$DIGTYP= 9
##$DL= (0..7)
0 120 120 120 120 120 120 120 
##$DP= (0..7)
150 150 150 150 150 150 150 150 
##$DP07= 0
##$DPNAME0= <>
##$DPNAME1= <>
##$DPNAME2= <>
##$DPNAME3= <>
##$DPNAME4= <>
##$DPNAME5= <>
##$DPNAME6= <>
##$DPNAME7= <>
##$DPOAL= (0..7)
0.5 0.5 0.5 0.5 0.5 0.5 0.5 0.5 
##$DPOFFS= (0..7)
0 0 0 0 0 0 0 0 
##$DQDMODE= 0
##$DR= 18
##$DS= 0
##$DSLIST= <SSSSSSSSSSSSSSS>
$$ [...]
##$SUBNAM0= <"">
##$SUBNAM1= <"">
##$SUBNAM2= <"">
##$SUBNAM3= <"">
##$SUBNAM4= <"">
##$SUBNAM5= <"">
##$SUBNAM6= <"">
##$SUBNAM7= <"">
##$SUBNAM8= <"">
##$SUBNAM9= <"">
##$SW= 18.0517779522481
##$SWIBOX= (0..15)
0 0 2 0 0 0 0 0 0 0 0 0 0 0 0 0 
##$SW_h= 3612.71676300578
##$TD= 16384
##$TD0= 1
##$TE= 0
##$TE2= 300
##$TE3= 300
##$TEG= 300
##$TL= (0..7)
0 120 120 120 120 120 120 120 
##$TP= (0..7)
150 150 150 150 150 150 150 150 
##$TP07= 0
##$TPNAME0= <>
##$TPNAME1= <>
##$TPNAME2= <>
##$TPNAME3= <>
##$TPNAME4= <>
##$TPNAME5= <>
##$TPNAME6= <>
##$TPNAME7= <>
##$TPOAL= (0..7)
0.5 0.5 0.5 0.5 0.5 0.5 0.5 0.5 
##$TPOFFS= (0..7)
0 0 0 0 0 0 0 0 
##$TUNHIN= 0
##$TUNHOUT= 0
##$TUNXOUT= 0
##$USERA1= <user>
##$USERA2= <user>
##$USERA3= <user>
##$USERA4= <user>
##$USERA5= <user>
##$V9= 5
##$VALIST= <valist>
##$VCLIST= <CCCCCCCCCCCCCCC>
##$VD= 0
##$VDLIST= <DDDDDDDDDDDDDDD>
##$VPLIST= <PPPPPPPPPPPPPPP>
##$VTLIST= <TTTTTTTTTTTTTTT>
##$WBST= 1024
##$WBSW= 4
##$XGAIN= (0..3)
0 0 0 0 
##$XL= 0
##$YL= 0
##$YMAX_a= 552037
##$YMIN_a= -871628
##$ZGOPTNS= <>
##$ZL1= 120
##$ZL2= 120
##$ZL3= 120
##$ZL4= 120
##$ABSF1= 10
##$ABSF2= 0
##$ABSG= 5
##$ABSL= 3
##$ALPHA= 0
##$AQORDER= 0
##$ASSFAC= 0
##$ASSFACI= 0
##$ASSFACX= 0
##$ASSWID= 0
##$AUNMP= <proc_1d>
##$AZFE= 0.1
##$AZFW= 0.1
##$BCFW= 1
##$BC_mod= 2
##$BYTORDP= 1
##$COROFFS= 0
##$CY= -3
##$DATMOD= 1
##$DC= 2
##$DFILT= <>
##$DTYPP= 0
##$F1P= 0
##$F2P= 0
##$FCOR= 0.5
##$FTSIZE= 0
##$FT_mod= 4
##$GAMMA= 1
##$GB= 0.15
##$INTBC= 1
##$INTSCL= 1
##$ISEN= 128
##$LB= 0.25
##$LEV0= 0
##$LPBIN= 0
##$MAXI= 10000
##$MC2= 0
##$MEAN= 0
##$ME_mod= 0
##$MI= 1.114404
##$NCOEF= 0
##$NC_proc= 0
##$NLEV= 6
##$NOISF1= 3.799351
##$NOISF2= 2.8
##$NSP= 1
##$NTH_PI= 0
##$NZP= 0
##$OFFSET= 14.38212
##$PC= 1
##$PHC0= -1560.884
##$PHC1= 11.79229
##$PH_mod= 1
##$PKNL= yes
##$PPARMOD= 0
##$PSCAL= 0
##$PSIGN= 0
##$REVERSE= no
##$SF= 200.129724274929
##$SI= 16384
##$SIGF1= 3
##$SIGF2= 2
##$SINO= 400
##$SIOLD= 16384
##$SREGLST= <1H.CDCl3>
##$SSB= 0
##$STSI= 0
##$STSR= 0
##$SW_p= 3205.1282051282
##$SYMM= 0
##$S_DEV= 0
##$TDeff= 0
##$TDoff= 0
##$TI= <>
##$TILT= no
##$TM1= 0
##$TM2= 0
##$TOPLEV= 0
##$USERP1= <user>
##$USERP2= <user>
##$USERP3= <user>
##$USERP4= <user>
##$USERP5= <user>
##$WDW= 1
##$XDIM= 8192
##$YMAX_p= 0
##$YMIN_p= 0
$$ End of Bruker specific parameters
$$ ---------------------------------
##NTUPLES= NMR FID
##VAR_NAME=  TIME,          FID/REAL,        FID/IMAG
##SYMBOL=    X,             R,               I
##VAR_TYPE=  INDEPENDENT,   DEPENDENT,       DEPENDENT
##VAR_FORM=  AFFN,          ASDF,            ASDF
##VAR_DIM=   8192,          8192,            8192
##UNITS=     SECONDS,       ARBITRARY UNITS, ARBITRARY UNITS
##FACTOR=    0.0002768,     1,               1
##FIRST=     0,             0,               0
##LAST=      2.2672688,     0,               0
##MIN=       0,             -871628,         0
##MAX=       2.2672688,     552037,          0
$$ Real data points
##PAGE= N=1
##DATA TABLE= (X++(R..R)), XYDATA
$$ [...]
1710h74j06J33m43P13K88p2N60l25N00Q1j73M43RK10K98n46J81n41k93K10n06
1731b53K61j94q8K10j55j48M3l94L55J3j7L76n3O11q5j09K49l29L35L36k60Q03
1753A507l91K48j53m40r9n86k72J49o34M8J3l52m0k31k29L53J89O14K08J50L32
1774C84O0L09p6k65m4j66rP4l35j63o22P9l11o49L10J15J64M88j53N82j44N9K45
1797f8k32L93J49m9M29N5m38p5j39J07l23l16M82k88M34m88k65q2j9k64N36m28
1819h89O28K98J74K78k01L46L13J3M59k27J86K76l98N4n37o50j83m79N5p5k88
1840h47p7M6j33J40j15L44M30J26N90k10O25J80K4J73l23J74j37m5L2k60k79j58
1862C00l20l54l21n4L34m96K34J96r3N01l28K67J77N6L89J53K75J69l9N4j82l05
$$ y = [-874, -980, -847, -1290, -577, -289, -361, 199, -126, 374, 455, 282, 725, 734, 944, 1242, 696, 877, 336, 43, 253, -253, 8, -186, -274, -64, -219, -367, -324, -718, -363, -350, -367, 9, -44, 567, 482, 373, 622, 293, 628, 964, 704, 1507, 1116, 1364, 1211, 771, 672, 86, -186, -37, -671, -623, -610, -962, -1002, -1233, -1462, -1109, -920, -306, -98, 52, 384, 444, 753, 677, 412, 368, 202, 193, 267, -68, -231, -853, -774, -1085, -1734, -1424, -1309, -1145, -657, -810, -228, -372, -313, -68, -300, 93, 242, 193, 622, 677, 239, 164, 25, 132, -191, -507, -25, -313, 121, -367, -632, -714, -733, -997, -461, -889, -261, 37, 211, 489, 288, 634, 947, 960, 1419, 1192, 1378, 1654, 1256, 1310, 773, 123, -60, -539, -484, -559, -847, -924, -878, -1011, -871, -986, -642, -212, -86, 504, 294, 919, 1099, 1123, 1296, 973, 1147, 1010, 965, 997, 737, 458, 300, -20, -374, -695, -749, -415, -911, -677, -481, -574, -73, -401, -134, 43, 99, 488, 641, 916, 1085, 1046, 1100, 918, 613]
1884F13j9k65q8O7m55M6l41N9J23l75J32k50J01M72q0J86K11K03K10m35j40N05
1906D80l51N18n14L75J5n70J9k93n4j1m50J57K5j92M69k07m2K65k34K72j23K57
1928a89M25k04K89Q3m6j57j0k3j9j00LQ6O5o2j65J15j6k68K19p4K52J74r5L98
1952F81m29M1K08j14J81m9n8J24P5R4j06l73j06P6R7L5k46N13M0n18M0m59J67
1975h6ok42L85J33j6k4m77J18k93P5L0m2M07m4L0P3j32N7R2o79L43L78j91K17
1999A06j38j8l14j82Nk94J44J01j2K48r8j98K29n23K18Q9n3O69p0K03L01n98L95
2022B10R2j11J52J03J34j99N1l38k14n5m0j86L19k62j24L85m42J4l28K33j2j05
2044g23K66J04J61J98j16K16K65k21L78r4L73N1l07K47k55j36J66k05N3k51l6
$$ y = [613, 594, 329, 241, 308, -147, -101, -442, -383, -260, -635, -503, -753, -652, -180, -260, -74, 137, 340, 550, 115, -25, 480, 129, 647, 133, 508, 523, -47, -28, -321, -375, -386, -836, -679, -654, -846, -377, -584, -626, -361, -595, -323, -446, -189, 236, 32, 321, 404, 358, 201, 191, 168, 149, 49, 52, 138, 203, 141, -24, 91, 75, -193, 26, -48, 204, 378, 283, 681, 252, 293, 501, 387, 568, 519, 461, 585, 660, 754, 648, 275, 169, 245, 342, 377, 131, 644, 684, 166, 206, -253, -86, -92, -334, 51, 184, 168, 144, -333, -215, -508, -433, -403, -445, -38, -82, -52, 21, -111, -54, 38, -641, -298, 80, -111, 106, -32, -50, -364, -546, -541, -835, -691, -590, -602, -354, -452, -650, -421, -944, -726, -637, -690, -21, -91, 112, 413, -185, 210, 302, 191, 343, 446, 580, 381, 432, 94, -120, -175, -215, -401, -82, -344, -468, -83, -525, -511, -839, -606, -618, -723, -457, -353, -192, 6, -110, 106, 371, 150, 528, 434, 807, 858, 551, 798, 543, 407, 573, 368, 421, 170, 134]
2065A34K03l00r0k17n18L29k84L03J8k20P8N5J25J88n2J82K31l3K52j97K33N3
2087D73J57J40qj48J39j96j9j53%J05q2m20J58j14o5k83M2q2j59R3J86K0Ok98
2111e08%J10j85L7N4M6M44j5j50J44r5J61l90O11JK07P1K7J56m25j39M6j19M5
2135A34K39j55L53j31k20j38l98j59O1j81L35k8J0O3l28Q1p6q8K1N70K09K65M9
2158D88L76k31j02K61k95L57r8q7J79l04k62k61m36j73j35K03J73j90L51m0j27
2179c53R4k17P5K08J28N79j15P2k36l64J04k68pK2Q6M16q2j22j6l93q6m1l2K85
2203b63M1M10O1l57j19l66J49J65m6N44K44J07M4j99K5r7k55L31l5n4J03l37k02
2226a06l21l49L97l65N45lJ71M06j97P0l54j20P5Q1K22M2O9j9j91j99J1k58J30
$$ y = [134, 337, 37, -53, -270, -788, -459, -743, -440, -422, -642, -564, -509, -384, -196, -248, -66, 165, 132, 384, 187, 420, 473, 630, 770, 762, 614, 753, 557, 538, 385, 385, 490, 408, -12, 146, 32, -33, -316, -274, -356, -515, -422, -236, -216, -210, -508, -508, -398, -583, -546, -492, -446, -2, -17, -167, -23, -118, 43, -347, 264, 265, 472, 543, 570, 726, 301, 162, 208, 89, 134, 373, 218, 571, 440, 220, 82, -316, -475, -414, -595, -260, -288, -278, -215, -543, -462, -538, -626, -605, -35, 174, 439, 488, 864, 633, 531, 792, 497, 854, 756, 669, 848, 544, 282, 21, -415, -588, -723, -520, -347, -537, -186, -226, -353, -259, -476, -401, -193, -65, 514, 399, 471, 235, -129, -25, -293, -300, -278, -192, 224, 142, 20, 4, -389, -475, -516, -548, -263, -222, 188, 249, -108, -227, -593, -444, -279, -325, 219, 463, 570, 614, 415, 440, 343, 88, 419, 384, 330, 433, 96, -106, -427, -776, -379, -744, -199, -202, -31, 375, 178, 248, -106, -226, -151, -70, 152, 194, 263, 244, 53, -146, -135, -393, -263]
2249b63J88K6K56K3J54j42j64j4P8J92N6j90J39j55j93L6l14j46K04k7J87O3M5
2272C9j29M3j68l1j22J20Q3J88J22j25L86l52k6Q8j27J87j31J96L96k74j73J45
2294C35k26P3j17J94J85o6p9j05K3L0j96J3ml47J27p3J32k74O0n1m6k8J38J37
2318a65k28K05j24M02j51K57j72J37L03j02P6q6k4m7r0m5K62m51K00k42l47J74
2340b58j55N6K85j93k5k81K36J44l05K64J06L7J93K07l2K2k65L85q8k93K68r5
2362B13M8j18l09K31m48q6J13j27K0J94K14j4j32j9J06p4L92j68J74J11k49m1
2384C1J29m62K08j06j13J78p3P1k7l2l53q5K2N8K19J73R5L19j66j64L28k89N4
2407A5K16L27rJ35l45r3j39L5k97K5j69K55J8k29J77l9m2J19k34K78L70k49K94
$$ y = [-263, -75, -49, 207, 230, 384, 242, 78, 64, 142, 334, 390, 200, 339, 184, -9, 27, -287, -433, -229, -256, -69, -6, 39, -90, -47, -215, -246, -368, -248, -165, 23, 145, 20, 406, 54, 28, 116, -11, 176, 45, 241, 637, 363, 190, 335, 109, 182, 65, 259, 444, 378, 299, 194, 217, 247, 51, 64, 60, -287, -160, -233, -101, -375, -315, -366, -412, -440, -302, -165, -393, -188, -312, 90, -61, 196, 24, 161, 464, 362, 438, 352, 328, 281, 191, 146, 408, -43, 157, -85, -432, -258, -413, -357, -72, -265, -290, -571, -335, -191, -496, -232, -126, -89, 104, 311, 279, 301, 36, 421, 333, 40, 308, 213, 261, 143, -166, 65, -383, -469, -356, -483, -463, -269, -55, -69, -201, -220, -114, -188, 204, 36, 210, 321, 72, 31, 160, -302, -94, -200, -313, -135, -208, -137, -164, -196, -549, -634, -612, -554, -335, -162, -67, 252, 86, -78, 250, -39, 15, 231, 558, 549, 684, 339, 246, 107, 142, -155, -130, -299, -44, -26, -255, -78, -117, -159, -40, -274, 4, 374, 125, 419]
2430D19n6j98R0p3J06j04mk2O8l47R6l16K33k66P9O4jJ27n1P5k2K28l21J98j12
2455a10P5J23M5J92k18J00l7l55L07j65K52j44j53o4L11l70K11j00K8j42Q6J45
2477A7J36j55m3J41J3k15K61P6o8Jj49P9J26p0P1Q2r2q0j88J36J20k10J69K3q4
2502I7K70l90K2R8j35l7j24M4J49r6J35M0m5j83o6Qm6J38N5j02J68J27l22N3J23
2527a9j8J26j35p1K0R4m0j07n8J69j86R6n1MK19j95J93j38p8J73K6K35m8OM1n5
2553B03p4N7k81K98l4J31k15J1M7k05l8J69j88J10M2jN9j76k64K07j44k5L7K8
2577b46K72j32M53l44j09M3P6K5K63j53K31q4O1p7k17j14N2k00R5J04j02Ok49
2600c46K76j05j22m9J2J72O1l5Q1j79J31P1k02L29j60R7o1J81M1J22k61N6j07
$$ y = [419, 363, 165, 255, 182, 288, 184, 180, 158, 226, -121, -25, -341, -108, -374, -295, -231, -232, -105, -156, -81, -103, 125, -196, 2, -110, -35, 88, 133, 325, 107, 207, 170, -185, 122, -43, 209, 65, -88, -152, 159, -211, 0, -100, -72, -214, -128, 17, 153, -2, -45, 96, 109, -106, 155, 231, 163, 164, 15, 94, 220, 150, 221, 303, 211, 131, -57, 79, 199, -11, 158, 181, 97, 367, -23, -1, 97, -38, -75, -199, -155, -6, -102, 33, 73, 28, -155, -221, -213, -259, -121, -66, -168, 0, 127, -195, -142, -19, -37, 89, -46, -117, -97, -3, -43, -150, -208, -39, -225, -129, -180, -176, 43, -152, 41, -97, -175, -2, 24, 259, 211, 217, 258, 203, 129, 186, -95, 203, 169, 300, 85, 96, 143, -62, -100, 69, -119, -9, 33, 32, 91, -85, -349, -142, -286, -311, -274, -246, 26, -106, 347, 3, -106, -63, 13, 38, 301, 148, 379, 295, 356, 279, 62, -52, 0, -200, -105, -1, -103, -97, -346, -70, -175, -297, -346, -334, -162, -101, -136, -55, -234, -103, -32, -234, 95, -65, 32, -29, 152, 193, 315, 54, 110, 3]
2623CJ47J37M5K3NQ3l86j59J46p4OJ27o9j36J75k3j74R1k65J63J39N3k08K4o2
2648a89n6r1K6L3J94jJ01R8j79M11m12J97r3N2K20K0j56J20k13J3N4k57lJ28k8
2673a1p1q9j17R5q7p9oL01j21K44O8j33K56j57P8j12J14J08J66k80J17o2p5n2
2697I5J21P7k15k76J73L8k07o4o4N0K0K7L20j92n2L09j09K57l55J35p5K65j24
2720A54q3k86K78m7j41m9k6J12r3O0J36j76Q7j27N1K48q0j09Q5J41J65k03M8p
2744A38j28q6R2j17J67rj44Rp1NM4J00J36k19J39k13K02K16j6L6r9j95L86Jm8
2769C26k34P6qk97J75M9j99J55j11n0j74J46J88j80J34j73k61L22J49o6j77K16
2791FQ0j6J3k51J93l2M0j88q2Q7LK47n2j52j17r8J34J74j04K73j0l9L5j47J53
$$ y = [3, 150, 287, 332, 355, 360, 443, 57, -102, 44, -30, -24, 103, 34, -102, 73, 50, -124, -33, -298, -135, 4, 57, -151, -127, -189, -245, -336, -310, -277, -83, -84, 17, 115, -64, 347, -65, 132, 39, 91, 311, 331, 175, 295, 82, 95, 149, -108, -111, 17, -11, -82, -171, -288, -193, -280, -359, -365, -64, -185, 59, 127, -6, 250, 93, 171, 59, 173, 281, 447, 167, 284, 222, 147, 95, 216, 293, 78, -198, -25, 13, -194, -258, -322, -272, -252, -225, 95, -97, -149, 160, 51, 308, -47, 88, 13, 278, 154, 71, -215, 63, 16, -125, -174, -200, -88, -181, -121, 15, -161, -74, -201, -150, 98, 18, -91, -6, 135, 300, 97, 145, 138, 10, -76, 16, -101, 66, 57, -87, -78, -149, -144, -100, 0, 136, -83, 56, -157, 45, 261, 245, 281, 182, -13, 373, 374, 326, 92, 168, 160, -137, 38, 87, -112, 43, -68, -118, -292, -146, 42, -138, -4, -177, -438, -116, 33, -33, -210, 6, 86, 70, 83, -168, 25, -7, 33, -155, -237, -150, -147, 100, 48, -104, -221, -319, -185, -11, -115, 158, 148, 109, 144, -3, 150]
2816A50j05j81J35m6K90j18j62K15k63j0l6J53N4l1K44q7k03o4K45l71L50k42
2838h3O6j37J70k8o9J82o4r9P5j73J89j46K97J21k92J93k57j0J31k81K5N8K3r7
2862b06K04j12J4n3R9O2J12j7p2j70J09o8J49Mj45L22j58j40K67j57o9J11o5J57
2886A78o1m6l5o2j01r9L25K1j51J53j18k04L70l34N7J51j13j07J82L9j02j0J84
2909A17k17J76j10j24J23J22J83l70r7J52j6p6J39N7J8q5M4K0k9l1j0k2j74J22
2933h8K73j63L2J16o9j74R1j54NJ83r8J77k75J03J61j92P7O7j15n5J74O3k9k1
2957H9K0J21k19q3J96K8k22R7J87l38K31q6k29K12l6j12J6L6j3O8K5l3j3J2k8
2982g4k71L56j52J81J2j37r5J15k4K86k04J28l85Q9K19n2k39J97L8K07q4j12n9
$$ y = [150, 45, -136, -1, -47, 243, 125, -37, 178, -85, -95, -131, 22, 76, 45, 289, 202, -1, -65, 180, -191, 159, -83, -17, -154, 16, -12, -81, 101, 37, -62, 13, -160, 29, -117, 180, 301, 9, 202, -55, -65, 66, -215, -190, -132, -109, -206, -2, -114, -100, -153, -54, 8, 120, 103, 31, -139, -30, -98, 51, 55, -90, 232, 74, -66, 201, 44, -25, 86, 21, 178, 117, 71, 36, -26, -127, -226, 99, 120, -31, 122, 4, -200, 170, -164, -107, 44, -69, -176, 6, 45, -57, -67, 117, -100, 76, -34, -158, -35, 87, 270, -100, -197, -45, -61, -137, 2, 59, 77, -8, 36, 56, 27, -4, -14, -36, -210, -88, 185, 22, 54, 170, 101, -73, 18, -136, -131, 52, -46, 131, -144, -41, 120, -72, 5, 72, -43, -98, 76, 139, 110, 89, 109, 230, 11, -72, 124, 152, -70, 27, 214, -124, 107, 21, -208, 4, -32, -144, -128, -92, -105, -37, -12, -45, -58, -46, -74, -345, 11, -141, 40, 52, -85, -180, -65, -89, 197, -7, 121, -264, -175, 44, -8, -247, -50, -12, 195, 111, -1, -60]
3005f0j84L12n8K3P6j24K3n5n5K3J67j34K08k48j13L36K2k32K44k75J01J78k37
3028f2J94k4j07N0j10j07J47m4K40j22n5N3n9n3l0J93l6j54O0Qk6k5j9N9l3r2
3054a54PJ0K30P2k54m8J0k4N3M4K00p7q4J56j46j5J74k41M4K34j02q4P0L5m36
3079c26K62M5J16l1j54M06m06J74J14j46k31M29k84j1K58k88J35k74J91m5l8j2
3101a16J19K28j57l15J28J42N7j81M9J31o4m0J46j47J34k74K42l08L52k3j66J97
3123A34l07P3J12O8M1l0oj88J30J71o9j01n2J69k13K3j13J10j93K06J12k7m9r4
3147i3K10j66o2K30J0k00p4J31J37k46K70k8j2k6j21J41j61J29j28KJ4K97k75
3170b1n0J43k6l0K7l0R3q8j57J35J01J8j72N9j23J30N8j14q6N0J66k56J52oP0
$$ y = [-60, -244, 68, 10, 33, 109, -15, 8, -47, -102, -79, 88, -46, 162, -86, -199, 137, 159, -73, 171, -104, -3, 175, -62, 132, 108, 1, 51, -59, -166, -19, -63, 177, 55, 0, 53, -6, -59, -89, 104, 68, -86, -26, -18, -44, -69, -88, -29, -62, -154, -147, -137, 93, 165, -89, -137, -127, -151, -98, -54, 146, 69, -15, 141, -5, -20, 154, -87, -43, 191, 89, 5, 75, 110, -326, -64, -19, 97, 66, -88, 318, -88, 86, 200, 54, -177, 252, -32, -43, 215, -73, 62, -212, -21, -66, -104, -116, 3, 231, 74, -241, -113, 29, 86, -95, -46, 85, 21, -19, 127, -20, 114, -160, 82, -226, 126, 103, -63, 134, -173, -100, 12, 80, 121, 91, 85, -103, 27, 198, 129, 28, -24, 145, -68, -45, -158, -48, -241, -35, 77, 50, 1, -93, 117, -49, -111, 119, 129, -71, -145, -14, 123, -123, 147, 119, 107, 81, -40, 101, -60, 69, -59, -57, -43, 254, -21, -71, 72, 46, 16, 43, 13, 106, 18, -139, -4, 97, 115, -57, 2, -121, 9, 67, -47, -133, -83, 83, -173, -21, -27, 43]
3195D3M0j44J94k80K56n3j41J64k3P1k20J31j89M8L19j81Jj41m5M6J48j39J50
3218E5k46J66K7r4K81l26Q0R0n0J28j7q4P1k52P0M3P0j09J67r9L6J47j90k04J48
3243i2J79j40L4o5M1p5P4J68k98J38o8j29O3K4K23q1Q5p6Q6m6J43j52k52L93j40
3268C7J57k43j58K41j0J86j51L9n0L5k48J18O5n8N6j30O3K25k83L03l07J17j67
3291a63L5J06l0P0j16RQ5j56K80J08j15J12j17Jj28n9J52j21r0J50j32O9P0lj77
3316a60n4o0J85l1J35J91k01J79k47K31k36k08N84l60k8O9LN9O1n08N34k19J09
3339B8p4L55Q3k37j96o0J59J0k35K37J65n4j21J09l00R0r8K57j81l1j56J23L22
3362A95l14L2j14K70O5j32l5J05n4K05j19k59N0k2K4J03PL2R7k08P1P5O8k68J13
$$ y = [43, 83, -61, 133, -147, 109, 56, -85, 79, 56, 127, -93, 38, -151, -103, 216, 35, 36, -105, -150, -104, 44, -95, 55, -191, -25, 2, -92, 189, -137, -57, 33, -17, 111, 94, 10, 81, -171, -101, -58, 12, -97, 70, -29, 7, 154, -36, -240, -92, 87, -53, -19, -84, -43, -118, -44, 124, -174, -36, -104, -233, -170, -146, 77, -4, 81, 5, 91, 45, 188, 36, -216, 177, 37, 194, -49, -207, 34, 24, 210, 59, 98, 48, 83, -165, -47, 18, -40, 16, -114, -51, 174, -109, 194, -113, 4, -163, -128, -22, -52, 18, -98, -89, -4, -160, 120, 228, 113, 225, 108, 109, -19, -78, 74, -47, -137, 13, -119, -50, 20, 17, -160, -214, -274, -89, -120, 15, 206, 5, 184, -63, 168, -68, -276, 308, -52, -80, -11, -8, 51, 112, -396, 138, -81, 28, -46, 309, 392, 155, -41, -101, 58, 68, -167, 70, 235, 181, 60, 169, -131, -41, -139, 118, -63, -94, -250, -127, 195, -119, -87, -201, 69, 134, 2, -33, 72, 18, 223, 104, -155, -105, -127, -103, 0, 7, 39, 136, -72, -1, 74, 142, -126, -13]
3387a3J33l33R5P3M3n1o5o0J23NJ72J44o8l53R1K56k22J86j03L6n1j8K8J41j40
3412D9k04K59j95Q6p7L63k61j50K02j70J48o5J55k07m2M9nJ3j8P2k2p3M9k10P8
3437a76J67j4L4j72K67k2N0j29J04k46J96L0k37J69l9L9o4k9J75k10J21J46n25
3460c65N08k93K70r7l12K39j5j02J12NJ21j24J57j12J41J4Mj71J41pj93K39n2
3483A08k10N8nO4p9J36Qk33K3mJ28K6p3J02p4k49J58N3RL2j02L84m48J93N6k52
3509a91K19k26J86K60k42r1J65j77K41l8j3j57J61j46Q6NMm7m6J86l16K17p1j
3533c2l%K74l03m5p9M9J99J3n9m7O8n9j42K79qQ8j69mj32J88j39K0J28k28K60
3559A17k44R3j28K81jk70J54o8P3j57J4L3K38l16J89K33l16N1qK1P1J36k27J43
$$ y = [-13, 120, -213, -118, -45, -2, -53, -118, -178, -55, -50, 122, 266, 198, -155, -64, 192, -30, 156, 53, 89, 38, 20, 48, 189, 49, -155, 104, -91, -5, -82, 281, 20, -130, 72, -98, 50, -15, 140, -67, -109, -60, -65, -52, -70, 2, -20, -93, -44, -254, -176, -9, -23, 11, -161, 106, 84, 134, 5, 109, -137, 59, 89, -148, 21, -18, 21, -43, -72, 103, -107, 14, 160, -365, 143, -150, 120, 23, -289, -50, -65, -167, -55, -50, 71, -53, 104, -8, 133, 147, 151, -20, 121, 114, -79, 160, 108, -102, -44, -49, 15, -64, 72, 80, -153, -130, -134, -6, 20, -53, 49, -25, -274, -116, -63, -54, -22, -124, 260, -188, 5, 61, -191, 28, -198, -12, 248, 6, -85, 80, -97, 144, 106, 93, -64, 97, -49, 37, 42, 46, -1, -47, 139, -177, 40, -31, -32, -35, -35, 239, -64, -109, -188, -139, 60, 73, 14, -33, 35, -24, -166, 113, 105, 193, 24, 20, -112, 76, -63, -43, 85, -143, 117, -127, -34, -162, 119, 118, -152, 2, -66, 7, -150, -136, -103, 135, -181, 8, 241, -75, -24, -32, -11, 60, 196, -31, 112]
3583A12r1K80l86k20K39q5K89m09N0K96K5k42J92k26N7o0K82P8j65K7p6mRJ01
3607G3j25n9J12Q3K8Q9k07j36M72n5j77m6p4K36j86O6Kk26J23M2j59L8J14mj00
3632g6pO7m39K19Q2L4Q9N0m0j66n7M6J99n8J47j01O9P8k7m0J04l0O9r4JO3j70
3659A2J10l1lk80L4o0J80r0J37J37k72L0M9j1o8J94j57Q6o5Nj32M05k90J74M4
3684A38j3j49K04j86J90N6j02k05n7K45L6k88K91k2l01K3k02J90j17krL7P5J7
3708a51J02j15p7J47j87K63K00j38K10m01J09N4k4K18k14J4K19K2r3R0N9j46q7
3731G4l0K04k78m8nk58L74l35J47Q8K6M6k78Q4J13J55k23j60K52N9j23K77J65
3754C26n14J27o6%QJ50M8k0j09r5J81j02J13M5k22J42o3L6O2p7j36O8p6k26K07
$$ y = [112, 21, 301, -85, -305, -66, -151, 138, -271, -221, 75, 100, -142, 50, -176, -119, -179, 103, 181, 16, 43, -33, -37, -28, 73, -52, -111, 1, 84, 112, 201, -6, -142, 330, 275, 98, 52, -22, 214, 28, 94, 96, -130, -7, 35, -124, -86, 28, 24, -76, -83, -16, -455, -236, -154, -120, -31, 19, -21, -187, -244, -198, 1, -57, 90, -11, 58, 136, 109, 69, 173, 143, 212, 118, 119, 182, 12, 122, 91, 88, -192, -158, -218, -38, -128, 9, 146, -126, -96, -47, -58, -126, 68, -89, -3, -68, -63, -195, 210, -80, 94, 138, 125, -24, 180, -6, 184, 240, 138, -67, -124, 121, 157, -131, 160, 138, -163, -140, -342, -152, -269, -271, -280, -243, -168, -151, -49, -164, -241, -94, -281, -18, 182, 44, 254, -147, -38, 16, -8, 210, -4, 10, 229, 251, 158, 248, 307, 161, 74, 44, 248, -30, -78, -83, -341, 33, -302, -155, -67, -41, 5, -273, -189, -76, 79, -144, -304, -52, 7, -116, 161, 326, -188, -61, -127, -127, -119, 31, 79, 59, -50, -145, 36, -66, 47, 92, -130, 12, -51, -15, 47, -30, -166, -98, -174, -400, -193]
3779a93j00L7K05m5J29l28K44j68O6K28J25K7K0j59L8J28k67M45k20L0J69j89
3801B22k37J99l02L50k81l3J04Q3k27oj94K45o6L8M7j74J61J34J0j6N9j02L3J07
3825A54l1l1J74k84j09J06n9m7O7j63J60j16J65j68K29k17j9p6L62j44K0O1m2
3848hk1M1J35k23J33j32N5p3K74p8k7q8j21K44r5o4P5q0K78j93Q1j0p4O0k7J24
3874A86j89RK98l5l58J96j43j05N6JK36l60R6k7K7k20K12O0K86k16J20j49N8J1
3898E0J69K17q5j73J05l6k59J32j90M0j69j16Q7k2N4Q0k02L93k75J39k7J80r3
3921anJ4Q0O1lo1J08n3m6j1K04Nk73L78m12K51k85R3j11o2O1L9O1j86J6k07M23
3948G8k19j67K37K09k64K80j82j82K70Q2j45q6m1k19J60J2K13j9j97N72m07k01
$$ y = [-193, -293, -256, -51, -96, 33, -295, -51, -219, -153, 75, 200, 227, 247, 88, 126, 254, -13, 432, 212, 242, 411, 222, -15, 184, -118, 232, -49, -82, 22, 105, -122, -128, -322, -77, -143, -105, -58, -232, -71, 63, 73, 57, 116, 14, 47, 154, 123, 92, 266, -18, -127, -21, -80, -127, -60, -223, -63, -179, -14, -182, 47, -170, -189, -265, 97, -47, -27, 34, -8, -29, 12, 147, -76, 57, -75, -20, -93, 181, 103, 76, -12, -133, 111, 16, -48, 27, -53, 225, 32, 113, 103, 29, 89, 62, 186, -3, 6, 304, 269, -89, 107, -36, -141, -85, -84, 152, -208, -112, -139, -112, -332, -120, -60, 226, 10, 130, -19, 39, 50, 219, 436, 351, 178, 283, 247, -12, 120, -70, -30, -199, -315, -228, -250, -196, -116, -318, 75, -200, -61, -88, 92, -1, -6, 8, 88, 149, 146, 85, 193, 140, 94, 83, 287, 292, 19, 397, -15, 236, -49, 44, -67, -129, -68, -29, 32, -154, -138, -345, 78, -141, -308, -71, 138, -126, 154, -28, -210, 60, 142, -3, -89, -130, -349, -189, -177, 36, 17, -180, 392, -15, -216]
3970b16J92Q8j5J6J74j04k18K79j24k31Q2J7j45J86k36L17j17j98K29%J51l3j81
3993h7J26J22j27P6j41Q6Jj2J74j65j2j14K9K41k66O5r9P1O8j13J97k03J54k95
4017b24l2K63J00k82k2K00Q3j0M2K3N9j62k02P5J78m2k37L88l73K03q5k17J3L53
4041I2j84J71j48j67K85j80K4j00l3J78j76J29N5j3j14N7K5O5K61j13k1M4J06
4064B43j71J22l3j76J30j45L3K31l13K52j11Rn7p1L3J13k4o3j80K27n6j76K9l8
4088a92j1J66J23p8n0J15k23m0J47J98n9R0r9P8j21j44J68k74J38L2k28O7R4q0
4112a83k14J62J17J82l43M25j27j3L51m54L68j89N5K18j23k0J56k85J98k40J24
4133A65j10l25K82oo1q0l1J42k76K16J0l8Q1J31L7oj54J38P4j47K11k27p4J46
$$ y = [-216, -24, 64, 49, 65, 239, 135, -83, 196, 72, -159, -77, -60, -205, -19, -255, 62, -55, -253, -24, -24, 127, 94, -87, 39, 161, 34, 110, -31, 55, 56, 44, 218, 53, 41, -73, -44, 197, -69, -4, -103, -32, 36, -77, 120, -83, 71, -224, -256, 7, 107, -175, -197, 3, 86, 76, 118, 141, 200, 38, -164, -89, 89, 47, -190, 198, -175, 28, -57, -274, -261, 92, -92, 79, -69, -236, 49, -131, -107, -207, -240, -62, -238, -109, -54, -67, -181, -124, -99, -34, 227, 114, 93, 137, 243, 72, 194, 161, -15, 115, -30, 3, 234, -79, 173, 62, 71, 14, -57, -24, 89, 65, 2, -178, 49, -7, -183, -154, -192, -203, -37, 86, 8, -42, 73, -150, -190, -43, 155, 96, 186, 87, 165, 44, -100, 68, -206, -68, -36, -264, -197, -103, -183, -397, -235, -118, 64, -279, 146, 19, 6, 357, -97, 271, 82, 137, 355, 232, 212, 368, 83, 281, 41, 165, 55, -270, 12, 6, -55, -135, -166, -24, -300, -84, -74, -112, -31, 100, 137, 131, -23, 115, 189, 42, 253, 26, -48, 98]
4157I8J01k21K21l64j7l3J43m6r4K76k56N0J41l58M87k03k45M26j80q2J01n5R5
4180a5q6qmq6K39j53j3J40q7Q7J2l5J50m72L37P8m9K37j48N1J65l30K19j02n7
4205G0J24l33K81p7l2Q2j33K8%k9J88l06K3J60M4M6m4l9l5Q1q8J59j28L5J65m8
4231A94j36p8J9N8k03J33l21L84m9k89L66k79P0j41q4J96N8j33K87m6J47J08k89
4254b8k1j0j3J94j74M18k48o0j24m4K74j64j14n6P9K19nq6O7j73j66J50J6J45
4278G6j09K58j17k33J18r6P6K25k95K27J11r2J3j56L9Q4l13J16L3RNj40J70o0
4302e1k29K56N4K36k31j62J63l4m8K5k01J52L9J3K85k90R6j48J47K15l50K07J61
4325C05j64K5o6O5N6j29k46K58l04Q8K69k19lo5J5R0j94R6P7J52J05j27P7m9j5
$$ y = [98, 199, -22, 199, -165, -182, -215, -72, -118, -212, 64, -192, -142, -1, -359, 128, -75, -320, 106, -74, -156, -55, -110, -15, -101, -109, -113, -199, 40, -113, -126, 14, -73, 14, 26, -9, 141, -331, 6, 84, 35, 272, 124, 175, 340, 10, 229, 127, 70, 194, -139, 142, 65, 33, 115, -18, 10, 10, -19, 169, -137, -114, 46, 90, 136, 92, 53, 18, 99, 11, 170, 42, 77, 242, 194, 58, -20, -1, 57, -146, -13, -334, 50, 1, -288, 78, -201, -131, -272, -356, -160, -102, -235, 52, 6, 153, 261, -28, -49, -59, -72, 122, -52, 366, 118, 58, -66, -110, 164, 0, -114, -170, -91, 128, 123, 37, 104, -69, -235, -85, -69, 76, -33, 225, 108, -125, -7, -103, -27, 198, -97, 130, 241, 149, 162, 6, 45, 129, -184, -68, -35, -26, -21, -161, 9, -51, -280, -24, 30, 266, 35, -127, 36, 2, -46, -21, -222, -70, -31, -18, 267, -23, 73, -75, 72, 287, -63, 144, 305, 141, 166, 100, 165, 221, 92, -154, 104, -200, -112, 157, -62, -65, -130, -115, -25, -219, -123, -46, 106, 211, 84, 161, 112, 97]
4350I7O4n2m30L70j70J14K1J0j22j60J79L5N5rj37P6K1k47L25o4j31K1pj1q8L37
4376I7o5q4K17j86j46K16j58M4m0P1K09n58K09Q6k69L69k82K11J78Qk0J65k96
4399b4L40Nj43n7J25J8j74K13j64o5m6Rj06J31k02n5J38j32P0j36K81J20l07J66
4423Ej65L62j44j52J38L2o4J75k40O1J28r9q8lJ30j55k24K32j98OJ49p6K86j94
4447i8J72O0j62K4M3o7J34J09O0J47l42N6o6J43k05J89j03k0j69o1K48J2j28j23
4471a47J35j29J02Q0N9r7R8j22J02J8O7j42O8R1j70O9q2j74J4J84J5l32J01J09
4495h3k49J0K07n7j77K22Q5N7J18j29k2J03j16J54n8K3pj52J80p7j09L1l0Pj04
4520a73K40Nk55K87j77O2J52k17K29j37m5K08Lk9rr8N2K5N7l24J90k36N3K52O8
$$ y = [97, 161, 109, -321, 49, -121, -7, 14, 24, -98, -258, -79, -44, 11, 2, -135, -59, -38, -285, 40, -24, -155, -134, -141, -152, -240, 97, 32, -52, 165, -21, -167, 49, -109, -65, -105, -34, 175, -383, -174, -88, -357, 12, -270, -59, 119, 127, 107, 272, -24, 316, 321, 178, 121, 246, 264, 90, 303, 139, 74, 28, 37, -69, 62, -140, -195, -57, -189, -119, -255, 26, 146, -161, 5, -160, 202, 58, -94, 44, 76, 12, 187, -53, 8, 136, 37, -51, -54, 76, -79, -303, -71, -269, -263, -114, -190, 96, -98, 74, 134, -28, -4, 39, -28, 106, 215, 275, 422, 80, 136, 70, 213, 8, 197, 94, 74, -95, -156, 92, 104, -24, -147, -12, -141, -39, 41, 100, 3, 101, -21, 81, 99, 166, 24, 92, 183, 13, 82, 0, -174, -160, 24, 39, -293, -192, -83, -332, -322, -115, -172, -349, -127, -42, 15, 133, 4, -18, 85, -31, 123, 65, 88, 81, -71, 109, 32, -77, -46, -76, -69, -173, 67, 72, -183, 104, -73, -11, 141, -76, 153, 16, -29, 179, 182, 153, 144, 46, 98, 123, 180, -144, 46, -190, -137, 115, 183]
4545A83k44Q9k9m1J15k0k68L03N6r6M8l5l5o5J14J7r3L7l8q9J32k87K78lj01m0
4571a12p0K67l12K20J6l67L20L20k01O0p8Q1q2K58l04M9R1M0j13O3L6j64P8j43
4595d7Q0K8Jk87K29k6k45M66j13j55p9J11K11ml06J09K16j36J81j38j25J25q1
4618A5o1J59R6j2l5q3l3J0k8P8k96L79l23k9K01m0lj7O5n3k62k7K54j89N2J10
4644g2N5k57J69R8l6L2K12J17q0m5j98K3J6L4j00Q4j92m9K59m6l40L75j05j22
4668a68J05q3O9J10j65OK6J39J1J7k45J20Q0Q6l17L77k18J61k37J80j18j50K16
4691Bl5o6J47j72J49J26p8k81J71L1n2J36m6r5j66K63Mj79J36J89k51j08lJ54
4715b4l1o1J01k27L74l55r2O11k46qK2O2l5k2K98O4j57j53Q5k46J63o7l13J80
$$ y = [183, -61, 28, -1, -42, 73, 53, -215, 88, 144, 48, 96, 61, 26, -39, 75, 92, -1, 36, -2, -91, 41, -246, 32, 29, -72, -112, -182, 85, -227, -7, 9, -358, -38, 282, 81, 141, 63, 144, 62, 320, 16, 65, 156, 196, 83, 146, 182, 18, 96, -47, 33, 61, 62, -225, 4, -22, -267, 199, 86, -69, -148, -37, 174, 170, -136, -27, 189, 53, 234, 96, -29, 96, 15, -46, 113, 209, 197, 162, 79, 46, 56, 28, 106, -190, 189, -134, -163, 38, -2, -5, -22, 43, -10, -272, -299, -45, -234, -182, -72, -17, -274, -105, -7, -43, -11, 201, 318, 238, 193, -5, 18, 34, 68, -32, 52, -140, -189, 70, 24, -316, 59, -46, -168, -63, -146, -77, 33, -132, -126, -100, 39, 50, 67, -178, -58, 22, 108, -209, 168, -50, 111, -126, 54, -64, -214, 2, -33, -99, 48, -124, 25, 151, 73, -208, -37, -6, -58, 78, 32, -63, -229, 34, 38, -141, -5, 184, -67, -175, -178, -24, -55, -116, -15, -242, 132, -223, -315, 296, 50, 42, 64, 126, 91, 69, 367, 431, 274, 121, 206, -40, 123, 56, -257, -77]
4739g7J26k6J6k79M08l70L44k71P8M8o8R5N6m9o2K13l02L77m83K71j11N9j02N0
4763e9J8R4k35o6L42K2l27n7K84k5l0N0J9p4j31K52M1j69J36Q0k18q4L8K16kk35
4789a20M3m9K26j35N3J03l7m1J2j25N5O3K1J74m5l64K37k3j98K38k6J04j29k8
4813IK3k23J54R1j45K6m3J46j8Q5j47p4Q2J26r0q0j17J46J08j13QM6r2K50n7O0
4839A61j48j16K81o0n0n7r2J69K8K3j03k9J6L5q2j26J07LM8k4L9J33j62J12k51
4864a45L69l74K75r4k23J46J32l11O0N3Q2q2Q3K01j21P8k46J99r3l5n9j7J42j0
4888A0j03j4p6J57J97j12j22J66k64M3J11lL4KP5J5J0j47J09l10J65K79l91L7
4912a32r0L6p5J56J19j67K69r1k9r9K69j91M5k1m8M7k01L67j30O2op7N0Jn4j16
$$ y = [-77, 49, 23, 39, -240, 168, -202, 142, -129, -51, -3, -71, 24, 80, 31, -31, 182, -120, 257, -226, 45, -66, -7, -109, -59, -41, 53, -182, -248, 94, 116, -211, -268, 16, -9, -39, 11, 30, -44, -175, 77, 118, -51, 85, 165, -53, -137, -99, 117, 115, -120, -77, -126, 100, -35, 18, 121, 84, 43, 55, -70, -15, 48, 69, 243, 198, -166, 71, 48, -150, 88, 62, 166, 37, 9, 32, -191, -37, 54, -91, -65, -108, 38, 20, 105, -42, -116, -34, 92, 2, -78, -195, -49, 59, -54, -46, 0, -92, 158, 101, 161, 13, -103, 178, 118, 68, 11, -81, 88, 116, 139, 36, 7, 23, 58, -24, -150, -43, -40, 8, -16, 23, 156, -6, 106, -145, 224, -150, 125, 31, -192, -46, 86, -225, -165, -112, -30, -112, -29, 172, 51, 129, -117, 82, -11, -46, -105, -122, 20, 10, -93, -107, -183, -26, 171, 59, -63, 103, -161, -118, -7, -10, 24, 26, 101, 116, 126, -21, 88, -222, -57, 222, -169, -132, -222, -186, -261, -105, 14, -153, 116, 25, -4, -103, 166, -25, 20, -1, -49, -2, -203, 164, 34, 96, 90, 13, 63, 64, 10, -106]
4938a06o7K66j31n1O3K27k37J8j13p3q0J28k3L36j97K6J10j66J08R3k9k34K07
4961G5J25k36K16p0j63j96kJ61J8K51q8k19O4M7j46L20k23K20j23Q7K1j58R0n9
4985A2l4k66K30L3L9j93K29j25j55J57K7j12K13k7k0j9JJ96j36m1O3j4m7j46J54
5010A9O6j20m8J92J28k92p8Q5M9J5J64r6j74j2L0K3r9N0m6J95J47m0j64j35K08
5035F7L8N0k89K29j95K11n4k61K34m8j98J74o8L00j34j5P3N0j2k29jK55k75K20
5059A22J3m3q2n9J43o7J1j01n2kRJ92M8k01n7n5L2Q7K8l7J36o9J78j04K1K8l48
5086b29P9J31k7Q4j53J5J1J04J28j76j07K04m3k7q3J7Q6n6J07j86P4N4Pr6M03
5111C21k84j39J74j53J66j52j47K23m8m7k5J39j16L60l15K05j43j9N9k14J90M7
$$ y = [-106, -173, 93, -38, -89, -26, 201, -36, -18, -131, -204, -284, -156, -179, 157, -40, -14, 96, -70, 38, 131, 102, -132, 75, 200, -36, 180, 110, -53, -249, -251, -90, -72, 179, 91, -128, -64, -17, -163, 157, -66, 154, 31, 118, 139, -19, 71, 12, -22, -288, -58, -25, 14, -179, 50, -75, -230, -73, -46, -158, 55, 28, 8, -11, -10, 186, 50, 9, 72, 58, 11, -135, 19, 85, -35, -83, 109, 237, -55, -133, -48, 1, 16, 180, 84, -90, -102, -72, -49, -148, -98, -144, 51, 198, 158, -6, -141, 67, 105, 155, -134, 95, -100, 111, 57, -204, 30, -18, -216, -42, -110, 190, 56, 41, 114, 164, 152, -77, -78, 177, -98, 122, 135, 92, 10, -49, 94, 27, 38, -63, -115, -117, -108, 84, 132, -69, -126, -181, -149, -62, -34, -71, 65, -4, 174, 70, 91, 119, -229, -150, -19, -46, 38, -115, -100, -89, 15, 143, -33, -140, 64, 21, -6, -89, -72, 14, -42, 65, -121, -47, 7, 14, -82, 321, 37, -102, 72, -81, 85, -67, -214, 9, -39, -86, -111, 28, -88, 272, -43, 162, 19, 0, 59, -155, 35, 82]
5133H2Q9j27L9j0r6M0j41J87j77L1L15j79k80K05J22j41O1J31k07k7J1N1p0KR5
5158FJ76o0n0j84N8q7L2N7Q9mj70L31l76M64j07j86j05J18J75l07K40r3j01m9
5182a33J51R8j62n7n1J83J12j59QM1L1j10j5J16j9pQ0j05L6Rj28R2j13j05K42
5207C5l5OK98k43j0j42M5K09n8j39o1k2K98m02J16O2j18kK44l71L77j8o5J35r0
5232D9k4J18l47L15j5Kj6j5k06L21l03J63m7O5j44K45p1J23m18K54m6J30k58n4
5256a79K99%j20n3J27j69K16mp6J7J51k08k1o3J19k3q0K12J24k33R6k4k11J86
5280H3j23P9J58o6j44J73j43j54K46l4j94L4k5J13J43q4k39K6K05j43J04R2j52
5303d5o0L8J16n1K19l11K3J19j79L03j85K7j05J69p3P9L3j75J7Q3j58J39N3o8
$$ y = [82, 171, 44, 83, 73, -23, 17, -124, 63, -114, -83, 232, 53, -227, -22, 100, -41, 20, 151, -56, -83, -72, -21, -91, -89, 6, 182, 122, 72, -112, -54, -141, -109, -52, 37, 33, -137, 194, -182, 282, 175, -11, -116, 2, 177, -130, 110, 17, -84, -133, 18, 116, -46, -103, -154, 29, 141, -18, -10, 31, 62, -48, -63, 53, 34, 27, 107, 2, 38, 47, -81, 11, -102, -207, 35, 0, 6, 304, 61, 51, -91, -46, 163, 105, -34, -95, -117, 181, -221, -105, -43, -161, -163, 81, -290, 87, 69, 4, 139, 49, 25, 143, -204, 111, 96, 98, 82, 67, -139, 182, -121, 42, -5, 60, -84, 161, 90, 213, -205, 49, 3, 133, -125, -179, 120, 120, 0, -53, 74, -95, 121, 117, 41, 58, 209, 1, -20, -83, 36, 13, -67, 145, 269, 36, 132, 108, -103, 83, -40, 39, 197, 131, -13, 160, 17, -137, 109, 75, -119, -85, -110, 3, 146, 62, -177, -151, 54, -89, 15, 107, -45, -105, -67, 49, -2, 217, -94, -71, 48, -131, 172, -13, 14, -91, 78, 5, 84, 117, -58, -41, 42, -116, 23, 76, 8]
5327Hm1LK85k65k0n5J28Oj20k35Q6L53Q9j04p6o2Mj08J28J7P7J39k5k09l3p8J36
5354B8J35j65R0p7o9N0K84k92n4j06J14R4j98J82q3j35K18qlN5l95L48N9N4o6
5379F0p0r8K1K13j17n5J88o4Qq0j63J41L7o5O2L0J07NN7q4j36n5J58n5k10J90
5405B5QJ10j76J17Pq0n1J49M1l64L18o5k08K26j4L1J54j89K6l9j31N2j39M01L8
5430B47l23L2K4M8J85j7j25j49K32r2n8n3J28j61R5K8K2J6j99J12k35M59k47K22
5454A91l3o4k31K26P5j34j9O3p5J9q6j23J43J79J01j53L2k08J52rq2k5K42k90
5478a09J53J5L2k26M9K23K0n8q8J9j80J30J05J19j5k68nK07j36n0%j8J70r4J47
5503A42j24m2k31K34m4K48j21M1m9P0k53J73n5n0J47m5J16j56M9m5J46M0j56K2
$$ y = [8, -33, -30, 255, -10, -30, -85, 43, 49, -71, -306, -220, 133, 222, 118, 42, -20, -16, -124, 4, 21, 98, 237, 212, 3, -30, -108, 28, 163, -2, 88, 11, -58, -8, 276, -16, -70, -176, -62, 32, -166, 16, -67, -202, 16, 8, 5, 60, -335, 13, 72, 126, 60, -10, -108, -87, 126, 9, -46, 142, 78, 86, 6, -157, -16, 21, -44, 18, 48, 155, 160, 217, 133, -3, -58, 100, 45, -165, 25, 33, 143, -33, 84, 91, 11, -40, 109, 150, -214, 104, 39, -169, 57, 43, 74, 228, 39, 65, 26, -105, -53, -192, 209, 247, -76, -44, -20, 28, 213, 196, 71, -78, 154, 62, 4, -49, 79, -82, 13, 41, 63, 79, -120, -8, -243, 216, -31, 191, 158, 94, -137, 89, 164, 30, 11, 74, -1, 18, -68, -191, -48, 131, 232, 79, 111, -97, 55, 46, -36, -61, 181, -109, 44, 59, 91, -135, -86, 137, 157, 99, 11, 30, -150, -20, 85, 204, 189, -79, -84, 123, -13, -63, -63, -81, 89, -5, 142, 18, -24, -255, -21, -65, 183, 62, 103, 54, 124, -129, 44, -11, -61, 86, 41, 157, 1, 50, 5, 151, 191, 35, 57]
5527E7r0k9p0J29j47K99o6jj55J57j06j54N78l11j8j63O4j33K63m0n5k3J17L1
5551A34Nj3j53q1J62o1O3j22J09n1N2qj08LK22k4p2Qj32nl4J51p4K55k57j25J71
5578A5p1l7N0J51j13M1l18K79m2PP7kJ6pO8j80MJ02n5n6J18q7j11J39k6J08o4
5605Fj26L8J42OokPj58J52M3k2k14N7J25p0M4J38j50j35Q3J13J9R8k01K01l14
5631a26J34n6m3Q4qJ39k34K78j30J80k38L7o5K66l10J36jM8N4l04K6J93J4O1j9
5656A16r0k24K84m2p0K11k22L1l8J00J13j18k71L25j21L64l38k1J17M4l06L80
5678B24j41n2N3j02M3J30Q3l33K22l9J67j75O7k85J98j03J26l2r5J05q6L6J69
5701A80j38l4K3K1q3Q6n5O4qj21Q4J22j13j8J2j38P1J56r3r7j01L27JO4k47O7
$$ y = [57, -33, -62, -132, -3, -150, 149, 83, 82, -73, 84, -22, -176, 402, 91, 73, -90, -26, -159, 104, 64, 9, -14, 103, 134, 139, 126, -27, -108, 54, -7, 56, -66, 43, -8, 44, 36, -72, -69, 153, 129, 57, 65, -67, -72, -106, 45, -29, 226, -31, -156, 15, -56, -93, -43, 108, -5, 36, -282, -3, -45, -38, 39, 37, 53, 46, 114, -66, -62, 40, -15, -71, 47, -40, -151, -12, -38, 70, 6, -120, -82, 60, 66, 60, 58, 65, -93, 59, 102, 80, -134, -77, 48, -22, 22, 160, 10, -125, -42, 71, 90, 188, -13, 188, -126, 8, -48, -91, -7, -15, 124, -110, 168, 38, 218, -20, 17, -48, 218, -92, 44, 43, 91, 145, -159, -133, 60, 74, 135, 116, 26, -198, 86, 44, -26, 185, -37, -6, -44, 56, 169, 51, -220, 105, -16, 348, 10, -11, 106, 150, -156, 224, 83, 31, 84, -18, 25, 155, 238, -95, 127, 88, 255, 80, 147, -138, 60, -43, 83, 51, -44, 61, -25, 11, 180, 42, 8, 31, 52, -31, 55, 0, 64, 56, -65, 19, 141, 28, 10, 22, -116, -45, 111, 18, -79, -180, 147, 148, 212, -35, 32]
5727C2P2j08L92k12q2m2Q7%j67j45J38J18j52n1Q7rJ89K2k55J64j20m7J92k33
5751a30m5J62Q8j60J3K72k34N9m7k7nK50j59j33J89j70o4K45j03k5O5l1J33j84
5775d1Q8O0j50J2K9k64L54J15k37J09j11o5m4K40k75K50j09J16m5j50o9J1J30
5798d6K53j36k06K89j13k42K88r9k6N0j97J52K9J40j76J9j4Rl2Q3j43o2K90o2
5822D8Oj35P6O2j05q7J36K76l68M4R7r7J06m8k73M03j79k23K51J36r2Qj48J15
5846Iq4J06o7J67j58J48k11J02Q9R2j71j93J30J08k59J98nJ68p1j84J18P7Q4l79
5870a86K25j67j7J07M8J85q6j74k3M9J88j71M8Lp3R2K09k00n0p9pK66l13L15j57
5895C2P2o9j5q5K15j26k68J20K41j66P5N6n7o1olJ23j05J40n1m13L63J90j9k08
$$ y = [32, 104, -4, 388, 176, 94, 52, 139, 139, -28, -173, -35, 83, -69, -120, -33, -42, 147, 169, -86, 78, -42, -89, 103, -130, -175, -13, 75, -85, -72, 200, -34, 25, -22, -49, -54, 196, 37, -96, 93, -77, -141, 104, 1, -24, 41, 10, 143, -41, 47, 107, -43, -31, -2, -266, 88, 203, -34, 75, -36, -101, -145, 95, -180, 70, -39, 77, 32, -118, -187, -176, -46, 207, 71, -135, 154, 41, -201, 87, -12, -38, 12, -185, -33, -4, 136, -40, -21, -35, -26, -58, 25, -118, -180, 110, 48, 54, -81, -5, 57, -48, -135, 1, 277, -91, -47, 50, -47, 59, 11, -262, 141, -38, -261, -10, 126, 34, 42, -106, 9, -75, 31, -36, 131, -27, 121, -90, 12, 101, 193, 22, -171, -41, 67, -192, 6, 1, 169, 98, -86, 32, 109, 193, -186, 39, -128, -145, -38, 10, 195, 109, -65, -88, -39, 149, -22, 26, 29, -44, 48, 257, 57, 7, -72, -79, 187, -126, 189, 32, 104, 35, 20, -65, 150, 24, -244, -124, 117, -49, 26, 82, 25, -36, -42, -45, 78, -27, 113, 62, -351, 12, 202, 183, -25]
5920b5J53j18p6K6K66k58N0n5j7J18j32J26J36j92M7m46K74j37L19K8R6l97J79
5943c5L3k18K24J18K1j59O3J10j35j32J26o9Q5K1J5KQ6p2k25K84p0r0J09Q6l7
5968A41j19J29m9j20m2N6k5k2J3R9l30L05O6j81J3N0K4Lk05K5k3J58q0K00M9j24
5994A1J13k40J97m7l42J32J40L8K09m48K59k56J14J65k2o3o8J0J51r3R2r2K2q1
6018i9Q9m0r4K09q0J11J40l17J32n2j41L42k91k7K5j21K09K13q1k40J33j69J24
6041b5l4K80L6m95J02JQ9J97j99p4P3K4J69M9r6o1j84J02n3M4Q5k0j63J24r7J69
6067D3N0k9k9j41K35k38n7J99p4R5q7L3J95k58J73p3J23j71j4l9L0k7K37l7j17
6092B2j35P6m3K60k40l1o3K62q8p6K33j67O4L6k4q9L2l0l0L2J94m82L38J14j88
$$ y = [-25, 128, 10, -66, -40, 226, -32, 18, -37, -54, 64, -68, 58, 194, 2, 49, -397, -123, -260, 59, 87, 183, -214, -35, -2, -220, 4, 122, 143, -16, 47, 157, 22, -110, 16, -53, 32, 53, 68, 70, 156, 84, -141, 143, 73, -17, 92, 178, 141, 22, 151, 102, -18, -60, -4, -29, -51, -38, 61, -269, 36, 102, -79, -66, -16, 8, 11, -194, -169, -192, -34, -114, 86, 135, 11, 124, -116, 81, 34, -308, -176, -36, 2, 211, -237, 22, -234, -120, 45, 23, -40, -108, -98, 53, -40, 52, -40, -18, -99, -10, -50, -144, 65, -15, 96, 236, -81, 51, -1, -142, 200, -91, -118, -93, -214, -5, 208, 127, -113, 20, -149, -25, -59, 221, 257, -238, -136, -135, -46, 151, -48, -122, -49, -25, 144, 193, 97, 36, -148, -46, -99, -55, 30, 10, -153, -29, -126, 43, 93, 64, 35, -106, 129, -109, -166, 33, -41, 54, -33, 0, 195, -63, 110, 37, 160, -11, -25, -64, -34, -61, 176, 139, 22, -113, -37, -80, 180, -60, -91, -154, 108, 20, -56, 177, 10, 74, 110, 86, -3, 29, -1, -31, 1, 195, -287, 51, 165, -23]
6117b3Q4p5j6K8j10K64j71m0J29j62R0l1j91J76J6R6j26m8J17K41l62J22o4N7
6141Ak9O5L4K14k49Rk02K7K94o0j83J54j44q3K52j65N9O0K4P0k08Q6Q1j74K19
6166A52k13O7J98q3r6j1j15j20M38k22J04q3LRj10j6RK48j68J51n7j73J55m8j24
6191a05k7J64J39J00k20J61j06M0o5k50R7J05j88J9J36j01J60K4j15nL6k52R1
6214a62R8k6K6R8p0l4K19nOq2l23K61k41J92O9j40J91j29R8m4n8j38Q4m1L5J61
6240D5k97K76j15J5K20j41kQ6K5J82k33k01L08l40K4J66k01K19O0j07M9m2J10
6263A06m3k31K10k6J28j77L9j03N5o1oM5op7P3jL7L9P0J1n2Kj0j6m7J10k79J61
6291d9Q2J70o2k47O1J27Jl75L27j36L24j35m7p7k3J97jk11L38k15j48J55L8k03
$$ y = [-23, 61, -14, -30, -2, -112, 152, -19, -59, 70, -92, -2, -33, -224, -48, -32, 64, -62, -110, 7, 248, -114, 8, -56, 1, -28, 37, 71, 285, 36, 45, -157, -130, 164, 104, -79, 75, -69, -152, 100, -65, -6, 54, 78, 148, -60, 26, 107, -67, 152, -61, 6, 204, 121, 25, 14, -101, -221, 217, -5, 99, 16, 19, 28, -82, -98, -89, 159, -9, 142, 85, -88, 67, 19, -105, -132, 32, 171, 271, 51, 212, 106, 146, 81, -169, -72, 33, -155, -136, 0, -101, 59, 83, -32, -37, -1, -253, -162, -64, -90, -64, 34, -36, -70, 149, 144, 150, 68, -255, 6, -235, -43, 26, -114, 77, -52, 46, 2, -56, -194, -110, -151, -116, 45, -252, 24, -91, -76, 144, 3, 1, 87, 112, 294, 61, -140, 168, -172, -148, 18, -183, 36, 96, -11, 38, -4, 106, 63, -168, 42, 16, 144, -33, 6, -97, -42, -103, -109, -64, -70, -147, -74, -75, -38, 1, 71, 82, 30, 32, 22, 6, -41, 69, -210, -49, 33, 203, 141, -106, -45, 82, 83, -292, 35, -101, 223, 88, 41, -36, -59, 138, 137, -74, 264, 49, -99, 56, 94, -109]
6315a09l5J2J14P8j33NJ19J9l9N7k39M8K23j18J46j67m9J13P7p2j08o4K4J00J28
6340A30Oj86J08k52L08j38q5K10r1J45m57K71k3J84J16m43J31J50p3J05m24J96
6362a12Q9J62k6J55j70k79L48j52l34L65j53J35rLN0l77K87l7J68k97N8m0L6J11
6386a9P0o5J10j33j40R0K9J1jK6p3J29j59J34J34j87M1J8p7R0r9K48r4j4R1j02
6412E8N0j04K15j39q0rL7J06k5k03J90p2p2J64j07j8n7J61M1r7LJ19l54J96K15
6437B18j92j64K74l47K32Q4K4k13O7L04j70k9k6om7P3n2J35l49J63J91j37m5M
6461hK8k3l1M2j88K85J78k59M3M0P5j49J83m4j63O2j06QNr4J45nq4o5L42k01j56
6488a40J93r9J31K1k24J78J79l38k25J76J02R8j47P9j0L3N4k22K18j70J16j10
$$ y = [-109, -144, -132, -18, 60, -73, -68, 51, 70, 31, 88, -151, -103, 120, 2, 148, -19, -68, 45, 122, 50, -58, -122, -98, 2, 130, 136, -50, 58, -194, 114, -24, -109, 101, 10, 155, -302, -31, -54, 130, 246, -197, -66, 84, 11, 116, -308, -112, -23, 139, 113, 268, 98, -181, 167, 15, -319, 46, -107, 28, 19, 22, 72, -305, -18, -55, 113, -184, -126, -166, -130, -19, 51, -14, 96, -37, -177, -87, -58, -47, -48, -22, -95, 34, -125, 9, 143, -44, -3, 15, -62, 28, -71, 177, 83, 69, 160, 58, 108, 4, 219, 80, 0, -9, 28, 134, 109, -94, 96, 24, -48, 116, 9, -9, -66, 95, 136, 39, 42, 161, -193, 3, 218, 26, -138, 136, -211, 21, 105, 129, -84, -17, 287, 117, 88, 62, 56, 9, 82, 30, 165, -184, -21, 170, 33, -12, -8, 20, -3, -34, 8, -180, 105, 283, 24, 67, 107, 182, 33, 216, 172, 9, 71, -35, -27, -22, -116, 29, 24, -60, -125, 217, 16, -140, 53, -46, 85, 106, -118, 60, 239, -99, -324, -148, -46, 52, -95, -16, -26, 7, 61, -161, 57, -113, 3, -107]
6510a07K45l81K97j04J95P9l66K36j6L8J51j98p3j33K01L2k3j55K71q2n4j01N1
6533CQ7K5r4N3j22j27J38j38L49k10o7P6M4J04m3q8L9j46K44n3l8j71J44P3p6
6558FQ9R6j71j44N5J34p7j37J35Q7j95L9J70P9k37O0J51k45M58m44J00k26J82
6581c5J56j33J84Mq2Q5k28J34j68pL6R6J17L5m08J8L16k11J76j15j79J69P2R6
6605A28j43R2j60R0j40J40J34k38K12m9l7J13j4j43k19K44n2J94m3j83K84k44
6627c4o8K30l9j24L9K53k04J5m6m7Mk1j4J51p2J2j98J51K61k40j20M3J54j68J97
6652A15mk06O6J85j77O8K8j01o2j3n7M27l38J13J47k15j28K07m6j09K20m8k4j1
6676C7m2j2q0j49K27Kk6rO6J61kk69R8l9J14mK2N1k87L07k36J2j9J77R6r1j9q2
$$ y = [-107, 138, -243, 54, -50, 145, 224, -142, 94, 78, 116, 267, 69, -4, -137, 64, 96, 73, -82, 189, 107, 53, -48, 3, 90, 115, 21, 74, -48, -175, -37, -175, 174, -36, -103, -27, 17, 121, 78, -10, 29, -117, 127, 74, 36, -135, 9, 82, 6, 95, 191, 20, -124, -69, 65, -12, -149, -14, 73, -122, -83, 87, 166, -71, -11, 140, -105, 353, -91, 9, -217, -35, 121, -12, 172, 176, 94, 179, -49, 85, -83, -90, -54, 42, 159, 194, -214, -196, 120, -91, 85, -30, -209, -40, 32, 128, -15, 77, -83, 7, -133, 7, 141, -97, 115, 66, 29, 142, 128, -15, -234, 10, -42, 152, 109, -74, 210, -34, -102, 128, 89, -35, 4, 257, 53, 68, 22, -25, -21, -42, -56, 95, 23, 35, -163, -12, 249, 9, -111, -68, 86, -82, 115, 111, -95, -29, 156, -21, 47, 75, -26, -88, -101, -158, 269, -69, 44, 191, -24, -152, 55, 9, -100, 120, 72, 48, 37, -5, -17, -97, -246, -19, -17, -43, -52, 14, 175, 173, -96, 2, -37, 77, 73, 95, 146, -141, 166, -70, -58, -77, 100, 196, 105, 86, 4]
6704DJ06k45m0J45J21k11L6J10l5J29j15Rq2J2l4J57Q1k02J72l5mj73J41jk01
6729a55J02j5K6j47J66K4J81j00P2Qk84K23k48L01k09N6M7J43r7q3J03k29J27
6752A2n6J46k74J14K3J14k11J73Nj4k40K63O1o5J09J9k02r1N4J44k6j38K2J29
6776G1k03J78j29R4J31Kj84L55q3k49o6J1mj9O5j37R1m4K55k14K11k85J85J22
6800A54k49K2J16j05L35k25m7j92K85P3m53J83J44j6q8J15q4J49r2M7K4k65O4
6823a05k5L49j72K3J60l93L10o3j25N6j46K40lN8k0j08j07J46k5k5j71J45N8p4
6847a7KQ9jk72L58j97K64l10J26R5k68K2L54k65J33O6k05J51j28J49j33r4K78
6870A97k15j13J81Q2o5m5n1K6r4p5J63j79J78j41K18j56j1R0n7J38j1j38J92L6
$$ y = [4, 110, -135, -175, -30, 91, -120, -84, 26, -9, 120, 5, 14, -68, -56, -90, 67, 148, -54, 118, 83, 79, -94, 47, 46, -155, -53, -68, -42, -189, -23, 1, 182, 82, 154, 162, -122, 101, -147, 154, -55, 1, 48, 191, 94, 11, 114, -115, 12, -44, 102, -172, -58, -35, 79, -132, 41, 46, 32, -208, 55, 116, 51, 160, 179, -23, -114, -60, 84, 58, -80, -58, 71, -132, 46, -83, 11, 142, 144, -40, 315, 232, -17, -83, -72, -76, -95, -30, -167, -76, -120, 135, -79, 132, -153, 32, 154, -95, -73, 43, -62, 273, 48, 1, -191, 94, 167, -286, -103, 41, 25, -63, 52, -32, 117, 25, 72, 96, -169, -105, -130, 219, 47, 70, 230, -163, 147, 84, -41, 15, -131, 109, 106, 164, 144, 36, -71, 75, 50, 25, -146, -1, 57, -17, -15, 74, 73, -199, 159, -38, 226, -84, 42, 137, -131, -109, 245, -20, 113, 179, -26, 125, -3, 146, 13, -81, 197, -18, -131, 50, 132, 67, 22, -29, -3, -97, -172, -9, -188, -10, -151, 67, -89, -100, -10, -67, 71, 60, -78, 114, 150]
6894A50l23J63j38Q9J57m4Q4j69m1P0%J06j35L4J1k6rR5l13L28n2L0m1m4M1j44
6920a21M9o3K97l06k7K72J15j78n7J56q2R1j06l7K4l14L08l2O3n2j08J39J32k40
6944g7K69k23N7r0O4O7j9n3q7K4J04L6Q2j67q3L2L07j78j50J33l6j67K07j19O6
6969aJ76j48Pk12J90K1k6P1k2L1k14K46q8J24j74P7J3j01l7J83j06J8j66M4J97
6994A03%j22l2j6J52n2R6p4n8k7J52k16M2J89p2j19l0J23k71M07j52Rm5r1J26
7019B2M2m6J5n4J64j18o9J30k57K13j25J30j16J03Q1j07J19j52n6l0J70l4J70
7042A95J1k52J93k96N0R5l0J24J27j57j12j36K89l5k4L5j28K2J12Kj21k6P3J68
7066A79k45R5K1o7M9pj59J16Pn7J74k61K61j82KK2M1L2L3j86K7J09J64M4l42J19
$$ y = [150, -173, -10, -148, -59, 98, 54, 138, -31, -72, -2, -2, 104, -31, 3, 14, -12, -21, 74, -239, 89, 37, 67, 26, -18, 23, -121, -72, -135, 162, -144, -171, 101, 216, 38, -19, 137, 55, 146, 40, 3, 27, -287, 21, -11, 52, 0, -108, 31, 163, -77, 192, -31, 26, -64, 0, 67, 48, -5, -92, -68, 36, 72, 154, -13, -96, -64, 243, 65, -85, 48, 12, -155, 52, -67, -1, 175, 27, 34, -178, 12, 33, 7, 78, 56, 87, -127, 119, 31, 155, -19, 58, 71, -30, -67, 116, 10, 28, -138, -94, 103, 103, -19, -51, -67, 85, 33, 129, 55, -3, -30, 122, -94, -52, 137, 65, -54, -84, 39, -232, 175, 23, 32, -13, -104, 22, 64, 18, 33, -21, 143, 25, -44, 86, -171, 42, -83, 47, -69, 34, 115, 8, 127, -25, -81, -111, 59, 25, 195, 206, -46, 147, -149, -99, -4, -34, 90, 217, 60, -52, -188, 101, 66, 42, 77, -51, -29, 83, 85, -36, -62, 11, 179, -66, 29, 50, -17, 32, 25, -134, -18, -11, -68, 106, -155, 106, -76, -74, -52, -11, 21, 54, -132, -105, 4, 168, 212, -130, -11]
7092a1O6K13k21k81J11J67k57K90j33K8l7n7K3R5p1L5j37K60k03J49J72j47j19
7115f5K08O7l96J65J8K3j1L35k59j50K41l45J36LK92m95J54J22m7Ll4r8L03j61
7139Ij28J38nj07J8M8o1o1J61m6l7K38m2N5j50j73K08j26K06k24M1K2lJ0K5o3
7165d7J54l18L41j85rkR8j29J44n1l6O7J3P1R7j82J09j42R2j39j48J55J03N9l46
7190b31l9K70J80r9l47L48n9j8J45q9j28J09O8j17J81l04J25j6K05k67K04k74
7212a53J33J81n1k37J20R0j39J52p6k6Nj0J09r3j03K3M8j04N6P6k16K37J0q3n1
7237a02J20k34K40O7k60l0R4J86k66L71j49l1K5q0q1K4N0n6J82j95J83L0k94L22
7261A16j43J12J33L0k59r3oJ38k3k8n3KK68m2j85qQ7l0q9L9Mm3K79j43J28k31
$$ y = [-11, 55, 268, 47, -234, -123, 44, -213, 77, -56, -28, -65, -122, -99, -4, -75, -40, -177, 83, -120, 29, 201, 54, -65, 143, 210, -186, -21, -3, 20, 9, 344, 85, -65, 176, -169, -33, -30, 262, -233, -79, 43, -4, -1, -35, -133, 170, 9, -119, 19, 14, -93, -75, -27, -88, -149, 12, -34, -71, 167, 125, 180, 30, -143, 65, -61, 145, -79, -38, -16, -19, -9, 16, -47, 107, -211, 130, -55, -64, -66, 32, -97, 47, -4, -40, 27, 40, 111, 208, 26, 135, -7, 85, -54, -202, -47, 56, 115, -231, -270, 0, 180, 81, -266, 82, 23, 5, 150, 61, -67, 42, 110, -7, 174, -130, -5, -21, 184, -83, 121, -153, -20, 161, 110, -127, -7, 83, -56, 96, 20, -6, -1, -11, 98, 5, -98, -75, -27, -131, -75, 1, -215, 22, 32, -51, -102, 18, -216, 24, 91, -169, -199, -105, 81, -185, 186, 37, 6, 31, -49, -130, -106, -56, -112, 70, -125, 58, 88, -206, 116, -27, 85, 218, 248, -11, -104, -110, 28, 5, -23, -76, -74, 194, 152, -33, -41, 46, 16, -73, -34, -30, -73, 206, 63, 191, -40]
7287d0K66k27n2j3j3L1qR4P5l7j35J54j15J18k17O0o7N0J56j98R0R6r9J95m8k1
7313I5r7l6n5j52L72m7p4o0L41l03P4J9j34J47k24R5J67k91J73R7jRl24M06r4
7338A03j26P8J3p8q1nJ81j72J38j64M7n3l1K31M8j60k4J01J05k28L64l46j18L21
7362A44j76J59k74P9K20q9k8KO2KN8j97K4J59l68J07J40j59J46O3j36o0O2K03
7386A43K7j38j14J18M3n6L9j25J75k51J94l2k03K35m8J50k89K81k54o8J25M8j82
7409a82J70L4J7k92L18M6L4j08l46L27M2n6p3K00j85L2RK26k82L9q6J45j04jQ5
7434Il0O4N3j66J24j75J01J80k60J26Qj11j2Q1j3j2o5L65k27L1qoko6j42N1O8
7461c4l5J71n7q8j78O1J08Q6l26L03q2Pk3K80j02j47Q6Q9k34L9j59K37q1L48k67
$$ y = [-40, 226, -1, -53, -66, -79, -48, -56, 38, 113, 76, -59, 95, -20, 98, -119, -59, -126, -76, 80, -118, -28, 68, -31, 164, 116, 95, -2, -38, -93, -245, 127, 80, 6, -54, 287, -16, 58, 77, -57, 90, -134, -39, 128, -163, 10, 107, 106, 115, -209, 197, 103, -23, 55, 68, -10, -91, -96, 85, -87, 51, -113, -66, -119, -150, 81, 129, -31, -55, 46, 151, -77, 287, -59, -177, 144, -32, 127, -147, -68, 152, 63, 35, 37, 99, 101, 159, -38, -14, 145, -223, -116, 24, -135, 11, 74, -62, -122, -60, 143, 170, 32, -82, 36, 79, 23, 62, -63, 112, -139, 55, 23, -180, 55, 7, 157, -132, 149, -105, -173, -48, 0, -182, -12, 22, 39, -253, 65, 111, 145, 37, -309, 18, 60, 4, -69, 131, -54, -22, -13, 213, -69, -30, -116, 29, -75, -76, 9, -21, 43, 96, -70, 54, -121, -20, 160, -100, 26, 34, -77, -89, -8, -21, -33, -98, 267, 40, 71, 63, 57, 55, -11, -153, -102, -34, -69, 102, 45, -43, -221, -160, -52, 34, -292, 11, -71, -64, -87, 193, 91, -56, 30, 119, -115, -76, -235, 2, -79, 269, 2]
7486BP3r0J8L5j01L6K24k94J39j3k20J42J05m1K0j08p3J91j49J19j74J27j5%J80
7511A33j55r7P3o3J2J06o5J03j66J40m1M1R6j44mJ54j59J54k20K32j51o9Q4j80
7535a86J95K7J36o7k20J35l8K14j30J52q3l53J25J30Q1m5j6o7q8PJ37P4n6R7j79
7560a8K31m09J31J19pOk2l2J0J36j66n3J76J02l1l87L59k72R9j7K58k31m9J1J03
7585D7n9j24J86J47k53Q2j40J19R0j71K39k06L9L9Pj88N6J96K8Qk32O5K5j3O0
7610D7j84J86n2J86j33M4L0J04r8k81P4J32j14j01J22K78k95J9j23K5j45L16j69
7633a32J44q9P5q8J5j27L9J24r0J98K91l79L1L8j80L03m18K72J21j16j30J54j04
7656d8J95j12k8j50K81K9k25j24K78j15k04J49N9p3J62j39J14m6m1j69j10M22
$$ y = [2, 75, -15, 3, 38, -63, -27, 197, -97, 42, 29, -191, -49, 56, 15, 35, -73, -146, 45, -104, 15, -159, -32, -47, -47, 133, -22, -119, -46, -109, -97, 9, -56, 47, -119, 21, -20, 21, 117, -27, -31, 123, -36, 118, -102, 130, -21, -90, -6, -186, 9, 36, 172, 105, -115, 20, -18, 196, 66, 218, 135, -218, -93, 37, 118, 73, 57, -10, -98, -91, 46, 120, 64, 161, -18, 213, -196, -65, 54, 47, 53, 31, -1, 9, 145, -21, -74, 102, 204, 173, -214, 145, -127, -28, -45, 213, -18, -67, -56, 47, -12, -136, 50, 197, -56, 26, -114, 5, 95, -76, 163, -43, -4, 35, 42, -146, -90, 106, 134, 142, -90, -25, 0, -13, 47, -137, 49, -3, 183, 50, 94, 124, 228, 130, -151, -77, 55, -59, -160, -38, 240, -55, -36, -159, -134, -279, 37, -132, 12, -77, -2, -90, -75, -202, -163, -39, -129, 69, 360, -19, 12, 50, -130, 173, -245, 27, 148, 32, -98, 56, -48, 147, 35, 7, -143, 138, 167, -58, -182, 96, -19, -223, -74, -15, -88, 74, -65, 49, 3, -38, -207, -317, 105]
7678A05k50Q5K2K76j62L0k71R2j43K28m3P4N6j60K9K26l87J20O3L0K1j59K55k14
7702g7J12j33L8K52j69R7k59P0K08j34J7n8j8j06J62j9N6M0L5N1j36J66j81J49
7726A63j07O7j62R2kj65J36KP8j75L2O4j0J11k45K7j8P5M3j6N8qk4Q4l64J14R8
7753e2m0J14ln0J13j40Q3M8O9l12K28j41K13j50N8Pj29J52Q2o7j66K89j54L4K8
7778A14k6J00j22j26M1Q8j09J09j60J45l2j47J9K1M3P9n0O0k9m1Q3k55J68J64
7802A37j01j4n7l4J91K0k36O6N0j51J43j08NO7J71l37J74K37l01l2O8o3L5k5P9
7827a6j3l6K12j13J4k04J45o1k4K98k80J33k84L83k21K04m34L01j14M0R9n0%j15
7851a36K73k53J28n9J1Q6j74J90m8j41J68q7J68k00N4K39j76q6J0J32NR3k30M9
$$ y = [105, -145, -60, -38, 238, 76, 106, -165, -73, -216, 12, -31, 43, 99, -61, -32, 194, -193, -73, -10, 20, 41, -118, 137, -77, 35, -98, -60, 192, 23, 120, -139, -69, 139, 5, 22, -36, -54, -160, 2, -17, 39, 79, 114, 165, 29, 195, 14, 163, 56, 123, -39, 53, 51, -114, 22, 24, 102, -73, -41, 23, 13, 124, -121, -94, -112, -37, 6, -10, 48, 40, 16, 100, -264, -150, -52, -92, 22, 19, -31, 82, -58, 25, 73, 142, -170, 58, -83, 130, -20, 38, 45, -84, 68, 150, 83, -83, 206, 52, 86, 114, 88, 188, 66, -60, -19, 69, -40, 69, -91, 54, 22, -125, -106, -85, -42, 37, -13, 47, 18, -23, 60, -195, -27, 137, 36, 22, -35, -69, 122, 142, -94, -28, 22, -129, 14, -94, -89, -22, 149, -188, -14, 223, -78, -110, -42, -105, -70, -95, -16, -29, -65, 147, 34, 48, -156, -11, -72, -96, 202, -78, 55, -229, 154, -67, 137, -297, 4, -110, -70, 29, -21, -21, -136, 137, -116, 12, -47, -36, 50, -124, 66, 18, -123, 45, -42, 126, -74, -20, 219, 43, -43, -33, 99, 104, 197, -33, 16]
7875A6j36J46k94K00K63j97J11j8J71k92L6k58K60J24k23J06n2p0j7O8J52R9j15
7898H0j15j0q9P5P0K3k3J37N2k47K27l33J78J21j2j88O9q1J01j48K91j47j09K12
7922A34j65L8J86j73p3J01k10r2K86n0K82l65k4L32k95J59k50J20J03J70j01m6
7944F7k25K92m5j42K27k63J67j10j4JQ0J01j41J49k55N2J7k7J57l82J93P2r7J99
7968G3o9n3J03j10N0J33o4NK04k81j47J53N5n2j12O8Q1r6P2J41l43J06M5J64j5
7993A11qk12P0j12J24J03m2j81L03k97J84k73J36J1J30Q5m5j98R6J67k68P3J64
8016A21j04k0n5M5Np2L8N7r8P3K4J70l04J40M5q2J01k65L40Kk72J73lo2J39j95
8042e9J17o6J47oq8J77k74L0r8J00P8l69L03j69J48J47j13j79J62j77J58lj4n3
$$ y = [16, -120, 26, -268, -68, 195, -2, 109, 91, 262, -30, 6, -252, 8, 132, -91, 15, -37, -107, -124, -56, 96, 195, 80, -35, -45, -134, -59, 11, 34, 11, 148, 200, -47, 180, -153, 25, 146, 134, -54, 15, -66, 35, -113, 178, 31, -78, 134, -31, 7, 193, 20, -53, 48, -162, -254, 32, -18, 264, -101, -125, 207, -88, 71, -179, -59, 44, 214, 113, 67, -158, 134, 89, -53, 174, -89, 78, -32, -46, -45, 35, 136, -5, 144, -111, -59, -42, -69, 88, -294, -101, -29, -126, 73, 4, -49, 54, -56, -6, 127, 63, 68, 272, -9, -156, -3, 52, 0, -112, -44, 37, -59, 13, 154, -189, -83, -38, 126, 111, 103, -109, -39, -151, -27, 76, 34, -147, 156, -141, 43, -230, -94, -83, 47, 132, 87, -111, -15, 152, -116, -43, 121, 17, -3, -58, -13, -8, -80, -42, 15, -83, -10, 14, 184, -120, 20, 65, -17, 84, -181, 159, 161, -111, 62, 59, -3, 136, -59, 58, -8, 139, 133, 45, 222, -52, -22, -120, -20, 58, -311, -8, -177, -29, 118, 5, -174, -12, -189, -31, -34, -48, -101]
8066a01J15N7j48j67K09J4OQ2M4kj0k66J21K6J24r9j7N4O3k66J05R8N4l6k3O4
8092A01j58L3O7p8j3J88j89J47j86K82m0o2j06M7J42O5l36J73j69K08j96J11n5
8115b4m0K43j80R5K1j15k94K79K9j92K57K1j77m2J41K09k56m3o9J49o3J96j70
8138b5P3j28OJ32j57M3Nj09L12k57R9j08J55KQ2j23p6j30K39R1j19j80L28j96
8162d1j64K97j37M39k92n8J49k05q9J17J81j13pQM1J0Q5l99J49K6j37J69O5k06
8186a12O7M7j62K33o5
$$ y = [-101, 14, 71, -77, -244, -35, -21, -15, 67, 111, 109, 99, -167, -46, -20, 104, 5, -12, 42, 105, -161, -56, 42, 96, 60, 37, 101, -57, -24, 43, -35, -48, 140, -49, 98, -88, 194, 154, 92, -14, 33, 175, 240, -96, 77, -92, 116, -80, 31, -24, -64, 179, -1, 94, 115, 0, -294, -15, 14, -178, 79, 100, -77, -119, 22, 231, -25, -68, -137, 12, -51, 145, -25, 48, -80, -74, 58, -99, -56, -51, -160, 152, -105, -6, -114, 41, 43, 125, 2, -74, -204, 35, 126, 7, -173, 155, -41, -205, 92, -45, 394, 102, 44, 193, -12, -101, 16, 197, 84, 77, 85, 126, 136, 221, -178, -29, -3, -140, 29, 94, -112, -45, 2, -160, 73, 8]
8191H
$$ Imaginary data points
##PAGE= N=2
##DATA TABLE= (X++(I..I)), XYDATA
0@%%%%%%QqQj6J6j6K4m0N3o1P2r4J18j44J69k01K41k82L33l90M56n32O12p02Q06
31D30r18J043j186J343j512J699j906K132k380K652k948L272l628M015m437M900
47B571n407N959o566P233p968Q783r686J0696j1833J3123j4595J6295j8293K0675
61A0987k3567K7175l1823L8070m6968O0768q5325J42530n31534m31941L62380
72e09248n7275M2122r4215J61426J94017O7585j28684O5033K65351K72667Q8686
83C67465l7437j33951Q6817J11352p1484j39865n1834R8325J66448k7841j62618
94B05377j89186k6943O1539p7398j26590l8886O3738J64276K9286j37177j19059
105a91023L0110J15024L1756j4467N351O9634J91557L8583j53074r1045k4293
$$ y = [0, 0, 0, 0, 0, 0, 0, 8, 0, 8, -8, 8, -8, 16, -24, 29, -32, 40, -54, 64, -80, 89, -112, 129, -153, 180, -210, 246, -286, 326, -376, 430, -488, 555, -631, 712, -800, 899, -1007, 1125, -1255, 1397, -1551, 1721, -1907, 2108, -2329, 2571, -2836, 3123, -3443, 3790, -4178, 4605, -5081, 5615, -6218, 6905, -7690, 8605, -9688, 10987, -12580, 14595, -17228, 20842, -26126, 34642, -50683, 91847, -439687, -871628, -509248, -566523, -524401, -618616, -457190, -263173, -195588, -324272, -259239, 6112, 278779, 367465, 330028, 196077, 282894, 394246, 322762, 182897, 131063, 229388, 395836, 367995, 205377, 16191, -10752, 50787, -26611, -153201, -192087, -128349, 35927, 65213, -71964, -191023, -160913, -45889, -14133, -28600, -23249, 46385, 237942, 276525, 123451, 32406, 8113]
116H113N6966P1126o1031o7134M3586J05719J4061j11905r4776k6357R8563J23067
128A59998l3618l7978M0303N7321L8875r4209j37815m2723M7970P1314n4188j05306
140i0056k7433R43J6799o0973j28603k1373Q5352J05107J9890m4873O526M8455
152i0239Q7808K3764p7834K4572J05611Q7421N2422n8627n8100L6307M8452j3986
164A67571q4814l8683L1002M3197J6923j01987r6651K2352K6048N126m3587n8462
176a11965L8476O9245K5944n3362o8964L4218N9365L3732j1104o1133J9852O7479
188D1783J0398m2568o6697N801N6870L3898r317p0360k127O3978L814j7361m2035
201c3923j6332P3158M5203k1104n1555j9872L9376J8020p661l9565k5622O6555
$$ y = [8113, 65079, 136205, 75174, 8040, 51626, 157345, 171406, 59501, -35275, -61632, 36931, 159998, 126380, 88402, 128705, 186026, 224901, 130692, -7123, -49846, -1876, 69438, 15250, -90056, -117489, -116546, -99747, -160720, -289323, -310696, -225344, -120237, -100347, -145220, -138694, -90239, -2431, 21333, -56501, -31929, 73682, 161103, 213525, 154898, 96798, 133105, 181557, 167571, 82757, 44074, 75076, 118273, 135196, 33209, -63442, -41090, -15042, -9916, -53503, -111965, -73489, -4244, 21700, -31662, -100626, -66408, -7043, 26689, 15585, -45548, -25696, 41783, 52181, 9613, -57084, -51283, 5587, 39485, 30168, -40192, -42319, 21659, 25473, 8112, -33923, -50255, 22903, 68106, 47002, -4553, -24425, 14951, 32971, 25310, -14255, -39877, 26678]
213B6678L6178k9279l6918m2245K4423M4690q709k5555j4943M4367M1812k2041
225C8458l3430m1726J5890O0537k755j9997r218J5140L7228j5244m2683l8325
237c6125O119N9091M842j8890m776r118L2720J657m9369k1256J0662M4632K4359
250D4548j5861j5770j8115J8887K405n1214j5067M311K3296L6043k1089k9759
262c7385j0333M994J0193k5077q066J4939K5924M6207r748k8490L188J2J5585
275A943l00j3684J3424K0527K7976r939l7194o264j0841N618R498k5174N491J9007
289H8O158k465k8910j2820O98J1269J9858j2160Q233K3051j207R059j4980j9585
303a3713J3178R493J1578j379l678J0143p421J936j1483k4659J3472M271m7Q242
$$ y = [26678, 62856, 33577, -3341, -45586, -21163, 23527, 14818, -10737, -25680, 18687, 60499, 38458, 5028, -36698, -20808, 39729, 36974, 16977, 7759, 22899, 60127, 44883, 2200, -36125, -30006, 29085, 33927, 15037, 10261, 1143, 33863, 35520, -13849, -35105, -24443, 20189, 44548, 28687, 12917, -5198, 13689, 16094, -35120, -50187, -45876, -22580, 13463, -7626, -37385, -47718, -42724, -32531, -57608, -65674, -50735, -24811, 21396, 11648, -16842, -13654, -13642, 1943, 1643, -12041, 1383, 21910, 49886, 39947, 2753, -3511, -14352, -8734, 764, -24410, -18919, 88, 6246, 3781, -25129, -37949, -37251, -25982, -6124, -18284, -10051, 13000, 11793, 20852, 5872, -13713, -535, 8958, 20536, 19157, 15479, 25622, 18201, 20137, 8654, -16005, -2533, 1738, 1691, 9933]
317I933j2638P93J003m556k141j2842J0613P213j961J4593j0429k810J2508q155
331A124M983K635l14Q063l157N564o294p511Q972j1666K079O768j4056J967n732
346f575r099K838n239L727j823L498J3688p815L731J950p892J9808P291K151J2579
361C2818J678R527j485q743n644j2424J2004M329j1159M024j3083o220p54k2599
375a7731j1810m823Q633J6642j445M660l698j039J4241j2653m419J2293J0646
388I497K6290O024j0109p405r511K079j5792j7043K865r29J6498J960k8758j2735
402c7069j0484k762J513r623P374J6269K4228J4083k0084p957p20K522J6815n261
416a1156m2J9952J2453N404k2947k5693o866R5J5382k670p321K0001R234M170
$$ y = [9933, -2705, -1912, -909, -5465, -7606, -20448, -9835, -2622, -4583, 10010, -419, -3229, 9279, 1124, 6107, 8742, 8428, 16491, 13334, 18898, 12604, 5093, 14065, 2399, 4478, 11246, -2810, -843, -6575, -15674, -12836, -18075, -14348, -16171, -12673, 1015, -6800, -3069, -1119, -9011, 10797, 18088, 20239, 32818, 34496, 44023, 42538, 33795, 28151, 15727, 27731, 32060, 20901, 24925, 11842, 5622, 4868, -17731, -29541, -34364, -25731, -9089, -10534, -5874, -9572, -10611, 3630, -9023, -13442, -1149, 9497, 35787, 41811, 31702, 24297, 14786, 16865, 1073, -15970, -13105, -14034, 2464, 4424, -24334, -37069, -47553, -50315, -48802, -58425, -51051, -34782, -10554, 3529, -16555, -24512, -25232, -22710, -5895, -11156, -11198, 8754, 21207, 26611, 3664, -22029, -28895, -28800, -13418, -16088, -23409, -3408, 5826, 9996]
430I996j0779k7886Q92J5950K0951J1363l496J5854J1558K041p877l3128n494
443e5J8377R906P471j3603r187L277q351j7521l3717j2653J9957J3462J2791o506
457a6352j2069J5684N697n930j0718m067K7625K7680J2663o564k0546M916K203
470B0222j5199j3041j6125J2165K5133J539j2352k2357j798J0335m280k728p290
483b5776J3092L4266M445j2120j7067j0774J3105K815q004o439N708K7004N221
496B5476j4020j5641j3775J6783J3490q047k245K074J7681J0824j7689j9892j3814
509a8795J2020J7286q346n074q23R604J6834j3772k1221o783R465K0764k449j0854
523b144m907K252J4941j1475k5067m719N138J9637O616j4898m908N703J4163q24
$$ y = [9996, -783, -28669, -27777, -11827, 9124, 20487, 16991, 32845, 44403, 46444, 38567, 5439, -55, 18322, 28228, 35699, 22096, 12909, 16186, 7835, -9686, -43403, -56056, -36099, -22637, -9846, -16352, -28421, -12737, -7040, -12970, -23688, -27755, -130, 27550, 40213, 33649, 13103, 18019, 20222, 5023, -8018, -24143, -11978, 13155, 14694, 2342, -20015, -21813, -11478, -15758, -18486, -25776, -12684, 21582, 26027, 13907, -3160, -13934, -829, 1986, -6018, -12457, -6749, 20255, 25476, 11456, -4185, -17960, -1177, 12313, 4266, 2021, 4095, 21776, 32600, 14911, -4981, -18795, -6775, 10511, 2165, -2909, -3732, 5872, 22706, 8934, -12287, -19070, -9605, 11159, 8710, -2144, -7051, -4799, 10142, -1333, -26400, -31119, -25981, -6344, 272, -14626, -19534, -13831, 332, -492]
537d92j9160l078O330J8692J2176j8186q133N813R192P523j3105p000J1161J9446
551B1179J5863j1407r309P934Q227J0783r999j6941N885Q341M213j5213k3684
564d128m113K257M933r709k1988M230J1389P037n29j6192K652J8846J4053M357
578A3095r838M815J6911J0186L291j6225n687J4635M304l257j6473j4393O008
591G372J548o665j8805j3613R192N888j016q731j2475J2629J4723J986j524m531
605a4022J3451J7578M307l903j0831P380J4584k596n569j2248j001J2299m249
618A5180j1842j3945k537J1992J83n493q823j627J6795K945o824m134j376J5444
632E938R899n607n715l022J0403L865j0840q686q028O724Q017j1254r214n030
$$ y = [-492, -19652, -22730, -16400, 2292, 14468, -3718, -11851, -6038, 3154, 10677, -2428, -9428, 1733, 21179, 37042, 25635, 16326, 24260, 32487, 43270, 33271, 16330, 22215, 30556, 34769, 19556, -4128, -8241, -5984, -1051, -10760, -32748, -28518, -17129, -10092, -10621, -26813, -24161, -5315, 8738, 13095, 3257, 8072, 24983, 35169, 38460, 22235, 16548, 31183, 35487, 32230, 15757, 1364, 7372, 8920, 2255, -16550, -30163, -20971, -15083, -16099, -24830, -37305, -24676, -9953, -7967, -9491, -14022, -571, 17007, 21314, 17411, 6580, 13960, 28544, 25948, 20379, 8131, 7130, 19429, 15180, 3338, -10607, -13144, -1152, -969, -6462, -15285, -16912, -117, 2828, -3996, -8130, -9506, 5938, 15837, 10230, 4515, 1493, 11896, 15761, 4921, -3765, -11793, -5069, 2948, -8306, -17520, -22550]
646b2550L520R125n543o667p84R620J5628k367m370Q01L477J2924j983j0010q95
661g4K404Q503l233j1766n247j625P835m49j2016o11K417P533N077r710l420M013
677a0369Q435N611p201q25M574O503Q527q394m851N365L656N844n762q172J600
692D541K364K368q789j1097J266J63L273k882j0432L872O028N195J599n235M708
707c058Q235O476L117p774K018N904K79N84r262n027L769n60k337p855m153M853
723d791J198K431m613m725Q225K230L24j494n185N380M269k52k588o056M466K762
739A581q52j17n772M384P200j662m02m393M46M730j893j125m845k17O083k927
755B19k087l442l372N968L83j994nl31O263R88j793j014l758N624K241l573J645
$$ y = [-22550, -19030, -9905, -15448, -22115, -22899, -13279, 2349, -18, -4388, -3587, -110, 12814, 10831, 821, -74, 2330, 10833, 7600, -4166, -9413, -11038, -3203, -3652, -15668, -16279, -13862, -6329, -1252, -10962, -14382, -10369, -1934, 3677, -3524, -4349, 225, 6728, 15255, 6861, 2010, 7375, 11031, 16875, 11113, 2941, 4541, 6905, 9273, 484, -10613, -9347, -9184, -5911, -8793, -19225, -15353, -9325, -4130, -2531, -7766, -3058, 5177, 11653, 14770, 6996, 9014, 14918, 15197, 15781, 6519, 1492, 5261, 4701, 2364, -5491, -9644, -4791, -3593, -1162, -5775, -10500, -2275, -45, 279, -1215, -6400, -1020, 3249, 2997, 409, -5647, -1181, 1581, 729, 612, -5160, -776, 6424, 4762, 4360, -33, 413, 5143, 3250, 2125, -2720, -2937, 3146, 219, -1868, -5310, -8682, -2714, -2331, -4325, -4330, -4661, 1602, 2590, 797, -217, -3975, 1649, 3890, 317, 1962]
772A962j912K604L250m253j808j598K277M217k814J260j239J77M606n053k494
787h18k56j398M495j310j765L49j798L516k756l408J929j262M421K210l578J820
803C91p05R76O52l760J468k18K323L670m510Q04M4j848K671l452r33K472n6K781
821B770k532j485O44k665K796j369k147M436l71J917P09l309J549o09R72J344
837B650k139L571k3k64K049m444m0O10k161K361j820M04J100k055J101l312j278
854c690K023k546K525M75j677L314j746r2J17j796J999o99J323J653k661K276
870G98j238k458J854l016P45Q99j193K237j614N49L62k363K370m94l1L326j559
887h26K231R57j884J401j989M93N67j814K131k069n92J714l677R29n45j517K347
$$ y = [1962, 50, 2654, 5904, 1651, -157, -1755, 522, 4739, 1925, 3185, 1946, 2123, 6729, 1676, -818, -1074, -2472, 2023, 713, -1052, -703, -2501, 1015, -1741, -5149, -3220, -4482, -61, 2149, -1429, 391, -314, 662, 1314, -2446, -978, -1196, 1127, 4797, 287, 1091, 1135, -713, 1958, -1494, -2427, 45, -11, 2770, 238, -1247, -603, -3268, -472, -1841, -3988, 448, 77, 1994, 2703, -606, 943, 334, 1306, 2650, 511, 4082, 4059, 3795, 5844, 1400, 1360, 1970, -191, 2170, 350, 754, 1854, -201, 900, -2412, -3690, -1667, -4213, -1688, -1213, -2890, 424, -1322, -1414, -1297, -3093, -1094, -1793, -470, 1183, -1478, 798, -440, -2898, -1044, -4060, -3315, -2416, -3609, -1372, -2986, -2437, -2075, -4438, -2068, -2562, -2593, 733, -826, 1405, 2362, 478, 1879, -110, 383, 950, -864, 1267, -802, -1394, 320, -3357, -2428, -2973, -4490, -2143]
904b143l91J124R55l06L017j269R48K050j504L542M95q51K017k291O42m51k652
921B932O19k444M88J65l394R19k046j051J837k989J079O90nK848r26J335J150
938A207l27L187r48K5K808j871K388o60k181Q75j768N31j009k802J371k180M71
955h83Q44l667J451k42j73J889j922R19R40k53J935k382M11J217j487J814j669
972a258j316J619j757O21q66j318J656q11J215L84j958K896j17M88J702k042K294
989A432P93n67J300k314P58M28j283Q11k983o82J169k597O04j469j366K044r27
1006d849R69k07l62L345m89J487J208p37L551O94L51J460j374J764O11q73Q32
1023G381j880J168M58k224N86k280p68J333k648K85j056m88J362j805K38l52n84
$$ y = [-2143, -2534, -1410, -455, -761, 2256, 987, 1935, 3985, 2481, 6023, 6518, 5667, 7684, 5393, 6035, 5584, 2932, 3551, 1107, 1595, 1760, -1634, -715, -2761, -3812, -1975, -4964, -3885, -3195, -3200, -352, -1278, 57, 1207, 880, 4067, 3119, 3144, 5952, 4081, 6469, 5809, 3628, 4503, 2735, 3266, 2257, -545, 826, -1354, -883, -39, -3706, -2255, -2497, -2670, -781, -2703, -1784, -844, -1097, 838, -1544, -1133, 84, -1403, 411, -1258, -2574, -955, -2712, -2091, -2957, -4275, -2619, -3430, -2215, -1831, -3789, -893, -1010, -522, 1180, -862, 1432, 2225, 1658, 2958, 644, 1402, 1830, 547, 1358, -1625, -2307, -1138, -3735, -3131, -4600, -5966, -3922, -4849, -3880, -4087, -4449, -1104, -1593, -106, 1102, 365, 3916, 4610, 4961, 6421, 5047, 6811, 7422, 6549, 7381, 5501, 6669, 7127, 4903, 5489, 3209, 2441, 3774, 1126, 1411, 355, -133, 1229, -576, -338, -690, -1274]
1040a274K184j179K4J216j349K204n96r46O15j690J702k85j133J350j863J507
1056D87N69k143J130p10O9J348j902L6q08q59N91k990k35m01j448J659j460m29
1074g496J174r12J923q1k48J745P4K037K19j171J691j087M91R20j574J536N85
1091a74Q01J680j298J989M63N97J993j484O63Q59j356N79j693j647j00j997K78
1108A53j100r70J900j071J498O37j004K550l2N63J143j174J090l55p82j3k681
1125C52P16q1j254J506j182P24J628p71J340o13L5J192j564M72j293k044M98k505
1143b844r10n00k219J353l05K44J201m75K385M16O27J811j002J678M31j159Q22
1160A554j444q52L51j505P63n88j01J792j004J510J75n13K021j010M25L53j350
$$ y = [-1274, 910, -269, -245, 971, -378, 1826, 1230, 284, 899, -791, 911, 626, -507, 843, -1020, 487, 1056, -1087, 43, -667, -598, 750, -1152, -1116, -1924, -2783, -2192, -5182, -5417, -5818, -7266, -5607, -7067, -7496, -6322, -7234, -5311, -5392, -5640, -3895, -3821, -1784, -1565, -2736, -1045, -2132, -1641, -721, -2295, -759, -174, 627, 2307, 1009, 2998, 3461, 4058, 6051, 4567, 5230, 6089, 4733, 5312, 3619, 1972, 1872, -125, 153, -947, -1917, -17, -1088, 410, 1047, 43, 2593, 2561, 3124, 4267, 3093, 4183, 3828, 3046, 3033, 352, 1068, 987, -267, 1239, 57, 781, 2409, 1638, 2978, 2365, 2400, 3592, 2028, 2500, 1207, -837, -339, -2844, -3754, -4254, -6473, -5120, -5425, -5181, -3980, -4455, -2070, -1654, -1027, 784, -218, 1460, 1891, 732, 1554, 110, -742, -391, -1896, -1133, -1721, -1822, -30, -1034, 476, 651, 138, 2159, 1149, 1574, 1927, 577]
1177E77P85j342q18k54j915R33p70q20J303j016J163J243r29J333k02O54Q69o90
1195A04J313q64m29J153j662L14K38p07J252o91p6Q21p68J056p91j92R78j454
1213d05Q60j74p22R29r00K49O52r46J411m21L86J202q95J099N2o47J176j041K87
1232B152J8r66P42j146lR8j261J049p77k87J107j196O88l4m29P46n09L58M75q37
1252a2J249p16K66O22j088N98l78n72P41j097P3J01j416O93q48m71N58j347J114
1271a930l30l69J193p25O71L18m45J276n48L56P84j525J403l29n95J188r64N96
1289B5N8k88P28q83O10L68p46J218n68j7Q53j182P15K12j039Q67o21j06K87p48
1309b57P87r05K16M76j434Q59j62o69P63o53L52m8n34P63m79M67P83p14R89j76
$$ y = [577, 1362, 20, -798, -1052, -2967, -2034, -2804, -3624, -2321, -3337, -2174, -931, -1860, -527, -729, -75, 794, 104, 1417, 553, 124, 1277, -385, -71, 167, -540, 712, 21, -55, 766, -2, 1054, 263, 71, 1049, -405, 455, 281, -441, 488, -412, -163, 489, -457, 954, 533, 919, 2121, 1226, 2325, 2377, 1730, 2906, 1865, 2152, 2170, 1204, 1946, 800, 797, 895, -366, 683, -94, -381, 726, -470, 218, 184, -245, 501, -8, 350, 825, -12, 1237, 521, 787, 1409, 321, 919, 541, -31, 710, -387, -314, -213, -1629, -936, -1784, -2255, -1697, -3044, -1930, -2260, -2629, -1436, -2161, -1490, -1172, -1617, -341, -889, -533, 251, -1274, 129, -200, -795, 393, -571, 25, 83, -205, 523, -360, 250, 618, -128, 1090, 522, 505, 1358, 176, 891, 1103, 64, 931, 310, 204, 491, -257, 530, -375, -159, 317, -1117, -258, -420, -1089, -326, -979, -627, -675, -1209, -446, -925, -458, 325, -389, 600, 424]
1329D24k35Q75p10N36N7m86R45q39K23Q8r77P66q39l26M43j187Q30m43m62N56
1349g61o37K74q6m03Q41m41K83O78n89R73n2j27P74j23M53K83l17J012p39L11
1369A607N72q56Q66n76k86N63r59O66l26p65N11r93J1k3j061P93p78k64K78j117
1389b137O45k94l31M27n03N10K68l12J038l92L30O78l90O48M1p9Q15p04O66k72
1409F52m57O45j054L37j79r03N73l33l13K49q20N13l04k93O56q19Q21Q7l83P85
1429e40j86L13M95k85P23P0Q1N91m78M39J47k10P97n30K06L16m38M38k13j85M1
1450A592l54J46k79p58R42r32N1j2p96J90l72j89K42k90L42k44j74J060p09R03
1470C59L27k03Q99j55L52P27l71M96m02K0M21o48L36n50p37M99r27j83j65j014
$$ y = [424, 189, 1064, 354, 890, 947, 461, 1406, 567, 790, 878, -99, 667, -172, -498, -55, -1242, -412, -855, -1317, -761, -1398, -1124, -1210, -1613, -772, -1213, -930, -252, -841, 132, 80, -47, 727, 604, 1057, 1340, 1023, 2035, 1296, 1607, 2179, 1323, 2189, 1613, 1327, 1890, 931, 1597, 1271, 506, 1017, 24, 35, 12, -1049, -256, -1034, -1298, -1020, -2137, -1492, -1786, -2117, -1690, -2193, -1683, -1415, -1727, -689, -1081, -751, -73, -463, 185, 226, 147, 962, 258, 924, 652, 195, 840, -214, 123, -56, -959, -386, -719, -1032, -783, -1603, -1090, -1394, -1687, -1031, -1850, -1029, -942, -1325, -540, -726, -413, 82, -203, 520, 590, 671, 1262, 784, 1223, 1370, 1160, 1957, 1427, 1633, 1949, 1511, 1949, 1736, 1551, 1592, 1238, 1384, 1105, 347, 1289, 357, 408, 396, -400, -210, -582, -771, -529, -819, -477, -721, -895, 165, -544, 359, 686, 483, 1382, 1227, 1579, 2306, 1935, 2431, 2029, 2049, 2470, 1822, 2158, 1608, 871, 1370, 443, 260, 95, -919]
1490i19K75p67k1K12m91O00J3k07R04k40M71O25k01J070j69J62P43o14K86o29
1510A103k75R7j006J89l95q26L4n30j48L5n89P99k76K9P39l77R13k83l32R99m22
1531e22qM63l56L42k65m6J53o98N38j47k41O10n65J94K91n63L62m03j13K96n9
1552g37P35n8R7M80l46O38J70k27N76j46Q0K38q11J61o16o42R4r35K50J60o00
1573a439O95m01M59M68n94Q89LM36M27k28N64l61k38L55p84j20M9n88L21l14j01
1594e02K73n18J98J26m44Q95p34O73J19m42L39o08L81nj57L82k35lO06n46K75
1615G3P0k21K17j44J44k5k27N74n91k03M17k61M03N6j62O48j94L35R8l00M28l28
1637H07r4K05n44J81m02j67J02o54K26l57n49O82l61j13L84j17J84k03K24M15
$$ y = [-919, -644, -1411, -1432, -1220, -1711, -1111, -1098, -1305, -401, -641, -170, 455, 254, 1324, 1155, 1317, 2060, 1446, 1732, 1103, 828, 925, -81, 108, -287, -1113, -1079, -1609, -1757, -1722, -2311, -1512, -1788, -1759, -1020, -1397, -484, -767, -1099, -100, -522, -530, -67, -423, -81, -346, -392, -239, -937, -399, -546, -787, -177, -742, -548, -257, -820, -458, -861, -974, -678, -737, -2, -60, 37, 517, 171, 809, 979, 752, 1328, 1182, 1262, 1500, 689, 850, 234, -408, -314, -1249, -999, -839, -1439, -744, -1145, -686, -218, -812, 77, 80, 516, 943, 715, 1279, 918, 680, 1035, 251, 131, 180, -408, -87, -401, -502, -229, -747, -549, -423, -867, 28, -706, -33, 86, -356, -17, -625, -244, -249, -406, -24, -259, -262, 344, -202, 73, 143, -78, 139, -5, 139, 114, -113, 461, -130, -333, 84, -177, 226, 282, 120, 768, 574, 909, 1007, 707, 1135, 807, 713, 918, 374, 555, 153, -14, 88, -566, -340, -697, -1246, -564, -925, -1038, -654, -771, -587, -790, -566, -151]
1657a51j48K03L05j41M62k02J96Ml44O33m12k7O8n81N68m81k30K55o72Q9K47l33
1679f92L38m24L59K47k56M04m89J70J47j52L46j34K40M03J3K44r7k97L64p1j20
1700E43N61m03M24kn79K80o92J96k5m83N42m22j1J86l75O8k76k58L46k62K70L3
1722c39k4N94m19J36J15r5N78J26k2K38j13K19k50p60j57k73L15k30n11J44l40
1743a068j74p4l27K33K87J60O59j37P77J58n4J03m43L78nr2M32l3l38q5o48M15
1765A24o48j78L14j21K47L7k69M3j25j54Q9l34M91L39M9P18k84K34R2j84N9j75
1787C64K37K11k59k7l09m75l75j81K05m65j36P68p8L06J63l82N66J29L32M78r7
1808I75M94J69l28j38m47j62m30m17K79n52N5l9k90M2j47k1N81J23K22M07J86
$$ y = [-151, -299, -96, 209, 68, 530, 328, 524, 528, 184, 817, 405, 378, 446, -135, 433, -48, -278, -23, -695, -606, -359, -692, -354, -778, -419, -172, -428, -24, -513, -343, -196, -348, -2, -136, 104, 507, 520, 764, 667, 370, 734, 663, 543, 1104, 701, 1125, 1123, 544, 824, 132, 328, 303, -180, 362, -60, -71, 115, -260, -192, -468, -726, -380, -642, -372, -339, -363, 231, -188, -52, 63, -32, 546, 672, 650, 888, 775, 994, 744, -16, -173, -446, -131, -361, -872, -728, -1068, -1242, -1316, -1643, -1410, -1123, -963, -304, -441, 336, 494, 440, 543, 100, 478, 473, 381, 813, 780, 442, 357, -291, 124, -524, -702, -388, -509, -262, -225, -494, -451, -576, -730, -641, -975, -484, -145, -96, 622, 338, 572, 664, 480, 539, 364, 601, 812, 553, 526, 217, -258, -633, -814, -609, -1074, -1210, -442, -520, -214, -51, -433, 133, 262, 594, 1072, 975, 1469, 1638, 1310, 1172, 725, 563, 133, -284, -5, -557, -502, -541, -831, -789, -936, -957, -376, -253, -31, 376, 562]
1829E62Q93l21K7K28j82K68j26M2j29k78Q2r8r35ko08K0r3l64M16l06K76j13k26
1852i67L87j72M66L49J67N63N4j1L15m85j02L24m56K50l43l05k8o37j72k05j77
1873a185J54l78L57L82r1L69j76K82L64l64L94Q5K15K18l32K24j7l61J67k79J9
1894D7k10j89J77l96j10J27l17K38m3L7L48J43J50L58O2J13L7o4R4k17j40R2K36
1917E73M7j89l80J78j69j13l48Q4K38q0Q2M1o4K4r9J98K79k15J64J25j47K69k74
1940B24J18l04M4O0k10K13K9j07J34k86j38j08J04om8J63K70k16J42k28M9L0j58
1963b29J80J27l5K54m9l25J40k67N2l36n3M02j92K15K10k45l8n10J04O7k55N85
1985a98p0k17M08n38J81j63k05L51k75M58J76m5K12k32pJ65k29K37l0J18J83k06
$$ y = [562, 1455, 1134, 1161, 1389, 1207, 1475, 1349, 1391, 1262, 984, 1066, 968, 33, 31, -577, -557, -650, -1014, -598, -904, -628, -741, -967, -580, -752, -286, 63, 230, 793, 847, 836, 1151, 666, 564, 888, 432, 682, 339, 34, 6, -631, -803, -1008, -1185, -1031, -1409, -1052, -670, -761, -392, -568, -286, 78, -286, 108, 193, 408, 626, 294, 518, 501, 140, 307, 28, 47, -163, -352, -175, -571, -681, -554, -871, -633, -676, -639, -291, -148, 2, 360, 422, 535, 572, 508, 602, 385, 245, 337, 573, 620, 431, 51, 229, 60, -53, -401, -317, -79, -159, -77, -36, -100, -76, -175, 23, 302, 87, 251, 376, 229, 498, 224, 342, 38, 82, 142, -68, 145, 174, 67, 201, -85, -223, -331, -227, -233, -281, -118, 152, -64, 78, -150, -101, -71, -229, -49, 78, 43, 297, 248, -77, 63, -204, -152, -488, -541, -139, -331, -116, 94, -151, -189, -699, -595, -528, -783, -198, -268, -485, -77, -615, -434, -597, -802, -451, -726, -268, -92, -137, 75, -157, -164, 1, -228, 9, -21, 97, 280, 74]
2007G4L1n0m87K95l94J99J96O9m6j61m7j10L9r2J09K11L80J14L66M9j00Q4j06
2030F23j1K48j5L00j72J88r2p06O9j13j32Pl93K71J3k93k6l71R3k0L6L37k02J9
2054c42M37r0n4K71k1J91j01L31J42k25K27l69J20j4k79K45l64k65J94k77n3J49
2076a47n00n6m7m1j9r0J21L12k83J32J01K02J71r0K35J3M5K26o4J92k9J66k3r4
2100D33K46j43k76L94l86N2L2N9j28l92R4O2l48J31R9rQ4j66q9j33Q7Nj96Q8J35
2125b65l3O7K27l01o9J68M8K79l5L20R2J12J3l13K05k14Q3j1J35j43r7l92o2m44
2149f30n8J6k47M89k86K56K04k33J97k61k28P06J57K25R7k50N03k81k0j81j57
2170A8M14J29M6K44l96J86m44o3k61l68J29M60l12K54l70j76J9m08L62K38P8O04
$$ y = [74, 105, 55, -432, -137, -531, -332, -136, -67, -113, -274, -321, -431, -392, -484, -375, -164, 216, 330, 696, 745, 645, 729, 623, 612, 860, 845, 1145, 973, 1161, 1069, 363, 432, 319, 187, 194, -199, 72, 85, -208, -234, -605, -512, -532, -496, -159, -361, -342, 95, 5, -49, 222, 201, 392, 291, 622, 764, 539, 766, 397, 517, 503, 224, 469, 105, -160, 34, -243, -296, -147, -647, -703, -750, -791, -810, -900, -779, -467, -750, -618, -517, -315, -144, -234, 1, 14, 59, 285, 221, 413, 384, 550, 527, 433, 679, 536, 260, 654, 268, 320, 352, 411, 283, -109, -15, 47, -301, -170, -71, -80, 4, -162, -251, -384, -297, -292, -488, -400, -265, -298, -231, -4, -305, -374, -206, -158, 121, 86, 406, 498, 610, 623, 310, 515, 301, 384, 373, 508, 365, 268, -124, -186, -630, -688, -672, -919, -430, -716, -460, -256, -489, -292, -553, -781, -75, 82, 307, 404, 154, 657, 376, 356, 175, 18, 432, 561, 607, 851, 455, 641, 197, 134, -127, -495, -366, 94, -218, 36, -334, -510, -491, -899, -537, -299, -221, 383]
2192C83J23J15K5m68J61l10m3j0K05j70P3j88j18n64o5J65O2M24L6K77J28j20
2214A21J16k13J0K0j63K74J90j51J88k98Pj19j12R7J63N7M23jl49Q5l85o1M5Q4
2238B8j28j34M23m2o2j44l35J84j38M29K97l65L08l0l04K98k53k84J38q3M55q8
2260A70J7M0r5l52J08j08L81J91J09j17j24p4l32J7J1k42lK20l0O5k59jn4M0p0
2285d92J76Q1L58j23L3K4M0Q5k28K5r1L59j97L75l04O4K02j19q5N6K75j48o5j51
2309A50M8R7l02J43j65k7J10j24%k35j59L22k38qm7K7r7J30j31K98rJ32L10l12
2333h7K36J8L30r7Lj56K5J30ol33R6k19n07J41o0P4K13j84j24N5K8R5l3J24L53
2358A15j22J30L71k27J21k85K51j85O6j57J63pn9j48J23k99j58K37k56K26J10
$$ y = [383, 506, 621, 646, 178, 339, 29, -14, -24, 181, 11, 84, -104, -222, -786, -851, -686, -624, -200, -164, 113, 241, 121, 237, 24, 34, 54, -109, 165, 355, 204, 392, 94, 101, -18, -130, -33, 130, 187, 610, 609, 260, 345, -40, -101, -56, 28, -100, -234, 189, 147, 85, -59, -394, -210, -348, 81, 378, 13, 321, 291, -13, 285, 32, -252, -114, -197, 258, 170, 187, 227, 132, -220, -112, -220, 161, 352, 461, 344, 220, 146, -186, -169, -158, -400, -403, -183, -213, -148, -407, -408, -462, -422, -492, -316, -235, 123, 0, 33, 57, 97, 182, -46, -21, -112, 247, 50, 425, 121, 185, 387, 268, 183, 239, 514, 366, 301, 150, 198, 295, -7, 136, -29, -56, 54, -70, -70, -305, -464, -142, -380, -388, -435, -408, -505, -375, -506, -208, -217, -85, 225, -87, 149, 167, 497, 400, 403, 247, 272, 402, 396, 63, 159, -60, -567, -426, -486, -412, -199, -383, -507, -452, -424, -329, -362, -238, 115, -7, 123, 494, 267, 388, 103, 354, 169, 235, 78, 241, 234, 175, 27, 150, -149, -307, -70, -326, -100, 10]
2379A0O3k7R6k6q1J71o3J3K36k7Q9Rk66p6J31m79K68j98K6K13l02p9J53m99K47
2404c98j7L66R1j63L5K00P8m5j01j2J73j66K01j32j57J39j68J04j80j33J58j6
2426a43J32k42K30J28j68J75j57L5K29q0M59m06j18M27m43kM26m24M4K09j06J05
2448C10m95M7J96j91J57R9l92N68k74m9Q7k42M23j51R8Q7j91K92k46J00j43J2
2470A02j16j12M0J08k04K77k10k04K11j34K43j22K8k0J30j46J42r6K52k45n3K93
2492A64k07L3k2j54K51p8o7m5J46q7k8q4J43L0k8m5J06J02j50m3L00l91l6L8R7
2517e5Q4j5K1j39K61j59p1j76J83j65K71J2J3K29k59J6j62J0J58r5J45j22k25
2540b40K67j31k08J45m2L11l43Q4N5J04k07j07K48o1J8J06K54j31O4j75K07j52
$$ y = [10, 73, 46, 142, 116, 35, 206, 143, 156, 392, 365, 454, 463, 197, 121, 252, -227, 41, -157, -131, 82, -220, -299, -146, -645, -398, -415, -49, 42, -121, -86, 114, 192, 147, 46, 34, 207, 41, 242, 110, -47, 92, -76, 28, -152, -285, -127, -143, -11, -253, -23, 105, -63, 112, -45, -10, 219, 139, 598, 192, 74, 501, 58, 56, 482, 58, 102, 311, 205, 310, -185, -138, 58, -133, 24, 123, -269, 299, 25, -24, 63, -179, 244, 93, 191, 278, 87, 379, 133, 233, 90, 102, -14, -126, -86, 22, -182, 95, -115, -319, -108, -242, 1, -121, -93, -113, 17, -129, 13, -83, 169, -76, -129, 164, -43, -10, -32, -186, 65, -13, -80, -125, 21, -66, -94, -178, -35, -5, -33, -78, 28, 130, -20, -63, 237, -154, -190, -152, -55, 29, 14, 35, -104, 157, -2, -73, -249, -66, -231, 40, 52, 65, 294, 35, 51, -111, -101, 57, -38, 107, -15, -240, 27, -104, -312, -167, -209, 102, -241, -157, -102, 2, -205, -312, -64, -125, -107, -1, 253, 122, 186, 11, 218, 66]
2562F6K4RJ78l2J64j62j76ok41K21l19L35j55P8O2j32k6J27l88J31o7R2K54O1
2586I8k06J57l7l8j12P5N3K60J05m74M02L6j91m0%k10M79m12K17M7m05q1p8N9
2610b96Mj39K07K38j16R4j53J9KJ61j18oR6L44m25K60j3k54J37j44KJ78J12J29
2634C19j13k24K71k68J50J52l9N7k03K06j60l23K8J62k58R9J9Q4o7l9m5k3J30
2657h5j21j6J30J52k06K21L4l1k25R9L06l3q9J02R9j57p2n0J17l77L29k82k1j85
2681c61m9O3N1j50J24Q6p8K41k51K74K09o1K12l65J91N4P7L72o34L30j80n7J67
2704B65l74q9J33qj20K79j72K8K01q2j60K8m8K4L40r0J21j51J13r3q4J7j2j17
2728e1J51q7j26j31J20j86J78k5j07j6P2K15k03J14J38K8K4K72k46K4o1j78Q8
$$ y = [66, 90, 99, 277, 245, 409, 247, 71, 65, -176, 45, -274, 61, -94, -16, 46, -86, -112, 15, -373, -242, -309, -217, 37, 98, -108, 49, 12, -26, -138, -63, -10, 250, 355, -119, 283, 319, 128, 88, 88, -122, 357, -55, 162, 209, -196, -277, -355, -296, -292, -431, -224, 14, -102, -8, -161, -142, -140, 21, -97, -103, -7, 337, -88, 172, 159, -95, 42, -102, -100, 78, 190, 319, 206, -18, 253, -15, 135, 287, 248, 305, 102, 308, 148, -175, -147, 15, -243, -144, -125, -41, -108, -147, -192, -215, -85, -206, -222, -92, 60, -146, 75, 109, 78, -147, -48, 258, 225, 136, 238, 337, 180, 108, 58, 175, -202, 127, -155, -176, -361, -410, -347, -296, -446, -322, -236, -314, -73, -324, -50, 159, 98, 310, -55, 136, 190, 267, 639, 5, 335, 155, 98, 265, -109, -198, -65, -73, -193, 86, -86, -58, 143, 61, -99, -71, -119, -95, 245, 155, 276, 125, 238, 145, 61, 78, 66, -51, 100, 13, -113, -244, -124, -310, -132, -157, -264, -280, -208, 7, -196, -82, 56, 84, 108, 380, 134, 158, 97, -81, 7]
2751Gj23j0J37l9J16k87j31L75l04J13N1J29L4l40K32O8q5J15K3J60j83Q3O8n2
2775A57o8Q1k01J31p8Q4J38m09R6l3j82J98jK10j61n8J92q0n0J51n27M96l3nj2
2800C6o6K18l24J81J5k99J36J63KK7o2j04L48j48j30r4J78O8k32M6Pm1rr2j7J23
2826g0J04J08R1k20J94k66Q5o2q7R1O2K31k35j41J55j29p8K52QR0j24M8K90m31
2850c4p1J60l1K21j89l7k74K57q5J85k29J74J5j36n4MK10k6j48K59k58q7J77j46
2874a43K3pO3J54k33l8j04K11J69j55J91o5p6J56j09j09O1P5j11J5J02j20q9J26
2898a3K9k86J96L6J01J11k3k21K28r6n4k19K25k6l1L2QL7M6Q3j29J08j50K55k86
2923c9O6K14j78J68l02k4J63J15M6k67R6r1RJ67k74J7k5L68j35j46N8j00q9K8
$$ y = [7, -116, -126, 11, -28, 88, -199, -330, 45, -259, -146, -95, 34, 68, -272, -40, 28, -57, 58, 81, 241, 58, 141, 209, 157, 89, 170, -31, 100, 22, 106, 244, -165, -69, -102, -284, -86, -87, 123, -38, -96, 96, 16, -34, 117, -410, 86, 53, 48, 36, -30, 188, -136, 45, 60, -239, -103, 60, 62, 89, 27, -77, 271, 123, -7, -101, 77, 145, -87, -41, -34, -75, -84, -176, -193, -70, 34, 142, 233, 13, 207, -59, 26, -36, -123, -32, 30, 261, 26, -115, 40, -89, -167, 85, 93, 183, 59, 107, 397, -34, -105, 55, 24, 245, 56, 19, -255, 2, -83, 102, -127, 47, 62, -74, -128, -124, 86, 60, -88, 171, -87, -174, 3, -143, -120, -127, -64, 90, -143, -181, -285, -74, 95, -60, 131, 66, -10, 146, 37, -72, -11, 64, -47, -32, 70, -50, -139, -13, 16, -270, -74, -38, 63, 174, 151, -70, 158, 62, 8, -211, 14, -12, -43, -11, -3, 34, 80, 163, 34, 142, -8, 247, -39, 27, 241, 63, 231, -71, -95, 68, 183, 229, -38, 58, -33, -24, 143, -131, -114, -139, 229, 94, -52, 6, -94, -183, -155]
2947a55J76o4J2p0P5M3R2j84J03q0J47l28Q3J45j03L47l12K6M3j54J4J13J02k2
2971D9K28l06m3j00J29K9O4j20k36L33k26J45q6N4Q1N0j39K75j39r7O4j0m5n9
2995a05K9p8O6J38j33J44j07K87j23j57K08k18J2J06r9o9M8k91M86k39Q9j56l3
3018a95l6K70m7j21J26M8J2J8R8Lk64J15P6k00K39j96J04JJ3M1J11k73NPj21J00
3044f6J31j35l7J71J18m32M87r7k45K66k68jo1K03r3k7%j66J55r3J30p3l1J93
3068B9k00j56M74o1r7N6k2Q6Ko5n6J49j60P7M7j56J19r6p7J40j7j81J77j7J68
3093A63o6k02J57j46J38k67L23j80k91N01r4M6p1k37L62j78j00K72l52K66n0l0
3115c6O5j32J44l02J61o6J01J29K1k60K01K4K3j47J14P5j07L1N8j95J44r7J84
$$ y = [-155, 21, -43, -31, -101, -26, 17, 109, -75, 28, -52, 95, -233, -150, -5, -108, 239, -73, -47, -4, -158, -144, -31, 71, 49, 277, -29, -72, -172, -43, -14, 50, -70, -306, 27, -199, -54, -140, -86, -5, 45, -94, 181, 42, -55, 9, -1, -46, -105, -76, -154, -88, 50, -83, 61, -46, 241, 118, -39, 169, -49, -37, 69, -30, -99, -51, -342, 144, -95, -6, -162, -195, -231, 39, -8, -129, -3, 45, 57, 75, 173, 176, -88, 27, 103, -97, 142, -54, 50, 51, 64, 105, 216, -57, -52, -45, -166, -66, 65, -70, -107, 64, 182, -250, 237, 140, -105, 161, -107, -108, -169, 34, -59, -86, -86, -252, -97, -190, -60, -133, -164, 29, -171, -327, 147, 86, -11, 45, 23, 109, 111, 46, -10, 139, -21, 56, 103, -53, 66, -30, -107, 33, 16, -165, 12, -5, 163, 97, -105, 52, -94, 44, -223, 100, -80, -371, 130, 36, 82, 11, -226, 136, -42, -142, 130, -222, 44, -6, -36, 29, -103, 41, -261, -100, -166, -65, 64, 85, -175, 26, 50, 73, -74, 40, 115, 8, 39, 97, -98, 46, -51, 133]
3138A33j46j8P2o7L4J70k59k4J58J1pJ74l49J25n1J13N4n0j56j11K28l1o8K72
3162B07j42j0R1k15K22j30L3K4j60J71k24Q1L5J59l20K27Q7k42J77o4K2jr1J30
3186F7o3l2J01J6L4l18J42n4MK8K0k9q7J84q5J34J5j27K93n82L04L8K6R7k36L
3212a07R2J77j88J26K23l10k8LP2j49j01K71j44O3L8k5r8nP3J4k6L6j05J29q2
3237e1O7j15J40J61l28J85j05k4j9n3L02l71J08P3M9j05N1j19K35j61K37k15n
3260f3J07k3J5p1N2m7M7k21J05J45k17n1J61L4K34j39R7k06K62j14J17K4j09j69
3284c0o0K29k08N2j87J31j22J70P7q8j75J45K33k53J52M2k02J94j04n7k49K36
3306g4P7p2Q5q2J43j08K52j8j11o6j53K07j38K29l1j53M8k36J96j12m5j1O6l6
$$ y = [133, -13, -31, 41, -26, 8, 178, -81, -105, 53, 64, 57, 231, -118, 7, -44, 69, 123, 73, -83, -194, 34, 3, -65, 207, 65, 55, 146, -69, 153, 23, 56, 80, -80, 91, -133, -52, -17, 142, -178, 49, 136, -106, 71, 7, 29, 28, -63, 67, 4, -28, 73, 89, 123, -195, -53, -107, -103, -75, -55, -84, -171, 13, -72, 62, 77, -50, 243, -339, -35, 3, 29, 126, -110, -107, -15, 162, -26, 100, 323, 13, -15, -12, 60, -89, -190, 81, -63, 0, 38, 13, -85, -90, -17, -3, -29, 7, -98, 31, -51, 16, -99, 41, 202, -126, 59, -46, -70, -89, -142, 160, -211, -103, -30, 19, -86, -35, -154, 81, -80, 157, -58, -63, 44, 21, 36, -35, 17, -30, 17, -204, -99, 46, -171, -222, -61, -27, 207, 68, 165, -41, 221, 107, 224, 248, 139, -30, -90, 139, -69, -17, -204, -73, -195, -25, 52, -36, -211, -66, 167, -86, 66, 108, -94, 100, -4, -61, -310, -74, 3, -69, 16, -66, 77, -31, 221, 203, 92, 26, -127, 80, -58, 171, 140, -13, 35, -201, -5, -117, -162, -173, -107, -143]
3330a43N2j47J15J2j59M02j80J6J11j10kR4L9q2L5k29L63k54m8K56j45R7j10J93
3354A76k88L51r3j2j37J57l5k5k65j1N1j43L42K7O9j33k60K04l8N0P6j66k1J43
3378A9k48K67J51j03Q0Q0l56J4J43J8q3O3o3p6M9j89o1K51l9J0rj0L8K60j74N2
3404H4j16J47r5O7L2mj53J68m30M82p5j14K0J2K7J08J55p7k34J71j23J37J03l70
3428g8K43k37o8J19k2J12j54j85J44QJ21m3n2K24p4J39L5l65L7O8j41J62k69M54
3452A78j55j15K09m88L98J36j74j24M14l42j23N0j33R1j11K33J10K12k44j90J30
3473c8K2J88P2l37J80j08P5np9J29K4k32K03q2J04j20j05J86j33K15q2j86K55
3496A46q9k05J76k61Q4K01k05L4P0q2K56q6k28J10p4K1J08kO8k88K57m4p6J44
$$ y = [-143, -91, -238, -123, -111, -270, 132, -48, -32, 79, -31, -33, 61, 100, 18, 53, -176, 187, -67, -115, 141, -4, 93, -17, 176, -112, 239, 146, 134, -3, 154, 119, 94, -171, -182, -131, -274, 68, 95, 164, 31, -229, -25, -63, -13, 63, -103, -124, 19, -229, 38, 189, 86, 166, 246, -110, -96, 47, 65, -18, 45, -18, -94, -45, -234, -295, -44, -83, -73, -82, -92, -54, 206, 32, 84, -32, 115, 20, 87, 119, 115, -38, 130, -300, 182, 107, -7, 13, 25, 52, 160, 315, 238, 4, 175, 52, 189, 292, -78, 165, -72, -140, -21, -43, 69, -85, -270, -126, -118, 3, -40, -92, 132, 58, 197, 232, -133, -96, -28, -169, -7, -276, 178, 23, -92, 117, -371, 27, 163, -11, -135, 279, -63, -186, -136, -269, -178, -289, -56, 54, 266, 22, -168, -38, -16, 172, 244, -93, 87, -21, 54, 49, -30, 99, 123, -109, 94, 12, 116, -4, -109, 77, -56, 159, 77, -109, 146, 57, -148, 28, -233, -149, 52, -153, -119, -49, -131, 125, 39, -189, -79, -153, -132, -24, -26, 42, -246, 11, -33, -109, 35]
3520C5j09J81J53j71j63j24K08J21n2Jj46K1J05o3O4l0j02N7l55L17k05J15LJ15
3544b4j88K07k5O0n2K94j46K2q2j20k1J38r8J50J38k69p1J06o6K37j80P0j23L3
3568a0O2l4q2R7l6j43R6r0J51l04L20j74J54J17j39j10L17l71J93j00L34o4j00
3591H4j68k8J6J09j53K21n7Q3j53o1r5J48j21J48Q6p0J7K18j63j59J57P2k16N5
3615c0Rj0J69k6J55j30l88K25N2k39M11M4n7R1r4n2l8r6M6J82M7l49J65N9k64
3640a18j31m3N9N6Q2j6K9m0k26K73j65J93j56J50J74q6L09l48L35j40j12j53J68
3663I4J69R7k08r3q9r6J45M2q4J11o6j32M4j18K3j19K52J47q1k2P9k0J84k26j32
3688i9R6K14R3j89K65n0j79K19l68Q0o0KJ42l11L11q9P8J54m05O0K02l76Q5J16
$$ y = [35, -74, 107, 260, 89, -74, -198, 10, 131, 79, 80, -66, -45, 60, -3, 61, 31, -71, -14, -369, -52, -257, -142, -139, -24, -212, -5, -30, 30, -22, 272, 126, 148, 66, -54, -75, 63, -35, 115, 253, -16, -87, 19, -47, 190, 10, 80, -43, -10, 52, 18, -64, 33, -3, -146, -50, -140, 11, -293, 27, -147, 7, 124, -15, -125, 192, -179, 14, -86, 248, 184, 84, -84, -112, -96, 13, -140, 81, 24, 107, -46, -107, -202, -54, -175, -27, 59, -11, 6, 224, 61, -98, 59, 131, -85, -30, -21, -31, 138, 112, 267, 137, -251, -26, 26, -213, 198, 242, 185, 276, 182, 130, 92, -4, 42, 224, 271, -78, 87, 146, -118, -249, -292, -233, -177, -95, -111, -82, -122, -348, -75, -240, -47, -203, -53, 121, 35, 344, -4, 331, 191, 79, -74, 94, 263, 360, 152, 59, -30, -126, 19, 61, -23, 88, 22, -110, -66, -184, -161, -280, -28, 119, 38, 16, 95, 75, 259, 33, -99, -3, 211, 304, 115, 380, 330, 151, 370, 2, 82, 22, 24, 166, -145, 166, 77, 155, 309, -96, -36, 166, -210, -125, -9]
3712ij77J15l05K37J82j67j69J20kk2J98k01P8k28L82Q3r4P3j10K17o7J90k88
3735C6p3m9L4J47J66k52L95k06j19J45l32n1J42k7p6r8O0n0j07J92J08J4r6K38
3759A41k04K55k68K46j83n2J21L8JN7j25k9J20J62j60q1L68n03L45k29oN7P6k87
3783a40RNn1R3j97K00j69J94p5j6J41k02N9J66N8K33l37K09R5r5J84k44j3j4l8
3808E5O8j6k52K37k78M1K16j26p8k56K39K46j69j25K02l4P8j34K38p7KP6q4J53
3832B22l30R7J7J27k12J96k10j2N0r1m8n6K52j37m1K3r8p2L04r0K90J2p2mKr7
3858B2q9n4J43j41J08l8O9j88Q3q1L05k91j62L74n1J98j88K17jk7P3k9r6K20m57
3883h1k%J39J05l20J54J17l47L10q4k42L83l58K37k5k1O4J27j00N0Nj03j24J34
$$ y = [-9, -186, -71, -376, -139, 43, -124, -293, -173, -175, -197, 1, -200, -122, -350, 32, 115, 21, 94, -16, 201, 134, 324, 36, -37, -86, -52, 95, 261, 9, 404, 198, 79, 224, -108, -159, -17, -44, -120, -218, -158, -208, -315, -123, -15, -1, -97, 141, -63, 192, -76, 170, -13, -65, 56, 94, 95, 152, 27, -2, 118, 280, 120, 39, 407, -96, 249, 20, 14, 71, 147, -140, -131, -126, -177, -84, -281, -81, -250, -56, -131, -147, -6, -208, -149, 17, 75, 308, -29, 180, 275, 180, 364, 120, 107, 93, 55, 123, 107, -145, 92, -186, -145, 71, -55, -133, -389, -150, 96, -73, -198, 4, -30, 48, -86, 152, 75, 77, 153, 69, 222, -108, -11, 6, 133, -79, 117, -93, -105, -55, -146, -194, -250, 2, -135, -176, -153, -251, -323, -19, -109, 181, 193, 121, 117, 119, 22, -67, -121, 22, -119, -11, -49, 20, -168, -85, -166, 139, -152, -314, 60, 9, 207, 19, 236, 235, 208, 281, 252, 156, 376, -81, -83, -83, 56, 161, -159, -5, 112, -235, 75, -9, -251, 132, -226, 11, -14, -35, 29, 156, 56, 106, 111, 8, -116, 18]
3907A8N5j44k0L16j43J2j94K29j6j63m7J9l90K04N1j04K77j66L7j86K88L3m1L50
3931B75k84N7M0O4J76m55J26RJ02j1J58k66O3k02KJ15J06N9j17j73M10k27J72
3954A99j31j17Q3n6J60k6j13l6P6j08J66j87K08j71L2O7Q9j47J21p3J69j70l18
3977b83L57k54J14O6j78J38J6l31J87J57N2j38J50l8k45K38P1j03J23k47O2J24
3999C8RJ69j87K43p2m03K84P6j04J84q3j06R8j22J2k31K93M6p5K25l90R2J25k54
4023a33J83k0p3L7n6J28J60p4q7j59P3O4k05M93k87Lk5J8oj49j46J76j33L61j32
4048A1j84K01k47J76Jq7J47k46J05j8q8P0J13l5L9j44K38j3o1P9J41k82K10k76
4072a50K11J73k5J29k41J1N8P2k8j07j10oj26K86l50M09l16m7O0n1J85K8p6q7
$$ y = [18, 73, -71, -91, 225, 82, 94, -100, 129, 113, -50, -97, -78, -468, -264, -213, -317, -40, -206, -169, -355, -67, -34, -75, 275, -9, 48, 88, 152, 328, -127, -1, 8, 110, 99, 257, -9, 54, -148, -146, -31, 75, 134, 17, -156, 254, 27, 199, 68, -49, 34, -22, 138, 112, -1, -37, 39, -69, 97, -90, 118, -53, -21, 46, 135, -12, 109, 36, 205, 35, -283, 74, -180, -66, 0, -178, -40, -24, -355, -168, -11, 41, -97, 53, 15, -230, 8, 79, -24, 99, -148, -86, 38, 47, 216, 29, 272, 200, -203, 81, 157, 53, 237, 154, 48, 146, 24, 36, -195, 98, 144, 69, 294, -96, -4, 121, -133, 50, 30, -43, -6, -62, 66, 226, 152, 65, -94, -21, 43, -162, 331, 44, 47, 22, 40, 34, -115, -261, -85, -218, 143, 11, -173, 28, -219, -43, -42, -129, 18, -228, -123, -141, -229, -159, -46, -81, -42, -186, 52, 39, -22, 57, 198, -84, 126, -150, 61, 234, 209, 338, 97, 108, 166, 238, 210, 103, -7, -13, -139, 147, -203, 206, -110, -157, -97, -148, 37, 65, -11, -98]
4096i8J57O4p1P0p0J14N5j9p3k23K92j29M3Q9k42q5n2J68j96j9J53j68j1J21j28
4121b58p0J79j86J73k46M48J14j10K34k02J06Mj03J74p2k80J95o7No8m03L33O7
4144c3j52K04l73L91kj88J61Q4p6J31m5K13j02j10J39j50J14J3k93K65r8j93Q2
4167a8M4R0j14l20L10j47N6j16J30J05j34P4k0j1J6L0N4J51k63j0j15K27j74P8
4191g7j35K55j82K47l37M3Q8K83O6k49K2r1J0J07R8j9L6j31P1Ok0J14k16J29J95
4216C13j94j35m6p2K40q2L2j8j50Q3N6p8O8J01mJ13j90K46l52K30k69O3l3J34
4240E6k45R6j0J7j2j35L64l33j3q4J80K12j43k76L26r0N3L3j87K77j70P7R7J1
4264A01N4K17k13m3j36J34q9O1R9k12R6j30J31J38k89J62j01J00k13R1q8K79j09
$$ y = [-98, 59, 123, 52, 122, 52, 166, 221, 202, 129, -94, 198, 69, 112, 201, -41, -126, -178, -10, -206, -225, -72, -240, -251, -130, -258, -328, -149, -335, -162, -408, 40, 154, 44, 278, 76, 182, 186, 83, 257, 185, -95, 100, 33, 38, -30, -433, -100, -33, -185, 19, -354, 37, 35, -153, 8, 92, 16, 147, 102, 315, 213, 103, 242, 92, 206, 219, -74, 191, 93, -100, -18, 26, 116, 2, -318, -8, -155, -99, -215, -85, 20, -114, -40, -60, -71, -55, -25, 29, 180, -83, -93, -208, 19, -155, -77, -212, 43, -139, 108, -229, -186, -98, 185, 251, 2, 24, -67, -57, 50, 148, 129, 165, 34, 105, 111, 91, 205, -11, 118, 313, 119, -16, -62, -134, 106, 24, 56, 38, -112, -29, 27, -51, 17, 118, 114, 227, 37, 283, -69, 161, -108, -45, -78, 56, -189, -93, -103, -86, -98, -233, 131, -202, -215, -299, -119, 93, -50, -326, 0, -90, -37, -4, -191, 86, -84, -7, 90, 101, 155, 372, 159, 116, -20, 114, 25, 86, 185, -27, 69, -61, 70, 208, -81, 81, -20, 80, -133, -42, -130, 149, 40]
4287D0r4l7J36O7j42j0J13K6R5j15L5N7M3n1l2%J8N1j6k24K02j97n3j74j36K95
4313a03Kj42KJ39r5O6Q4J24j95J7K59k42J32J81k68j1L1r8n3J46m5R4O1RJ1q8
4339A8P4RR4p1k37K01j68K52j86l07K61r0J61q4n3K16j5rJ78j69R8J61j18l1j88
4364cl2K35l20L38j87k55K61j24K8M1j45J39n2O5L1j60K56P3m5k9j43P8k80J75
4388e5l7J41O2o7J51j45j08k6K52l50J78k1j05j04J59oJ08J26J24k31R3L1M8j78
4412D0j01J59J00j53l4J07k48L49l69N9J4j84L54k40J05k04J36Q7K1q7J33K5J12
4435A81J28r9n2j38o2J32q4R4K1q9o7J08l37J68k26J11J57l17M00j41q3K73l31
4458b53L57m5rK21j65L40k50k69J75k61j9J54j01k7m7K10j15J53j7l62J73J48
$$ y = [40, -54, -91, 45, 112, -30, -40, 73, 99, 194, 79, 114, 171, 214, 163, 131, 131, 149, 200, 184, -40, 162, -35, -88, -262, -398, -103, -101, -243, -241, -102, -197, -131, -47, 77, -118, -101, 158, -84, 48, 229, -39, -50, -19, -117, -170, -24, -69, 25, 86, 95, 106, 18, 92, 101, 195, 124, -113, 88, -80, 172, -14, -321, -60, -150, 11, -73, -126, 90, 75, 66, 244, 75, 173, 334, 216, 185, -3, -35, 200, -120, 218, 31, -224, 37, -87, -59, -18, -163, -24, -76, -11, 20, -140, 116, 189, 144, 115, -28, 50, -230, -55, -92, 49, 111, 44, 195, 50, -58, -84, 168, -182, -4, -25, -130, -234, -75, -81, 27, 153, 277, 46, 139, 170, 218, 40, -61, 98, 198, 45, 11, 118, -130, 219, -150, -91, -77, -261, 93, -147, -42, -246, -110, -23, -2, -89, 44, 69, 181, 309, 210, 158, 20, -42, 90, 6, 100, 121, 32, -35, 73, -264, -96, -322, -211, -54, -371, 29, -112, -195, 78, -253, 104, 59, 50, 271, 106, 446, 196, -73, 102, -159, -178, -24, -125, -152, -199, 11, -104, 49, 32, -330, -157, -9]
4480im0K82l6m3k1Q3j14m0O4J9p1O8k15J43L7r8j09q1O6J56j52j58Q1J84n7k15
4506b76J06L8o2L28j80J1K61k53o6O3J27N0r8j93J9J11j55O0q7J14j32LJ77o4
4530i8N1J91j56L20k46k57J28K18L6j2k17Q1m9R4j51J47p2J24%j94q8J01j63K84
4554G2k71J53J74Kmo7L7J33j29k23K57k2K36l17j21q2J16J95l66N9M3n4J05k1
4578i5k26K57j96J40n3m6L34k41K75l7J56k65J55j71J71k36J08L68m61K44P0m06
4600a55K12n5j96J81k35L59l3o9j5j37O5L3j59M01k97m6L71k15R6k8m9RR3K7j13
4625D5O0R1r2m3n6K54j57j09K27l6rn6j24m0l9j06K29p2j96%L2O0J50m08K58J26
4651a1j30J97Q6N3k86J64Lj00k25L77k09J10r8j15j1J32P3J5M4j20j74K23K6O
$$ y = [-9, -49, 233, 197, 154, 133, 216, 102, 62, 126, 145, 74, 142, -73, 70, 107, 9, -100, -181, -115, 41, -111, -269, -188, -4, -61, -276, -170, -132, -194, 134, -46, -35, 226, -27, -93, -30, 97, 147, 49, -144, -125, -14, -169, -109, -196, -82, -214, -211, -34, -98, -47, 144, -12, 308, 62, -195, -67, 151, 187, 175, -42, 39, -10, 84, -67, 80, 8, 132, 132, -62, -150, -49, -212, 72, -199, -46, 128, 130, 126, 59, 96, 229, 100, -123, 134, 112, 348, 31, -90, -172, -56, 139, -227, -168, -125, -179, -74, -95, -321, -64, -260, -120, -173, -219, 115, -126, 149, 112, 268, 3, 158, -13, 158, -78, 30, 398, -63, 181, 251, -155, 57, 2, -194, -13, -248, 111, 78, 9, -6, -143, -78, -45, -204, 197, -100, -146, 225, 10, 106, 78, 29, 38, 131, 158, 45, 105, 196, 104, 61, 5, 259, 102, -7, 220, 184, 175, 119, -5, -45, -84, -190, 39, -33, -229, -229, -197, -137, 13, -395, -137, -11, -141, 56, 142, 195, -91, 73, 76, -24, -249, 128, -81, 29, -69, -184, -195, -63, 10, 25, 69, -51, -225, -2, 24, 30]
4675C0%k10K81k26q1K39J9m5m4P5J83k20J45j35j41Q0J02j72J13j23J30L0J71
4698B01k40lJ9k9J81o5L7k98K43n2P4p4O6J40j81j39K18o7j21jk89P2J21K33j19
4723g3J30n9l5k0J38r2j75K86L2m8%K3K36j97J60m79K95j43J77l5j15L2k2j72
4747a56P1R5j50K15Pj51q4J37P7m5R9J7l54K75j01k4J21J2k3O6P4n4j69J93j52
4772doj17J8K05m0j21j5K65l71J55J37j16J85k86L6O4r1M80j89j48J07j39J13
4795A22o4n0o5L5M6J05j26K70j93Q5k73J28R1p2J9J64k80P7R0j80K2j3R8J76k43
4820c1j38j37L84p1J15j88K0K00j35L8O8K5J17j74J50k75j44k1J82r8J65Q3k82
4843a47J80j46jN9K23j59J6n0L2J34p7L7j07j41K41j48j48K7N8L1J80j24qQ7j42
$$ y = [30, 30, -180, 101, -125, -206, 33, 52, 7, -37, 38, 221, 1, 146, 11, -130, -50, 52, -120, -7, -130, 0, 30, 201, -39, -42, -23, -52, 129, 64, 101, -197, 46, -6, 68, -6, 60, 200, 19, -120, 98, 31, -90, -91, -380, -308, -187, 46, -73, 57, -2, -37, -57, 81, -11, -186, 100, 132, 84, 84, 107, 343, 146, 306, -173, 122, -21, 156, 121, 6, 38, 16, -156, -85, 10, -140, 75, 82, -69, -153, -16, 61, 16, 115, 132, -222, 53, -48, -72, 49, 61, 38, 104, 178, 124, -45, 148, -4, -10, -127, -109, 96, 56, -65, -80, 185, -186, -31, 106, -10, 175, -111, -75, -11, -102, 378, 189, 41, 148, 9, 122, 58, 8, -57, -22, 24, 129, 3, 273, 80, 165, -108, 20, 111, 39, 58, 222, -58, 19, 109, -71, -49, -62, 36, 212, -31, -169, -306, 78, 7, 122, -66, -46, 154, 19, 57, 125, 150, 267, 93, 243, -32, -176, -197, -15, -113, 52, 135, -147, 33, -113, -114, -55, 168, 9, 25, -25, 7, 141, 64, 101, -6, -147, 94, -54, -202, -175, -117, -86, 94, -30, -38, 49, -93]
4868i3o8J88j66L12m3rn4nO0l9j26R6r6J72l32J50K55j81l4n6J67J12k97L3J50
4893I6k62R7L2L43l79N9pJ15K7r9O8nKk76J08J27j10qL82l70J0k8J42k66J62p7
4919a17j14J7J65p1q3J50K00l72J66L6l1Q7k07O2K47q8j79J11J70j29Jj06J78
4942I3k33K49J8n9O0p1j5j32J54km2Q0J8j89k36L98k9m8K51m20K99j92J75l13
4966a86O4R3K74j66J06j84J68N4l28J25K3n1p4J2L57j18k29K66l22K6P4J8Q7j25
4990c6N9p3J16m3J7k03k01L33N8Pj43j7J36j1k22qK82Kl7K23n3j88K36k10J20
5015A44k82J70Q3k27l0J80P9j7k52N2J6j33J52N8j21J64J7L4k14p6M35k54J45
5038A23j91J6j44J12j12J22K0j52L42o6m2J09k23j03J60J6J75j96J47k19K63k91
$$ y = [-93, -161, 27, -139, 173, 130, 121, 67, 62, 122, 83, -43, 53, -43, 129, -203, -53, 202, 21, -13, -69, 98, 210, -87, -54, 96, -166, -69, -37, 306, -73, -14, -21, 94, 121, 22, 90, 85, 87, -189, -81, 46, -64, -72, 310, -60, -50, -78, 64, -202, -40, -117, -231, -214, -49, -120, -203, -53, 147, -225, -59, -23, -54, 33, -174, -112, 135, 47, -132, -21, 149, 20, 21, -85, 93, -140, 109, 127, 68, 128, 57, 42, -90, 64, 62, 20, 100, 118, -71, -307, 91, 62, 14, 265, -155, 144, -48, 127, -186, -122, -29, 245, 79, 185, 1, 169, 223, -105, 20, 43, -8, -82, -70, 287, 169, -60, 206, -116, -90, -16, 2, 89, -36, 23, -50, 66, 23, 40, -163, -364, -31, 27, 34, -109, -126, 10, -1, -223, -231, 51, 53, 16, 239, 186, -2, 234, 24, 144, -138, 32, 115, -112, -142, 38, 117, 100, -152, -100, -84, -217, -65, -7, -128, 36, 53, 87, -127, -203, 232, -22, 123, -68, -52, -196, -84, -196, -74, -54, -206, 136, 70, 28, 137, -86, -189, -29, -13, 162, -34, 113, -106, 157, -134]
5060a34K00j28P7j60J62K5k44J48m4J29k00J10j2K0J41o8P7j23Q8k47J31J93M
5083A45q1o9K28j18n5J6o4P4L8J7Kk81K5J69j19Om7J52j42R2J80j67j3K1K18m49
5109b22P2K36k82L01j23j0J83k47R0O3q8J43L8j87j02J49j43Q0Q7l25K86J59k82
5132a24P0R9j24K86k41j65J45n0J20r2j05K95l33J75k9k5nP1k2LJ32J06r7o1O4
5157I3K0J59j60k60J98M6k14J86j05m9J46k39K88p6K2j59J5P7qm6j00K4p2L68
5181A54k6K9k13j00J74j02J53k32K47k00K41k05j2K1NL06l4Q8k66Q0j72N8O8j17
5205e5J1k10J49K61k15N7o6q8Q1J77p5O5k72L81j37j23J9j40R1L0N3l6k1O9R4
5230A00Jj86M2J05J17k83K43k56J1J62l4j29K28K1l03L92j96Jj61J07j6O1m0n4
$$ y = [-134, 66, -62, 15, -145, 17, 42, -202, -54, -98, 31, -169, -59, -71, -51, 90, 22, 99, -24, 64, -183, -52, 141, 145, 64, -5, 223, 105, 50, 66, 2, 76, 114, 131, 133, -148, -123, 46, -73, -67, -114, 38, -104, -12, 168, 1, -12, 9, 227, -222, -150, 86, -196, 105, -18, -28, 155, -92, -2, 61, -27, 116, 154, -33, -135, 14, -129, -49, 38, -287, -1, 158, -124, -54, 45, -79, 207, -34, -199, -54, -104, 16, -76, -181, 114, -219, -44, -73, -98, -103, -32, -54, -51, 81, 187, 90, 29, 93, 113, 272, 112, -148, 50, 96, -118, 68, -37, -86, 60, -179, 109, 33, 55, -104, -89, -12, -20, -66, -166, -142, -214, 154, 128, 157, -56, -156, 18, -84, 69, -163, 84, -116, 125, -80, -92, -71, -66, 240, 206, 294, 28, 108, -64, -6, 62, -55, -44, -254, -105, 156, -59, -2, -68, -156, -75, 102, 27, 92, -180, 201, 64, -59, -40, -180, -89, -59, -6, -42, -63, 6, 100, 101, -85, -43, 62, 179, -104, 139, -117, -106, 56, 22, -107, 121, 142, -161, 231, 35, 36, -125, -18, -34, 27, -13, -67]
5254f7l5j12K51r3Q2k90M53l86p9M21k07J84j46J36j99j6K0P3P8j7k1K0j13pJ87
5279A17k65K01N3j51j9P0J48q4n0k9N0K4j56L35j03p6q4M2J9j13O2n3J22j60K41
5304A41j20m3j79L13j58J72k27m6J05Q1k0k9j83L75j38K3P5j34j09Q1J76r0K6
5327I2n8n1q1L84l20J84r0r1J32J40l01j18K31k6p2J22j94L0K20o5K3l2q9m7j8
5352i5J97K7j20J1j92K71j83J65k57O1J59K5j26M6rJ5p0J65l9ql8j84K84r6P1
5377H0Q5j77n3K3P8l10N51k05j06q3R0k1q4N7R8j35P3J69p2l5J04K0k46K5J07
5402C3j9M6J12N4k01O0j82J71J49M1k95p8K17j66K86k62N1R1j35K0k2Kj7J82Q6
5427B24l80J49R7k10q2K97Ol40K86M2k04J67q0N8P8p0l5k6p0M7K66p6k22J21j57
$$ y = [-67, -102, -214, 37, -56, 26, -264, 189, -197, -276, 145, -62, 122, -24, 112, -87, -103, -83, -10, 68, 51, 30, 50, -63, -70, 117, -148, 53, 106, -45, -64, 6, 154, 70, 20, -9, 41, 65, -91, 244, 141, 65, -19, 23, 42, -71, -9, -62, 60, -100, 141, 21, -22, -201, 112, -46, 126, -101, -147, -42, 39, 19, -10, -193, 182, 44, 67, 142, 8, -101, -20, 156, 66, 92, 34, -17, -98, 286, -34, 150, 60, -31, 101, 241, -60, -178, 53, 27, -45, 77, -117, -87, 133, 68, 91, 59, -30, -77, -95, 102, 129, 9, 20, -172, 99, -84, 81, -176, -115, 44, 69, -57, -11, -20, -5, -75, 90, 51, 43, 5, -179, 105, 9, 80, 165, -12, -65, -42, 36, -274, 277, 72, -34, -117, -27, -48, -132, -75, 23, -112, -39, 130, 58, 23, 127, 147, -99, -74, 33, 14, 60, 172, 226, 25, 85, -97, 74, 223, 264, -31, -109, 108, -58, 228, -34, 17, 108, -27, -7, -29, -27, -44, 138, 224, -156, -7, 90, -120, -202, 95, 101, -239, 47, 89, -115, 52, -28, 30, 108, 38, 3, -23, -93, -46, 220, 144, -78, 43, -114]
5452a14J56q9l3J15j28q5N9j30K52OJ15q9j31O7j08L20k52Q7qj12J47K5J7N9n6
5477I0m4K2j33L6K4po9nK08r0J53k75k3L31k55j29K85j85mJ18L2j2J45k84p1k49
5503c91M97k08K33j68j4J6P0N5k83J03k8J17m6L8P8j75Q4m5m5K44j44M8J4j96
5527a46j0K00J73j59p5O3O9k29o4Q5J40n3j01K9J12J62k7j19J09j03M4q8K01k36
5551b3N2q0K7n1K23n3P5q3j31J60j11m1N7L9R9k58J98j3r3j70M00k2j25k0J33
5576A89k85J94l29L22n6j90J23p8P4J07n9m3j47L03j97n3O5j78L11K4j24J53j60
5599c4j27K21j67n2K56j35R3j08m4m8M8K47j72j28J52L7k02J15J77RRj54N6L4
5623H3j75j30J16L42k06M8o0l6j03J60j90m7L70j78R8j48J15j4QMl6R1j96O8J70
$$ y = [-114, 42, -47, -80, 35, -93, -178, -119, -249, 3, 9, 124, 35, -96, -29, -137, 183, -69, 18, 10, -102, 45, 70, 87, 146, 90, 46, 68, -65, -29, -5, -12, -81, -86, 122, 32, 185, -90, -113, 218, -37, -166, 119, -66, -70, 48, 80, 68, 213, -71, -142, -391, 106, -102, 131, -37, -51, -35, 35, 90, -193, -90, -118, -1, -47, -9, 69, -106, -22, -67, -112, 132, -12, 36, 50, -146, -156, 44, 217, 58, -17, 46, 115, -114, -178, -93, 47, -6, -107, -78, 34, 196, 169, 50, 159, 56, 100, 12, 213, -23, 29, -51, -24, -75, 148, 95, 170, 87, -44, 116, 5, -36, 21, 60, 159, -99, 99, 86, -7, -177, 223, 201, 76, 56, 189, -96, 98, -231, 91, 35, -155, -32, -110, -36, 71, 12, -31, -178, 125, -72, -125, -60, -238, 73, 97, -27, 126, -34, -161, 60, -107, -159, 97, -38, 55, -53, -97, -145, -97, 150, -22, -150, 2, 39, -163, -48, 129, 138, 147, -7, 49, 83, -92, -222, -106, 236, 30, 78, 18, -18, -121, 39, -151, -198, 172, -6, 92, -56, 59, 45, 53, 57, 21, 112, -84, -16, 154]
5648A54j16kmOR4k17K89l05L14j31j34Q4r9m5M5K19q2j02r0l7K94j8o1j59J73
5673G0p6o3N6Jj28m2M03j88oJ07j81j45K97k18N5j4N3O2j26J86J5j20p6P3K53
5698B48l07J24j26J6o4L69l05R4r6J15j17N6R7m06M16p5n2r9J72o0n8R4K86j46
5722A76r9q6L7M6J91k35KJ05k46K79L3q8j45l6qR0k31J87l9L53l69J32m5m0K3
5747a3k3O4J06k41jK13j37q9O3j4J87k96J24o2J52p6j28J51j78K11j12N4K63l26
5771a08K96k56J26j53R3J0n0P7j07P6L0Q2J24k28J96r9m7j47J36j14N1J35qj3
5795A02M8j65O5p1L3L6j90J51J85k40O9k5P4j49K84k60J44l20J69J05j29N2J86
5818A54M2j32q9o3k11J01K12J36j19l7J03j24j04j78K45N6l1J59j09pN3LN8J5
$$ y = [154, 38, 36, 32, 38, 132, -85, 204, -101, 213, 82, -52, 32, -67, -112, -67, 152, 70, -32, -122, -159, 135, 117, 56, -103, 70, -6, -69, -13, -12, -140, -182, 221, 33, 27, 134, -47, -192, 105, -113, -58, -72, -19, 43, -83, 103, 118, -2, -78, -5, 248, -59, 65, -61, -45, -109, 260, -45, 49, -47, 68, -49, 7, 104, -302, 114, 39, -13, -112, 60, 0, -58, 36, 322, 176, 77, -9, 28, 74, 265, 30, 32, 137, -109, 170, 203, 115, -30, -66, -74, 16, -215, -28, -67, 286, -83, 49, 4, -36, -13, -36, 28, 134, -107, -108, 105, -32, -121, -58, -72, 115, -181, -57, -119, 33, -43, -171, -20, -198, 13, -99, -45, 218, -108, 188, -68, 58, -95, -2, 8, -42, 35, -72, 4, 34, 116, 240, 12, 208, 109, 62, -85, 51, -63, -12, 123, 115, 102, 150, -15, 50, -21, 12, 48, -142, 9, 194, -46, 23, -2, 72, -77, 207, -53, 91, -229, -60, 45, -84, -32, 154, 196, 64, -25, -88, -299, -198, 14, 150, 31, -6, 97, -27, -131, -309, -64, -8, -39, 120, 11, 4, 57, 60, 118, 133]
5842A33j70J9N8j45J36K55j93k24J25J8rr0J26k1j32K4k8J29J07J20m92L84j96
5865f6k00J80J56J6rj71J79q1R2k0j29L41l51n0K27j45n0K16j19kp4J72n9o3J68
5890A58n0m3j6j62J75j36J27q0j76j29L48j00o0J31J0N5p7j45RJ35PJ27o1k59
5914b12J79J05j80k3J87k08n6M16m0lk67K00m4jl4K67l08k2k7K95l25O0KJ27r0
$$ y = [133, -37, -18, 40, -105, 31, 286, 93, -131, -6, 12, 3, -87, 39, 18, -114, -90, -118, 11, 118, 238, -254, 130, -66, -266, -86, 70, 86, 77, -94, 85, 4, 96, 76, -53, 288, -63, -113, 114, -31, -81, 135, 16, 14, -60, 112, 53, -10, 158, 108, 65, 49, -113, 62, -74, 53, -27, -203, -332, 16, -84, -144, -13, -3, 52, -25, -170, -161, -26, -19, 108, 47, -212, -33, 72, -108, -131, 56, -152, -208, 208, 168, 165, -102, 98, 54, 53, 19, 286, -22, -44, -71, 224, -101, -41, -39, 88, -2]
$$ [...]
8191a17
##END NTUPLES=NMR FID
##END=
