##TITLE=1H_103-2024
 DMSO-d6
 8 sc, 
 5.12.2024
##JCAMPDX= 6.0         $$ Bruker NMR JCAMP-DX V2.0
##DATA TYPE= NMR FID
##DATA CLASS= NTUPLES
##ORIGIN= UXNMR, Bruker Analytische Messtechnik GmbH
##OWNER= root
$$ XWIN-NMR		Version 3.5
$$ Thu Dec  5 14:26:34 2024 Russian Standard Time (UT+4h)  she@DPX200
##.OBSERVE FREQUENCY= 200.1315
##.OBSERVE NUCLEUS= ^1H
##.DELAY= (6, 6)
##.ACQUISITION MODE= SIMULTANEOUS
##.ACQUISITION SCHEME= undefined
##.AVERAGES= 8
##.DIGITISER RES= 18
##SPECTROMETER/DATA SYSTEM= spect
##.PULSE SEQUENCE= zg30
##.SOLVENT NAME= CDCl3
##.SHIFT REFERENCE= (INTERNAL, CDCl3, 0, 15.7039)
##AUDIT TRAIL= $$ (NUMBER, WHEN, WHO, WHERE, WHAT)
$$ ##TITLE= Audit trail, XWIN-NMR		Version 3.5
$$ ##JCAMPDX= 5.01
$$ ##ORIGIN= Bruker BioSpin GmbH
$$ ##OWNER= she
$$ F:/spectra/data/she/nmr/H-F/1/audita.txt
$$ ##AUDIT TRAIL=  $$ (NUMBER, WHEN, WHO, WHERE, WHAT)
(   1,<2024-12-05 14:25:24.57 +0400>,<she>,<DPX200>,
      <created by zg, POWCHK disabled, PULCHK disabled
       configuration hash MD5:
       00 E9 B6 7A A2 85 ED C7 34 08 36 98 17 FE 4E 26
       data hash MD5: 16K
       22 16 AA 50 EA 23 04 C9 01 7C 42 43 0D CA 10 5C>)
$$ ##END=
$$ 
$$ hash MD5
$$ 7D 6B 9F 4D 67 B7 22 64 1E 19 99 20 13 C7 39 72
##$RELAX= 
##$RELAX= 
##$RELAX= 
##$RELAX= 
##$RELAX= 
##$RELAX= 
$$ Bruker specific parameters
$$ --------------------------
##$DU= <F:/spectra>
##$EXPNO= 1
##$NAME= <H-F>
##$PROCNO= 1
##$TYPE= <nmr>
##$USER= <she>
##$AMP= (0..31)
100 100 100 100 100 100 100 100 100 100 100 100 100 100 100 100 100 100 
100 100 100 100 100 100 100 100 100 100 100 100 100 100 
##$AQSEQ= 0
##$AQ_mod= 1
##$AUNM= <au_zg>
##$AUTOPOS= <>
##$BF1= 200.13
##$BF2= 200.13
##$BF3= 200.13
##$BF4= 200.13
##$BF5= 200.13
##$BF6= 200.13
##$BF7= 200.13
##$BF8= 200.13
##$BYTORDA= 1
##$CFDGTYP= 0
##$CFRGTYP= 5
##$CHEMSTR= <none>
##$CNST= (0..31)
1 1 145 1 1 1 1 1 1 1 1 1 1 1 1 1 1 1 1 1 1 1 1 1 1 1 1 1 1 1 1 1 
##$CPDPRG= <>
##$CPDPRG1= <>
##$CPDPRG2= <>
##$CPDPRG3= <>
##$CPDPRG4= <mlev>
##$CPDPRG5= <mlev>
##$CPDPRG6= <mlev>
##$CPDPRG7= <mlev>
##$CPDPRG8= <mlev>
##$CPDPRGB= <>
##$CPDPRGT= <>
##$D= (0..31)
0 1.2 0 0 0 0 0 0 0 0.06 0 0.03 0 0 0 0 0.0002 0 0 0 0 0 0 0 0 0 0 0 0 
0 0 0 
##$DATE= 1733394324
##$DBL= (0..7)
120 120 120 120 120 120 120 120 
##$DBP= (0..7)
150 150 150 150 150 150 150 150 
##$DBP07= 0
##$DBPNAM0= <>
##$DBPNAM1= <>
##$DBPNAM2= <>
##$DBPNAM3= <>
##$DBPNAM4= <>
##$DBPNAM5= <>
##$DBPNAM6= <>
##$DBPNAM7= <>
##$DBPOAL= (0..7)
0.5 0.5 0.5 0.5 0.5 0.5 0.5 0.5 
##$DBPOFFS= (0..7)
0 0 0 0 0 0 0 0 
##$DE= 6
##$DECBNUC= <off>
##$DECIM= 24
##$DECNUC= <off>
##$DECSTAT= 4
##$DIGMOD= 1
##$DIGTYP= 9
##$DL= (0..7)
0 120 120 120 120 120 120 120 
##$DP= (0..7)
150 150 150 150 150 150 150 150 
##$DP07= 0
##$DPNAME0= <>
##$DPNAME1= <>
##$DPNAME2= <>
##$DPNAME3= <>
##$DPNAME4= <>
##$DPNAME5= <>
##$DPNAME6= <>
##$DPNAME7= <>
##$DPOAL= (0..7)
0.5 0.5 0.5 0.5 0.5 0.5 0.5 0.5 
##$DPOFFS= (0..7)
0 0 0 0 0 0 0 0 
##$DQDMODE= 0
##$DR= 18
##$DS= 0
##$DSLIST= <SSSSSSSSSSSSSSS>
$$ [...]
##$SUBNAM2= <"">
##$SUBNAM3= <"">
##$SUBNAM4= <"">
##$SUBNAM5= <"">
##$SUBNAM6= <"">
##$SUBNAM7= <"">
##$SUBNAM8= <"">
##$SUBNAM9= <"">
##$SW= 24.0689530833862
##$SWIBOX= (0..15)
0 0 2 0 0 0 0 0 0 0 0 0 0 0 0 0 
##$SW_h= 4816.95568400771
##$TD= 16384
##$TD0= 1
##$TE= 0
##$TE2= 300
##$TE3= 300
##$TEG= 300
##$TL= (0..7)
0 120 120 120 120 120 120 120 
##$TP= (0..7)
150 150 150 150 150 150 150 150 
##$TP07= 0
##$TPNAME0= <>
##$TPNAME1= <>
##$TPNAME2= <>
##$TPNAME3= <>
##$TPNAME4= <>
##$TPNAME5= <>
##$TPNAME6= <>
##$TPNAME7= <>
##$TPOAL= (0..7)
0.5 0.5 0.5 0.5 0.5 0.5 0.5 0.5 
##$TPOFFS= (0..7)
0 0 0 0 0 0 0 0 
##$TUNHIN= 0
##$TUNHOUT= 0
##$TUNXOUT= 0
##$USERA1= <user>
##$USERA2= <user>
##$USERA3= <user>
##$USERA4= <user>
##$USERA5= <user>
##$V9= 5
##$VALIST= <valist>
##$VCLIST= <CCCCCCCCCCCCCCC>
##$VD= 0
##$VDLIST= <DDDDDDDDDDDDDDD>
##$VPLIST= <PPPPPPPPPPPPPPP>
##$VTLIST= <TTTTTTTTTTTTTTT>
##$WBST= 1024
##$WBSW= 4
##$XGAIN= (0..3)
0 0 0 0 
##$XL= 0
##$YL= 0
##$YMAX_a= 144709
##$YMIN_a= -107327
##$ZGOPTNS= <>
##$ZL1= 120
##$ZL2= 120
##$ZL3= 120
##$ZL4= 120
##$ABSF1= 10
##$ABSF2= 0
##$ABSG= 5
##$ABSL= 3
##$ALPHA= 0
##$AQORDER= 0
##$ASSFAC= 0
##$ASSFACI= 0
##$ASSFACX= 0
##$ASSWID= 0
##$AUNMP= <proc_1d>
##$AZFE= 0.1
##$AZFW= 0.1
##$BCFW= 1
##$BC_mod= 2
##$BYTORDP= 1
##$COROFFS= 0
##$CY= 11.3945322036743
##$DATMOD= 1
##$DC= 2
##$DFILT= <>
##$DTYPP= 0
##$F1P= 15.6554695791079
##$F2P= 12.8336369535428
##$FCOR= 0.5
##$FTSIZE= 0
##$FT_mod= 4
##$GAMMA= 1
##$GB= 0.15
##$INTBC= 1
##$INTSCL= 1
##$ISEN= 128
##$LB= 0.24
##$LEV0= 0
##$LPBIN= 0
##$MAXI= 10000
##$MC2= 0
##$MEAN= 0
##$ME_mod= 0
##$MI= 1.114404
##$NCOEF= 0
##$NC_proc= 0
##$NLEV= 6
##$NOISF1= 3.799351
##$NOISF2= 2.8
##$NSP= 1
##$NTH_PI= 0
##$NZP= 0
##$OFFSET= 15.70392
##$PC= 1
##$PHC0= -26708.27
##$PHC1= 14.78744
##$PH_mod= 1
##$PKNL= yes
##$PPARMOD= 0
##$PSCAL= 0
##$PSIGN= 0
##$REVERSE= no
##$SF= 200.130013532006
##$SI= 16384
##$SIGF1= 3
##$SIGF2= 2
##$SINO= 400
##$SIOLD= 16384
##$SREGLST= <1H.CDCl3>
##$SSB= 0
##$STSI= 0
##$STSR= 0
##$SW_p= 3612.71676300578
##$SYMM= 0
##$S_DEV= 0
##$TDeff= 0
##$TDoff= 0
##$TI= <>
##$TILT= no
##$TM1= 0
##$TM2= 0
##$TOPLEV= 0
##$USERP1= <user>
##$USERP2= <user>
##$USERP3= <user>
##$USERP4= <user>
##$USERP5= <user>
##$WDW= 1
##$XDIM= 8192
##$YMAX_p= 0
##$YMIN_p= 0
$$ End of Bruker specific parameters
$$ ---------------------------------
##NTUPLES= NMR FID
##VAR_NAME=  TIME,          FID/REAL,        FID/IMAG
##SYMBOL=    X,             R,               I
##VAR_TYPE=  INDEPENDENT,   DEPENDENT,       DEPENDENT
##VAR_FORM=  AFFN,          ASDF,            ASDF
##VAR_DIM=   8192,          8192,            8192
##UNITS=     SECONDS,       ARBITRARY UNITS, ARBITRARY UNITS
##FACTOR=    0.0002076,     1,               1
##FIRST=     0,             0,               0
##LAST=      1.7004516,     0,               0
##MIN=       0,             -107327,         0
##MAX=       1.7004516,     144709,          0
$$ Real data points
##PAGE= N=1
##DATA TABLE= (X++(R..R)), XYDATA
$$ [...]
$$ plain form
2006 22 133 -198 54 -442 -529 -142 220 553 -349 -503 25 138 -70 -93 356 -75 -233 -81 321 -34 -205
2027 -205 -74 -139 60 185 32 -417 -315 -170 185 278 30 -104 -91 -223 227 347 299 43 -333 334 415 -148
2049 -148 100 -196 -86 -279 551 495 223 -269 -150 -88 113 247 91 -415 -245 130 238 186 -343 -294 -122
2070 -122 186 -19 308 43 -142 -66 295 272 104 48 -207 -345 -53 233 215 -234 -169 22 156 496 192 -132
2092 -132 -260 -288 60 439 -27 -511 -452 112 400 4 -122 -647 -111 178 180 14 -232 -322 52 -19 136 395
2114 395 228 -411 -384 250 34 -87 -277 7 -297 96 160 441 -105 -414 -55 149 360 -89 82 75 -285
2135 -285 146 166 181 -370 -59 223 170 302 210 120 -476 -6 547 234 -61 -405 -268 19 -332 92 255 -318
2157 -318 -133 253 191 22 -351 112 -361 -88 623 160 -40 -353 160 -226 294 644 75 -53 -459 126
$$ packed form
2006B2J11l31K52m96q7L87L62L33r02j54N28J13k08k3M49m31j58J52M02l55j71
2027b05J31o5J99J25j53m49J02J45L55R3k48j34J3j32M50J20m8k56l76O67Q1n63
2049a48K48k96J10j93Q30n6k72m92J19O2K01J34j56n06J70L75J08n2n29M9J72
2070a22L08k05L27k65j85P6L61k3j68n6k55j38K92K86j8m49O5J91J34L40l04l24
2092a32j28k8L48L79m66m84N9N64K88l96j26n25N36K89Kj66k46r0L74p1J55K59
2114C95j67o39K7O34k16j21j90K84l04L93O4K81n46l09L59K04K11m49J71pl60
2135b85M31K0J5n51L11K82n3J32r2r0n96M70N53l13k95l44J37K87l51M24J63n73
2157c18J85L86o2j69l73M63m73K73P11m63k00l13N13l86N20L50n69j28m06N85
$$ plain form
2177 126 654 254 -369 -118 191 383 -18 -197 -4 -395 -246 51 96 180 -172 -486 53 -159 291 302 -93
2198 -93 -483 101 256 0 39 -107 -54 -155 241 320 115 -569 -29 489 101 -134 -306 318 44 72 303 124
2220 124 -18 -87 -153 350 270 -30 254 -466 -399 67 558 -140 -188 -130 -68 250 132 95 -127 -360 216 391 -145
2243 -145 -516 -130 178 -103 -188 198 201 -256 -182 90 143 58 2 -38 -12 408 361 8 -226 -124 -159 203 230 84
2267 84 232 -311 -245 81 99 -2 -226 -238 -37 -36 -67 350 29 -194 -98 216 114 -196 -129 -337 6 97 328
2290 328 16 -275 3 118 263 68 52 -25 -201 -194 231 -108 186 77 -53 -58 -148 247 -113 -85 -350 -236 228
2313 228 136 -375 -228 104 170 -222 -239 -233 -26 -127 16 -134 -104 -47 153 -316 92 -164 103 112 -462 237 15
2336 15 -100 97 -318 92 -337 261 342 -33 271 108 70 181 92 16 -27 -47 -184 -17 -257 -90 200 -323
$$ packed form
2177A26N28m00o23K51L09J92m01j79J93l91J49K97M5Q4l52l14N39k12M50J1l95
2198i3l90N84J55k56L9j46N3j01L96P9k05o84N40N18l88k35j72O24k74K8K31j79
2220A24j42o9o6N03q0l00K84p20O7M66M91o98m8N8O2L18j18l7k22k33N76J75n36
2243a45l71L86L08k81q5L86Lm57P4K72N3q5n6m0K6M20m7l53k34J02l5L62K7j46
2267H4J48n43O6L26J8j01k24j2K01Jl1M17l21k23R6L14j02l10O7k08L43R1K31
2290C28l12k91K78J15J45j95j6p7j76PM25l39K94j09j30nr0L95l60K8k65J14M64
2313B28r2n11J47L32O6l92j7OK07j01J43j50L0N7K00m69M08k56K67Rn74O99k22
2336A5j15J97m15M10m29N98Q1l75L04j63l8J11q9p6m3k0j37J67k40J67K90n23
$$ plain form
2358 -323 -44 96 -282 44 -247 -75 398 205 293 -189 -374 44 149 106 -218 -317 -157 160 -129 25 -28
2379 -28 -37 -54 305 -96 273 -12 -273 -270 113 -109 214 295 -275 46 130 205 -46 166 -228 -234 164 360 -91 -305
2403 -305 -134 -285 -17 112 -9 230 -266 221 18 141 -21 -263 -18 -42 -218 239 178 110 -226 -70 204
2424 204 -116 -157 -386 -53 -60 78 25 -186 -32 -68 120 252 146 -222 -245 -97 239 16 -108 -227 -16 43
2446 43 -218 143 320 -48 -279 -11 -91 1 -10 -363 88 -19 -105 184 224 201 -69 -202 73 332 27 105 -24
2469 -24 -145 -106 233 311 -100 -250 -114 297 225 -168 -192 -56 -62 248 288 -195 -448 163 -122 -190 44 -258 -223
2492 -223 -32 -259 -50 20 149 -3 189 157 107 148 373 -183 -7 412 554 160 -420 -93 50 70 61 50 8
2515 8 -26 103 275 119 -70 96 -71 264 -19 -26 57 -173 -465 -122 442 120 96 -111 -58 256 92 301 130
$$ packed form
2358c23K79J40l78L26k91J72M73j93Q8m82j85M18J05m3l24r9J60L17k89J54n3
2379b8rj7L59m01L69k85k61LL83k22L23Q1n70L21Q4P5k51K12l94oL98J96m51k14
2403c05J71j51K68J29j21K39m96M87k03J23j62k42K45k4j76M57o1o8l36J56K74
2424B04l20m1k29L33pJ38n3k11J54l6J88J32j06l68k3J48L36k23j24j19K11N9
2446D3k61L61J77l68k31K68q0R2j1l53M51j07q6K89M0k3k70j33K75K59l05P8j29
2469b4j21L9L39P8m11j50J36M11p2l93k4J36oL10M0m83k53O11k85o8K34l02L5
2492b23J91k27K09P0J29j52J92l2n0M1K25n56J76M19J42l94n80L27J43K0rj1m2
2515Hl4J29J72j56j89J66j67L35k83pQ3k30k92L43N64l22k4k07N3L14j64K09j71
$$ plain form
2538 130 362 98 79 13 -69 161 -203 203 -34 321 138 5 -98 196 -169 6 276 131 -89 -137 -179 99
2560 99 89 -78 -111 289 47 163 -38 -303 -171 35 104 -60 -433 67 128 98 -212 223 -63 -64 -150 45 10
2583 10 96 -89 -513 -123 -43 122 222 69 196 -82 20 -174 -139 6 7 -39 -266 20 145 44 -185 -38
2605 -38 -56 367 -129 24 -273 70 84 326 175 -200 -29 29 310 1 -256 -287 9 99 56 84 -288 -149 245
2628 245 -200 57 87 -86 -70 31 21 -79 31 100 -39 -7 95 193 125 50 -278 8 -66 370 -91 -159 -103 153
2652 153 63 -55 145 -150 98 18 -223 292 -137 62 -41 205 258 256 113 96 -109 -222 -126 295 107 -32
2674 -32 142 488 227 249 197 29 136 313 135 127 190 -78 -31 527 36 37 -221 -229 -164 209 191 83 -27 -555
2698 -555 3 -49 74 217 70 -185 -49 373 -73 -104 208 -22 121 97 36 82 -1 -107 -12 89 73 225 -37
$$ packed form
2538A30K32k64j9o6q2K30l64M06k37L55j83j33j03K94l65J75K70j45k20m8m2K78
2560I9j0j67l3M00k42J16k01k65J32K06O9j64l73N00O1l0l10M35k86jq6J95l5
2583A0Q6j85m24L90Q0J65J00j53J27k78J02j94L5J45Jm6k27K86J25j01k29J47
2605c8j8M23m96J53k97L43J4K42j51l75J71N8K81l09k57l1K96R0m3K8l72J39L94
2628B45m45K57L0j73J6J01j0j00J10O9j39L2J02R8o8p5l28K86p4M36m61o8N6K56
2652A53r0j18K00k95K48q0k41N15m29J99j03K46N3kj43j7k05j13R6M21j88j39
2674c2J74L46k61K2n2j68J07J77j78qO3k68M7N58m91Jk58qO5L73j8j08j10n28
2698e55N58n2J23J43j47k55J36M22m46l1L12k30J43k4o1M6q3j06R5J01j6J52k62
$$ plain form
2721 -37 158 -50 -135 195 -21 -237 -226 405 -166 -163 -271 95 -254 63 257 -38 81 -40 130 -416 12 29
2743 29 184 -146 -373 143 72 210 87 -164 -11 24 -315 -80 -311 -189 306 -114 -2 -158 51 -147 -340
2764 -340 -212 46 -50 29 -144 282 -147 186 132 -240 -22 134 192 -41 -173 -323 -203 254 75 111 -28 -215
2786 -215 -130 -109 439 -286 -11 -172 450 43 -100 0 290 -18 -338 407 -212 -40 -188 -85 -16 42 169
2807 169 -14 -273 7 42 32 -85 56 161 -51 185 171 10 -268 -364 -245 85 -29 -344 -77 365 -74
2828 -74 -6 27 -5 172 28 112 -271 188 -414 -184 -531 -234 98 243 -113 -17 -218 218 -85 -131 57 -16 314
2851 314 -241 6 -23 -98 47 23 -41 -214 41 176 -28 177 -114 -109 97 7 -309 -266 175 249 -58 -110 -86 247
2875 247 -77 156 -149 167 -194 -460 -170 32 -172 -79 129 -42 -101 25 156 -123 -306 41 -14 -180 -46
$$ packed form
2721c7J95k08q5L30k16k16J1O31n71Lj08L66l49L17J94k95J19j21J70n46M28J7
2743B9J55l30k27N16p1J38j23k51J53L5l39K35k31J22M95m20J12j56K09j98j93
2764c40J28K58r6P9j73M26m29L33n4l72K18J56N8k33j32j50J20M57j79L6j39j87
2786b15Q5K1N48p25K75j61O22m07j43J00K90l08l20P45o19J72j48J03O9N8J27
2807A69j83k59K80L5j0j17J41J05k12K36j4j61k78r6J19L30j14l15K67M42m39
2828g4O8L3l2J77j44Q4l83M59o02K30l47K97L32J45l56R6k01M36l03m6J88p3L30
2851C14n55K47k9p5J45k4o4j73K55J35k04K05k91NK06r0l16M3M41P4l07n2K4L33
2875B47l24K33l05L16l61k66K90K02k04R3K08j71n9J26J31k79j83L47n5j66J34
$$ plain form
2896 -46 -71 -123 51 136 289 -72 -114 26 62 -276 -69 98 -148 -204 35 376 242 121 -397 -491 -162 184 105
2919 105 11 -79 269 423 52 -63 -170 100 16 75 49 -52 -80 138 88 -100 386 189 75 -235 -138 328 -3
2942 -3 243 -252 -3 -298 329 -2 38 69 -264 -74 93 276 -375 -9 156 -183 324 -182 10 -320 11
2963 11 322 -84 93 -96 77 -292 -165 380 192 320 7 -94 -73 120 50 -141 -36 5 -56 44 -76 -20
2985 -20 -161 58 157 93 -91 36 -36 -225 92 22 63 -279 -389 -153 117 -62 -324 -132 -323 -6 -5 -49 -50 174
3009 174 217 -118 159 -117 68 152 -245 -4 -106 -53 196 108 -97 -397 226 17 -102 -71 60 13 -58 114
3031 114 149 -189 57 287 202 24 -88 389 150 -161 -239 135 66 30 -48 49 -174 -144 -59 23 -215 -11 244
3054 244 -207 62 -30 345 219 -156 156 -126 67 34 247 -119 -15 380 166 80 43 60 17 88 -226 168
$$ packed form
2896d6k5n2J74Q5J53l61m2J40L6l38K07J67k46n6K39L41j34j21n18r4L29L46p9
2919A05r4r0L48J54l71j15j07K70q4N9k6j01k8K18n0j88M86j97j14l10R7M66l31
2942cK46m95K49k95O27l31M0L1l33J90J67J83o51L66J65l39N07n06J92l30L31
2963A1L11m06J77j89J73l69J27N45j88J28l13j01K1J93p0j91J05M1o1J00j20N6
2985b0j41K19R9o4j84J27p2j89L17p0M1l42j10K36K70j79k62J92j91L17Jm4jK24
3009A74M3l35K77k76J85Q4l97K41j02N3K49q8k05l00O23k09j19L1J31m7p1J72
3031A14L5l38K46K30q5j78j12M77k39l11p8L74o9l6p8R7k23L0Q5Q2k38K04K55
3054B44m51K69r2L75j26l75L12k82J93l3K13l66J04L95k14q6l7J7m3P1l14L94
$$ plain form
3076 168 -120 30 55 -4 21 67 -221 223 142 -125 -344 -54 -166 117 -128 77 38 -131 289 322 71 30 227
3099 227 -194 -149 112 15 431 -274 274 148 15 244 -95 136 -18 -30 72 73 -44 215 -58 -81 -43 -205
3121 -205 -96 -190 -49 -52 -143 -413 -339 -61 416 -47 57 117 124 -188 73 166 158 -94 152 326 296 -12 13 -165
3145 -165 114 -87 10 -68 1 -17 -154 67 -152 197 -377 -132 -134 -81 66 43 -75 124 -235 443 84 13 206
3168 206 180 60 -142 -136 81 -119 401 18 -18 228 -54 66 -146 -1 -91 10 -182 219 -232 255 278 -23
3190 -23 224 -218 -82 37 -385 74 103 69 -1 263 -195 12 22 45 59 -17 -68 23 210 -378 -136 -134 5 -71
3214 -71 -60 -470 -97 -58 42 -310 -140 287 -79 -176 -140 -158 -56 10 -55 -19 -77 144 125 203 299 -9 123 7
3238 7 91 222 57 20 -55 -88 17 -125 -170 191 -128 58 110 -187 176 244 -301 -194 94 222 222 -98 52 297
$$ packed form
3076A68k88J50K5n9K5M6k88M44q1k67k19K90j12K83k45K05l9j69M20L3k51m1J97
3099B27m21M5K61r7M16p05N48j26j33K29l39K31j54j2J02Jj17K59k73k3L8j62
3121b05J09r4J41lr1k70P4K78M77m63J04O0Pl12K61R3qk52K46J74l0l08K5j78
3145a65K79k01R7p8O9j8j37K21k19L49n74K45kN3J47k3j18J99l59O78l59p1J93
3168B06k6j20k02OK17k00N20l83l6K46k82J20k12J45r0J01j92M01m51M87K3l01
3190b3K47m42J36J19m22M59K9l4p0K64m58K07J0K3J4p6n1R1J87n88K42KJ39p6
3214g1J1m10L73L9J00l52J70M27l66r7L6j8J02O6o5L6n8K21j9P8R6l08J32j16
3238GQ4J31j65l7p5l3J05j42m5L61l19J86N2k97L63O8n45J07K88J28%l20J50K45
$$ plain form
3262 297 -30 28 158 242 56 -94 182 59 191 382 120 -140 -224 -6 98 151 205 104 -109 -146 -14 -223
3284 -223 -127 283 168 46 -89 59 -163 -130 131 -88 46 37 156 323 63 -75 146 137 345 -83 -32 -91 -71
3307 -71 55 -339 -4 -185 146 342 172 53 -97 -21 -286 250 220 -152 121 229 -33 97 -86 232 165
3328 165 -188 -215 -112 -156 -288 195 124 94 -214 21 -35 -111 -28 94 -115 -49 -17 167 284 166 -254 136 -145
3351 -145 18 51 364 101 -122 386 5 6 100 -315 151 -55 -86 -7 -246 -113 186 128 109 -71 167 460 -92
3374 -92 75 99 -150 -2 249 -23 97 -90 76 -109 183 72 114 -52 172 116 174 37 -150 57 -108 115
3396 115 158 -91 -147 -69 -100 104 -149 -72 161 421 -201 -170 134 173 61 188 265 358 -210 -113 -9 28 -96 80
3420 80 358 -181 47 54 216 206 -237 142 210 -289 -91 315 -147 -190 138 25 4 17 -108 -195 -91 135 -13
$$ packed form
3262B97l27N8J30Q4j86j50K76j23J32J91k62k60q4K18J04N3N4j01k13l7J32k09
3284b23R6M10j15j22j35J48k22L3K61k19J34rJ19J67k60j38K21rK08m28N1n9K0
3307g1J26l94L35j81L31J96j70j19j50P6k65N36l0l72K73J08k62J30j83L18o7
3328A65l53k7J03m4j32M83p1l0l08K35n6p6Q3J22k09O6L2J84J17j18m20L90k81
3351a45J63L3L13k63k23N08l81JR4m15M66k06l1P9k39J33K99n8j9j80K38K93n52
3374i2J67K4k49J48K51k72J20j87J66j85K92j11M2j66K24n6N8j37j87K07j65K23
3396A15M3k49n6P8l1K04k53P7K33K60o22L1L04L9j12J27P7R3n68R7J04L7j24J76
3420H0K78n39K28PJ62j0m43L79O8m99J98M06m62m3L28j13k1J3j25q7J04K26j48
$$ plain form
3443 -13 39 -133 45 -210 65 -160 -132 176 92 -44 -137 239 -116 -163 -66 131 -135 31 78 -89 -151 -13 18
3466 18 4 -182 11 303 71 104 -111 19 208 51 226 116 -169 50 -66 108 -107 -236 263 2 -256
3487 -256 170 -22 -38 -250 -50 85 327 14 86 -248 -194 131 -33 47 41 -242 -47 -159 40 -84 292 -196
3509 -196 59 18 108 -108 -333 -3 92 -274 -153 -1 -106 27 66 54 -67 91 -59 -72 -158 -23 66 33 -80
3532 -80 21 40 -254 -312 -51 -87 5 -118 -258 158 -263 -334 207 -13 103 455 356 92 28 -317 37 -199 55
3555 55 164 -162 65 30 -202 143 -29 -68 -265 -44 175 -90 116 18 1 77 -56 134 -183 152 -80 -23
3577 -23 -193 20 -23 -126 181 21 111 107 -172 -54 39 -90 321 -46 152 260 239 27 -126 26 234 -54
3599 -54 -93 -19 -9 95 87 22 180 -118 104 22 221 18 207 82 -289 45 228 13 -123 112 81 -278 -118
$$ packed form
3443a3N2j72J78k55K75k25K8L08q4j36r3L76l55m7R7J97k66J66M7j67o2J38L1
3466A8j4j86J93K92k32L3k15J30J89j57J75j10k85K19j16J74k15j29M99k61k58
3487b56M26j92j6k12K00J35K42l13P2l34N4L25j64Q0ok83J95j12J99j24L76m88
3509a96K55m1R0k16k25L30R5l66J21J52j05J33L9j2j21J58j50j3q6J35Q9l3j13
3532h0J01J9k94n8K61l6R2j23j40M16m21p1N41k20J16L52r9k64o4l45L54k36K54
3555E5J09l26K27l5k32L45j72l9j97K21K19k65K06r8j7P6j33J90l17L35k32N7
3577b3j70K13m3j03L07j60R0mk79J18R3j29M11l67J98J08k1k12j53J52K08k88
3599e4l9P4J0J04qo5J58k98K22q2J99k03J89j25l71L34J83k15j36K35l1l59J60
$$ plain form
3622 -118 23 88 -44 84 26 -108 204 4 163 279 -76 69 -129 156 -123 -60 20 -163 56 76 -131 -140
3644 -140 393 205 -149 -77 258 -20 -147 37 21 123 -264 -121 197 -133 -64 -323 106 89 174 -56 128 70
3666 70 75 -156 -187 -243 -306 -115 49 24 207 -284 69 -362 54 129 -94 215 -321 -37 -204 -56 1 97 -56
3689 -56 166 39 285 -35 162 -97 132 -90 -3 3 60 46 -202 10 88 -161 -57 259 72 136 -72 -36 58
3712 58 284 -27 -107 -170 20 -179 160 -290 -213 -218 -180 -87 362 -104 67 -339 168 -98 182 105 -185 -33 -51
3735 -51 41 194 -55 339 59 -206 -195 -114 182 57 107 -96 -19 -185 268 36 286 -115 -61 -61 -108 156 -129
3758 -129 39 39 83 -33 -12 156 188 42 -58 253 4 -76 38 -139 361 39 -181 -417 173 63 123 -58
3780 -58 190 6 -66 283 161 -77 190 -136 -259 82 -3 114 -213 2 -11 -72 -218 137 14 80 -49 -210
$$ packed form
3622a18J41O5j32J28n8j34L12k00J59J16l55J45j98K85k79O3Q0j83K19K0k07r
3644a40N33j88l54P2L35k78j27J84j6J02l87J43L18l30O9k59M29j7Q5k30J84n8
3666G0Nk31l1n6o3J91J64k5J83m91L53m31M16P5k23L09n36K84j67J48N7R6j53
3689e6K22j27K46l20J97k59K29k22Q7ON7j4k48K12P8k49J04L16j87O4k08L6R4
3712E8K26l11q0o3J90j99L39m50P7nL8R3M49m66J71m06N07k66K80p7k90J52j8
3735e1R2J53k49L94k80k65J1Q1K96j25N0k03P7j66M53k32K50m01N4%m7K64k85
3758a29J68%M4j16K1J68L2j46j00L11k49q0J14j77N00l22k20k36N90j10O0j81
3780e8K48j84p2L49j22k38K67l26j23L41q5J17l27K15j3o1j46L55j23O6j29j61
$$ plain form
3802 -210 2 -107 -179 -220 276 -152 280 -158 -73 36 23 202 -235 -332 165 236 -22 -76 85 -15 144 -91
3824 -91 375 -117 -138 34 -265 -18 -255 -35 -136 -326 -90 211 245 -193 -106 -73 -113 -82 -212 -143 153 -235 131
3847 131 -265 -20 -445 169 -42 -37 104 34 179 413 -25 36 203 65 42 147 -16 60 209 -375 177 -69
3869 -69 250 -53 16 137 296 -144 -48 -124 -262 26 -387 101 69 -32 50 157 -39 -21 -6 11 180 -240 253
3892 253 -47 -159 26 19 -208 -93 64 -61 100 -62 -105 34 -140 106 96 100 -174 206 -151 -26 221 -341
3914 -341 160 -17 -60 188 123 248 -18 -41 143 -87 3 9 -102 -109 48 -206 276 31 157 -209 -140 -117 -96 173
3938 173 273 216 90 -224 -244 3 348 -34 169 44 -183 -129 -100 7 -224 -166 51 -42 -152 167 -4 -169
3960 -169 -7 -47 247 4 -72 -153 78 -38 76 225 272 219 0 69 -77 273 -17 115 112 -102 -464 -57 113
$$ packed form
3802b10K12j09p2m1M96m28M32m38Q5J09j3J79m37r7M97P1k58n4J61j00J59k35
3824i1M66m92k1J72k99K47k37K20j01j90K36L01L4m38Q7L3m0L1j30O9K96l88L66
3847A31l96K45m25O14k11NJ41p0J45K34m38O1J67j38k3J05j63P6J49n84N52k46
3869f9L19l03O9J21J59m40R6p6j38K88m13M88l2j01Q2J07j96J8J5J7J69m20M93
3892B53l00j12J85pk27J15J57j25J61j62m3J39j74K46j0Mk74L80l57J25K47n62
3914c41N01j77m3K48o5J25k66k3J84k30R0Oj11pJ57k54M82k45J26l66O9K3K1K69
3938A73J00n7j26l14k0K47L45l82K03j25k27N4K9J07k31N8K17r3j10L19j71j65
3960a69J62m0K94k43p6q1K31j16J14J49M7n3k19O9j46L50k90J32lk14l62M07J70
$$ plain form
3983 113 -185 159 91 364 97 164 94 -21 237 -15 -192 130 -81 -116 -392 91 -161 187 72 110 -84 -83
4005 -83 8 -86 199 -72 175 -130 41 37 -378 -268 66 142 -103 -251 -108 63 -105 -116 -49 -79 46 -294 65
4028 65 -194 -94 45 197 271 -104 57 -222 396 35 -236 71 -125 -113 -131 14 -326 103 -67 215 -322
4049 -322 -120 140 -483 57 19 4 -101 74 -251 98 -190 -301 -27 169 -103 172 -87 -62 91 7 16 -570
4071 -570 100 57 -113 -308 15 -108 -80 17 -86 -449 -79 -365 124 209 111 113 7 2 -301 98 -216 -223 -93 7
4095 7 -92 2 145 -113 -252 -126 -125 -468 71 -250 -239 76 55 -232 100 -226 -72 -63 -50 -79 104 80 42 153 -276
4120 -276 8 169 -218 -111 54 -37 23 120 13 -94 -15 21 107 254 144 -175 80 -96 -325 127 -55 -128
4142 -128 -15 -167 40 219 159 -89 -95 105 177 -124 215 162 -9 72 -5 -79 -151 128 146 -172 301 -83 -6 -165
$$ packed form
3983A13k98L44o8K73k67O7p0j15K58k52j77L22k11l5k76M83k52L48j15L8j94J
4005h3R1r4K85k71K47l05J71mm15J10L34P6k45j48J43J71j68j1O7l0J25l40L59
4028F5k59J00J39J52P4l75J61k79O18l61k71L07j96J2j8J45l40M29j70K82n37
4049c22K02K60o23N40l8j5j05J75l25L49k88j11K74J96k72K75k59K5J53q4Rn86
4071e70O70m3j70j95L23j23K8R7j03l63L70k86M89Q5r8Kj06nl03L99l14pJ30J00
4095Gr9R4J43k58j39J26Jl43N39l21J1L15k1k87L32l26J54RJ3k9J83k4l8J11m29
4120b76K84J61l87J07J65r1O0R7j07j07P9L6Q6J47j10l19K55j76k29M52j82p3
4142a28J13j52K07J79o0k48oK00P2l01L39n3j71Q1p7p4p2K79J8l18M73l84P7j59
$$ plain form
4166 -165 -36 -192 11 11 254 133 -158 -77 141 -156 -158 47 -278 -166 101 73 148 -148 -364 -159 44 -71
4188 -71 49 -330 -94 -19 259 -67 7 306 -7 -52 17 39 25 278 111 -361 62 126 -379 -179 24 35 203
4211 203 -96 -32 -156 58 158 -36 -111 -122 63 -223 154 -27 -75 -48 -104 -317 -167 158 315 -24 -107 -21 32
4234 32 -143 165 -53 -401 -163 -17 -231 195 -1 112 -26 -118 -4 233 -41 -98 -82 173 -145 120 384
4255 384 -213 -22 95 -11 104 -100 128 2 -28 360 237 69 -177 109 9 -247 77 115 1 -75 106
4276 106 3 -101 -221 -83 118 179 -134 235 -137 236 305 154 55 -271 290 235 -129 -25 173 10 -196
4297 -196 277 -74 92 -91 30 255 23 121 -19 -177 18 -24 34 108 138 20 113 -151 136 199 82 -59
4319 -59 -107 -125 129 -27 -292 -93 469 38 250 -85 -84 354 207 9 -9 -85 130 -61 -170 146 -107 28
$$ packed form
4166a65J29j56K03%K43j21k91Q1K18k97kK05l25J12K67k8P5k96k16K05K03j15
4188g1J20l79K36P5K78l26P4K99l13m5O9K2j4K53j67m72M23O4n05K00K03J1J68
4211B03k99O4j24K14J00j94p5j1J85k86L77j81m8K7n6k13J50L25J57l39q3Q6N3
4234C2j75L08k18l48K38J46k14M26j96J13j38r2J14K37k74n7J6K55l18K65K64
4255C84n97J91J17j06J15k04K28j26l0L88j23j68k46K86j00k56L24L8j14p6J81
4276A06j03j04j20J38K01O1l13L69l72L73O9j51r9l26N61n5l64J04J98j63k06
4297a96M73l51J66j83J21K25k32R8j40j58J95m2N8P4L0j18R3k64K87O3j17j41
4319e9m8j8K54j56k65J99N62m31K12l35JM38j47j98j8p6K15j91j09L16k53J35
$$ plain form
4341 28 76 -395 70 5 -45 -230 147 -220 -35 164 177 132 -25 -138 3 -83 -67 -67 -64 3 5 29 -99 424 -35
4366 -35 104 52 -48 -462 -18 93 -353 20 -110 -174 122 -247 248 165 -373 308 -28 -108 218 145 -41 71
4388 71 327 75 -135 -26 -296 29 -119 -28 -47 -9 67 -242 80 -34 -127 -21 -228 58 -139 -144 -40 93 13
4411 13 334 -272 -56 313 -89 -24 144 -83 33 -48 109 144 59 -26 130 -14 -95 -143 194 86 -279 61 51
4434 51 -47 -89 -113 -73 -64 -128 138 -177 -61 17 -192 -118 41 -250 37 51 128 140 -93 117 268 40 -131 -200 191
4459 191 -42 -39 -203 357 2 262 125 -163 -454 -308 -203 -33 81 161 -147 -98 -251 293 116 29 83 -38
4481 -38 281 -294 -290 9 -92 42 -166 125 -23 -285 115 4 182 40 -206 306 -28 -232 91 -241 16
4502 16 166 -3 35 -165 -19 166 20 -325 201 -5 -113 245 -108 -361 39 -27 272 -122 -108 -210 100
$$ packed form
4341B8M8m71M65o5n0j85L77l67J85J99J3m5j57j13J41q6J6%LO7KK4j28N23m59
4366c5J39n2j00m14M44J11m46L73j30o4K96l69M95q3n38O81l36q0L26p3j86J12
4388G1K56k52k10J09k70L25j48R1j9L8P6l09L22j14r3J06k07K86j97nJ04J33q0
4411A3L21o06K16L69m02O5J68k27J16q1J57L5q5q5J56j44q1m8L37j08l65L40j0
4434E1r8m2k4M0Ro4K66l15J16P8k09P4J59k91K87J4P7J2k33K10J51k28j71o9L91
4459A91k33Lj64N60l55K60j37k88k91J46J05J70J14Q0l08M9j53N44j77q7N4j21
4481c8L19n75MK99j01J34k08K91j48k62M00j11J78j42k46N12l34k04L23l32K57
4502A6J50j69L8k00J46J85j46l45N26k06j08L58l53k53M00o6K99l94J4j02L10
$$ plain form
4523 100 -43 25 159 48 83 -20 -211 99 -69 -136 88 261 -122 -55 238 125 23 3 137 173 -80 -114
4545 -114 21 -38 44 156 519 124 105 245 -221 -138 84 -29 8 -185 58 -209 -70 68 6 46 -183 223
4567 223 67 -26 -204 106 137 27 169 109 -27 47 -298 -387 -273 251 -102 -72 31 42 -143 31 -108 47
4589 47 29 128 303 161 -14 3 94 -186 -237 6 6 -45 42 245 90 -21 -19 -483 23 265 -6 47 -117 -48 -156
4614 -156 -23 -144 183 -13 -139 387 -101 110 -272 -111 126 292 -185 72 -15 25 -104 -78 0 4 -130 -150
4636 -150 -305 -29 -124 109 69 -112 -28 189 -135 -52 249 -310 13 89 -180 -40 140 -278 365 346 83 200
4658 200 293 93 19 224 121 -171 -72 92 122 -255 4 -394 -37 -28 -335 62 12 63 92 93 49 220 -13 -68
4682 -68 44 -96 -213 -149 119 -173 70 -225 257 -243 -118 -62 51 59 -183 54 -190 -46 -343 176 -121 -14
$$ packed form
4523A00j43O8J34j11L5j03j91L10j68o7K24J73l83O7K93j13j02k0J34L6k53l4
4545a14J35n9Q2J12L63l95j9J40m66Q3K22j13L7j93K43k67J39J38o2M0k29M06
4567B23j56r3j78L10L1j10J42o0j36P4l45q9J14N24l53L0J03J1j85J74j39J55
4589D7j8R9J75j42j75J7R1k80n1K43%n1Q7K03j55j11Km64N06K42k71N3j64O9j08
4614a56J33j21L27j96j26N26m88K11l82J61K37J66m77K57q7M0j29K6P8Mj34k0
4636a50j55K76r5K33m0j81Q4K17l24Q3L01n59L23P6k69J40J80m18O43j9k63J17
4658B00R3k00p4K05j03k92R9J64L0l77K59l98L57Rl07L97n0N1K9Jm4J71k33n5
4682f8J12j40j17O4K68k92K43k95M82n00J25N6J13Qk42K37k44J44k97N19k97J07
$$ plain form
4704 -14 -116 -239 393 108 -10 104 -172 49 72 -4 91 20 114 342 -17 -59 -314 -88 -134 -123 -162 -163 204 -63
4728 -63 -314 330 26 -157 46 75 -206 48 -49 -156 -116 -149 141 51 -254 75 134 -75 -6 216 -67 -86 188
4751 188 -207 -220 230 -178 14 114 -120 244 209 -8 66 95 -168 -259 116 156 -154 49 -96 -284 228 -42
4773 -42 208 177 -66 74 73 139 108 -20 62 -340 -53 -177 77 7 -155 -65 -137 123 51 72 -182 -219 -45 -88 41
4798 41 194 55 -274 16 -57 -107 -173 229 -95 157 272 -88 -79 -157 -91 146 -106 -329 100 75 14 -264 -16
4821 -16 189 -104 -334 -91 45 -8 -60 187 -43 81 188 354 -50 365 10 -2 -4 12 -74 -18 -29 -43 -263 -304
4845 -304 41 397 -149 -52 -91 -47 -47 271 -108 -244 -16 -15 -21 -207 141 -68 -128 0 169 -108 54 -59 -76 60
4869 60 42 136 -86 -16 88 -30 -78 -216 77 119 -78 -75 -75 397 13 85 525 -100 -345 -43 2 22 -296 -107
$$ packed form
4704a4j02j23O32k85j18J14k76K21K3p6R5p1R4K28l59m2k55K26m6J1l9jL67k67
4728f3k51O44l04j83K03K9k81K54r7j07M0l3K90r0l05L29N9k09O9K22k83j9K74
4751A88l95j3M50m08J92J00k34L64l5k17P4K9k63r1L75M0l10K03j45j88N12k70
4773d2K50l1k43J40jO6l1j28Q2m02K87j24K54p0j62R0p2K60p2K1k54l7J74m3J29
4798D1J53j39l29K90p3n0o6M02l24K52J15l60Rp8O6K37k52k23M29k5o1k78K48
4821a6K05k93k30K43J36n3n2K47k30J24J07J66m04M15l55j2kJ6q6N6j1j4k20m1
4845c04L45L56n46R7l9M4%L18l79j36K28Joj86L48k09o0J28J69k77J62j13j7J36
4869F0j8R4k22P0J04j18m8j38K93M2j97L%M72l84P2M40o25k45L02M5K0l18J89
$$ plain form
4893 -107 377 -202 -41 -29 4 252 164 -5 -203 -348 -260 334 64 87 -137 -315 71 -373 78 -111 165 142
4915 142 78 -265 -72 -3 184 -108 32 187 -115 -90 25 217 -207 190 -44 192 -46 87 298 -80 -139
4936 -139 171 246 212 161 -28 26 7 367 -10 135 114 69 232 -60 328 -128 8 -364 258 162 -295 54 -234
4959 -234 204 -62 310 79 -29 146 51 -280 -9 -245 -106 -221 19 -169 194 -241 -218 -327 90 -109 -63
4980 -63 228 194 -103 82 -211 244 -24 -38 228 113 -52 81 65 -138 221 -46 -119 -251 -171 -9 -139 -185
5002 -185 -57 136 -138 -283 78 -509 186 23 363 -11 -71 -2 -85 132 17 85 252 -203 210 54 246
5023 246 87 58 84 -263 -28 396 -93 24 -418 -142 -109 -159 3 488 199 -6 -32 92 151 -175 20 179
5045 179 431 -344 78 -186 29 -276 -228 -94 18 129 79 44 9 -92 69 -25 -82 -181 -76 323 -113 340
$$ packed form
4893a07M84n79J61J2L3K48q8j69j98j45Q8N94k70K3k24j78L86m44M51j89K76k3
4915A42o4l43J93O9J87k92J40J55l02K5J15J92m24L97k34K36k38J33K11l78n9
4936a39L10P5l4n1j89N4j9L60l77J45k1m5J63k92L88m56J36l72O22r6m57L49k88
4959b34M38k66L72k31j08J75r5l31K71k36J39j15K40j88L63m35K3j09M17j99M6
4980f3K91l4k97J85k93M55k68j4K66j15j65J33j6k03L59k67p3j32Q0J62j30m6
5002a85J28J93k74j45L61n87O95j63L40l74o0O9q3K17j15O8J67m55M13j56J92
5023B46j59k9K6l47K35M24m89J17m42K76L3n0J62M85k89k05k6J24N9l26J95J59
5045A79K52p75M22k64K15l05M8J34J12J11n0l5l5j01J61r4n7r9J05L99m36M53
$$ plain form
5067 340 -25 -125 191 -73 95 269 -3 102 140 20 175 216 -256 -22 -98 110 1 -182 -343 -33 -4
5088 -4 249 50 13 -257 238 -230 499 382 -276 -25 -255 127 -246 5 24 -289 -135 -352 -80 176 -103
5109 -103 -137 191 -58 -119 -30 -124 -33 -146 69 246 242 91 -212 -61 324 -9 73 -538 -21 186 -95 280 185
5132 185 -41 -124 -169 29 -25 254 56 -137 -128 141 -65 -134 76 -108 -372 -136 2 174 -15 63 142 -92 86
5155 86 31 127 13 35 -161 -109 77 45 61 -56 321 -442 259 -74 -45 -3 83 16 -176 -32 -41 119 -94 -193 -165
5180 -165 103 -67 310 -273 56 -282 311 69 -166 89 -216 136 -13 218 -173 149 387 -63 -320 80
5200 80 189 -136 -114 249 139 413 -46 -35 214 121 -131 -150 207 480 -276 42 283 71 328 -46 -236 151
5222 151 -41 133 139 221 -35 510 224 -91 -76 231 234 232 39 40 -47 -11 36 -60 -11 -233 22 172 153 -176 18
$$ packed form
5067C40l65j00L16k64J68J74k72J05L8j20J55M1m72K34p6K08j09j83j61L10K9
5088dK53j99l7k70M95m68P29j17o58K51k30L82l73K51J9l13J54k17K72K56k79
5109a03l4L28k49o1Q9r4R1j13K15J77mj51l03J51L85l33Q2o11N17K07k81L75r5
5132A85k26q3m5J98n4K79j98j93RK69k06o9K10j84k64K36J38J72j89P8P9k34J78
5155H6n5R6j14K2j96N2J86l2J6j17L77p63P01l33K9M2Q6o7j92J44rJ60k13r9K8
5180a65K68j70L77n83L29l38N93k42k35K55l05L52j49K31l91L22K38m50k57M00
5200H0J09l25K2L63j10K74m59J1K49r3k52j9L57K73p56L18K41k12K57l74j90L87
5222A51j92J74OQ2k56N45k86l15J5L07Lkj93Jq7L6M7r6M9k22K55J50j9l29J94
$$ plain form
5247 18 225 156 -52 67 -98 4 -134 -150 -127 56 -81 -294 -72 44 -152 -15 157 -333 268 -49 163
5268 163 216 -151 116 43 -43 -64 -131 -31 -122 -266 24 -271 -160 -86 -237 -33 -530 -109 -91 -384 -72 136 -374
5291 -374 -86 -171 -210 -181 -397 -261 -48 136 -233 104 -115 255 -371 -120 91 268 -32 -56 -235 71 -302
5312 -302 -23 -72 -133 148 104 -7 15 222 -1 189 139 319 -105 1 -230 14 -319 -227 -83 172 -82 109
5334 109 126 61 -17 158 -25 20 -170 235 84 215 122 -103 100 -112 46 189 -116 -213 -26 -38 -41 18 163
5357 163 -52 -367 7 241 2 -164 -16 -70 -34 198 302 -82 143 -235 83 -271 86 -335 96 12 -97
5378 -97 264 103 53 -205 -40 144 197 239 232 -247 -9 -215 203 -39 -89 -269 -130 99 -74 384 -259 -106
5400 -106 -201 27 -212 184 -217 -310 -248 97 -144 75 -201 -56 143 -102 -231 -177 252 92 187 -27 104 -248
$$ packed form
5247A8K07o9k08J19j65J02j38j6K3J83j37k13K22J16j96J37J72m90O01l17K12
5268A63N3l67K67p3q6k1o7J00r1j44K90k95J11P4j51K04m97M21J8k93L12K08n10
5291c74K88q5l9K9k16J36K13J84l69L37k19L70o26K51K11J77l00k4j79L06l73
5312c02K79m9o1K81m4j11K2K07k23J90n0J80m24J06k31K44l33R2J44K55k54J91
5334A09J7o5p8J75j83M5j90M05j51J31r3k25K03k12J58J43l05r7J87j2lN9J45
5357A63k15l15L74K34k39j66J48n4L6K32J04l84K25l78L18l54L57m21M31q4j09
5378i7L61j61n0k58J65J84N3M2pm79K38k06M18k42n0j80J39K29j73M58o43J53
5400a06r5K28k39L96m01r3O2L45k41K19k76J45J99k45j29N4M29j60R5k14J31l52
$$ plain form
5422 -248 130 70 -302 -82 63 308 134 114 26 72 -7 104 33 -140 -113 -266 233 181 277 44 153 174 -86
5445 -86 -26 -115 221 -50 -183 74 229 6 263 -88 -179 71 -251 -131 153 41 136 -55 77 -4 -47 119
5467 119 -70 47 63 40 -131 234 65 268 -327 141 -396 -126 -324 -119 165 28 -375 -20 -131 -144 -100
5488 -100 77 -367 95 171 79 -114 154 108 13 -19 -372 132 -2 345 -247 -25 -199 52 -69 33 -241 216
5510 216 -21 175 -37 -174 -243 -183 296 69 -13 -207 206 81 -175 -105 19 143 82 26 110 -77 56 147 150
5533 150 116 -211 -176 27 -10 -65 75 288 351 130 -113 -235 -40 -231 -190 -195 -88 -99 -162 -20 -25 92 68 101 -22
5558 -22 -369 -205 327 132 147 -60 37 41 148 -176 -180 29 -129 102 -3 -75 158 101 389 153 -35 153 -190
5581 -190 29 14 -48 85 102 -350 -286 285 124 -250 220 -25 -113 -133 141 -8 -106 32 -303 -3 128 267
$$ packed form
5422b48L78o0l72K20J45K45j74k0q8M6p9J11p1j73K7j53M99n2R6k33J09K1k60
5445h6O0q9L36k71j33K57J55k23K57l51r1K50l22J20K84j12R5j91J32q1m3J66
5467A19j89J17J6k3j71L65j69K03n95M68n37K70j98K05K84j37m03L55j11j3M4
5488a00J77m44M62P6r2j93K68m6r5l2l53N04j34L47n92K22j74K51j21J02k74M57
5510B16k37J96k12j37o9O0M79k27q2j94M13j25k56P0J24J24o1n6Q4j87J33R1L
5533A50l4l27L5K03l7n5J40K13O3k21k43j22J95j91M1nJ07j1o3J42nJ17k4L3j23
5558b2l47J64N32j95J5k07R7MJ07l24mK09j58K31j05p2K33n7K88k36j88J88l43
5581a90K19j5o2J33J7m52O4N71j61l74M70k45q8k0K74j49r8J38l35L00J31J39
$$ plain form
5603 267 48 12 22 -60 24 -316 -132 333 360 -214 288 -55 -101 -296 -164 217 65 -5 24 -209 61 222 53
5626 53 -31 -310 -201 -307 34 -65 310 -228 200 278 -167 -76 146 227 -13 -174 -43 -119 -83 113 115 -223 -173 176
5650 176 -222 -223 114 222 43 49 76 -57 114 217 -85 -77 -80 -9 171 -41 -46 114 261 -75 260 -102 13 132
5674 132 8 27 -167 -27 43 6 -383 84 -458 -107 61 87 114 74 -173 -47 -63 95 77 -22 -179 139 -98
5697 -98 -198 222 140 133 -98 -97 -61 -69 -34 227 138 105 -580 93 47 -193 -76 115 -77 201 208 32 -105 13 90
5722 90 43 -334 -74 226 -200 -61 269 58 34 113 110 -258 -260 -65 -89 70 -72 118 72 -59 87 -62 54
5745 54 133 200 -163 89 -177 -270 -10 183 78 -259 -207 -126 100 -317 49 -98 198 -260 111 379 265 199
5767 199 -475 226 159 -241 -152 155 -51 -17 -314 -83 -22 -150 -187 -37 -129 276 -249 -15 114 -73 106 -1
$$ packed form
5603B67k19l6J0q2Q4l40J84M65K7n74N02l43m6j95J32L81j52p0K9k33K70J61j69
5626E3q4k79J09j06L41r9L75n38M28P8m45R1K22Q1k40j61J31p6L6J96Kl38N0L49
5650A76l98jL37J08j79OK7j33J71J03l02QlP1J80k12nJ60J47l36L35l62J15J19
5674A32j24J9j94J40P0l7l89M67n42L51J68K6K7m0k47J26j6J58j8r9j57L18k37
5697i8j00M20q2pk31JL6qL5K61q9l3o85O73m6k40J17J91j92K78Pj76j37J18P7
5722I0m7l77K60L00m26J39L30k11k4P9ll68kJ95k4J59j42J90m6j31J46j49J16
5745E4P9O7l63K52k66r3K60J93j05l37N2Q1K26m17L66j47K96m58L71K68j14o6
5767A99o74P01o7m00Q9L07k06L4k97K31O1j28l7J50r2M05n25K34J29j87J79j07
$$ plain form
5789 -1 178 50 -106 177 95 -147 62 154 -20 124 -24 -222 -103 -5 76 148 92 -11 -155 156 334 8 3
5812 3 -190 -131 106 -34 190 -91 203 52 -173 4 -203 38 79 -229 -1 -82 -68 159 -161 91 179 -190
5834 -190 125 90 -282 -62 -108 21 17 266 -170 -70 -211 -231 21 47 -46 250 64 -132 200 143 139 -300 59
5857 59 -457 -401 224 10 321 211 -13 153 68 -3 134 186 6 233 -159 -109 -193 101 56 127 235 204 -119
5880 -119 212 142 -165 239 -170 -43 -11 -45 -154 67 -20 56 -317 -326 76 16 121 179 199 176 154 255 -147 -129
5904 -129 -154 -56 -158 18 117 106 90 -166 31 -323 16 -111 -321 22 152 111 -19 30 -43 255 34 -135 -227
5927 -227 -72 301 -286 198 176 -155 -92 -82 -51 -165 -276 -60 -16 47 115 -110 280 7 -367 -283 55 -356 224
5950 224 143 352 -148 -147 -156 -341 -37 -401 150 50 93 -160 -225 -205 -73 98 215 -114 116 391 -81 118 235
$$ packed form
5789aJ79j28j56K83q2k42K09R2j74J44j48j98J19R8Q1P2n6j03j44L11J78l26n
5812Cj93N9K37j40K24k81K94j51k25J77k07K41M1l08K28q1J4K27l20K52Q8l69
5834a90L15l5l72K20m6J29mK49m36J00j41k0K52K6r3K96j86j96L32n7mm39L59
5857E9n16N6O25k14L11j10k24J66q5p1J37N2j80K27l92N0q4K94m5P1J08l1l23
5880a19L31p0l07M04m09J27L2l4j09K21q7P6l73rM02o0J05N8K0k3k2J01m02J8
5904a29k5R8j02J76R9j1j6k56J97l54L39j27k10L43J30m1j30M9p3K98k21j69r2
5927b27J55L73n87M84k2l31O3J0L1j14j11K16M4O3O8k25L90k73l74Q4L38m11N80
5950B24q1K09n00Jrj85L04l64N51j00M3k53o5K0J32J71J17l29K30K75m72J99J17
$$ plain form
5973 235 -71 -116 214 13 93 -9 64 -17 46 -58 -200 59 -150 -35 15 -19 -4 -71 -170 -156 142 117 151 -118
5997 -118 -133 100 -47 82 119 -169 87 -68 -49 7 -196 -52 74 116 -153 124 -34 103 -466 -31 -50 31
6019 31 -13 91 33 -100 309 139 74 -15 -135 -227 74 73 138 -48 88 -79 480 -29 -202 70 -55 56 -252
6042 -252 -170 161 44 -32 31 -124 140 -216 110 60 300 21 -127 24 -186 166 -374 88 -26 -296 208
6063 208 116 -395 -105 -35 -240 -36 268 12 208 -152 156 -235 164 133 118 515 131 -35 87 47 192 -106
6085 -106 147 -127 165 202 110 82 -237 232 -170 -235 26 -514 -344 235 116 282 34 173 160 140 141 -250 -130
6108 -130 12 -112 -9 -236 -313 -39 -211 37 -43 45 -107 -207 209 30 -287 176 6 -56 48 52 30 33 221
6131 221 -242 53 -10 128 -34 -319 -55 198 59 16 -133 -49 -137 -154 155 164 -94 75 20 -249 102 333 -242
$$ packed form
5973B35l06m5L30k01Q0j02P3q1O3j04j42K59k09J15N0l4J5o7r9J4K98k5L4k69
5997a18j5K33j47J29L7k88K56j55J9N6k03J44J26M2k69K77j58J37n69M35j9Q1
6019C1m4J04n8j33M09j70o5q9j20r2L01jO5j86J36j67N59n09j73K72j25J11l08
6042b52Q2L31j17p6O3j55K64l56L26n0K40k79j48J51k10L52n40M62j14k70N04
6063B08r2n11K90P0k05K04L04k56J96l60L08l91L99l1j5L97l84j66J22m0J45k98
6085a06K53k74K92L7r2k8l19M69m02o5K61n40J70N79j19J66k48J39j3k0Jl91J20
6108a30J42j24J03k27p7K74j72K48q0Q8j52j00M16j79l17M63j70o2J04Mk2LJ88
6131B21m63K95o3J38j62k85K64K53j39m3j49Q4q8j7L09Rk58J69n5k69L51K31n75
$$ plain form
6154 -242 35 -114 -146 106 -84 -302 160 -105 8 -39 132 -225 0 167 377 136 -183 -52 -71 -5 162
6175 162 -204 -114 -244 -118 -81 -51 188 -111 -97 -212 145 54 -181 12 -31 141 105 -149 -14 -211 -23 -136
6197 -136 32 -267 136 -43 -255 -195 28 -106 192 142 -13 -277 -182 -304 3 -126 -277 -198 -6 71 -195 72
6219 72 -257 -45 95 -218 162 86 -139 -545 -65 -7 -1 152 -105 -447 -50 8 -131 -73 -76 -336 -348 146 122 -146
6243 -146 183 -198 -388 20 8 -10 -248 129 79 -146 -386 -182 -122 -28 34 208 -162 -133 73 -232 -84 -299
6265 -299 9 292 116 62 -66 42 53 465 204 268 50 -34 56 40 -48 -184 -74 117 -28 36 -75 12 -80
6288 -80 -14 -47 -311 -15 44 -152 -246 -24 -19 -192 159 -90 121 -42 251 -45 -16 -269 2 -225 105 -46 -16
6311 -16 49 -171 289 -240 -151 198 20 -269 -249 -22 13 188 -257 -116 366 118 95 123 175 261 -158 65 118
$$ packed form
6154b42K77j49l2K52j90k18M62k65J13m7J71l57K25J67K10k41l19J31j9O6J67
6175A62l66R0j30J26L7L0K39k99J4j15L57r1k35J93m3J72l6k54J35j97J88j13
6197a36J68k99M03j79k12O0K23j34K98n0j55k64R5j22L07j29j51P9J92P7k66K67
6219G2l29K12J40l13L80p6k25m06M80N8OJ53k57l42L97N8j39N8lk60j2M94k4k68
6243a46L29l81j90M08j2j8k38L77n0k25k40K04O0R4O2J74l70K9K06l05J48k15
6265b99L08K83j76n4j28J08J1M12k61O4k18q4R0j6q8j36J10J91j45O4j11Q7r2
6288h0O6l3k64K96N9j96r4K22Nj73L51k49K11j63K93k96K9k53K71k27L30j51L0
6311a6O5k20M60n29Q9L49j78k89K0K27L5J75m45J41M82k48k3K8N2Q6m19K23N3
$$ plain form
6334 118 -1 -166 323 26 364 449 -139 261 -168 11 -143 -75 -227 -185 33 -389 180 -376 76 88 72 -31
6356 -31 -179 99 -90 172 154 -101 322 -358 -46 145 163 14 -32 -247 -212 281 -174 -126 112 61 -119 1
6378 1 65 -141 -325 -105 -199 106 95 59 150 -11 -280 44 97 195 -41 -144 50 -21 181 -106 94 315 -179
6401 -179 -10 211 -185 16 41 39 141 53 -36 72 247 297 -14 326 -133 -114 284 -97 9 317 128 -31
6423 -31 267 -156 20 53 178 -106 -156 77 -57 41 -16 -1 -44 119 10 -78 131 -121 -35 -27 65 -58 185 -80
6447 -80 -232 -8 -61 24 243 160 5 400 -160 84 39 -232 64 1 144 216 151 208 14 4 101 -442 -68 -84
6471 -84 166 -35 -67 165 153 -187 -28 -6 -288 62 127 -284 -408 -122 -187 488 290 7 -239 205 -89 483
6493 483 81 -87 -62 -220 201 106 -172 -301 -31 -40 22 -79 -47 79 -236 421 39 91 157 129 -4 72 128 13
$$ packed form
6334A18j19j65M89k97L38Q5n88M00m29J79j54O8j52M2K18m22N69n56M52J2j6j03
6356c1j48K78j89K62j8k55M23o80L12J91J8j49m6k15L5M93m55M8K38n1j80J20
6378AO4k06j84K20r4L05j1l6R1j61k69L24N3R8k36j03J94p1K02k87K00K21m94
6401a79J69K21l96K01K5kJ02q8q9J08J75N0l11L40m59J9L98l81J06L08j89j59
6423c1K98m23J76L3J25k84n0K33j34R8n7J5m3J63j09q8K09k52Q6QR2j23K43k65
6447h0j52K24n3Q5K19q3j55L95n60K44m5k71K96o3J43P2o5N7j94j0R7n43L74j6
6471h4K50k01l2K32j2l40J59K2k82L50O5m11j24K86o5O75j98k83k46M44k94N72
6493D83m02j68K5j58M21r5k78j29K70rO2j01L2J26l15O57l82N2O6k8j33P6N6j15
$$ plain form
6517 13 84 289 -409 36 31 -39 102 -119 -78 291 -459 244 -140 70 106 177 -26 -116 239 -223 124 -84 -193
6540 -193 93 -249 -58 193 128 -61 101 167 32 -146 -106 297 173 -255 -102 187 47 347 152 -102 -119
6561 -119 -109 24 73 15 35 -14 134 21 48 101 -11 65 -185 -137 51 -93 85 259 14 41 -142 -71 169 61
6585 61 -70 -42 -203 33 234 76 137 136 277 300 311 400 23 -59 -120 -172 4 187 62 35 163 36 90 -2 186
6610 186 -215 105 318 -220 120 -306 -98 -112 215 -292 -187 -94 32 -235 3 -190 -91 68 333 137 61
6631 61 177 181 81 200 243 67 115 -62 4 54 -166 -81 171 -167 -120 -106 377 -132 245 -32 -52 63 -77 -357
6655 -357 35 1 284 -155 42 219 189 -72 291 -7 -238 31 -14 27 -241 75 -76 -292 -310 -81 -28 359
6677 359 107 -15 357 144 -215 -127 -46 -464 -188 -252 161 64 54 184 -97 131 -132 71 -297 50 -40 275
$$ packed form
6517A3P1K05o98M45np0J41k21M1L69p50P03l84K10L6P1k03r0L55m62L47k08j09
6540a93K86l42J91K51o5j89J62O6j35j78M0M03j24m28J53K89j40L00j95k54j7
6561a19J0J33M9n8K0m9J48j13K7N3j12P6k50M8J88j44J78J74k45K7j83P1K40j08
6585F1j31K8j61K36K01j58O1jJ41K3J1Q9l77q2o1n2J76J83j25k7J28j27N4r2J88
6610A86m01L20K13n38L40m26K08j4L27n07J05R3J26k67K38j93R9J59K65j96p6
6631F1J16Mj00J19M3j76M8j77O6N0k20Q5K52l38M7J4M83n09L77k77k0J15j40k80
6655c57L92l4K83m39J97J77l0k61L63k98k31K69m5M1k68L16j51k16j8K29N3L87
6677C59k52j22L72k13l59Q8Q1m18K76o4M13r7j0J30k81K28k63K03l68L47r0L15
$$ plain form
6699 275 -223 -33 34 116 -101 -65 -149 -178 -143 171 13 33 -235 -94 142 325 187 -254 -31 176 -38 -324
6721 -324 -202 -246 -38 117 34 -258 -143 -102 120 146 -218 -218 -121 44 -15 -217 -253 340 101 -183 -105 -3 103
6744 103 -224 -45 -100 70 -99 -52 -101 160 -162 56 3 -135 64 400 131 331 248 6 -166 37 128 90
6766 90 -105 -399 -273 -132 287 173 127 64 284 233 -106 -224 421 257 31 -134 -10 -232 -61 206 209 -32
6788 -32 69 -87 236 114 18 -462 44 15 63 -169 -105 335 20 -168 329 262 -3 -51 -131 162 -123 263 126
6811 126 29 274 -142 98 -202 138 35 31 165 282 162 -140 -27 144 223 88 119 247 60 86 25 77 -66
6834 -66 -137 -184 260 -31 87 33 68 7 -169 232 -275 19 13 -55 -7 24 -150 30 165 -23 211 41 -180 -242
6858 -242 -75 -83 -93 103 -237 26 17 -52 -109 -102 122 110 69 -118 -82 191 121 -118 -24 7 2 163 -64 132 169 330
$$ packed form
6699B75m98J90O7Q2k17L6q4k9L5L14j58K0k68J41K36J83j38m41K23K07k14k86
6721c24J22m4K08J55q3k92J15M1K22K6l64%R7J65n9k02l6N93k39k84P8J02J06
6744A03l27J79n5J70j69M7m9K61l22K18n3j38J99L36k69K00q3k42j72K03R1l8
6766I0j95k94J26J41M19j14m6o3K20n1l39j18O45j64k26j65J24k22J71K67Lk41
6788c2J01j56L23j22r6m80N06k9M8k32O4M40l15j88M97o7k65m8q0K93k85L86j37
6811A26r7K45m16K40l00L40j03mJ34J17j20l02J13J71P9j35L1J28j87K6o1N2j43
6834f6p1m7M44k91J18n4L5o1j76M01n07K94oo8M8L1j74J80J35j88K34j70k21o2
6858b42J67qj0J96l40K63ro9n7PK24j2m1j87L6K73p0k39R4L1nJ61k27J96L7J61
$$ plain form
6884 330 289 -64 4 135 85 17 64 228 94 -78 86 228 243 204 -184 -1 -69 -61 -182 -29 38 102 59 275
6908 275 254 30 -147 18 -258 -33 242 200 -321 52 -317 -152 282 -67 -113 112 130 7 -9 -9 24 -31 -45
6931 -45 -130 -219 278 81 310 18 67 59 6 171 -192 77 1 -81 57 121 -379 279 45 -10 -57 261 -86 -104
6955 -104 12 29 23 116 -77 -95 -279 -279 220 -188 -129 162 -65 265 -153 -263 245 215 76 -101 114 -233 44
6978 44 -166 214 -84 188 165 -321 -14 -139 131 -6 -84 104 20 164 63 57 -43 -197 -172 -119 96 50 24
7001 24 11 -116 111 75 -367 -20 18 -134 -245 71 -132 -167 305 214 -63 95 332 -335 -273 31 -182 142
7023 142 -78 289 201 -404 78 -54 87 -134 -374 299 -99 -20 -61 -2 -20 -76 -111 121 215 78 -247 -131 143
7046 143 104 -599 94 89 -40 10 169 -128 154 -80 -245 180 -60 192 -261 -17 60 -196 -297 -138 -109 365
$$ packed form
6884C30m1l53O8J31n0o8M7J64j34j72J64J42J5l9l88J83o8Qj21J53O7O4m3K16
6908B75k1k24j77J65k76K25K75m2n21L73l69J65M34l49m6K25J8j23j6%L3n5j4
6931d5q5q9M97j97K29k92M9qn3J65l63K69p6q2J38O4n00O58k34n5m7L18l47j8
6955a04J16J7oR3j93j8j84%M99m08N9K91k27L30m18j10N08l0j39j77K15l47K77
6978D4k10L80k98K72k3m86L07j25K70j37p8J88q4J44j01oj00j54K5N3K15m6k6
7001B4j3j27K27l6m42L47L8j52j11L16k03l5M72r1k77J58K37o67O2L04k13L24
7023A42k20L67q8o05M82j32J41k21k40O73l98P9m1N9j8n6l5K32R4j37l25J16K74
7046A43l9p03O93nj29N0J59k97K82k34j65M25k40K52m53K44P7k56j01J59K9M74
$$ plain form
7068 365 76 55 364 5 209 217 -348 108 72 -173 -210 195 -20 149 -63 -73 -14 -246 23 217 -356 -21
7090 -21 -60 55 -32 -214 301 101 163 -212 77 -336 -174 -63 136 77 -302 192 -156 29 16 -169 -200 285
7112 285 -80 182 116 122 -99 78 -105 -164 147 1 -40 -470 -53 83 -370 324 -105 -154 55 -293 -96 -173
7134 -173 62 22 76 84 93 -275 229 -29 90 -282 -39 114 -73 106 -196 172 185 -235 -124 -179 -44 302 219
7157 219 139 -209 -97 7 -125 107 131 40 41 -62 154 -144 -1 -72 141 -159 150 93 -79 15 200 64 181
7180 181 90 -222 -218 291 -396 81 -14 -246 -3 -137 -168 -191 93 -192 93 54 44 -174 -44 -258 -130 -270 165
7203 165 -214 211 67 -77 538 155 -81 -175 -297 -15 8 -147 217 53 -225 92 42 66 -33 67 -113 -89
7225 -89 249 251 -52 -127 -268 -76 -139 -30 -125 -180 -14 245 -27 -71 51 69 -68 -392 -250 14 -70 -136 -34 116
$$ packed form
7068C65k89k1L09l59K04Qn65M56l6k45l7M05k15J69k12j0N9k32K69J94n73L35
7090b1l9J15q7j82N15k00O2l75K89m13J62J11J99n9l79M94l48J85j3j85l1M85
7112B85l65K62o6Ok21J77j83n9L11j46m1m30M17J36m53O94m29m9K09l48J97p7
7134a73K35m0N4QRl68N04k58J19l72K43J53j87J79l02L68J3m20J11n5J35L46q3
7157B19q0l48J12J04j32K32K4r1Jj03K16k98J43p1K13l00L09n7j72R4J85j36J17
7180A81r1l12MN09o87M77r5k32K43j34l1k3K84k85K85l9j0k18J30k14J28j40M35
7203A65l79M25j44j44O15l83k36r4j22K82K3j55L64j64k78L17n0K4r9J00j80K4
7225h9L38Kl03p5j41J92o3J09r5n5J66K59k72m4J22J8j37l24J42K64q4o6J02J50
$$ plain form
7249 116 136 -29 202 194 116 -193 12 1 221 13 -270 50 167 -20 54 -152 -236 122 314 29 -238 92
7271 92 68 91 -206 56 12 91 -134 -31 379 -92 339 331 -110 -41 6 -138 47 -136 -373 393 -273 -345 312
7294 312 -99 76 168 27 38 128 123 131 -236 48 22 40 -117 -170 80 -70 -189 19 199 65 -200 -117 51 102
7318 102 -294 102 87 -71 44 -99 131 2 -107 -97 6 105 19 32 88 29 -159 -106 479 29 -78 67 116
7341 116 -77 -37 -49 -497 65 0 248 181 150 -23 -94 319 7 15 114 -195 37 145 -328 -75 -79 60 102 -73
7365 -73 226 206 70 143 -107 -215 169 141 -189 -304 -194 84 -146 -162 59 -289 -43 134 149 115 233 -125
7387 -125 -95 -102 273 -67 -84 240 -85 208 130 -231 -23 156 25 -189 3 144 329 -309 313 92 -99 169
7409 169 -101 -99 -182 -14 23 126 105 -283 15 -43 302 -212 -425 65 35 162 7 29 -49 247 94 462 21
$$ packed form
7249A16K0j65K31qp8l09K05j1K20k08k83L20J17j87P4k06q4L58J92k85k67L30
7271I2k4K3k97K62m4P9k25J03M10m71M31qm41O9M7j44J85j83k37P66o66p2O57
7294C12m11J75R2j41J1R0nQl67K84k6J8j57n3K50j50j19K08J80j34k65Q3J68N1
7318A02l96L96j5j58J15j43K30j29j09J0J03R9q6J3N6n9j88N3N85m50j07J45M9
7341A16j93M0j2m48N62o5K48o7l1j73p1M13l12QR9l09K32J08m73K53mJ39M2j75
7365g3K99k0j36P3k50j08L84k8l30j15J10K78k30j6K21l48K46J77J5l4J18l58
7387a25L0pL75l40j7L24l25K93p8l61K08J79j31k14J92J41J85o38O22k21j91K68
7409A69k70Kq3J68L7J03k1l88K98n8L45n14k13M90l0J27j55K2p8K96j53L68m41
$$ plain form
7432 21 -83 15 -156 161 218 -13 -285 -22 16 -14 -166 -94 -271 -3 79 204 -22 198 26 30 -304 109 68
7455 68 -51 17 152 -101 85 225 95 26 -147 127 19 41 -63 -2 -81 -66 202 87 109 -103 281 -266 -80
7478 -80 77 -204 175 262 -4 96 171 -252 -22 92 -198 -8 -399 34 -50 244 -145 23 7 -299 50 36
7500 36 -85 162 148 -346 117 -115 -93 -99 -96 -163 -28 -299 245 -90 248 162 493 97 2 15 -122 104 -48 45
7524 45 222 -92 -41 -19 -133 -40 -190 47 172 102 -79 -135 209 107 84 108 -122 144 -91 172 -135 18 97
7547 97 216 29 -297 120 184 176 92 -34 21 267 -225 230 -233 -87 -35 -209 -175 150 -149 65 65 -131 -70 -169
7571 -169 72 35 -18 -120 252 49 -54 118 -355 -208 -42 79 -28 14 -188 33 439 -236 188 -46 225
7592 225 -75 183 -26 75 136 15 -68 -176 -37 126 -89 -149 340 9 154 -339 -237 105 -108 -240 -88
$$ packed form
7432B1j04R8j71L17N7k31k72K63L8l0j52P2j77K68Q2J25k26K20j72Ml34M13m1
7455F8j19O8J35k53J86J40j30o9j73K74j08K2j04O1p9J5K68j15K2k12L84n47J86
7478h0J57k81L79Q7k66J00P5m23K30J14k90J90l91M33q4K94l89J68j6l06L49j4
7500C6j21K47j4m94M63k32K2oLo7J35k71N44l35L38q6L31l96r5J3j37K26j52R3
7524D5J77l14N1K2j14R3j50K37J25p0j81n6L44j02k3K4k30K66k35K63l07J53P9
7547I7J19j87l26M17O4qq4j26N5K46m92M55m63J46N2j74L4L25k99K14%j96O1r9
7571a69K41l7n3j02L72k03j03J72m73J47J66J21j07M2k02K21M06o75M24k34K71
7592B25l00K58k09J01O1j21q3j08J39J63k15o0M89l31J45m93J02L42k13j32J52
$$ plain form
7613 -88 265 -58 -204 151 361 -41 -110 143 -49 105 -177 248 -201 -7 94 30 -21 -143 -265 -23 -118 220
7635 220 -110 -147 65 -30 -164 348 346 252 -178 -123 -382 87 -46 341 -113 101 -128 277 210 -294 12 272
7657 272 83 -118 188 -163 98 -205 237 -194 26 150 -305 62 -9 -160 -346 -76 -73 224 195 -13 60 4
7679 4 87 221 -192 112 139 23 320 131 14 -112 -56 205 -134 40 107 1 -15 -42 -250 -56 274 -139 -45
7702 -45 84 -535 31 -133 26 -146 -100 10 -65 -62 15 -212 -217 -12 -183 0 -58 -130 6 89 -131 164 135 -62
7726 -62 -163 333 -150 -122 -47 -180 -2 21 -30 -286 -55 -164 -36 -505 226 106 75 -75 100 -80 339 -134
7748 -134 74 114 126 39 -226 -300 -176 -444 69 -149 -88 -141 -151 106 -12 15 90 -193 -139 6 99 -98 -223 172
7772 172 106 -107 -99 -114 -130 -93 147 -22 -62 67 53 -173 -71 -111 -328 181 180 -139 13 30 -107 156 250 -136
$$ packed form
7613h8L53l23j46L55K10m02o9K53j92J54k82M25m49J94J01o4n1j22j22K42r5L38
7635B20l30l7K12r5j34N12kr4m30N5k59M69j33L87m54K14k29M05o7n04L06K60
7657B72j89k01L06l51K61l03M42m31K20J24m55L67p1j51j86K70LK97k9k08P3n6
7679DQ3J34m13L04K7j16K97j89j17j26N6K61l39J74O7j06j6k7k08J94L30m13R4
7702d5J29o19N66j64J59j72M6J10p5LP7k27nK05j71J83n8p2J36Q3k20K95k9j97
7726f2j01M96m83K8P5j33J78K3n1k56K31j09J28m69P31j20l1j50J75j80M19m73
7748a34K08M0J2q7k65p4J24k68N13k18O1n3j0K57j18K7P5k83N4J45R3j97j25L95
7772A72o6k13Qj5j6L7K40j69m0J29j4k26J02m0k17N09jl19J52J7j37K63R4l86
$$ plain form
7796 -136 253 66 222 -502 64 -124 -60 -340 -126 -112 -182 0 336 -44 121 -207 163 57 85 -151 -53 170
7818 170 -250 -150 229 -118 -490 76 -37 7 -66 -126 -48 -24 -231 145 -278 -96 298 64 315 -23 73 212
7840 212 -320 230 209 230 169 44 291 -121 154 238 43 -274 -62 265 341 -166 -40 -197 152 -52 -319 93
7862 93 -340 7 217 -101 -123 -58 -99 -8 -64 22 -138 -21 146 -193 -49 38 63 283 -48 -13 189 -74 -27 -111
7886 -111 -84 46 -2 -122 -67 -156 -91 165 -199 -89 69 -69 152 112 -150 -29 -131 -116 1 -249 34 -96
7908 -96 -25 37 -188 129 -130 153 30 182 -59 240 200 36 -139 32 341 -32 -276 -5 80 29 -5 -89 -86
7931 -86 -25 52 -49 -290 44 -4 -52 97 185 -117 -59 -208 12 -75 202 203 -77 73 -2 -22 203 -318 119 145
7955 145 380 -173 -75 -248 134 133 114 126 117 18 -298 -44 169 -183 -71 183 127 -108 143 -144 -135 -196 -215 -247 -159
$$ packed form
7796a36L89j87J56p24N66j88O4k80K14J4p0J82L36l80J65l28L70j06K8k36R8K23
7818A70m20J00L79l47l72N66j13M4p3o0P8K4k07L76m23J82L94k34K51l38R6J39
7840B12n32N50k1K1o1j25K47m12K75Q4j95l17K12L27P6n07J26j57L49k04k67M12
7862I3m33L47K10l18k2O5m1R1n6Q6j60J17J67l39J44Q7K5K20l31L5K02k63M7q4
7886a11K7J30m8j20N5q9O5K56l64J10J58j38K21m0k62J21j02J5J17k50K83j30
7908i6P1O2k25L17k59K83j23J52k41K99m0j64j75J71L09l73k44K71Q5n1l4q4L
7931h6O1P7j01k41L34m8m8J49Q8l02N8j49K20q7K77Jk80J50p5k0K25n21M37K6
7955A45K35n53R8j73L82jj9J2rr9l16K54K13l52J12K54n6k35K51k87Ro1j9l2Q8
$$ plain form
7980 -159 3 -190 0 50 -14 -181 -107 -111 -86 -232 49 203 -92 141 64 -217 -296 28 104 38 -21 -170 350 44
8004 44 143 180 49 -31 -54 147 -204 96 -217 0 -277 159 361 132 -200 -35 -138 134 -105 -241 -198 195
8026 195 -160 -12 -35 166 -13 -198 261 -77 -25 -183 -170 268 -320 158 39 -27 -259 -80 -154 41 111 -202
8048 -202 -63 -79 120 226 -108 218 83 -8 114 191 90 -74 86 96 10 68 85 58 -42 58 -94 141 203
8071 203 -182 -13 143 -10 62 38 -143 -395 -107 142 -208 174 -160 84 120 165 238 -439 101 11 -40 -35 -80
8094 -80 -17 -88 -103 5 105 -85 83 -160 245 -192 -21 -216 48 -90 -107 -138 -262 96 -70 -177 271 -146
8116 -146 -73 34 -91 9 225 8 -256 -394 34 -74 -164 -66 -370 51 85 -390 102 -49 -178 -81 69 -180
8138 -180 -197 -35 -189 -194 178 -157 5 181 -297 210 -119 45 -147 46 132 -147 81 138 255 23 16 -2 -76
$$ packed form
7980a59J62j93J90N0o4j67P4mK5j46K81J54k95K33p7k81p9L24P6o6n9j49N20l06
8004D4R9L7j31q0k3K01l51L00l13K17k77M36K02k29l32J65j03K72k39j36M3L93
8026A95l55J48k3K01j79j85M59l38N2j58J3M38n88M78j19o6k32J79p4J95P0l13
8048b02J39j6J99J06l34L26j35r1J22P7j01j64J60J0q6N8J7k7j00J00j52K35O2
8071B03l85J69J56j53P2k4j81k52K88K49l50L82l34K44L6M5P3o77N40r0n1Nm5
8094h0O3p1j5J08J00j90J68k43M05m37J71j95K64j38j7l1j24L58j66j07M48m17
8116a46P3J07j25J00K16k17k64j38M28j08r0R8l04M21L4m75M92j51j29R7J50k49
8138a80j7J62j54nL72l35J62J76m78N07l29J64j92J93Q6k79K28N7J17k32pj8p4
$$ plain form
8161 -76 -380 -318 139 46 43 -65 -243 2 -269 6 99 -348 -12 -40 356 212 1 172 -131 165 85 3 191
8184 191 184 44 96 171 -344 -158 112
$$ packed form
8161g6l04O2M57r3lj08j78K45k71K75R3m47L36k8L96j44k11J71l03K96q0q2J88
8184A91pj40N2P5n15J86K70
8191A12
$$ Imaginary data points
##PAGE= N=2
##DATA TABLE= (X++(I..I)), XYDATA
$$ plain form
0 0 0 0 0 0 0 0 0 0 0 -8 8 -8 8 -13 16 -16 24 -24 32 -34 40 -48 56 -64 74 -86 97 -111 125 -141 160 -178
32 -178 201 -224 250 -278 310 -342 381 -422 470 -518 572 -635 703 -781 868 -967 1082 -1214
50 -1214 1369 -1558 1790 -2082 2466 -2995 3774 -5034 7441 -13698 64805 144709 55287 14205
64 14205 13964 62096 82719 78813 48498 39487 49490 69090 62962 45620 29830 29690 33275 49741
78 49741 74614 80874 39046 -10784 -12546 37176 79660 74679 29199 -8885 721 43828 60494
91 60494 26680 -12408 -4444 36636 58672 39339 5915 -13859 -11946 6734 31155 41791 28138
104 28138 2265 -17584 -18589 5210 32779 26478 -10944 -28952 320 35885 28703 -16534 -46743
117 -46743 -29299 17066 44150 24085 -19902 -42532 -24209 5504 11967 822 -5521 -8130 -13457
$$ packed form
0@%%%%%%%%%qJ6j6J6k1K9l2M0m8N6o6P4q8J04j20J38j60J83k08K36k66L01l38
32a78L79m25M74n28N88o52P23q03Q92r88J090j207J338j484J649j835K049k296
50a214K583k927L348l872M548n461O769q808J2475k1139P8503P9904q9422m1082
64A4205k41M8132K0623l906l0315r011J0003J9600o128j7342j5790j40L585J6466
78D9741K4873O260m1828m9830j762M9722M2484m981m5480l8084R606M3107J6666
91F0494l3814l9088P964M1080K2036j9333l3424j9774J913J8680K4421J0636j3653
104B8138k5873j9849j005K3799K7569o301l7422j8008K9272L5565p182m5237l0209
117d6743J7444M6365K7084k0065m3987k2630J8323K9713O463j1145o343k609n327
$$ plain form
130 -13457 -11143 1002 2498 -13130 -28166 -21855 5179 27493 17343 -24300 -54518 -35732 15122
143 15122 38759 9951 -29834 -33035 -6742 11693 4876 -13593 -22493 -10919 9902 16507 3421
156 3421 -12562 -19491 -19837 -9842 13279 29925 16480 -17953 -34983 -14197 19094 27565 5094
169 5094 -18967 -14722 13779 31608 12114 -22796 -27707 4142 32329 30585 10014 -7492 -12754
182 -12754 -4963 8992 20726 22871 14166 195 -4772 5411 21206 22340 2813 -12930 2943
195 2943 35889 42010 11633 -19505 -18489 11268 39755 37660 11887 -7668 -1336 15765 21544
208 21544 14769 8907 10037 12646 14545 19786 21509 11162 -3863 -4742 14471 35845 37047 13217
222 13217 -13721 -13201 16097 38487 27878 1612 -6170 9820 26952 24252 6917 -5001 295
$$ packed form
130a3457K314J2145J496j5628j5036O311K7034K2314j0150m1643l0218J8786N0854
143A5122K3637k8808l9785l201K6293J8435o817j8469q900J1574K0821O605j3086
156C421j5983o929l46R995K3121J6646j3445l4433j7030K0786L3291Q471k2471
169E094k4061M245K8501J7829j9494l4910m911L1849K8187j744k0571j7506n262
182a2754P791J3955J1734K145q705j3971m967J0183J5795J134j9527j5743J5873
195B943L2946O121l0377l1138J016K9757K8487k095k5773j9555O332J7101N779
208B1544o775n862J130K609J899N241J723j0347j5025q79J9213K1374J202k3830
222A3217k6938N20K9298K2390j0609k6266p782J5990J7132k700j7335j1918N296
$$ plain form
235 295 16067 27002 23756 11941 1227 -2676 947 12840 27105 26324 6798 -8839 -2429 17477
249 17477 26452 12791 -7156 -7713 13978 32383 24074 -2745 -17741 -4895 18925 27303 16150
262 16150 2511 -2313 28 5780 11596 12626 8475 2563 261 5928 16122 16880 1033 -13884
276 -13884 -7142 16220 31509 18437 -8903 -18840 -3031 18187 22542 8320 -5861 -4612 8310
289 8310 14906 8098 -886 -2713 1102 6574 12910 14664 8009 -4654 -11929 -3092 15645 24416 11549
304 11549 -8514 -13899 1712 18966 16559 -1784 -11707 -901 15809 18821 5983 -8174 -10134
317 -10134 1011 12492 14707 9182 1116 -5478 -5336 2071 11705 13760 4406 -7380 -6215 8195
331 8195 17125 8064 -8691 -13503 309 18747 19875 2012 -13866 -11255 4160 14520 11104
$$ packed form
235B95J5772J0935l246j1815j0714l903L623J1893J4265p81j9526j5637O410J9906
249A7477Q975j3661j9947n57K1691J8405q309k6819j4996J2846K3820Q378j1153
262A6150j3639m824K341N752N816J030m151n912k302N667J0194P58j5847j4917
276a3884O742K3362J5289j3072k7340r937J5809K1218M355j4222j4181J249J2922
289H310O596o808q984j827L815N472O336J754o655j2663p275Q837J8737Q771j2867
304A1549k0063n385J5611J7254k407j8343r923J0806J6710L012j2838j4157j960
317a0134J1145J1481K215n525q066o594J42P407R634K055r354j1786J165J4410
331H195Q930r061j6755m812J3812J8438J128j7863j5878K611J5415J0360l416
$$ plain form
344 11104 955 -4913 -2529 2771 5791 6000 2755 -2810 -4748 1449 10573 12209 2014 -11600
358 -11600 -12478 2920 18255 15124 -2300 -14291 -8611 7354 14482 5363 -7412 -8105 1285 9447
372 9447 8292 -72 -6943 -6427 -721 5661 9430 6533 -3116 -10754 -7657 4312 12971 7916 -6441
387 -6441 -12291 -2838 10762 11328 -1536 -12805 -9379 5265 13793 7110 -5820 -11237 -5933 2976
401 2976 7904 5263 -843 -4985 -5811 -1997 4684 7038 -70 -8253 -8231 1567 11309 7721 -6810 -15477
417 -15477 -7435 8095 13516 3863 -9491 -12323 -2629 7143 6298 -1697 -6553 -5776 -1012 3488 3680
432 3680 -956 -5983 -8409 -4194 4498 8204 1318 -9521 -13162 -4585 7769 9312 -1880 -12623
446 -12623 -10433 830 7914 3181 -7464 -11748 -5689 3425 5210 124 -6626 -9365 -6571 -518
$$ packed form
344A1104j0149n868K384N300L020K09l245n565j938O197R124J636j0195j3614
358a1600q78J5398J5335l131j7424j1991N680J5965P128r119j2775o93R390Q162
372I447j155q364o871N16N706O382L769k897r649p638L097J1969Q659n055j4357
387f441n850R453J3600N66j2864j1269L426J4644Q528o683j2930n417N304Q909
401B976M928k641o106m142q26L814O681K354p108q183K2R798R742l588j4531q667
417a5477Q042J5530N421r653j3354k832R694R772q45p995m856P77M764M500J92
432C680m636n027k426M215Q692L706o886j0839l641Q577J2354J543j1192j0743
446a2623K190J1263P084m733j0645m284O059R114J785n086o750k739K794O053
$$ plain form
460 -518 3844 2578 -3641 -10405 -9487 -1447 5947 2906 -6871 -12926 -7940 3347 7317 -1101 -12281
475 -12281 -12794 -3461 5584 4512 -4266 -11257 -9683 -2628 2563 1444 -3477 -8527 -8512 -4047 986 2120
491 2120 -2173 -9608 -11773 -4016 5092 4558 -4880 -13142 -10997 -685 6913 2754 -7866 -12410 -6462
506 -6462 2317 4380 -2055 -7691 -8607 -4839 485 2721 230 -5996 -9053 -5866 551 4833 2205
521 2205 -6200 -10765 -6138 3717 7031 -112 -9528 -10089 -1625 6341 5121 -3403 -8977 -7063 437
536 437 5583 2992 -3242 -6343 -4525 -279 4118 4266 -671 -6435 -6108 650 6224 5454 -2029 -8200
552 -8200 -5576 2982 8581 4792 -4682 -8374 -2094 5960 6845 1392 -4066 -5911 -883 5216 6352
567 6352 1708 -3625 -4518 -1156 3588 6299 3334 -2832 -5858 -1292 6175 7744 1201 -5709 -5311 1481
$$ packed form
460e18M362j266o219o764R18Q040P394l041r777o055M986J1287L970q418j1180
475a2281n13R333R045j072q778o991J574P055N191j119m921n050J5M465N033J134
491B120m293p435k165P757R108n34r438q262K145J0312P598m159j0620m544N948
506f462Q779K063o435n636r16L768N324K236k491o226l057L187O417M282k628
521B205q405m565M627R855L314p143r416n61Q464P966j220q524n574J914P500
536D37N146k591o234l101J818M246M397J48m937n764L27O758N574p70p483o171
552h200K624Q558N599l789r474l692O280Q054Q85n453n458j845N028O099J136
567F352m644n333q93L362M744K711k965o166l026M566P467J569o543o910L98O792
$$ plain form
583 1481 7314 6823 -437 -6660 -4281 3870 7971 4269 -1527 -4361 -2402 2049 5788 4049 -895
598 -895 -4435 -2646 3012 5779 3897 -1541 -5726 -4169 3501 8520 4278 -4395 -7047 -1608 4696
613 4696 6548 1785 -4319 -5518 -349 5074 4515 -630 -4588 -3620 784 3874 4400 1189 -4435 -5928
629 -5928 -613 5493 5478 146 -4930 -5641 -321 5763 5146 -1723 -6766 -3738 3370 5808 1784 -3457
645 -3457 -5792 -3040 2291 5619 2974 -3472 -5349 -2745 1501 3537 2697 -1420 -5566 -3491 3439
660 3439 5861 902 -5252 -5867 -1049 4253 5539 1107 -5326 -6412 -891 4980 4266 -965 -3818 -3126
676 -3126 -703 2829 3499 -843 -5411 -3978 1208 4190 2853 -1299 -5571 -5411 70 5485 4576 -2441
692 -2441 -6715 -3531 1701 3706 1084 -2833 -5154 -3097 2932 4684 -92 -5084 -5178 -1803 2230 4021
$$ packed form
583A481N833m91p260o223K379Q151M101l702n796k834J959M451L739j739m944
598h95l540J789N658K767j882n438m185J557P670N019m242q673k652N439O304
613D696J852m763o104j199N169N423n59n145l958R68M404L090N26l211n624j493
629e928N315O106j5n332n076p11N320O084o17o869n043L028P108K438m024n241
645c457k335K752N331L328k645o446j877K604M246K036q40m117m146K075O930
660C439K422m959o154o15M818N302J286m432o433j086N521N871p14n231k853O92
676c126K423L532O70m342m568J433N186K982j337m152m272J60N481N415r09p017
692b441m274L184N232K005k622l917k321K057O029J752m776m992r4L375M033J791
$$ plain form
708 4021 1744 -4008 -6451 -3385 2366 3559 -306 -4212 -5058 -2238 1785 2920 -1217 -6930 -5917
723 -5917 663 3810 1954 -2927 -6281 -5913 -1345 2762 2548 -2824 -6302 -4485 -777 985 -214 -2837
739 -2837 -6192 -5219 -51 3531 -178 -6198 -7904 -4073 28 2696 415 -5064 -8291 -4476 351
754 351 653 -2611 -5393 -5049 -2988 -6 497 -2537 -6936 -7542 -2435 1899 774 -2790 -6420 -7508
770 -7508 -4251 1164 1907 -2898 -6564 -5296 -1535 97 -929 -4293 -6704 -5152 -514 2587 227
785 227 -5691 -7123 -4504 -549 1739 1243 -2949 -6459 -4860 -122 2259 -1179 -4351 -4701 -2096 1024
801 1024 2339 -736 -5506 -6282 -1836 3160 2925 -836 -4231 -4942 -2408 1716 3114 -689 -4284 -3514
817 -3514 227 2421 1506 -1551 -4243 -3337 860 4649 3110 -1938 -4762 -2622 1361 3425 2870 -200
$$ packed form
708D021k277n752k443L066N751J193l865l906q46K820M023J135m137n713J013
723e917O580L147j856m881l354L68M568M107k14n372l478J817L708J762j199k623
739b837l355R73N168L582l709o020j706L831M101K668k281n479l227L815M827
754C51L02l264k782L44K061K982N03l034m399o06N107M334j125l564l630j088
770g508L257N415P43m805l666J268L761J632j026l364k411J552M638L101k360
785B27n918j432K619L955K288m96m192l510J599M738K381l438l172l50K605L120
801A024J315l075m770p76M446M996k35l761l395p11K534M124J398l803l595P70
817c514L741K194r15l057k692R06M197L789j539n048k824K140L983K064n55l070
$$ plain form
833 -200 -3275 -2584 2214 3818 1116 -2052 -2452 -211 2894 4581 2056 -2617 -4375 -413 3645 5024
849 5024 2089 -1372 -2681 -739 2658 4368 1838 -2068 -1719 1646 4275 3066 198 -2472 -2182 1505
865 1505 5368 4803 246 -3051 -2025 1217 3901 3708 1040 -1504 -1468 1867 4370 2085 -1552 -2331
881 -2331 134 3132 4577 2827 -1590 -3834 -1193 3009 4573 2701 -691 -2231 -1095 1914 3639
896 3639 1447 -1773 -2083 775 3608 3094 205 -2779 -3208 -307 4095 4330 443 -2965 -2625 -39
912 -39 2286 2407 224 -2040 -2028 717 2806 2345 -1672 -3106 -1292 1461 3586 2333 -1609 -4418 -2665
929 -2665 1516 3058 1519 -1565 -2742 -1760 868 2311 414 -2379 -3133 -888 2515 2782 -160 -3209
945 -3209 -3577 -1332 2087 3023 504 -3216 -2983 -732 1486 1411 -215 -2572 -2743 289 1994 1382 -1727
$$ packed form
833b00l075O91M798J604k702l168m00K241L105J687k525m673j758L962M058J379
849E024k935l461j309J942L397J710k530l906L49L365K629j209k868k670K90L687
865A505L863n65m557l297J026L242K684j93k668k544L6L335K503k285l637p79
881b331K465K998J445j750m417k244K641M202J564j872l392j540J136L009J725
896C639k192l220l10K858K833n14k889k984m29K901M402K35l887l408L40K586
912c9K325J21k183k264J2K745K089m61m017j434J814K753K125j253l942k809J753
929b665M181J542j539l084j177R82K628J443j897k793p54K245L403K67k942l049
945c209l68K245L419R36k519l720K33K251K218p5j626k357j71L032J705o12l109
$$ plain form
962 -1727 -3604 -2820 560 2845 2049 -1183 -3690 -3485 191 2185 1528 -1424 -2585 -1774 544 1500 494
979 494 -2388 -3352 -869 2044 2443 810 -2648 -4240 -1852 1124 2670 958 -2734 -3222 -1128 1121
995 1121 1344 -319 -2401 -2527 -89 2094 1654 -1259 -3215 -2809 -214 2297 2193 -582 -3195 -2959 -599
1012 -599 1540 1208 -1183 -2695 -1885 393 1826 593 -2115 -3353 -1649 950 2178 815 -1789 -3349
1028 -3349 -2369 719 2054 1090 -1536 -2875 -1423 1218 974 -97 -2105 -2285 -283 2011 1964 -608
1044 -608 -3009 -2810 -683 1734 2097 -73 -2272 -2595 -730 1689 1260 -335 -2468 -1688 587 1846
1060 1846 1137 -1394 -2992 -1524 941 2079 1693 -1043 -2980 -2288 296 1929 1084 -934 -2336 -1210
1076 -1210 912 1452 184 -2111 -2310 -497 1933 2589 593 -2504 -2593 -782 1525 2185 608 -1628
$$ packed form
962a727j877P84L380K285p96l232k507K05L676J994o57k952j161Q11K318R56j006
979D94k882r64K483K913L99j633l458j592K388K976J546j712l692m88K094K249
995A121K23j663k082j26K438K183m40k913j956M06K595K511j04k775k613K36K360
1012e99K139l32k391j512Q10K278J433j233k708j238J704K599J228j363k604j560
1028c349R80L088J335r64k626j339J452K641k44j071k008j80K002K294m7k572
1044f08k401J99K127K417L63k170k199l23J865K419m29j595k133P80K275J259
1060A846p09k531j598J468K465J138l86k736j937O92K584J633q45k018j402J126
1076a210K122N40j268k295j99J813K430O56j996l097q9J811K307O60j577k236
$$ plain form
1092 -1628 -1952 -167 1306 1482 -296 -1907 -1988 671 1920 1530 -1155 -2711 -2145 458 2412 1467 -752
1109 -752 -2089 -1687 260 1532 1159 -604 -1993 -1088 633 1585 491 -1662 -2326 -1212 1435 2239 689
1126 689 -1662 -2692 -1067 989 1918 516 -1390 -1589 -446 1340 1348 -480 -1395 -1893 192 1570 1833
1143 1833 -558 -2159 -2012 -271 1903 1545 -275 -2076 -1978 -150 1326 1578 -820 -1817 -1193 621 1516
1160 1516 807 -1377 -2322 -849 700 1898 1054 -938 -2145 -1304 1004 1649 725 -672 -1489 -801 1009
1177 1009 1396 9 -1567 -1781 -309 1477 1772 -32 -1867 -1912 -175 1166 1408 118 -1819 -1490 -373
1194 -373 1173 998 -284 -1963 -1032 610 1802 847 -736 -1859 -1469 584 2030 1451 -437 -1808
1210 -1808 -1070 901 1499 758 -585 -1295 -238 1374 1707 246 -1490 -1433 -142 1199 2148 696 -1344
$$ packed form
1092a628l24J785J473J76j778j611q1K659J249l90k685j556N66K603J954r45k219
1109g52j337M02J947J272l73j763j389R05J721R52j094k153o64J114K647Q04j550
1126F89k351j030J625K056R29j402j906j99J143J786Qj828r15m98K085J378K63
1143A833k391j601J47J741K174l58j820j801R8J828J476K52k398r97O24J814Q95
1160A516p09k184r45J473J549J198q44j992j207Q41K308O45r24j397q17O88J810
1177A009L87j387j576k14J472J786K95j804j835m5J737J341K42j290j937L29J117
1194c73J546j75j282j679R31J642J192r55j583j123L90K053J446n79j888j371
1210a808P38J971N98p41j343p10J057J612L33j461j736N7J291J341R49j452k040
$$ plain form
1227 -1344 -1692 -479 1375 1656 524 -899 -1396 -112 1352 1503 -30 -1599 -1057 681 1614 1059 -342
1244 -342 -1396 -1379 386 1822 1544 -603 -1298 -830 520 1280 637 -416 -1150 -600 982 1520 813 -1275
1262 -1275 -1484 -317 1237 1803 912 -866 -1642 -761 1107 1318 -60 -762 -1144 -190 912 1203 -304
1279 -304 -1666 -1818 -512 866 865 -561 -1434 -1387 -333 1367 1073 -248 -1482 -1427 52 713 911 -348
1297 -348 -1777 -1169 516 1260 478 -1041 -1960 -854 500 1196 509 -971 -2018 -1018 365 909 -40
1314 -40 -1245 -1229 -720 194 813 180 -1643 -2222 -434 1090 930 -616 -1724 -1862 -585 420 1154 -482
1332 -482 -1603 -1124 345 433 119 -100 -1305 -1518 -387 931 485 -1128 -2037 -1204 -293 758 502 -640
1350 -640 -1719 -1634 73 945 -115 -1733 -1339 -465 -122 543 273 -1480 -1698 -528 761 630 -74 -883
$$ packed form
1227a344l48J213J854K81j132j423m97J284J464J51j533j569N42J738R33n55j401
1244c42j054J7J765J436k78k147o95M68J350P60o43j053p34N50J582N38p07k088
1262a275k09J167J554N66q91j778p76Q81J868K11j378p02l82R54J102K91j507
1279c04j362j52J306J378jj426q73M7J054J700k94j321j234N5J479O61J98j259
1297c48j429O08J685P44p82j519r19J106J354O96o87j480j047J000J383N44r49
1314d0j205J6N09R14O19o33j823n79J788J524j60j546j108j38J277J005P34j636
1332d82j121M79J469Q8l14k19j205k13J131J318m46j613r09Q33R11J051k56j142
1350f40j079Q5J707Q72j060j618L94Q74L43O65k70j753k18J170J289j31p04q09
$$ plain form
1368 -883 -1466 -780 353 696 -275 -1774 -1264 -162 542 378 -508 -1112 -1439 -275 1340 865 -782 -1575
1386 -1575 -690 -232 735 569 -414 -1779 -1048 103 578 187 -1211 -1153 -433 4 696 437 -947 -1756 -518
1405 -518 778 559 -89 -776 -926 -531 520 1020 258 -1569 -1003 294 770 392 101 -637 -1282 -512 1228
1424 1228 1389 -713 -1082 -853 137 547 785 -73 -1255 -1273 652 1320 637 -459 -1148 -547 266 657 700
1443 700 -512 -1089 -514 821 891 16 -428 -555 -550 97 1196 536 -1281 -1395 -305 978 897 15 -713
1462 -713 -1147 -143 979 1152 -218 -1165 -604 -53 825 708 200 -823 -1164 128 1142 888 -721 -619
1480 -619 -629 223 1056 992 -503 -1151 -544 677 976 115 -279 -913 -344 347 987 520 -956 -1196 -28
1499 -28 645 487 217 -508 -975 -815 712 1066 366 -1066 -1001 -169 709 777 71 -702 -1145 -406 1026 699
$$ packed form
1368h83n83O86J133L43r71j499N10J102P04j64q86o04l27J164J615m75j647p93
1386a575Q85M58R67j66r83j365P31J151M75l91j398N8P20M37O92k59j384q09J238
1405e18J296k19o48o87j50L95J051N00p62j827N66J297M76l78k91p38o45P70J740
1424A228J61k102l69K29R90M10K38q58j182j8J925O68o83j096o89O01Q13L91M3
1443G00j212n77N75J335P0q75m44j27NO47J099o60j817j14J090J283q1q82p28
1462g13m34J004J122J73j370r47N61N51Q78j17n08j023l41J292J014k54j609J02
1480f19j0Q52Q33o4j495o48O07J221K99q61l94o34N69O91O40m67j476k40J168
1499b8O73j58k70p25m67J60J527L54p00j432O5Q32Q78O8p06p73m43P39J432l27
$$ plain form
1519 699 -409 -809 -602 245 622 850 -107 -863 -476 390 1014 479 -310 -912 -436 39 739 927 -486
1538 -486 -1224 -237 799 826 208 -298 -1019 -397 559 1159 10 -1192 -707 -18 590 755 3 -518 -930
1557 -930 -470 444 931 108 -692 -899 -126 489 825 174 -1397 -1127 661 824 433 -347 -1234 -236 159
1576 159 400 411 24 -847 -940 198 682 -6 -229 -500 -325 265 960 481 -662 -870 -9 376 664 419
1596 419 -552 -538 -321 658 772 85 -769 -576 -80 383 563 139 -731 -643 105 744 315 -218 -790 -695 13
1617 13 729 461 -188 -966 -749 461 773 402 -241 -897 -540 390 793 714 -241 -546 -149 129 803 339
1637 339 -160 -761 -352 833 904 137 -591 -681 98 467 801 207 -551 -799 -96 729 883 -118 -394 -470
1657 -470 224 663 886 -184 -603 -572 -60 809 576 -372 -647 -377 503 652 573 -281 -721 -276 452 624
$$ packed form
1519F99j108m00K07Q47L77K28r57p56L87Q66O24n35p89o02M76M75P00J88j413
1538d86p38R87J036K7o18n06p21O22R56O00j149j202M85O89O08J65p52n21m12
1557i30M60R14M87q23q00k07P73O15L36o51j571K70J788J63l91p80q87R98L95
1576A59K41J1l87q71r3J138M84o88k23k71J75N90O95m79j143k08Q61L85K88k45
1596D19r71J4K17R79J14o87q54J93M96M63J80m24q70Q8P48O39m29n33n72R5P08
1617A3P16k68o49p78K17J210L12l71o43o56L57R30M03p9r55l05L97K78O74m64
1637C39m99o01M09J185P1p67p28r0P79L69L34n94p58k48P03Q25J54j001k76p6
1657d70O94M39K23j070m19L1N12Q69k33r48k75K70Q80J49p9q54m40M45P28J72
$$ plain form
1677 624 381 8 -814 -194 493 736 221 -518 -614 -69 231 888 573 -285 -414 -97 341 528 366 -384
1697 -384 -686 222 460 562 10 -460 -380 5 489 606 -65 -620 -406 87 866 615 -9 -844 -502 219
1717 219 768 269 185 -478 -351 283 331 496 -262 -274 -7 525 492 458 -198 -772 -166 395 617 502 -248 -605
1739 -605 -121 309 267 242 -348 -629 120 453 598 -7 -254 -344 279 725 360 -43 -329 -110 194 456 666
1760 666 -74 -587 -342 135 673 295 -271 -382 -69 370 605 254 -279 -285 -395 230 557 433 -237 -162 -26
1781 -26 198 122 337 -232 -518 139 421 610 353 -609 -589 17 570 780 -11 -546 -323 -143 424 461 -95
1802 -95 13 -479 270 441 308 -136 -291 -143 334 463 371 -175 -539 -305 428 590 -18 141 4 -2 303
1823 303 547 316 -271 -347 177 86 693 155 -347 -400 8 552 645 200 -497 -248 9 462 437 177 -233 -337
$$ packed form
1677F24k43l73q22O20O87K43n15p39r6N45L00O57l15q58j29L17M38J87j62p50
1697c84l02R08K38J02n52m70Q0L85M84J17o71n55K14M93P79k51o24q35L42P21
1717B19N49m99q4o63J27O34M8J65p58j2K67N32l3l4o56n74O06N61K22j15p50l57
1739f05M84M30m2k5n90k81P49L33J45o05k47r0O23M46l65m03k86K19L04K62K10
1760F66p40n13K45M77N38l78n66j11L13M39K35l51n33oj10O25L27j24o70P5J36
1781b6K24p6K15n69k86O57K82J89k57r62K0O06N53K10p91n35K23J80N67L7n56
1802i5J08m92P49J71j33m44j55J48M77J29r2n46l64K34P33J62o08J59j37oL05
1823C03K44k31n87p6N24r1O07n38n02n3M08N44R3m45o97K49K57M53k5k60m10j04
$$ plain form
1845 -337 50 429 458 3 -640 -78 214 526 388 49 -347 -153 228 216 476 -184 -383 -16 165 447 48
1866 48 -317 -515 -19 356 513 -59 -47 -367 -220 100 362 289 -118 -234 -160 564 492 305 -124 -148 -20 587
1888 587 495 156 -393 -237 152 446 759 148 -418 -312 -111 697 665 -467 -538 90 433 174 -14 -157 -259
1909 -259 32 190 343 434 -73 -205 -140 112 308 465 -4 -570 -51 451 186 206 -300 -684 -275 254 650
1930 650 373 -333 -669 -131 467 383 -26 -220 -493 -57 457 334 -167 -209 -169 116 383 46 -111 -298 -249
1951 -249 141 499 411 -104 -74 -183 213 273 522 -193 -362 96 68 309 368 152 -242 -331 167 406 76 -404
1973 -404 -246 -75 250 154 147 -173 -411 -175 346 434 -160 -432 -261 215 219 242 -29 -154 -107 -67 498 342 -197
1996 -197 -36 -374 7 439 296 -210 -384 -18 490 490 6 -43 -263 -415 117 260 8 -127 -447 -254 735
$$ packed form
1845c37L87L79K9m55o43N62K92L12j38l39l96J94L81j2K60o60j99L67J81K82l99
1866D8l65j98M96L75J57n72J2l20J47L20K62p3m07j16P4P24p2j87m29k4J28O07
1888E87r2l39n49J56L89K94L13o11n66J06K01Q08l2j132p1O28L43k59j88j43j02
1909b59K91J58J53R1n07j32O5K52J96J57m69n66N19N02k65K0n06l84M09N29L96
1930F50k77p06l36N38N98q4m09j94k73M36N14j23n01m2M0K85K67l37j57j87M9
1951b49L90L58q8n15L0j09L96O0K49p15j69M58k8K41N9k16l94q9M98K39l30m80
1973d04J58J71L25r6pl20k38K36N21Q8n94k72J71M76MK3k71j25M7M0N65j56n39
1996a97J61l38L81M32j43n06j74L66N08%m84m9k20j52N32J43k52j35l20J93R89
$$ plain form
2017 735 363 164 -77 -262 -424 375 363 43 -183 -33 89 70 470 227 -293 -371 229 702 399 -70 -278
2038 -278 -284 -70 242 224 102 -138 -141 553 358 48 -157 -138 -109 211 428 265 37 -350 -125 84 274 133
2060 133 -104 -271 6 282 750 19 -303 -153 -128 199 195 150 -234 -388 -46 316 206 -43 -191 146 -122
2081 -122 -191 -8 17 -436 -65 15 123 142 51 -367 -238 -158 328 787 -115 -357 -339 333 385 22 -80 42 15
2104 15 100 627 134 -221 239 -64 -10 62 283 115 -596 -120 208 140 146 -227 38 25 224 373 -48 -225 -63
2127 -63 77 931 149 -180 58 103 135 139 640 273 -532 -188 -57 213 -14 153 -88 -332 102 477 188 -348
2149 -348 -296 -149 346 267 301 -172 -483 -135 183 309 145 -267 65 -107 -69 466 336 -141 -205 -219 395 56
2171 56 374 -113 -124 -78 486 98 40 -126 -73 548 100 121 89 129 -63 110 319 669 -153 12 -34 257 105
$$ packed form
2017G35l72j99k41j85j62P99j2l20k26J50J22j9M00k43n20p8O00M73l03m69k08
2038b78oK14L12j8j22k40lO94j95l10k05J9K9L20K17j63k28l87K25K09J90j41
2060A33k37j67K77K76M68p31l22J50K5L27mm5l84j54L42L62j10k49j48L37k68
2081a22o9J83K5m53L71Q0J08J9r1m18J29Q0M86M59r02k42J8O72N2l63j02J22k7
2104A5Q5N27m93l55M60l03N4P2K21j68p11M76L28o8Ol73K65j3J99J49m21j77J62
2127f3J40Q54p82l29K38M5L2MN01l67q05L44J31K70k27J67k41k44M34L75k89n36
2149c48N2J47M95p9L4m73l11L48L18J26j64m12L32j72L8N35j30m77o4j4O14l39
2171E6L18m87j1M6N64l88n8j66N3O21m48K1l2M0j92J73K09L50q22J65m6K91j52
$$ plain form
2194 105 372 227 -246 -482 381 333 -32 45 -220 413 39 262 609 -251 -178 -104 504 281 73 -333 73
2215 73 -28 185 148 -229 -292 -137 339 327 79 -117 -95 -106 -107 581 251 9 -34 -56 122 201 376 170 -382 -140
2239 -140 -27 25 -26 -65 -132 -247 25 51 295 -112 -210 -211 -71 414 178 -7 -260 -44 50 278 161 -348 -153
2262 -153 -154 192 -114 -115 -19 188 -31 -237 204 -4 147 -11 59 431 402 70 -66 -312 70 410 100 -349
2284 -349 -181 -71 26 109 206 -27 19 -49 395 427 -139 -121 44 -210 94 3 261 -182 98 146 -13 -269 67
2307 67 259 -347 -269 383 656 11 8 -477 313 145 -253 163 -407 93 131 87 107 -375 -63 386 37 -4 121
2330 121 -94 89 -137 236 357 20 57 -233 -115 -268 256 139 -23 -343 -236 203 181 109 -242 -323 -165
2351 -165 174 262 236 -104 -98 -2 -261 -166 -223 72 -119 -216 124 330 135 -150 74 -120 132 -11 -64 -234 -188
$$ packed form
2194A05K67j45m73k36Q63m8l65P7k65O33l74K23L47q60P3P4O08k23k08m06M06
2215G3j01K13l7l77o3J55M76j2k48j96K2j1jO88l30k42m3k2J78P9J75k06n52K42
2239a40J13N2n1l9o7j15K72K6K44m07r8jJ40M85k36j85k53K16R4K28j17n09J95
2262a53jL46l06jR6K07k19k06M41k08J51j58P0L72k9l32j36k46L82L40l10m49
2284c49J68J10R7Q3R7k33M6o8M44L2n66J8J65k54L04r1K58m43K80M8j59k56L36
2307F7J92o06P8O52K73o45lm85P90j68l98M16n70N00L8m4K0m82L12M49l49m1J25
2330A21k15J83k26L73J21l37L7k90J18j53N24j17j62l20J07M39k2p2l51q1J58
2351a65L39Q8k6l40OR6k59R5n7K95j91r7L40K06j95k85K24j94K52j43n3j70M6
$$ plain form
2374 -188 117 -90 103 -82 -230 38 -206 -143 247 94 -332 63 -139 -71 80 188 -92 -35 276 162 152
2395 152 11 -75 88 480 126 -127 -131 -261 47 119 -174 -67 -321 226 172 330 -20 129 -316 166 73 367
2417 367 63 84 -430 -275 127 34 131 -210 -335 16 -79 154 -77 -327 -196 -206 289 67 -67 -361 -23 -202
2439 -202 135 565 -62 101 -318 -61 -167 146 267 -204 34 -248 217 -48 -264 -132 -242 136 -13 323
2459 323 141 -151 224 142 69 -54 -23 153 -404 -192 121 271 61 -153 -308 -43 121 125 116 -304 -74 336
2481 336 216 284 -132 44 132 291 248 -298 39 28 -81 -349 297 70 -174 -47 -106 53 95 -20 -100 -174 60
2504 60 95 460 -192 -150 -172 143 119 -260 96 5 -34 426 275 0 -159 37 111 33 -370 285 -206 -494 -172
2527 -172 319 22 -4 37 -257 134 117 -59 113 -158 -24 53 47 230 141 -167 -106 -158 246 -191 -281 187 -349
$$ packed form
2374a88L05k07J93j85j48K68k44O3L90j53m26L95k02O8J51J08k80N7L11j14j0
2395A52j41q6J63L92l54k53mj30L08P2k93J07k54N47n4J58l50J49m45M82r3K94
2417C67l04K1n14J55M02r3R7l41j25L51r5K33k31k50J31j0M95k22j34k94L38j79
2439b02L37M30o27J63m19K57j06L13J21m71K38k82M65k65k16J32j10L78j49L36
2459C23j82k92L75q2p3j23L1J76n57K12L13J50k10k14j55K65J64Mrm20K30M10
2481C36j20O8m16J76Q8J59m3n46L37j1j09k68O46k27k44J27n9J59M2j15q0p4K34
2504F0L5L65o52M2k2L15k4l79L56r1l9M60j51k75j59J96P4p8m03O55m91k88L22
2527a72M91k97k6M1k94L91j7j76J72k71J34P7oJ83q9l08O1n2M04m37r0M68n36
$$ plain form
2550 -349 76 75 448 124 -160 -17 -119 16 -43 46 64 122 -203 -108 198 172 -89 -311 -119 -158 -283 -206 -24
2573 -24 -93 -266 189 -160 35 -155 -97 -186 74 -10 244 -358 -156 294 -88 -7 -169 -49 370 212 209 -142 25
2596 25 186 -76 -167 -120 140 49 -37 -195 -12 551 239 -160 0 -137 58 12 -284 -217 39 -201 338 -306
2618 -306 -1 -152 -66 -56 22 -100 -263 246 287 309 -90 -168 -97 145 -136 124 308 109 29 103 -139 138 132 410
2642 410 240 -46 -162 -116 -87 -183 -87 19 -37 356 -178 -281 -270 58 -155 69 46 193 -198 55 178 -265
2664 -265 38 -111 -421 -375 283 101 315 -54 -302 68 85 64 103 61 0 -37 150 -83 12 -111 106 -69 250
2687 250 -49 96 243 -15 -262 171 -84 21 -162 -200 33 -107 28 -369 135 1 22 203 161 -134 15
2708 15 -198 -172 48 0 -210 -139 140 -211 -155 -138 -51 -117 -132 47 48 60 162 10 -137 333 98 -405 47 61
$$ packed form
2550c49M25jL73l24k84J43j02J35n9Q9J8N8l25R5L06k6k61k22J92l9j25P7J82
2573b4o9j73M55l49J95j90N8q9K60q4K54o02K02M50l82Q1j62J20M19j58ll51J67
2596B5J61k62r1M7K60r1q6j58J83N63l12l99J60j37J95m6k96O7K56k40N39o44
2618c06L05j51Q6J0P8j22j63N09M1K2l99p8P1K42k81K60J84j99q0P4k42K77oK78
2642D10j70k86j16M6K9r6R6J06n6L93n34j03J1L28k13K24k3J47l91K53J23m43
2664b65L03j49l10M6O58j82K14l69k48L70J7k1L9m2o1l7J87k33R5j23K17j75L19
2687B50k99J45J47k58k47M33k55J05j83l8K33j40J35l97N04j34K1J81m2k95J49
2708A5k13K6K20m8k10P1K79l51N6J7Q7o6j5J79JJ2J02j52j47M70k35n03M52J4
$$ plain form
2732 61 -51 109 63 11 -236 17 7 -118 272 -36 41 258 187 320 266 -34 -216 -98 -104 232 125 -41 -490
2755 -490 -128 7 -31 -140 -71 149 116 345 -135 -36 181 -67 7 361 40 153 -14 -153 -199 -246 67 67 10
2778 10 -267 416 37 -251 279 167 -177 -113 -177 -150 -65 -52 186 272 -35 150 44 -97 23 -251 144 -113
2800 -113 242 -86 34 130 -42 22 -20 -200 63 116 -215 -167 -80 -135 -91 111 104 75 224 2 -80 129 -19 -121
2824 -121 313 152 292 -163 -43 355 -300 -91 60 -65 202 315 -181 -259 191 270 459 -40 -87 -51 -54 155
2846 155 -153 -311 -195 -175 -161 145 159 -119 265 -19 -192 -110 111 40 42 39 143 227 -91 -80 405 -96 -138 56
2870 56 127 -295 21 -206 15 -97 -90 -161 -141 94 -112 -13 -101 194 -266 71 63 -167 64 -354 -75 223 -92
2893 -92 -244 -134 12 -54 -15 -49 181 -179 -116 4 141 -204 -1 151 -77 -50 45 204 86 -44 -324 33
$$ packed form
2732F1j12J60m6n2k47K53j0j25L90l08P7K17p1J33n4l00j82J18oL36j07j66m49
2755d90L62J35l8j09O9K20l3K29m80R9K17k48P4L54l21J13j67j39m6m7L13%n7
2778A0k77O83l79k88N30j12l44O4o4K7Q5J3K38Q6l07J85j06j41J20k74L95k57
2800a13L55l28J20R6j72O4m2j80K63N3l31M8Q7n5M4K02pk9J49k22q2K09j48j02
2824a21M34j61J40m55J20L98o55K09J51j25K67J13m96p8M50P9J89m99m7L6lK09
2846A55l08j58J16K0J4L06J4k78L84k84j73Q2K21p1KlJ04Q4l18J1M85n01m2J94
2870E6P1m22L16k27K21j12Pp1K0K35k06R9q8K95m60L37qk30K31m18K79K98l15
2893i2j52J10J46o6L9l4K30l60O3J20J37l45K03J52k28K7R5J59j18j30k80L57
$$ plain form
2915 33 -268 -93 166 -272 -279 -127 60 86 238 -390 273 52 103 -126 82 17 -128 -55 -140 -153 -166 -33 172
2938 172 -327 -164 -435 236 -122 -213 74 -144 -64 -216 -91 61 -282 249 89 211 283 -113 88 -181 -177 181
2960 181 -104 22 314 116 -167 -223 -106 -25 -19 -536 30 36 -44 -157 81 -15 -140 232 158 -299 60 99 114 -55
2984 -55 -44 191 -46 104 -178 -95 105 -300 -9 267 64 69 -46 -159 73 126 -40 -7 -74 220 74 -255 -146
3007 -146 -3 27 229 119 78 108 309 180 -257 -138 -136 98 -212 27 454 74 96 -164 147 -188 -168 -235 -54
3030 -54 -179 -189 143 -196 -1 -288 -65 81 47 -377 -193 -302 -385 -199 123 55 -144 151 -3 -244 372 222
3052 222 201 -211 -256 116 250 110 -23 22 13 -163 -125 249 -356 -166 -113 36 110 139 270 -84 155 89 -23
3075 -23 -41 307 279 54 -249 504 -50 -38 216 -174 245 184 49 157 -18 91 -39 59 129 -70 -70 199 5
$$ packed form
2915C3l01J75K59m38pJ52J87K6J52o28O63k21N1k29K08o5j45P3q5j3j3J33K05
2938A72m99J63k71O71l58r1K87k18Q0j52J25J52l43N31j60J22P2l96K01k69ML58
2960A81k85J26K92j98k83n6J17Q1On17N66Oq0j13K38r6j25L72p4m57L59L9J5j69
2984e5J1K35k37J50k82Q3K00m05K91K76k03Nj15j13K32N3j66L3o7K94j46l29J09
3007a46J43L0K02j10m1L0K01j29m37J19KK34l10K39M27l80K2k60L11l35K0o7J81
3030e4j25j0L32l39J95k87K23J46l4m24J84j09q3J86L22o8j99K95j54k41O16j50
3052B22k1m12m5L72J34j40j33M5rj76L8L74o05J90N3J49P4K9J31l54K39o6j12
3075b3j8L48k8k25l03P53n54J2K54l90M19o1j35J08j75J09j30R8P0j99%K69j94
$$ plain form
3098 5 54 -41 58 -154 -91 -24 69 -142 34 -80 90 77 173 213 87 34 80 215 -206 71 -129 -144 14 30 14
3123 14 52 136 -119 -28 110 -185 -212 156 153 306 -136 -191 218 -27 -241 86 117 -201 -313 -93 -113 -233 -121
3146 -121 -95 6 25 -143 276 196 77 127 367 -167 210 -479 389 39 -200 -8 20 54 12 114 -121 -191 75
3169 75 301 189 -280 -34 -444 -143 24 -142 -88 114 -119 204 -277 156 -117 -42 -100 -156 -309 -13 -50 -116
3191 -116 -128 -93 -66 -23 28 -84 13 124 50 23 206 203 41 78 83 -92 160 -46 -62 -4 240 -162 103 -229 85
3216 85 -234 -170 52 -308 -93 148 301 240 -159 -53 66 -253 17 -129 -86 -99 84 -57 93 -172 -222 94
3238 94 -121 -593 215 -188 27 -386 19 -38 -7 86 -125 -242 -85 145 0 -200 -139 -1 414 245 -235 -23
3260 -23 -177 134 -224 57 48 -5 -82 59 27 166 111 -82 19 -36 158 -199 -26 245 33 -1 257 -110 166
$$ packed form
3098EM9r5R9k12O3O7R3k11J76j14J70j3R6M0j26n3M6J35m21K77k00j5J58J6j6
3123A4L8Q4k55R1J38k95k7L68lJ53m42n5M09k45k14L27L1l18j12K20k0j20J12
3146a21K6J01J9j68M19q0j19N0K40n34L77o89Q68l50k39J92K8L4m2J02k35p0K66
3169G5K26j12m69K46m10L01J67j66N4K02k33L23m81M33k73P5n8n6j53K96l7o6
3191a16j2L5K7M3N1j12R7J11p4k7J83lj62L7Nj75K52k06j6N8K44m02K65l32L14
3216H5l19O4K22l60K15K41J53o1l99J06J19l19K70j46M3j3J83j41J50k65n0L16
3238I4k15m72Q08m03K15m13M05n7L1R3k11j17J57K30j45k00O1J38M15j69m80K12
3260b3j54L11l58K81rn3p7J41l2J39n5j93J01n5J94l57J73K71k12l4K58l67K76
$$ plain form
3283 166 51 113 84 -200 124 -205 -118 331 26 -170 62 -180 -40 -212 -86 -311 -118 -41 143 200 -142 19
3305 19 211 86 -25 156 80 168 29 -31 122 -98 49 160 146 -175 -291 24 -141 66 -116 -376 42 -5
3327 -5 153 -42 -107 -274 298 -66 -220 -81 -71 182 201 -68 200 9 12 -88 167 -303 62 153 142 60 -221
3350 -221 120 174 51 7 26 151 -143 36 54 89 -207 -93 -2 -67 -89 -23 -106 -310 -42 101 462 -270 89
3373 89 -62 -151 -23 81 264 -49 -31 40 -73 -228 265 39 -109 -255 30 144 171 95 -125 230 -65 -26
3395 -26 -140 -189 -67 44 -167 -34 318 61 -221 183 33 128 -66 246 174 -231 47 38 -22 14 -55 45 98
3418 98 70 -54 -276 -14 22 -1 218 -220 -104 52 -196 77 287 247 -151 32 -58 -42 -312 -70 97 -390
3440 -390 274 -241 16 -154 1 69 218 -125 -47 87 5 -192 111 170 182 -207 -214 203 -148 308 56 -105
$$ packed form
3283A66j15O2k9k84L24l29Q7M49l05j96K32k42J40j72J26k25J93P7J84N7l42J61
3305A9J92j25j11J81p6Q8j39o0J53k20J47J11j4l21j16L15j65K07j82k60M18m7
3327eJ58j95o5j67N72l64j54J39J0K53J9k69K68j91Lj00K55m70L65R1j1q2k81
3350b21L41N4j23m4J9J25k94J79J8L5k96J14R1o5k2O6q3k04K68J43L61p32L59
3373H9j51q9J28J04J83l13J8P1j13j55M93k26j48j46K85J14K7p6k20L55k95L9
3395b6j14m9J22J11k11J33L52k57k82M04j50R5j94L12p2m05K78ro0L6o9J00N3
3418I8k8j24k22K62L6k3K19m38J16J56k48K73K10m0l98J83r0J6k70K42J67m87
3440c90O64n15K57j70J55O8J49l43P8J34q2j97L03N9J2l89pM17l51M56k52j61
$$ plain form
3462 -105 158 -163 -52 -86 88 11 -19 -43 97 -263 98 -25 -268 -188 49 45 22 3 -80 74 -4 124 120 -53
3486 -53 -190 -222 -92 -25 -68 -137 -133 -221 -104 -227 -2 74 -48 -91 185 -172 -211 -168 -118 202 -90 132 -73 119
3510 119 -78 22 236 -188 -243 -73 71 345 -46 -55 403 -160 105 -118 -24 142 52 43 -13 205 3 36 -25
3533 -25 -405 -100 103 -160 -419 22 22 -89 30 82 -74 141 82 -219 18 -180 30 211 -9 236 25 47
3555 47 -100 40 5 259 -95 81 -291 -255 58 -72 -140 271 6 101 -244 90 2 -74 -238 -88 147 162 -225
3578 -225 25 61 -51 62 161 402 184 341 200 -130 148 116 -44 193 159 -111 -103 -180 164 129 -134 -236 153
3601 153 -144 -1 114 -130 41 194 -96 40 247 119 -165 47 91 -224 121 -192 -183 -14 -93 -75 -92 143
3623 143 58 194 35 -159 10 108 196 -89 121 194 154 82 96 55 -244 2 -79 -106 -59 -339 -262 21 69 167 101
$$ packed form
3462a05K63l21J11l4J74p7l0k4J40l60L61j23k43Q0K37mk3j9q3J54p8J28mj73
3486e3j37l2J30O7m3o9Mq8J17j23K25P6j22m3K76l57l9M3N0L20k92K22k05J92
3510A19j97J00K14m24n5J70J44K74l91rM58n63K65k23R4J66r0rn6K18k02L3o1
3533b5l80L05K03k63k59M41%j11J19N2j56K15n9l01K37j98K10J81k20K45k11K2
3555D7j47J40l5K54l54J76l72L6L13j30o8M11k65R5l45L34q8p6j64J50K35J5l87
3578b25K50L6j12J13R9K41k18J57j41l30K78l2j60K37l4k70Qp7L44l5k63j02L89
3601A53k97J43J15k44J71J53k90J36K07j28k84K12M4l15L45l13RJ69p9J8j7K35
3623A43q5J36j59j94J69R8Q8k85K10P3m0p2J4m1k99K46q1k7M7k80P7K83M8R8o6
$$ plain form
3648 101 246 -265 53 49 -166 48 -71 -47 349 13 129 4 -85 185 189 18 114 -154 -313 -173 211 -170
3670 -170 -45 65 61 -77 -167 199 139 200 -88 131 143 -214 39 -54 241 46 144 123 -53 -109 605 500 -28
3693 -28 10 -162 -329 -117 15 127 137 -151 -336 -293 -194 -54 -240 84 -19 -18 -150 67 -20 -116 6 -152 139
3716 139 360 217 -315 -65 -9 371 -145 -224 -3 -199 20 253 374 -124 -145 72 253 355 -251 -84 369
3737 369 -85 19 239 -195 348 -70 360 237 -113 -96 42 66 -104 59 -333 83 -312 -77 312 -274 265
3758 265 165 97 11 361 39 -35 -146 -148 -30 112 -21 230 219 -7 200 94 -146 -157 -265 38 82 -28 -103
3781 -103 -87 -14 -78 120 74 142 -38 48 -55 292 333 -216 179 -92 36 241 -3 -92 306 -302 -112 -102 36
3804 36 177 109 90 179 24 -62 -216 125 106 -191 265 -51 179 155 -61 -256 92 -251 -61 -64 -368 130 -6
$$ packed form
3648A01J45n11L18mk15K14j19K4L96l36J16j25q9K70Mj71R6k68j59J40L84l81
3670a70J25J10mj38r0L66o0O1k88K19J2l57K53r3K95j95R8k1j76n6P14j05n28
3693b8L8j72j67K12J32J12J0k88j85M3R9J40j86L24j03Jj32K17q7r6J22j58K91
3716A39K21j43n32K50N6L80n16p9K21j96K19K33J21m98k1K17J81J02o06J67M53
3737C69m54J04K20m34N43m18M30j23l50J7J38K4j70J63l92M16l95K35L89n86N39
3758B65j00o8q6L50l22p4j11kJ18J42j33K51j1k26K07j06k40j1j08L03M4j10p5
3781a03J6P3o4J98m6O8j80Q6j03L47M1n49L95k71J28K05k44q9L98o08J90J0J38
3804C6J41o8j9Q9j55q6j54L41j9k97M56l16K30k4k16j95L48l43J90ll04M98j36
$$ plain form
3827 -6 267 151 110 122 151 82 304 -39 99 -45 28 -57 -117 69 -169 55 283 -208 56 -1 -44 -453 -518 89
3851 89 18 212 -128 24 51 -119 61 23 -96 217 -79 -49 283 -195 -206 -90 -26 177 44 -56 97 187 80
3874 80 -163 -163 112 -108 408 -117 194 -232 173 205 -11 62 22 138 94 171 -182 78 -117 61 -132 -24 108
3897 108 28 203 292 88 -218 67 -235 -252 -255 17 214 -14 -354 158 -367 -31 317 100 -47 -100 241 34
3919 34 -68 -38 258 -60 -395 -141 -34 -74 -128 -132 -50 152 -59 317 136 2 -93 61 -218 41 93 -67 -64 -64
3943 -64 232 92 256 236 -113 271 208 8 89 161 467 149 -54 73 -82 104 237 -29 32 92 145 185 -166
3966 -166 231 3 206 137 165 -205 -184 -84 -240 163 -78 380 228 -176 -107 44 -68 73 144 380 -99 174
3988 174 29 -134 -77 -29 147 66 -228 -250 112 345 55 -18 48 -139 247 54 128 194 70 58 -39 299 5
$$ packed form
3827fK73j16m1J2K9o9K22l43J38j44P3q5o0J86k38K24K28m91K64n7m3m09o5O07
3851H9p1J94l40J52K7j70J80l8j19L13k96L0L32m78j1J16O4K03j33j00J53R0j07
3874H0k43%K75k20N16n25L11m26M05L2k16P3m0J16m4P7l53K60j95J78j93J08J32
3897A08q0J75Q9k04l06K85l02j7lK72J97k28l40N12n25L36L48k17j47n3L41k07
3919C4j02L0K96l18l35K54J07m0n4mQ2K02k11L76j81j34r5J54k79K59N2j60L%
3943f4K96j40J64k0l49L84o3k00Q1P2L06l18k03J27j55J86J33k66O1O0N3M0l51
3966a66L97k28K03o9K8l70K1J00j56M03k41M58j52m04O9J51j12J41P1K36m79K73
3988A74j45j63N7M8J76q1k94k2L62K33k90p3O6j87L86j93P4O6j24j2r7L38k94
$$ plain form
4011 5 33 -39 -241 191 174 -36 2 -44 84 -147 46 -120 205 275 -154 11 -90 94 -44 191 185 -95 49
4034 49 155 118 56 99 228 134 -82 -169 -286 226 -55 -345 20 -15 -52 81 -136 -400 50 93 55 184 165 -172
4058 -172 -129 -197 -242 180 -197 -41 195 -27 230 -278 74 -228 252 50 445 18 -50 284 168 -80 67
4079 67 106 -221 406 183 161 -76 167 30 10 -221 -2 24 152 -67 -52 90 192 197 81 -37 148 -368 -284
4102 -284 303 170 64 -29 182 -119 -26 5 0 -52 -151 18 -4 198 167 -49 -57 -118 -21 -15 -144 -320 400 -3 193
4127 193 88 -231 78 278 33 -199 107 -271 -22 69 69 -1 -95 50 -23 11 -148 143 5 -91 -140 -52 -388
4150 -388 78 -109 232 -33 -273 202 -90 308 -78 -25 -149 13 -23 -41 -79 -248 425 142 147 360 340 287 -74
4173 -74 -54 -40 -204 108 51 -9 97 292 -146 255 435 176 168 -132 -33 13 -113 63 -78 -96 -131 12 35 -76
$$ packed form
4011EK8p2k02M32j7k10L8m6J28k31J93j66L25P0m29J65j01J84j38K35ok80J44
4034D9J06l7o2M3J29r4k16q7j17N12k81k90L65l5l7J33k17k64M50M3l8J29j9l37
4058a72M3o8m5M22l77J56K36k22K57n08L52l02M80k02L95m27o8L34j16k48J47
4079F7L9l27O27k23k2k37K43j37k0k31K19K6J28k19J5J42J02Nj16j18J85n16Q4
4102b84N87j33j06r3K11l01R3L1nn2r9J69k2K02l1k16qo1R7Oj29j76P20m03J96
4127A93j05l19L09K00k45k32L06l78K49R1%p0r4J45p3L4j59K91j38r6m9Q8l36
4150c88M66j87L41k65k40M75k92L98l86N3j24J62l6j8l8j69O73k83NK13k0n3l61
4173g4K0J4j64L12n7o0J06J95m38M01J80k59ql00R9M6j26J76j41j8l5J43K3j11
$$ plain form
4197 -76 14 -162 -58 -205 30 165 -26 -184 387 204 276 61 -195 42 90 88 -66 -100 94 183 -153 219 -170
4220 -170 -56 16 54 25 265 -23 198 -95 64 352 132 48 -332 24 78 -100 23 -128 137 53 100 -17
4242 -17 76 -86 -57 113 -71 250 6 -140 -128 67 -211 67 89 1 208 36 -322 65 93 -19 -94 -328 -34
4265 -34 -35 -21 -238 125 -176 147 -160 -65 -41 130 255 200 373 192 205 -60 -227 -323 275 415 -30 -82 208
4288 208 -77 132 -84 175 169 -249 17 80 67 219 -6 240 220 98 -10 330 -190 41 -41 -326 52 240
4310 240 -251 -44 -28 174 74 -53 83 -66 93 7 -40 -106 319 -128 -79 37 2 -116 -253 21 -64 140
4332 140 -105 262 416 -292 41 -316 -43 178 300 152 -105 -3 68 178 -385 -193 226 -165 286 -87
4352 -87 -301 -142 202 25 -2 327 141 255 -82 29 -236 361 71 -208 108 -165 142 0 338 127 204
$$ packed form
4197g6R0j76J04j47K35J35j91j58N71j83P2k15k56K37M8kj54l4J94Q9l36L72l89
4220a70J14P2L8k9K40k88K21k93J59K88k20q4l80L56N4j78J23j51K65q4M7j17
4242a7R3j62K9J70j84L21k44j46J2J95k78K78K2q8K07j72l58L87K8j12p5k34K94
4265c4jJ4k17L63l01L23l07R5K4J71J25n5J73j81J3k65j67r6N98J40m45n2K90
4288B08k85K09k16K59om18K66O3j3J52k25K46k0j22j08L40n20K31q2k85L78J88
4310B40m91K07J6K02j00j27J36j49J59q6m7o6M25m47M9J16l5j18j37K74q5K04
4332A40k45L67J54p08L33l57K73K21J22j48k57J02P1J10n63J92M19l91M51l73
4352h7k14J59L44j77k7L29j86J14l37J11k65N97k90k79L16k73L07j42L38k11P7
$$ plain form
4373 204 -48 -69 158 -187 -94 411 260 -198 102 -121 -33 101 175 -43 187 262 -70 -266 -147 24 -150 -192
4395 -192 371 -386 90 -87 -290 -6 90 -309 361 -18 -333 -15 -27 171 151 -65 179 12 125 21 61
4416 61 193 -218 27 66 -89 19 -62 335 81 -322 67 -254 17 -106 -134 -133 169 -136 215 -215 26 125
4438 125 -83 2 81 -31 108 -139 74 25 74 -74 -7 -154 -87 90 -300 176 274 370 -185 -159 442 -28 -381
4461 -381 -173 -151 65 212 -182 -221 197 -234 68 265 -95 6 -108 12 97 -68 214 -27 145 -245 -493
4482 -493 175 107 145 -58 -59 156 -134 -66 254 5 70 -168 28 15 176 307 -86 -153 122 -288 -81 -155 -77
4505 -77 -419 -25 99 52 -189 127 32 3 -122 202 151 -90 -50 47 -121 2 -190 -75 -83 -18 -214 75 -170
4528 -170 -207 119 65 210 -213 -157 254 67 -332 69 -128 -95 -33 201 -15 -357 193 128 -84 -95 -250 43
$$ packed form
4373B04k52k1K27l45R3N05j51m58L00k23Q8J34P4k18K30P5l32j96J19J71j74m2
4395a92N63p57M76j77k03K84R6l99O70l79l15L18j2J98k0k16K44j67J13j04M0
4416F1J32m11K45L9j55J08q1L97k54m03L89l21K71j23k8JL02l05L51m30K41R9
4438A25k08Q5P9j12J39k47K13m9M9j48O7j47O7J77l90M76R8R6n55K6O01m70l53
4461c81K08K2K16J47l94l9M18m31L02J97l60J01j14J20Q5j65K82k41J72l90k48
4482d93O68o8L8k03jK15k90O8L20k49O5k38J96j3J61J31l93o7K75m10K07p4P8
4505g7l42L94J24m7k41L16r5k9j25L24n1k41M0R7j68J23j92J15qO5j96K89k45
4528a70l7L26n4J45m23N6M11j87l99M01j97L3O2K34k16l42N50o5k12j1j55K93
$$ plain form
4550 43 250 17 100 -211 -405 -96 -10 -82 290 82 5 190 62 -82 -90 262 175 -364 -91 108 199 -45 211
4573 211 192 -202 -63 172 -148 -41 105 260 82 65 15 -33 -143 -296 259 122 -82 106 -146 -148 37 -282
4595 -282 91 262 -37 77 -232 -183 145 -18 51 58 -61 -88 92 94 -82 45 149 -39 183 -177 -160 -21 39
4618 39 356 -181 -365 275 381 62 -337 -19 213 48 105 61 -30 231 -203 83 -47 174 -277 -163 -132 -95
4640 -95 -53 22 -133 143 80 -16 -188 -89 204 108 91 451 226 -64 -444 -117 -2 20 153 -83 403 47 -25
4663 -25 323 71 -281 -8 -403 -10 -120 -135 -74 -76 144 -86 182 217 -52 70 112 249 -177 -119 209 323 88
4686 88 -71 18 66 -426 103 150 -141 45 68 482 -18 94 -210 13 -112 -13 129 -138 -59 -196 215 300 -98
4709 -98 -271 -379 29 -163 48 75 10 -43 -116 150 -85 -104 154 149 261 163 200 -28 -35 -233 177 148 -34 41 235
$$ packed form
4550D3K07k33Q3l11j94L09Q6p2L72k08p7J85j28j44qL52q7n39K73J99R1k44K56
4573B11j9l94J39K35l20J07J46J55j78j7n0m8j10j53N55j37k04J88k52kJ85l19
4595b82L73J71k99J14l09M9L28j63O9Pj19k7J80Kj76J27J04j88K22l60J7J39O0
4618C9L17n37j84O40J06l19l99L18K32j65N7m4r1K61m34K86j30K21m51J14L1L7
4640i5M2P5j55K76o3r6j72R9K93r6j7L60k25k90l80L27J15K2J33k36M86l56p2
4663b5L48k52l52K73l95L93j10j5O1kK20k30K68L5k69J22M2J37m26N8L28J14k35
4686H8j59Q9M8m92N29M7k91J86K3M14n00J12l04K23j25R9J42k67P9j37M11Q5l98
4709i8j73j08M08j92K11K7o5n3p3K66k35j9K58nJ12r8L7k28pj98M10k9j82P5J94
$$ plain form
4734 235 85 53 73 82 6 -46 86 -193 -201 -129 37 91 186 327 28 -112 110 -53 19 -73 -22 189 134 237 136
4759 136 -464 367 -157 -57 -80 66 169 65 90 65 -55 118 -38 -319 -217 155 -210 -227 316 85 -35
4780 -35 49 -155 -129 -153 -312 -46 -160 6 271 -7 -150 -181 63 7 45 -9 -141 -193 -41 174 -114 97 223
4803 223 186 -151 -112 228 -117 -130 383 -6 -143 13 181 -44 13 272 184 -177 140 -261 -152 27 47 63
4825 63 250 -194 85 88 114 167 74 -186 -319 219 61 47 -203 -81 -274 4 -376 -67 -103 196 234 121 466
4848 466 -3 33 37 242 191 -81 173 -80 -97 -95 -124 -88 -30 -117 -388 -176 -343 271 146 196 98 -93 -45 21 13 -57
4874 -57 68 -85 -56 -329 64 -95 18 -107 260 -117 104 -11 127 -75 12 71 -13 25 44 139 -166 113 -43
4897 -43 37 -290 -156 -84 129 -37 -161 26 -25 185 -101 273 50 -91 -121 271 86 -56 186 -347 -47 -123
$$ packed form
4734B35j50l2K0Rp6n2J32k79qP2J66N4R5J41k99j40K22j63P2r2N1K11n5J03j01
4759A36o00Q31n24J00k3J46J03j04K5k5j20J73j56k81J02L72l65j7N43k31j20
4780c5Q4k04K6k4j59K66j14J66K65k78j43l1K44n6L8n4j32n2J52K15k88K11J26
4803B23l7l37L9L40l45j3N13l89j37J56J68k25N7K59q8l61L17m01J09J79K0J6
4825F3J87m44K79LK6N3r3k60j33N38j58j4k50J22j93K78l80L09l6K99L8j13L45
4848D66m69L6MK05n1k72K54k53j7Kk9L6N8q7k71K12j67O14j25N0r8j91M8O6qp0
4874e7J25j53K9k73L93j59J13j25L67l77K21j15J38k02Q7N9q4L8J9R5l05K79j56
4897d3Q0l27J34P2K13j66j24J87n1K10k86L74k23j41l0L92j85j42K42n33L00p6
$$ plain form
4919 -123 83 -65 117 139 -77 -72 197 279 -108 126 -299 -261 310 182 14 116 171 -195 -83 -59 -28 114 185
4942 185 6 121 -164 -82 -4 -82 -202 3 -91 16 -38 -132 -35 -118 146 16 275 260 -297 -1 -227 172 124
4965 124 229 51 69 48 -95 191 223 8 20 484 37 -45 190 -72 -98 -40 -145 -149 148 177 -86 -97 145 36
4989 36 -158 -212 39 15 106 -135 95 -29 288 100 -41 -252 -151 146 170 -305 -253 -122 -46 167 -53 -209
5011 -209 -285 141 32 217 138 93 -167 -262 -65 91 135 93 56 -140 -152 26 15 58 40 -111 -141 -202 62 130 27
5036 27 30 -14 -205 -102 87 110 33 138 -93 -162 145 -43 289 -135 132 -263 -3 -127 -94 -94 329 -308 120
5059 120 154 223 -157 -119 392 -1 398 238 -233 -103 -260 276 221 -287 -59 148 95 -165 -199 -174 119 225
5081 225 -216 -315 157 184 97 204 -139 147 63 375 321 -120 -380 -41 49 137 -387 237 11 -33 96 -102 111
$$ packed form
4919a23K06j48J82K2k16NK69Q2l87K34m25L8N71j28j68J02N5l66J12K4L1J42P1
4942A85j79J15k85Q2P8p8j20K05r4J07n4r4R7q3K64j30K59j5n57K96k26L99m8
4965A24J05j78J8k1j43K86L2k15J2M64m47q2K35k62k6N8j05mK97K9k63j1K42j09
4989C6j94n4K51k4R1k41K30j24L17j88j41k11J01K97K4m75N2J31P6K13k20j56
5011b09p6M26j09J85p9m5k60r5J97J56M4m2l7j96j2J78j1M3j8j51l0o1K64O8j03
5036B7Lm4j91J03J89K3p7J05k31o9L07j88L32m24K67l95K60j24L3%M23o37M28
5059A20L4O9l80L8N11l93L99j60m71J30j57N36n5n08K28K07n3k60l4K5K93J06
5081B25m41r9M72K7q7J07l43K86q4L12n4m41k60L39R0Q8n24O24k26m4J29j98K13
$$ plain form
5104 111 3 243 83 -255 -108 99 -279 305 -110 -49 292 111 -188 44 107 317 4 34 -158 2 326
5125 326 -201 27 77 -130 -86 16 -230 -151 280 -28 161 -190 143 -297 -371 338 241 89 43 -31 -98 136 -192
5148 -192 35 5 -134 -150 165 -45 -28 178 -145 124 150 2 -61 187 -68 -282 -41 -237 193 -153 -126 -149
5170 -149 89 2 -82 169 -187 60 77 64 -104 -122 -22 61 -199 -229 59 90 -83 -65 14 -245 -69 -10 36 181
5194 181 -126 -299 -242 -240 -326 169 -40 69 -76 -106 -77 -36 -217 121 314 -236 -27 233 292 -670 -42 36 -139
5217 -139 323 92 -86 190 -28 -141 -145 -331 -95 21 -322 -175 -50 24 -141 -27 -107 76 -128 146 -8
5238 -8 -72 99 168 -49 316 131 -233 149 -184 69 174 86 -176 -44 320 64 178 -38 -148 168 -79 102
5260 102 -23 185 -5 -58 -85 22 130 -132 -17 -186 -120 -371 101 109 70 38 -221 71 -140 -307 148 71 68
$$ packed form
5104A11j08K40j60l38J47K07l78N84m15O1L41j81k99K32O3K10l13L0j92J60L24
5125C26n27K28N0k07M4J02k46P9M31l08J89l51L33m40p4P09r7j52m6p4o7K34l28
5148a92K27l0j39j6L15k10J7K06l23K69K6j48o3K48k55k14K41j96M30l46K7k3
5170a49K38q7q4K51l56K47J7j3j68j8J00Q3k60l0K88L1j73J8P9k59J76N9M6J45
5194A81l07j73N7Kq6M95k09J09j45l0K9M1j81L38J93n50K09K60N9r62O28P8j75
5217a39M62k31j78K76k18j13mj86K36J16l43J47J25P4j65J14q0J83k04K74j54
5238ho4J71O9k17L65j85l64L82l33K53J05q8k62J32L64k56J14k16j10L16k47J81
5260A02j25K08j90n3k7J07J08k62J15j69O6k51M72Ql9l2k59K92k11j67M55p7l
$$ plain form
5283 68 55 514 -116 -81 -297 -356 37 37 -20 -115 309 -128 -103 -344 -407 47 -111 -25 -166 -114 163 -49 -99 84
5307 84 -121 -41 42 -8 -148 -234 -69 151 168 47 -242 53 55 -44 95 8 61 -2 149 194 320 -211 -135 167 27
5332 27 19 164 -5 28 -22 50 137 -121 314 49 195 -276 -114 49 -23 -379 70 -69 81 264 -222 -24 -102
5355 -102 243 -251 28 52 -86 -140 -10 186 116 7 21 -42 -184 -18 -129 253 133 51 84 -236 277 91
5377 91 13 -115 30 210 -332 43 77 221 304 73 397 -35 -187 42 283 -11 -190 268 -198 -25 -289
5398 -289 -170 -175 152 169 -186 -246 233 -325 67 -41 -50 -161 62 -144 355 124 -323 -149 -221 42 12 20 -196
5421 -196 369 95 379 -235 168 167 57 103 95 295 57 -35 133 125 60 86 -219 -31 -81 28 -48 -237 -31 0
5445 0 -61 253 38 66 -295 -15 18 -78 32 -114 42 285 370 -208 -98 -327 280 156 52 -70 133 -42
$$ packed form
5283F8j3M59o30L5k16n9L93%n7r5M24m37K5k41o3M54j58Q6j41N2K77k12n0J83
5307H4k05Q0Q3n0j40q6J65K20J7j21k89K95Kr9J39q7N3o3J51M5J26n31P6L02j40
5332B7qJ45j69L3n0P2Q7k58M35k65J46m71J62J63p2l56M49j39J50J83m86J98p8
5355a02L45m94K79K4j38n4J30J96p0j09J4o3j42J66j11L82j20q2L3l20N13j86
5377I1p8j28J45J80n42L75L4J44Q3k31L24m32j52K29K41k94j79M58m66J73k64
5398b89J19nL27J7l55o0M79n58L92j08rj11K23k06M99k31m47J74p2K63l0Qk16
5421a96N65k74K84o14M03jj10M6qK00k38r2J68qo5K6l05J88n0J09p6j89K06L1
5445@o1L14k15K8l61K80L3r6J10j46J56K43Q5n78J10k29O07j24j04j22K03j75
$$ plain form
5467 -42 -133 -108 117 -229 -62 99 74 -25 -74 -114 38 -122 41 84 -90 251 186 89 -118 134 155 125 -77 -175
5491 -175 -98 -27 -131 56 294 262 -169 86 58 187 -320 -118 -202 -100 130 -112 160 -8 213 245 -371 187
5513 187 25 -97 -198 94 -52 -93 -47 10 -4 362 37 36 -306 -237 -305 -156 66 92 -13 61 -169 -79 186 -261
5537 -261 3 -239 98 -9 -2 -73 31 -152 -174 191 11 307 -74 42 -17 -79 -89 -63 30 84 103 -185 90 -239
5561 -239 109 -18 79 100 329 145 -434 116 -291 149 -225 44 26 22 -67 -18 -104 58 201 78 242 -205 11
5584 11 5 5 -39 22 124 67 -188 112 101 98 186 -40 115 278 199 37 -23 -129 230 174 -388 -207 -330 13 -117
5609 -117 -400 -180 -118 -82 27 -35 53 -24 163 -6 -277 224 -39 -321 -207 -23 -348 -209 64 -265 107 -65
5631 -65 208 -300 -118 187 237 -1 136 74 -93 53 48 109 -19 44 142 44 94 237 -23 44 187 -234 79 -174
$$ packed form
5467d2r1K5K25l46J67J61k5r9m9m0J52j60J63M3j74L41o5r7k07K52K1l0k02r8
5491a75P7P1j04J87K38l2m31K55k8J29n07K02q4J02K30k42K72j68K21L2o16N58
5513A87j62j22j01K92j46m1M6N7j4L66l25jl42O9o8J49K22K6j05P4k30R0K65m47
5537b61K64k42L37j07Pp1J04j83k2L65j80K96l81J16n9o2j0K6R3N4J9k88K75l29
5561b39L48j27R7K1K29j84n79N50m07M40l74K69j8mq9M9q6J62J43j23J64m47K16
5584A1o%m4O1J02n7k55L00j1lQ8k26J55J63p9j62o0j06L59n6n62J81j23L43j30
5609a17k83K20O2L6J09o2Q8p7J87j69k71N01k63k82J14J84l25J39K73l29L72j72
5631f5K73n08J82L05N0k38J37o2j67J46nO1j28O3R8r8N0J43k60O7J43m21L13k53
$$ plain form
5655 -174 -1 18 -45 99 268 181 23 74 127 137 -32 65 -109 60 -107 -16 -206 -49 -33 -244 45 71 -23 -70
5679 -70 -38 392 190 235 -221 274 144 -245 -90 -74 -150 24 -250 -44 20 -51 63 99 -4 -300 -18 -300 159
5702 159 227 -83 -149 -126 154 -190 -193 122 144 15 -313 42 32 -239 -442 52 2 235 110 -103 307 258 -308
5725 -308 -213 53 55 -409 71 -217 -138 -251 176 -220 331 62 225 -11 175 65 -115 28 -24 86 28 167
5747 167 147 94 -115 -87 -4 -113 85 -181 154 -182 -108 48 78 113 -157 -88 233 32 5 -245 -20 51 -134
5770 -134 83 -31 11 -22 -102 197 89 -46 24 -85 192 -105 67 217 -202 -27 123 -95 -39 -61 -261 -353
5792 -353 -316 299 -29 37 189 -260 -29 -33 3 71 -26 32 48 171 -29 -46 97 -255 251 -36 -20 288 87 369
5816 369 -84 -223 79 -198 157 197 -287 -397 290 98 99 -12 218 -65 -3 -142 -214 -112 52 118 40 -278
$$ packed form
5655a74J73J9o3J44J69q7j58N1N3J0j69R7j74J69j67R1j90J57J6k11K89K6r4m7
5679g0L2M30k02M5m56M95j30l89J55J6p6J74k74K06O4p1J14L6j03k96K82k82M59
5702A59O8l10o6K3K80l44lL15K2j29l28L55j0k71k03M94n0K33j25k13M10m9n66
5725c08R5K66Km64M80k88P9j13M27l96N51k69J63k36J86j10j80J43n2J10n8J39
5747A67k0n3k09K8Q3j09J98k66L35l36P4J56L0L5k70O9L21k01k7k50K25P1j85
5770a34K17j14M2l3q0K99j08j35P0j09K77k97J72J50m19J75J50k18N6k2k00r2
5792c53L7O15l28O6J52m49K31mL6O8r7N8J6J23k00j7J43l52N06k87J6L08k01K82
5816C69m53j39L02k77L55M0m84j10O87j92Jj11K30k83O2j39p2J02J64O6p8l18
$$ plain form
5838 -278 181 -10 -131 48 -344 -180 72 0 73 116 100 -89 286 277 93 -115 78 10 -304 -137 -108 -73 -12
$$ packed form
5838b78M59j91j21J79l92J64K52p2P3M3j6j89L75rj84k08J93o8l14J67K9L5O1
$$ [...]
8191C22
##END NTUPLES=NMR FID
##END=
