##TITLE=1H_102-2025
 200.13MHz, CDCl3,
 8 sc
 
 15.8.2025
##JCAMPDX= 6.0         $$ Bruker NMR JCAMP-DX V2.0
##DATA TYPE= NMR FID
##DATA CLASS= NTUPLES
##ORIGIN= UXNMR, Bruker Analytische Messtechnik GmbH
##OWNER= pz
$$ XWIN-NMR		Version 3.5
$$ Fri Aug 15 13:52:00 2025 Russian Standard Time (UT+4h)  she@DPX200
##.OBSERVE FREQUENCY= 200.1313
##.OBSERVE NUCLEUS= ^1H
##.DELAY= (6, 6)
##.ACQUISITION MODE= SIMULTANEOUS
##.ACQUISITION SCHEME= undefined
##.AVERAGES= 8
##.DIGITISER RES= 18
##SPECTROMETER/DATA SYSTEM= spect
##.PULSE SEQUENCE= zg30
##.SOLVENT NAME= CDCl3
##.SHIFT REFERENCE= (INTERNAL, CDCl3, 0, 14.3821)
##AUDIT TRAIL= $$ (NUMBER, WHEN, WHO, WHERE, WHAT)
$$ ##TITLE= Audit trail, XWIN-NMR		Version 3.5
$$ ##JCAMPDX= 5.01
$$ ##ORIGIN= Bruker BioSpin GmbH
$$ ##OWNER= she
$$ F:/spectra/data/she/nmr/H-C/1/audita.txt
$$ ##AUDIT TRAIL=  $$ (NUMBER, WHEN, WHO, WHERE, WHAT)
(   1,<2025-08-15 13:50:43.56 +0400>,<she>,<DPX200>,
      <created by zg, POWCHK disabled, PULCHK disabled
       configuration hash MD5:
       00 E9 B6 7A A2 85 ED C7 34 08 36 98 17 FE 4E 26
       data hash MD5: 16K
       FD 6C 75 6A 6D 7F D7 37 5B 12 80 69 38 F2 65 66>)
$$ ##END=
$$ 
$$ hash MD5
$$ E8 F8 C4 83 9E D3 45 FF 1B E2 DE 4F 4C E4 AB 8E
##$RELAX= 
##$RELAX= 
##$RELAX= 
##$RELAX= 
##$RELAX= 
##$RELAX= 
$$ Bruker specific parameters
$$ --------------------------
##$DU= <F:/spectra>
##$EXPNO= 1
##$NAME= <H-C>
##$PROCNO= 1
##$TYPE= <nmr>
##$USER= <she>
##$AMP= (0..31)
100 100 100 100 100 100 100 100 100 100 100 100 100 100 100 100 100 100 
100 100 100 100 100 100 100 100 100 100 100 100 100 100 
##$AQSEQ= 0
##$AQ_mod= 1
##$AUNM= <au_zg>
##$AUTOPOS= <>
##$BF1= 200.13
##$BF2= 200.13
##$BF3= 200.13
##$BF4= 200.13
##$BF5= 200.13
##$BF6= 200.13
##$BF7= 200.13
##$BF8= 200.13
##$BYTORDA= 1
##$CFDGTYP= 0
##$CFRGTYP= 5
##$CHEMSTR= <none>
##$CNST= (0..31)
1 1 145 1 1 1 1 1 1 1 1 1 1 1 1 1 1 1 1 1 1 1 1 1 1 1 1 1 1 1 1 1 
##$CPDPRG= <>
##$CPDPRG1= <>
##$CPDPRG2= <>
##$CPDPRG3= <>
##$CPDPRG4= <mlev>
##$CPDPRG5= <mlev>
##$CPDPRG6= <mlev>
##$CPDPRG7= <mlev>
##$CPDPRG8= <mlev>
##$CPDPRGB= <>
##$CPDPRGT= <>
##$D= (0..31)
0 0.7 0 0 0 0 0 0 0 0 0 0.03 0 0 0 0 0 0 0 0 0 0 0 0 0 0 0 0 0 0 0 0 
##$DATE= 1755251442
##$DBL= (0..7)
120 120 120 120 120 120 120 120 
##$DBP= (0..7)
150 150 150 150 150 150 150 150 
##$DBP07= 0
##$DBPNAM0= <>
##$DBPNAM1= <>
##$DBPNAM2= <>
##$DBPNAM3= <>
##$DBPNAM4= <>
##$DBPNAM5= <>
##$DBPNAM6= <>
##$DBPNAM7= <>
##$DBPOAL= (0..7)
0.5 0.5 0.5 0.5 0.5 0.5 0.5 0.5 
##$DBPOFFS= (0..7)
0 0 0 0 0 0 0 0 
##$DE= 6
##$DECBNUC= <off>
##$DECIM= 32
##$DECNUC= <off>
##$DECSTAT= 4
##$DIGMOD= 1
##$DIGTYP= 9
##$DL= (0..7)
0 120 120 120 120 120 120 120 
##$DP= (0..7)
150 150 150 150 150 150 150 150 
##$DP07= 0
##$DPNAME0= <>
##$DPNAME1= <>
##$DPNAME2= <>
##$DPNAME3= <>
##$DPNAME4= <>
##$DPNAME5= <>
##$DPNAME6= <>
##$DPNAME7= <>
##$DPOAL= (0..7)
0.5 0.5 0.5 0.5 0.5 0.5 0.5 0.5 
##$DPOFFS= (0..7)
0 0 0 0 0 0 0 0 
##$DQDMODE= 0
##$DR= 18
##$DS= 0
##$DSLIST= <SSSSSSSSSSSSSSS>
$$ [...]
##$SUBNAM0= <"">
##$SUBNAM1= <"">
##$SUBNAM2= <"">
##$SUBNAM3= <"">
##$SUBNAM4= <"">
##$SUBNAM5= <"">
##$SUBNAM6= <"">
##$SUBNAM7= <"">
##$SUBNAM8= <"">
##$SUBNAM9= <"">
##$SW= 18.0517328524113
##$SWIBOX= (0..15)
0 0 2 0 0 0 0 0 0 0 0 0 0 0 0 0 
##$SW_h= 3612.71676300578
##$TD= 16384
##$TD0= 1
##$TE= 0
##$TE2= 300
##$TE3= 300
##$TEG= 300
##$TL= (0..7)
0 120 120 120 120 120 120 120 
##$TP= (0..7)
150 150 150 150 150 150 150 150 
##$TP07= 0
##$TPNAME0= <>
##$TPNAME1= <>
##$TPNAME2= <>
##$TPNAME3= <>
##$TPNAME4= <>
##$TPNAME5= <>
##$TPNAME6= <>
##$TPNAME7= <>
##$TPOAL= (0..7)
0.5 0.5 0.5 0.5 0.5 0.5 0.5 0.5 
##$TPOFFS= (0..7)
0 0 0 0 0 0 0 0 
##$TUNHIN= 0
##$TUNHOUT= 0
##$TUNXOUT= 0
##$USERA1= <user>
##$USERA2= <user>
##$USERA3= <user>
##$USERA4= <user>
##$USERA5= <user>
##$V9= 5
##$VALIST= <valist>
##$VCLIST= <CCCCCCCCCCCCCCC>
##$VD= 0
##$VDLIST= <DDDDDDDDDDDDDDD>
##$VPLIST= <PPPPPPPPPPPPPPP>
##$VTLIST= <TTTTTTTTTTTTTTT>
##$WBST= 1024
##$WBSW= 4
##$XGAIN= (0..3)
0 0 0 0 
##$XL= 0
##$YL= 0
##$YMAX_a= 578277
##$YMIN_a= -935294
##$ZGOPTNS= <>
##$ZL1= 120
##$ZL2= 120
##$ZL3= 120
##$ZL4= 120
##$ABSF1= 10
##$ABSF2= 0
##$ABSG= 5
##$ABSL= 3
##$ALPHA= 0
##$AQORDER= 0
##$ASSFAC= 0
##$ASSFACI= 0
##$ASSFACX= 0
##$ASSWID= 0
##$AUNMP= <proc_1d>
##$AZFE= 0.1
##$AZFW= 0.1
##$BCFW= 1
##$BC_mod= 2
##$BYTORDP= 1
##$COROFFS= 0
##$CY= -3
##$DATMOD= 1
##$DC= 2
##$DFILT= <>
##$DTYPP= 0
##$F1P= 0
##$F2P= 0
##$FCOR= 0.5
##$FTSIZE= 0
##$FT_mod= 4
##$GAMMA= 1
##$GB= 0.15
##$INTBC= 1
##$INTSCL= 1
##$ISEN= 128
##$LB= 0.25
##$LEV0= 0
##$LPBIN= 0
##$MAXI= 10000
##$MC2= 0
##$MEAN= 0
##$ME_mod= 0
##$MI= 1.114404
##$NCOEF= 0
##$NC_proc= 0
##$NLEV= 6
##$NOISF1= 3.799351
##$NOISF2= 2.8
##$NSP= 1
##$NTH_PI= 0
##$NZP= 0
##$OFFSET= 14.38212
##$PC= 1
##$PHC0= -1558.662
##$PHC1= 10.19228
##$PH_mod= 1
##$PKNL= yes
##$PPARMOD= 0
##$PSCAL= 0
##$PSIGN= 0
##$REVERSE= no
##$SF= 200.129724274929
##$SI= 16384
##$SIGF1= 3
##$SIGF2= 2
##$SINO= 400
##$SIOLD= 16384
##$SREGLST= <1H.CDCl3>
##$SSB= 0
##$STSI= 0
##$STSR= 0
##$SW_p= 3205.1282051282
##$SYMM= 0
##$S_DEV= 0
##$TDeff= 0
##$TDoff= 0
##$TI= <>
##$TILT= no
##$TM1= 0
##$TM2= 0
##$TOPLEV= 0
##$USERP1= <user>
##$USERP2= <user>
##$USERP3= <user>
##$USERP4= <user>
##$USERP5= <user>
##$WDW= 1
##$XDIM= 8192
##$YMAX_p= 0
##$YMIN_p= 0
$$ End of Bruker specific parameters
$$ ---------------------------------
##NTUPLES= NMR FID
##VAR_NAME=  TIME,          FID/REAL,        FID/IMAG
##SYMBOL=    X,             R,               I
##VAR_TYPE=  INDEPENDENT,   DEPENDENT,       DEPENDENT
##VAR_FORM=  AFFN,          ASDF,            ASDF
##VAR_DIM=   8192,          8192,            8192
##UNITS=     SECONDS,       ARBITRARY UNITS, ARBITRARY UNITS
##FACTOR=    0.0002768,     1,               1
##FIRST=     0,             0,               0
##LAST=      2.2672688,     0,               0
##MIN=       0,             -935294,         0
##MAX=       2.2672688,     578277,          0
$$ Real data points
##PAGE= N=1
##DATA TABLE= (X++(R..R)), XYDATA
0@%%%%%%Qq%%Qj6J6k2L0m0M8n6O4p4R5j15J34j57J83k12K46k83L24l71M26m85
$$ 0 0 0 0 0 0 0 8 0 0 0 8 -8 8 -14 16 -24 24 -32 32 -42 53 -62 72 -85 98 -114 132 -151 173 -198 228 -257
32b57N47o20P00p86Q81r84J100j229J365j513J676j854K049k260K491k745L025
$$ -257 290 -330 370 -416 465 -519 581 -648 717 -796 880 -974 1075 -1185 1306 -1439 1586
49A586l333L670m043M458m922N445o035O709p487Q401r487J0798j2427J4505j7255
$$ 1586 -1747 1923 -2120 2338 -2584 2861 -3174 3535 -3952 4449 -5038 5760 -6667 7838 -9417
64i417K1077k6739L5967n3424R7104l96725o03137J167303J82416p31962K60819
$$ -9417 11660 -15079 20888 -32536 64568 -332157 -935294 232009 414425 -317537 -56718
75e6718M82030m30056r1889N76516j14571o45295L56732N01528o06023l30442
$$ -56718 425312 -4744 -96633 479883 365312 -279983 76749 578277 -27746 -358188
85c58188N96681M2724m23916Q8643K36198q2096q9628O9836q9151k98837J59606
$$ -358188 238493 281217 -142699 -54056 182142 100046 10418 80254 -8897 -307734 -148128
96a48128M08882k39029l42541K48879J64438j27435J9220P9236k4582m7981K0042
$$ -148128 260754 21725 -320816 -71937 92501 -34934 -15714 63522 38940 -9041 11001
107A1001J1815r4707P3553J43227j70770l4770K26397q6900j09965Q8584j33031
$$ 11001 22816 -71891 1662 144889 -25881 -60651 165746 78846 -31119 57465 -75566
118g5566k1996K68411p3792l11087O1903K51537r5490k16274J85900J23356k82257
$$ -75566 -97562 170849 97057 -214030 -152127 99410 3920 -212354 -26454 96902 -185355
129a85355N3501K23342k76260l1288M15367j04950l49866J83300K76377j65855
$$ -185355 -131854 91488 -184772 -216060 199307 94357 -255509 -72209 204168 38313
139C8313k07758J90100J38877k04750N6779J99201k49845r5909L45129l687l07827
$$ 38313 -169445 20655 159532 -45218 11561 210762 -39083 -134992 210137 206450 -101377
150a01377K4508K23798m4411k43428N3468K09372j27923o7538J87642j23290j68704
$$ -101377 -76869 146929 102518 -140910 -87442 121930 -5993 -73531 114111 -9179 -177883
161a77883K15110Q6934j99792m4904J52317L9149j47083O317J64420o3308o3576
$$ -177883 37227 124161 -75631 -120535 31782 70931 -76152 -69835 94585 31277 -32299
172c2299J27419o4333q9902J24275q370r6961L3673M4894L3477k9264q6454K9791
$$ -32299 95120 30787 -59115 65160 56790 -40171 -6498 38396 71873 42609 -43845 -14054
184a4054M8170j1497j0228n5140J2356M3774q5296K0721Q6639q4908N586Q4818
$$ -14054 34116 22619 12391 -42749 -30393 13381 -71915 -51194 35445 -49463 -43877 40941
196D0941q6231l1419Q7803J3300n2400m7814P1865Q4657r9178k3986R8555n0613
$$ 40941 -45290 -76709 11094 24394 -28006 -75820 -3955 80702 -18476 -42462 56093 5480
208E480j6883Q4736m7349o5848J8205L3600J2288o8600P131R6340p6962o0729
$$ 5480 -11403 73333 25984 -39864 -21659 11941 24229 -44371 -37240 59100 -17862 -78591
220g8591J06270k0645o4285N5258P528l0602m923K1305N0014m5132l1052J00275
$$ -78591 27679 7034 -57251 -1993 5535 -25067 -29990 -8685 41329 -3803 -34855 65420
232F5420j1523o5512N7422L034l6274J3765j1078K5093l942o7711M7280K8226
$$ 65420 53897 -11615 45807 48841 12567 26332 15254 40347 36405 -31306 15974 44200
244D4200p2635K9335L3608m9249p418N188J2605q112n4019N2808L7398r4176L1167
$$ 44200 -28435 900 34508 -14741 -22159 -16971 -4366 -12478 -66497 -13689 23709 -70467 -39300
257c9300P5260o4558k352N0838j9218j3501K059L1919Q846p3092L4605P3986p4679
$$ -39300 35960 -28598 -30950 19888 670 -12831 -10772 21147 29993 -43099 -8494 65492 -9187
270i187q352O9406m0611j9966L2564j300q213l5471Q674M3238o0666j1814O8362
$$ -9187 -17539 51867 11256 -8710 23854 22554 14341 -21130 -12456 30782 -29884 -41698 26664
283B6664m5069k5021N2222j6730j0455J2253q602K1920j6268j5084N0195k4718
$$ 26664 -18405 -43426 8796 -7934 -18389 -6136 -14738 7182 -9086 -24170 26025 1307
295A307k3408N1882j6416j2420L3154k3475P122J5433l3485K1215P07m0397K8761
$$ 1307 -22101 29781 13365 945 34099 10624 17746 33179 -306 20909 21616 -18781 9980
308I980k876k6877K2110j8105j512K6908l6803J1277K8763m8269J1410L2806k9263
$$ 9980 7104 -19773 2337 -15768 -17280 9628 -27175 -15898 12865 -35404 -23994 8812 -20451
321b0451O196K537p536K6869j6986N108L3928m7011M168N7688l6036j5811K4761
$$ -20451 -14255 -11718 -19254 7615 -9371 -4263 29665 -17346 -13178 44510 8474 -7337 17424
334A7424j8171N724N556m096J8224l3322k230N5524l5906k3164M5130k8343k0001
$$ 17424 -747 4977 10533 6437 24661 -8661 -10891 44633 8727 -14437 30693 2350 -17651
347a7651K9186r257l758o399o883K9135k2667r409N3355l4169l2771N0613j2491
$$ -17651 11535 2278 -1480 -7879 -14762 14373 -8294 -17703 35652 1483 -31288 19325 6834
360F834j8936K7000j9144j2562J0647Q870K1105l2454j8814N1368k1200k3200
$$ 6834 -12102 14898 -4246 -16808 -6161 2709 23814 -8640 -27454 23914 2714 -20486
372b0486M5016l3812k9982M8467o827k4326J0839O165J0495j9214j601M5495l3512
$$ -20486 24530 -9282 -39264 9203 2376 -21950 -11111 -4946 5549 -13665 -15266 30229 -3283
385c283k3120N7060k9161l6226N6061m600m0737J5506K0018K196k9394k094M5275
$$ -3283 -26403 30657 1496 -34730 21331 16731 -24006 -8500 11518 13714 -15680 -17774 27501
398B7501l4255k9960N9930k2711m4947N4602J682m1685K0784K3339k905k2667
$$ 27501 -6754 -36714 23216 505 -44442 10160 11842 -29843 -9059 14280 11375 -11292
410a1292P58M1275k3401k5635N0599j7393l0442N1577j4487m1784L9044J8036
$$ -11292 -10534 30741 7340 -18295 32304 14911 -15531 36046 21559 -20225 18819 36855
422C6855j7357j2745q282K2106r44j3156J4736l2116n312N7977l6039m3029M8210
$$ 36855 19498 6753 -1529 20577 19633 6477 21213 -10903 -16215 41762 5723 -37306 10904
435A0904o125k8063K6963k384k2510j781J5591P000m0712J6782O6066o2014m8083
$$ 10904 4779 -23284 3679 1295 -21215 -22996 -7405 -405 -41117 -24335 41731 -20283 -68366
448f8366Q6763N117n6646L1995J7800l4662J098L9322p1o5102J8863Q6205o1811
$$ -68366 18397 23514 -33132 -1137 16663 -17999 -16901 22421 22350 -42752 -23889 62316 505
461E05o2238Q9588J899q1506L4902M1409l6149j2882L0959j153n3776K7391Q8514
$$ 505 -61733 27855 29754 -51752 -16850 24559 -11590 -24472 6487 5334 -48442 -21051 67463
474F7463n9386p7713Q2563L3488n8482P892J3835r896K1136J5543j2196l4039
$$ 67463 8077 -69636 12927 46415 -12067 -4175 9660 -236 20900 36443 24247 -9792
486i792N156O0028j8874n5275K9783J3838j5918R264k8765r11N4931j4137m2721
$$ -9792 -4636 55392 36518 -18757 11026 24864 8946 18210 -10555 -11466 43465 29328 -13393
499a3393K470Q888J1539q164j9433J497o758K9573K9226p9535j7059J04019j0370
$$ -13393 -10923 -2035 9504 1340 -18093 -16596 -23354 6219 35445 -44090 -61149 42870 32500
512C2500p5366K6807K5693l5906n020M7348N71o4141L6077P5933q8364m7122J21007
$$ 32500 -42866 -16059 9634 -26272 -31292 16056 16627 -47514 -11437 64496 -23868 -70990 50017
525E0017r093j11999M5563P5193n4057m8849N3369K6767o1904K5067Q0332q7875
$$ 50017 40924 -71075 -25512 49681 -4376 -53225 144 26911 -34993 -9926 70406 -17469
537a7469o9186J18931K0424j03467K8232P3515l6570m9189L5776L9728m2664j0026
$$ -17469 -86655 32276 52700 -50767 -22535 50980 14410 -34779 997 40725 -1939 -11965
549a1965N4888m4055m7096Q5722J5683q7011N418O2070J2759l1657l3991Q102
$$ -11965 42923 -1132 -48228 37494 53177 -33834 -28416 33654 46413 14756 -19235 -11133
561a1133J3456O528K1609k6961l0266M1336Q347k8176Q101m425O380K2611m1675
$$ -11133 2323 8851 30460 3499 -26767 14569 22916 -5260 2841 -1584 4796 27407 -14268
574a4268k9474M3872K2764k7024k6663K3433L4410l0630j3423K4841m4615k72
$$ -14268 -43742 130 22894 -4130 -30793 -7360 27050 -3580 -17003 7838 -36777 -37049
586c7049Q6045l0902q4259M5580N8692m0173l3397N0949K2653p0659P56O9717
$$ -37049 48996 18094 -66165 -20585 38107 -2066 -35463 15486 38139 -32520 -31764 37953
598C7953n1915m0337R3517k224q8092L8167O8089m6381n5625M5935M7282n6842
$$ 37953 -13962 -54299 39218 36994 -51098 -12931 55158 8777 -46848 -913 46369 -10473
610a0473j9072O4802l2783n2102P2929J9768o9652J3148M7865k7291m7448K4739
$$ -10473 -29545 35257 2474 -49628 23301 43069 -26583 -13435 34430 7139 -40309 -15570
622a5570N1559l1001l5290M5336k710l8698M0160J2475m4212J1480L0130r240
$$ -15570 35989 4988 -30302 15034 12324 -26374 13786 26261 -17951 -6471 23659 14419
634A4419k3190l759K8315N005k0039J1142j765j1945J7829j6456j9339L2977k87
$$ 14419 -8771 -12530 15785 20790 751 11893 10128 -1817 16012 -444 -19783 13194 12907
647A2907k0722J2119j0096j1700K0420Q148j3786j7953J1493K3355l3315j2901
$$ 12907 -7815 4304 -5792 -17492 2928 11076 -2710 -20663 -9170 14185 -19130 -32031
659c2031M8292j2026l2174L4633M235l1199J1778K0131j0738k0942J6895L3073
$$ -32031 16261 4235 -27939 6694 10929 -20270 -8492 11639 901 -20041 -3146 29927
671B9927l6451k7906N3074K949m0840K5039J7515k9997o242J9696P168k2587m176
$$ 29927 -6524 -34430 18644 21593 -19247 5792 23307 -6690 -12932 6764 13932 -8655 -12831
684a2831L6684j7057l9175L8160J7952l7900O388J8928r923n301K772Q309p328
$$ -12831 23853 6796 -32379 5781 23733 -14167 -7779 11149 1226 -4075 -1303 7006 -322
697c22j2916K6487N475l1515J1846J5024j5800L535K872j019N807j6362k9J5479
$$ -322 -13238 13249 18724 -12791 -945 14079 -1721 1814 4686 3667 9474 -6888 -6917 8562
711H562j5166k36J6365j1825p155L922M002P736j6417l006K4747j5854j2727K5914
$$ 8562 -6604 -6840 9525 -2300 -9455 -5533 -1531 6205 -10212 -13218 11529 -4325 -17052 8862
725H862n560j5412J1498P367N81j0325l554J9598j2344j5394K9960j789k7063
$$ 8862 3302 -12110 -612 6755 7336 -2989 -6543 13055 711 -14683 15277 13488 -13575
738a3575J3509J0153r140l241L746J1398j4530j6306L0029Jl1939J9227J3389
$$ -13575 -66 10087 947 -2294 1452 12850 -1680 -17986 12043 12044 -19895 -668 12721
751A2721k3486K698J4871k033j3076o426K3707J220k7835J8034J4166k8124N862
$$ 12721 -10765 -8067 6804 4771 -8305 -14731 8976 10196 -17639 395 14561 -13563 -7701
764g701K1926q260j0389j152J2908K522k0593J3176J5424l0415J417K7115j4089
$$ -7701 14225 5965 -4424 -5576 7332 9854 -10739 2437 17861 -12554 -11137 15978 1889
777A889j2862Q816M318k372j0026J0632J1312k6686R45K8859j6255j1447J8947
$$ 1889 -10973 -2157 2161 -211 -10237 395 11707 -14979 -14034 14825 -1430 -12877 6070
790F070k966p869K053O913P727j6804l954K3719j2053j3125K0713l938j4074P487
$$ 6070 3104 -4765 -2712 4201 11928 -4876 -8830 14889 2836 -10289 10424 6486 -7588 -101
804a01N619L210j0135p815J8708n430j5503J9702j975j9093J2250Q182n479l598
$$ -101 5518 8728 -1407 -9222 9486 4056 -11447 8255 6280 -12813 -563 7619 2140 -1458
818a458m133J0870j260j4271J5737K577k0796J1912R638j1110K315R85J136J920
$$ -1458 -5591 5279 4019 -10252 5485 8062 -12734 -822 8816 -2294 21 1006 2142 4062
832D062r981R320P203j9389N927J1717j3264K124N012n667K044o098L078J0565
$$ 4062 -5919 3401 10604 -8785 -2858 8859 -4405 -2281 2731 -2936 -892 -6990 -3912 6653
846F653j5484k424J3739r143r0Q011p693J674Q77j66J1580j0908q055J9633m368
$$ 6653 -8831 -11255 2484 -6659 -6749 1262 -6431 -4757 -3880 -4046 7534 -3374 -11429 8204 3836
861C836j0649J1428j077l781J962m33O886p570o924J9261q153j7303K1440L236
$$ 3836 -6813 4615 3538 -243 1719 1286 8172 602 -6322 12939 4786 -12517 8923 12159
875A2159j9375O227P507k509m631j457J0471p239j0167K1329m059k2293J9106
$$ 12159 -7216 -989 6518 4009 -622 -2079 8392 1153 -9014 12315 8256 -14037 5069
888E069Q821j9023K304Q399j577l842k578R521m457j0445J7107k365k1123J7216
$$ 5069 13890 -5133 -2829 5570 3993 151 -2427 7094 2637 -7808 9299 6934 -14189 3027
902C027Q375j9884K806P494l391q24l501K883j522m726J3998p250j9375K0830
$$ 3027 11402 -8482 -5676 1818 -1573 -2397 -5898 -3015 -4537 -9263 4735 -2515 -21890 -1060
916a060Q403k0239O210O687p635N850L844m122m078K668J4643q806j6519K1706
$$ -1060 7343 -12896 -6686 1 -7634 -1784 2060 -2062 -6140 -3472 11171 2365 -14154 7552
930G552M317k2119J1835Q252j3328O811N325j0401l108Q672J0802j3116j4340
$$ 7552 11869 -10250 1585 9837 -3491 3320 8645 -1756 -4864 3808 14610 1494 -12846
943a2846K1404L031k0198J3044M376j6888J1677Q450j5402j583R533L730j0749
$$ -12846 8558 11589 -8609 4435 8811 -8077 3600 12050 -3352 -4935 4598 8328 -2421
956b421n681J8816k602j9526J4010K627j4203J7537K919k4424N426J8417l367
$$ -2421 -8102 10714 8112 -11414 2596 5223 -8980 8557 11476 -12948 -7522 10895 7528
969G528j4206j321J6187m489j3211J5052n559j8072K5663N837l2440P042K4108
$$ 7528 -6678 -7999 8188 3699 -9512 5540 -19 -18091 7572 13409 -19031 -11989 12119
982A2119j0327j8173O908J7864q152j1038J6782q646j9036L2199R662l9296N049
$$ 12119 1792 -16381 -9473 8391 239 -10799 5983 -2663 -21699 10500 20162 -19134 -14085
995a4085L0158q486j8432N342J3461o879o730J7890r429k3663K7291J2949l3168
$$ -14085 16073 7587 -10845 -5503 7958 1079 -5651 12239 2810 -20853 6438 19387 -13781
1008a3781L587K5056q620j3727K623R510o20o089R549m836j5159J9120P897k4276
$$ -13781 -10194 14862 6242 -7485 -4862 4648 4028 -2061 7488 2652 -12507 6613 14510 -9766
1022i766N643J5595p006l296j901j692O260M76o90k929m024J1195k921j6182J3803
$$ -9766 -4123 11472 4466 1170 -731 -2423 3837 4313 3623 694 -3330 7865 4944 -11238 2565
1037B565O948j2833O931k124j3305J0986R147j1446q077Q602J3935j3910j6346
$$ 2565 9513 -3320 3611 1487 -11818 -832 8315 -3131 -11208 -2606 11329 -2581 -18927
1050a8927K0534L504j7529J6069L802k3645R253J9291j2926j3677J3721J7964
$$ -18927 1607 5111 -12418 3651 7453 -16192 -6939 12352 -574 -14251 -530 17434
1062A7434j6793j8622K2669M526k0771J5180R690k5062M633K0449j1140j5895
$$ 17434 641 -17981 4688 9214 -11557 3623 13313 -11749 -7116 13333 2193 -13702
1074a3702R284J9422r377j9831J5116O826j7853J0920J1147j7923K100J3584q018
$$ -13702 -4418 15004 5627 -14204 912 7738 -10115 805 11952 -5971 -3871 9713 1695
1087A695r122L411J2582N64j4985N326O893j0300N369N023j0398P783N090j0530
$$ 1695 -7427 -4016 8566 9130 -5855 -529 6364 -3936 1433 6456 -3942 3841 8931 -1599
1101a599L37R62M04O139m074k933J490k560M141m604p459J5987J007j7352P584
$$ -1599 -1262 -300 104 6243 2169 -764 726 -1834 2307 -2297 -9756 6231 7238 -10114 -2530
1116b530M609j0236N331O323m686l763K655P773q889r949J9919M454j9982P725
$$ -2530 2079 -8157 -2826 3497 -1189 -4952 -2297 5476 -3413 -13362 6557 11011 -8971 -1246
1130a246R502j3514M55Q975j067n140K90R609o100j5296J5791R693j7849L284
$$ -1246 8256 -5258 -4803 4172 3105 -2035 -1745 7864 1764 -13532 2259 11952 -5897 -2613
1144b613J0095q938k769M611J711m65l803O398J399j3662N084R735r205O75N960
$$ -2613 7482 -1456 -4225 386 2097 1632 -2171 4227 5626 -8036 -2952 6783 -2422 -1747 4213
1159D213m483O45k862j576P796l699k567O668n294k671M227j199K442j370k843
$$ 4213 -270 375 -2487 -4063 3733 34 -2533 4135 -1159 -3830 397 -802 1640 270 -2573
1174b573Q603n156j0865J1956K660r555N173L749m149l709M65Q546l983q171J3546
$$ -2573 6030 874 -9991 1965 4625 -4930 243 3992 -157 -3866 -3401 5145 1162 -7009 6537
1189F537J29j6565Q876R794r994k260P121K120o513n684J1012l20j4541J1435
$$ 6537 6666 -9899 -1023 8771 -1223 -3483 3638 5758 -755 -6439 4573 4253 -10288 1147
1203A147R417j6907n44J0556l461n038K392P191k613j1733Q907R003j4592K162
$$ 1147 10564 -6343 -6887 3669 208 -4830 -2438 4753 2140 -9593 -686 8317 -6275 -4113
1217d113J2928q036n487O068K530k800o210O166Q319j2462k045J2874q024o539
$$ -4113 8815 779 -4708 1360 3890 1090 -5120 1046 9365 -3097 -5142 7732 -292 -6831
1231f831R896J380m905l404K552O568q843k211J3812o903j0278J1020K018p790
$$ -6831 3065 4445 -460 -3864 -1312 5256 -3587 -5798 8014 1111 -9167 1853 3871 -3919
1245c919P9M173L268o388k766J1955n157j1283J2803M405j1973J962O073j690
$$ -3919 -3840 333 3601 -2787 -5553 6402 1245 -10038 2765 7170 -4803 -2841 3232 1542
1259A542m247O9J0214m308j1907J1862M940j4853L581R707o441m374L911O299
$$ 1542 -2705 -2636 7578 3270 -8637 3225 8165 -6688 -3107 6600 159 -4215 -304 5995
1273E995m620r103J0705N292j5440M315J1624j0579m052Q809K120m115m349O983
$$ 5995 1375 -7728 2977 8269 -7171 -2856 8768 -1811 -5863 2946 5066 951 -3398 3585
1287C585K721j2680M155J1231j1871l816J1037j847n268O23M322J039q803K789
$$ 3585 6306 -6374 -2219 9012 -2859 -6675 4362 2515 -2753 -2130 2192 3231 -5572 -2783
1301b783R282j0312m389J2196l128o172M852K168j355m145L10P935o336o287J0325
$$ -2783 6499 -3813 -8202 3994 866 -5306 -454 1714 359 -3786 -3476 4459 -1877 -8164 2161
1316B161p75p566O163K215k388j463K36O010l340p805R673K028j0765N865O598
$$ 2161 1386 -6180 -17 2198 -190 -1653 -1417 4593 1253 -6552 3121 5149 -5616 249 6847
1331F847o114k267K572M082l550p065R199J403j2776P125Q585j0617j299Q075
$$ 6847 733 -1534 1038 5120 1570 -5495 3704 5107 -7669 -544 8041 -2576 -3875 4200
1345D200j54n551j761P119K32j0637O908P518j2348J490J0102o174m471M401K404
$$ 4200 4046 -1505 -3266 3853 4085 -6552 356 7874 -4474 -2984 7118 944 -3527 874 3278
1360C278l018n231M783M787r060J311Q087o855j376O586l652k199J448M24J927
$$ 3278 260 -4971 -188 4599 -4461 -3150 4937 -1918 -3294 3292 -360 -2559 -1111 -687 1240
1375A240m179p23O335l149k309L501k342N72J781m633L429J637n458N067J447
$$ 1240 -2939 -3662 2673 -476 -2785 716 -1626 -1054 727 -3906 -477 1160 -4298 769 2216
1390B216n942L441L347k538k510j42O070j313q715P721M589j0407M050O791q585
$$ 2216 -3726 -285 3062 524 -1986 -2128 3942 2629 -6086 1635 6224 -4183 -133 6658 -1927
1405a927j088O993J99o404j956R400l87j1520P564P062j1928J666R164p343l564
$$ -1927 -3015 3978 4177 -2227 -4183 5217 4830 -6690 874 7936 -3992 -2326 6838 -505 -4069
1420d069O978J444o471k824R156R75j1917N217Q051r877O68P925p035k655O796
$$ -4069 2909 4353 -2118 -4942 4214 5189 -6728 -1511 6540 -3337 -2669 5256 -1779 -4434 2362
1435B362K33m507j607O013R12q261L591N276p867K270N763q400Q71P018m504l270
$$ 2362 2595 -1912 -3519 2494 3406 -4855 -1264 4012 -3855 -1585 4178 -4222 -3351 3667 -837 -4107
1451d107L142K407j003l942L349J105n808N909L393j0675M159Q972q174l454O616
$$ -4107 -965 1442 439 -3503 -154 951 -4857 1052 4445 -6230 -2071 6901 -1273 -4727 1889
1466A889O12l386q8L512j611n271P533J904j1996N729R927j0138l491P758l44
$$ 1889 2501 -885 -973 2539 928 -4343 3190 5094 -6902 -1173 8754 -1384 -4875 2883 2539
1481B539l981J665L129k782m180P492J121j1822O091R772j0736k561P650k688
$$ 2539 -1442 223 3352 570 -3610 3882 5003 -6819 -728 9044 -1692 -4253 3397 709
1495G09l338L513J265l546j320O387j282r707O889P326j0281m7P516n535j812
$$ 709 -2629 884 2149 -1397 -2717 3670 2388 -7319 -430 6896 -3385 -3432 4084 -1451 -3263
1510c263N942k030l813K292M865l623p284P356M966r997K618P323q500l07P518
$$ -3263 2679 649 -3164 -872 3993 370 -6914 442 5408 -4589 -1971 5352 -3148 -3455 4063
1525D063m221m304N057M530n059n705P296L081r716L835P595r315l64Q184n394
$$ 4063 -158 -4462 595 5125 66 -5639 1657 4738 -4978 -1143 6452 -2863 -3227 4957 -437
1540d37m923O084M021m791m754O233K791q559L194O712p809L37P239n831l689
$$ -437 -5360 724 4745 -46 -4800 1433 4224 -4335 -1141 5571 -2238 -1901 5338 -493 -4182
1555d182N681J979l359k129M094R99o421K966M127o688K394N667p256j766N673
$$ -4182 1499 3478 119 -2010 2084 3083 -3338 -372 3755 -2933 -539 5128 -2128 -3894 1779
1570A779o86k665J379J335j26k924J698J821n495M524M399p949l9O073l936j844
$$ 1779 1093 -1572 -193 1142 1016 -1908 -210 1611 -3884 640 5039 -2910 -2949 3124 -812 -2656
1586b656L718M67j948r07K203r2n324M931M944p912K39O512m929k311L891L96
$$ -2656 1062 1529 -419 -1326 877 785 -4539 392 5336 -2576 -2337 4175 -754 -3065 826 1222
1602A222q66p66J655m82m559L167M438n891Q8N826m296k269L239l36Q1L51K13
$$ 1222 356 -410 1245 763 -3796 -629 3809 -2082 -1994 3832 -464 -2733 506 170 251 602 815
1619H15P21l548J244L337l578N52L683l478n92J891k832J385K366k375N52k08
$$ 815 1536 -2012 -768 2569 -1009 -457 3226 -252 -844 1047 -1785 -400 1966 -409 143 -65
1635f5p16O72j589K391J414m012K195K333n939J690M334l284n07K311o02j312
$$ -65 -781 -109 -1698 693 2107 -1905 290 2623 -3316 -1626 2708 -576 -1083 1228 626 -686
1651f86j866L024K046m989K532L527o027j54N067k315j497J822J413j320l477
$$ -686 -2552 472 2518 -2471 61 3588 -2439 -2593 2474 159 -1338 484 1897 577 -2900
1666b900K674L532n568Q35N848m777k917L958L73j929l43K299J771m997m19N499
$$ -2900 -226 3306 -2262 -1427 4421 -356 -3273 685 1058 -871 -1214 1085 2856 -2141 -2560 2939
1682B939l168k459N546q58l219Q17Q82N76j700o71M606k629m269N184k31l966
$$ 2939 -229 -2688 2858 2000 -1219 -402 480 1056 -644 -1315 3291 662 -3607 1577 1346 -2620
1698b620K395J716r80j702l51K951j441l833N663P58n947K596L226l538r83K265
$$ -2620 -225 1491 511 -1191 -1542 1409 -32 -3865 1798 2556 -3391 -795 2431 -1107 -2090 175
1714A75K104j889l716M671R04o408K781M972m556j590L311M05k033j296M140R67
$$ 175 2279 390 -3326 1345 2249 -4159 -1378 3594 -962 -2552 759 1164 -869 -2165 1975 2942
1730B942n817K273M730n756j103N456j316k516M88K486q4m011K192M539n592j368
$$ 2942 -2875 -602 4128 -1628 -2731 2725 1409 -1107 -619 1867 1783 -2228 -36 4503 -1089 -2457
1746b457N929k710l771L160K013j667k305K044L053m715j722N971k247m396L919
$$ -2457 3472 762 -3009 151 2164 497 -1808 236 3289 -1426 -3148 2823 576 -3820 99
1761I9J411k798m11J808J734l060j506N092j713m984M283J702l662Q28K018M17
$$ 99 1510 -1288 -1699 109 1843 -1217 -2723 2369 656 -4328 -45 1657 -2005 -1177 841 1258
1777A258j954r73L831n47m913M006J958m952P47L667j103k028n31L554o03n083
$$ 1258 -696 -1669 2162 1615 -3298 708 2666 -2286 -1539 2128 1025 -1003 -1534 2020 1417 -3666
1793c666L773L727o443N35N358k081k831J473K457j625l686L531K693o063N67
$$ -3666 107 3834 -2609 -2074 3284 1203 -1628 -155 2302 677 -3009 522 3215 -2848 -2281
1808b281O217m018k558M381O18k911j250L051J064n071J243N308m476j974N730
$$ -2281 3936 -82 -2640 1741 2359 -552 -1802 1249 2313 -2758 -1515 3793 -683 -2657 3073
1823C073j235l526J802J454j449k250J085L304l586j527M966j256k921K749o3
$$ 3073 1838 -1688 114 1568 119 -2131 -1046 2258 -1328 -2855 2111 855 -2066 683 620
1838F20j087Q3p43J874r68j956K759Q69k935J293P70m48j72j939K179J332l963
$$ 620 -467 -384 -1127 747 -221 -2177 582 1451 -1484 -191 579 131 -41 -1980 199 1531 -2432
1855b432J582L258l507m36L471j257k361P51K896r59m686L975L577o295N62N945
$$ -2432 -850 2408 -1099 -1535 1936 679 -1682 -931 1965 1006 -3680 295 3872 -2423 -1861 4084
1871D084l578l334M351Q20l776q23M319Q85o520L091N473n655k462O380j584m143
$$ 4084 506 -2828 1523 2343 -1433 -2256 2063 2948 -3572 -481 4992 -663 -3125 3255 1671 -2472
1887b472K551K137k323k504L645J874n040M68N619m151k689M676j157k721J755
$$ -2472 79 2216 -107 -2611 1034 2908 -2132 -1664 3955 -196 -2885 1791 634 -2087 -332
1902c32L41l59r10R17J886k553o66L190j556j369K183j538O0J928k030j9K119
$$ -332 9 -350 -1260 -343 1543 -1010 -1676 1514 -42 -1411 772 -766 -706 1222 -808 -827 1292
1919A292j442l91O72p9M89j803J649R60l927K103L582m646r02M988j471l049J722
$$ 1292 -150 -541 131 52 541 -1262 387 1347 -2580 -477 3105 -1541 -2443 2545 1074 -1975 -253
1936b53K381j939k374L459J218n565K299N120n667k247O265p29m072J642L032
$$ -253 2128 189 -2185 1274 2492 -3073 -774 4346 -1321 -3568 2697 1968 -2104 -462 2570
1951B570k116k828L103J865n504J476N711m608k938N448k53l670J035K144j099
$$ 2570 454 -2374 729 2594 -2910 -1434 4277 -331 -3269 2179 1926 -1744 -709 1435 336
1966C36k195J736K093m045P34M223l496j744L982j313j672J897l72k23J74nK32
$$ 336 -1859 -123 1970 -2075 -1341 2882 -614 -2358 1624 311 -1361 536 164 -59 115 110 342
1983C42j551J030K003l213M70K955l179q2L010k277j072K576m31j718L08J587
$$ 342 -1209 -179 1824 -1389 -919 2036 -1143 -1225 1785 -492 -1564 1012 581 -1137 -829 758
1999G58J70l013K007K798m097q5M501l416k189M210rk981m37L176k6l996K400
$$ 758 928 -2085 -78 2720 -1377 -1462 3039 -377 -2566 1644 1635 -1346 -1783 1393 1367 -2629 -229
2016b29L765n086l54N044l349k461M104L21k670k83K501j80l265J309L522l386
$$ -229 3536 -1550 -1904 3140 -209 -2670 1434 1755 -915 -1198 1303 1123 -2142 -833 2689 -697
2032f97r62M008k658j926L480o20j409N12P42J53j687K60K465k095j03K403k662
$$ -697 -1659 2349 -309 -2235 1245 625 -784 -272 470 623 -1064 -804 1661 -434 -537 1866 -796
2049g96p24K870j719p89J907q11r8K59m81M05p96R65J134k539N93K418k643n67
$$ -796 -1520 1350 -369 -1158 749 -62 -160 99 -382 23 -773 192 1326 -1213 -620 1798 -845 -1412
2067a412L046j510r79J409k71o88l65J328R87k547L66K720l160o00L182j514j062
$$ -1412 1634 124 -855 554 283 -405 -770 558 1545 -1002 -636 2084 -1076 -1676 1506 -8 -1070
2084a070K131n91n72o82J098P81k436J130K552l172o91K809j553r08K025m63r61
$$ -1070 1061 470 -102 -784 314 1095 -1341 -211 2341 -831 -1522 1287 -266 -1174 851 388 -573
2101e73k87P84O43j290J86J990j895j021K862j909q22K275n56p64N92k72M53q43
$$ -573 -860 -76 567 -723 -537 1453 -442 -1463 1399 -510 -1332 943 387 -377 215 -57 396 -447
2119d47l6K029j638p50K301j875j143K224n97n70Q31m10P15j188k52K087j284
$$ -447 -483 1546 -92 -842 1459 -416 -1559 665 68 -502 329 -81 634 -554 -806 1281 -3
2136co75K128j420j005J667q45j21Q31n34L69j61j279J432k61q08J551q18j133
$$ -3 -678 1450 30 -975 692 -153 -274 557 23 392 231 -1048 384 123 -685 866 48 -1085
2154a085J103k81J78Q17j261J035L24k078J101O85j248N59L26l41M04j472R07
$$ -1085 18 -263 -85 732 -529 506 830 -1248 -147 538 -710 -151 175 -166 238 -1234 -327
2171c27J500k345J075J592k346k0J160p52K49k1L67J239k246L69K279k378j29
$$ -327 1173 -1172 -97 1495 -851 -871 289 -463 -214 -235 132 1371 -875 -506 1773 -605 -734
2188g34K456j633j006R55R0j80n87M30J746j845r09L186j904j463K126M7j005
$$ -734 1722 89 -917 38 128 -52 -639 -209 1537 -308 -1217 1969 65 -1398 728 775 -230
2205b30l14N43O44j300l48K919j628j957K502l45j537Q08P22k40p04j84J420m08
$$ -230 -544 -1 643 -657 -1005 1914 286 -1671 831 486 -1051 -243 479 239 -465 -649 771 363
2223C63k073L056l27k223J478Q18j301l88M09Q93m37j706J992M87k786J398J591
$$ 363 -1710 1346 1019 -1204 274 1092 -209 -597 -188 705 268 -1438 554 1041 -1745 -347 1244
2240A244j541j48M84N8j96q57J036J175k142L79K079k128l9J061j01o59j13P89
$$ 1244 -297 -445 39 97 -99 -956 80 1255 -887 -508 1571 -557 -596 465 364 -295 -408 381
2258C81M23k059L78K393j898p16K386p69j131M30P39J71j601Q32J530j925j182
$$ 381 804 -1255 -877 1516 -382 -1098 1288 519 -612 -182 557 728 -873 -41 1489 -436 -1618
2275a618L180p98j725J374L30j082k78M73R52j302o78K501r46k036K137N90j555
$$ -1618 1562 764 -961 413 743 -339 -617 -144 808 -494 -1172 1329 383 -1653 484 1074 -481
2292d81N35J80Q1m53q33J319J17j469J513L48j345K77L83k37K23j005P43Q19j699
$$ -481 54 234 315 -138 -971 348 465 -1004 509 857 -488 -211 172 -65 158 -847 -104 715 -984
2311i84Q33J221j609J53Q51m24O7j051J086R96k205K61K501j963j180K393n6j970
$$ -984 -151 1070 -539 -386 465 41 108 -943 143 1139 -1066 -805 1696 -267 -1447 946 890 -1080
2329a080P06Q90R1j914Q53K200k523r90L534j122k011J800O31j218n57J202O20
$$ -1080 -374 516 607 -1307 -454 1746 -777 -1767 1767 645 -1366 434 1065 -153 -710 492 1112
2346A112k284K12K892j918j694K839q9k256J127N34l13q59P13J010j249j091K104
$$ 1112 -1172 -960 1932 14 -1680 1159 1070 -1186 -59 475 162 -697 16 1026 -223 -1314 790
2363G90n73j283J322J70q10M74l98M93J68j411J007N46r88L59J11l2N38q07K33
$$ 790 217 -1066 256 426 -384 90 -308 185 353 -1058 -51 495 -493 -134 -23 -55 483 -324 -91
2382i1J300j811N1J797j720l59J288P6p89n33J388L63k257P81K396k832r02L155
$$ -91 1209 -602 -551 1246 -474 -833 455 531 -258 -791 597 960 -1297 -516 1880 -952 -1854 1301
2400A301p78j964J569J272j225j371J975O27k448L0L038k337j530K889K11k629
$$ 1301 523 -1441 128 1400 175 -1196 779 1406 -1042 -1012 2026 -311 -1841 1048 1259 -1370
2416a370Q91J786r84j500R65J588k151o19L042j329j961K606q4j597N70N66k02
$$ -1370 -479 1307 323 -1177 -212 1376 -775 -1394 1648 319 -1642 964 880 -717 -147 419 217
2433B17p08J01J118p70q47J599k72j118P94l25j03O79o88j31J159q42P1M74l01
$$ 217 -491 -390 728 -42 -889 710 438 -680 114 -211 -314 365 -323 -454 705 -137 -66 408 107
2452A07J47r75O06J149j644j55K064j648o16K060o44j232O75R59o78j299J219
$$ 107 254 -721 -115 1034 -610 -765 1299 -349 -965 1095 451 -781 -106 853 175 -1124 95
2469I5J397k535J15L080k008j675K791m39j685J11J641k86j655J048J677k278
$$ 95 1492 -1043 -928 2152 144 -1531 1260 821 -864 -753 888 602 -1053 -5 1672 -606
2485f06j151L220r13k201K157O95j876j31J345J18j299lJ754r95j325J982q8j641
$$ -606 -1757 1463 550 -1651 506 1201 -675 -806 539 657 -642 -645 1109 114 -1211 771 683 -958
2503i58J051N2m29J35K44J21k77l59M00L70q87M43L5m00Q51n92J07Q96j008l22
$$ -958 93 145 -284 -149 95 216 -61 -420 -20 350 -537 -94 -59 -459 392 -200 -93 803 -205 -527
2523e27J033m41l46M0K18j33l40j00J552j295k26J876j263r54J411j41r93J29
$$ -527 506 65 -281 -241 -23 -156 -496 -596 956 -339 -565 1311 48 -906 505 364 -629 -500
2541e00R21K02j180M51J313j791p28K298n79j755J477K74q43r2O37O17j009l59
$$ -500 421 623 -557 -106 1207 -584 -1312 986 407 -1348 129 403 -440 -532 105 722 -287 -646
2559f46J724q42j390J711L0j562J059L01l69l29j33P87n89l50J062L5j406J030
$$ -646 1078 236 -1154 557 587 -975 84 385 16 -313 -446 341 -248 -598 464 499 -907 123
2577A23L1p93N25L25m10M69m20K06L63p99Q39p5o56J29L37n35O63m36j63J026
$$ 123 154 -639 -114 211 -199 270 -150 56 419 -380 459 384 -272 -143 194 -341 322 -114 -277 749
2597G49j168k0J012o00j35M18l25L89m00k80R75r78n9J258m35j134Q56l69l3M30
$$ 749 -419 -439 573 -27 -162 256 -69 320 -80 -360 615 -363 -422 836 401 -733 123 -246 -279 151
2617A51k36O16n65m60O33m17m43J483n40p14P71l03k92K46l67Q85l57m95R62m93
$$ 151 -85 531 -34 -494 139 -278 -721 762 222 -492 279 -24 -316 -70 -437 448 91 -404 558 65
2637F5o85R52l25k92P29l22o12L72l01N71R8p41P57r7o46N27J16p17R01k50k56
$$ 65 -620 332 7 -285 444 122 -490 -118 -419 152 250 -491 266 169 -477 50 166 -551 350 100 -156
2658a56J30k88J75L02n42Q14k7q19P98l57m56N91j07k55L18j67j21L20k53L88
$$ -156 -26 -314 -139 163 -379 435 408 -411 387 30 -426 165 58 -197 121 -46 -167 153 -100 288
2678B88J14n64L85n7o60R06k97k26N62m71j65O68r56M33L27m64L14P2m92M59j77
$$ 288 402 -162 223 166 -494 412 115 -111 451 -20 -185 483 -473 -40 287 -177 137 209 -283 176 -1
2699aj91L63j67j97N21m87J22L87k51l27L98n57P11k76l56P39l82l76J002p12
$$ -1 -192 171 4 -193 328 -159 -37 350 99 -228 170 -387 324 48 -308 431 49 -327 675 -37
2719c7n61O97J01j68J13j58M43o10l84R69q8q63Q52K04r54L52r1O16l05l47P80
$$ -37 -598 99 200 32 145 -13 430 -180 -564 405 317 -546 306 510 -444 -92 -183 433 128 -219 561
2740E61j78j164J221J71j138O72J80n97K7L31j14L76n66N00qq07K33K84k20M52
$$ 561 383 -781 440 611 -527 145 325 -272 -245 86 -28 348 -218 282 274 -533 -300 -16 -236 216
2760B16K15k05K6m37K32J66l95L44j09l04K67j26M0M56n97R5M87o27l47O62Kk74
$$ 216 431 226 252 -185 47 213 -182 162 53 -251 16 -110 -70 386 -211 -116 371 -256 -603 59 61 -213
2782b13J55J84On0k22P39m97o50J036R6j360Q43M44p50R1M44o9n54j40Q41k18
$$ -213 -58 126 132 82 -140 599 102 -548 488 584 -776 67 511 -239 -148 296 227 -327 -467 374 156
2803A56q50J187K0j062M66N89n83k24N00L42n37n42J018l7j350J197L43j109O28
$$ 156 -694 493 513 -549 -83 506 -77 -301 199 541 4 -538 480 443 -907 290 633 -476 152
2822A52J34j84p0q4L90j86o75N87L08n38L31J39m40M85m20r0K68N8l58M82k07
$$ 152 286 102 32 -52 338 152 -523 64 372 -166 165 304 -136 349 -71 -161 107 165 -193 289 82
2843H2j91K16k73M27m34k36J121o34p29J102j01j047Q47L05n72l43P79K26o65
$$ 82 -109 107 -166 261 -173 -409 712 78 -651 451 350 -697 150 455 -117 -460 319 545 -120
2862a20l68J139l94j222J040L91r88M4J096n86n32L16R08o95q52J503l78j133
$$ -120 -488 651 257 -965 75 466 -522 -478 618 32 -500 -184 724 29 -823 680 302 -831
2880h31Q84Q53j306L26O09l95n13jO97k29n48M65L99q55N19O01q37O3J33j00O8
$$ -831 53 906 -400 -74 535 140 -373 -374 323 94 -454 11 410 -445 74 675 -162 -99 34 -66 2
2901Bj80L81o0k30O0N31p95M86l53l68N39J80n94P69j3p41M57L08j15l83O3O05
$$ 2 -178 203 143 -87 -27 504 -291 195 -158 -526 13 193 -401 368 355 -386 71 379 264 -119 -56 549
2923E49p70o87J440j62j348J138L06q35J81O39r7r50K69Q68p44r02J704J36j534
$$ 549 -221 -908 532 370 -978 160 466 -369 -188 451 354 -596 -327 541 -203 -1105 599 735 -799
2942g99J020R40j303k49P32k99n12O3P53j25j046Q40Q04j535O78O83o75n75L40
$$ -799 221 1161 -142 -391 341 42 -470 -407 346 221 -825 15 819 -716 -38 645 -30 -605 -265
2961b65O77l50l37N07M31j249O82M67o61n2M53n37K27j28%M63n57Q6L93l03n1
$$ -265 412 62 -275 232 663 -586 96 563 -98 -150 303 -234 -7 -135 -135 328 -229 -143 250 -53 -104
2982a04K69j80K32n05j56J009n07o09N50L59o27M1M18pn79N9Q08n94p92J226j58
$$ -104 165 -15 217 -288 -444 565 58 -551 -1 358 -269 -228 190 183 -396 -337 471 -123 -915 311 153
3003A53q90N60R49j121j15N89L05m76l38J119l09j154O02Q90j417L39Q71p88l54
$$ 153 -737 -177 772 -349 -464 125 430 -46 -384 735 426 -728 -126 764 -653 -314 557 -231 -585
3022e85K72P67n94n13J064J07j202N13Q57r34L13L77k88k11k39M74J96p95J10
$$ -585 -313 454 -140 -653 411 518 -684 -171 686 -248 65 442 154 -57 -296 178 374 -421 -311
3041c11P76n74m37R79n92O7K27q9M28q17K60Q4j45m53P17L0k84K28j95M60n27
$$ -311 465 -109 -546 433 -159 -92 135 46 474 -343 -83 1 -144 -597 120 150 -134 94 -101 359 -168
3062a68j53N11m7p54O85J5l69l1M94l3j10j92Q70o64q16J109o6p11L02M41p28
$$ -168 -321 190 143 -611 74 89 -280 -311 183 150 40 -152 718 54 -762 347 281 -430 -128 313 -415
3083d15L07O43n78pk19L34K34p31L68N40p69Q1M53o1k32k32M85p0m37K13N66q05
$$ -415 -108 535 -43 -50 -269 65 299 -432 -64 476 -293 -212 241 180 -52 -284 201 131 -306 -93 473 -332
3105c32M8O79l75j42K1J34q8j60R1L03o01M64P3l03j9L69j49P5j02K8J10L5m92
$$ -332 -284 395 20 -122 -101 33 -55 -215 -124 179 -422 42 115 -188 -207 162 13 88 -14 14 124 159 -333
3128c33N67J42n00L10l06J63r1N1l4J52k91L18J66n33L58o0j02m4k16K16K15o63
$$ -333 234 376 -124 186 -120 43 -48 3 -31 121 -170 148 314 -219 139 79 -23 -67 -283 -67 148 -515
3150e15N89N4l74K99J62o35M44Q5j39Ml06M50M02o54j55N68n00R5J01j47L5m4
$$ -515 74 128 -246 53 215 -420 24 109 -30 -26 -332 118 520 -134 -289 279 -221 -126 -25 -172 -137 -181
3172a81K29J24j53k21L45m0m52O20k06j54K60j90J89l49q0M70k22m1K25l41m1
$$ -181 48 172 19 -202 143 103 -349 271 65 -89 171 -19 170 -179 -259 211 -11 -52 173 -168 -209
3193b09M06n46K14L16l03L94k90l49N83k97j31K47K9j9K11m06J5J75n90N97r9
$$ -209 197 -349 -135 181 -122 272 -18 -367 216 -81 -212 35 64 45 256 -150 -135 40 -550 47 -52
3214e2j58L23P4n16L94M9j60K4j44j2K72l72J11N96n55k6J73k60L65j95L1J84
$$ -52 -210 113 187 -329 65 114 -46 -22 -166 -178 94 -278 -167 429 -126 -152 21 -239 126 -69 -38 146
3236A46k46J06K83j52r5M61o39J67M9j02L0k57M6M78l85p1M17m13K38J1k59p1
$$ 146 -100 6 289 137 42 503 -136 31 80 -22 8 -249 -203 275 -110 -181 236 -177 61 72 -187 -258
3258b58L00n01L85J4k39K05J9N8N4l80K4J66m6J15M31o53K06L85m54k0M55k88
$$ -258 42 -459 -74 -60 -299 -94 -75 -17 37 -343 -319 -153 -199 -84 347 -306 -100 285 -169 -189 266 -22
3280b2J25m88L04K54l60L05L49o44L84J77p50L71M7M5k34o6J71k4k75J59K48m21
$$ -22 103 -385 -81 173 -187 118 467 -177 207 384 -366 5 52 97 -137 -203 -32 -56 -331 -172 76 -345
3302c45N44J3l38l2M40l57q9K28m27M38j34j85L29m58M18m8l19M17R5j95J8J49
$$ -345 199 212 -126 -158 282 -75 -164 64 -363 75 -59 -244 85 -373 45 -3 -322 95 190 -5 13 162
3324A62J6k51o6M48k16k64L32J48l87Q5M98n84K57O1j8l47j57K62J04l10K47J51
$$ 162 178 -73 -139 309 93 -171 161 309 -78 7 505 -79 178 239 221 -126 -283 -21 83 -227 20 171
3346A71n66K35N59o81J57L43j59j08J92k83J7j15J44K83m62J2L81m88M86K47n72
$$ 171 -395 -160 399 -282 -125 218 59 -49 143 -140 -123 -238 -94 189 -273 -261 120 -368 118 365 -207
3367b07L90p3l61M5L92m06K64P2o1l0j70K31J0o16N42J81k78k83P15l67j47J71
$$ -207 183 110 -251 -206 186 -220 44 116 55 25 -145 86 96 -520 22 203 -75 -358 357 -10 -157 14
3389A4K0J98n81M42K62j004K67Q13m62j45M14j3k85P5K05L1o47J62O16n97J11
$$ 14 34 232 -349 93 355 -649 -382 431 -31 -176 238 225 -60 15 220 251 -396 -234 382 -215 -104
3410a04N89o55q2M75j06ll86M14J10o21N29P1k24k77O65l56k74L41J73j40j1l3
$$ -104 485 -170 -252 223 117 114 -272 142 252 -369 160 231 7 -270 395 39 -235 106 279 139 128 95
3432I5K2k65K09J54m53K0O64o13K99R0m15K62j2j24J36j02j68L17k27J71j64k07
$$ 95 117 -148 61 215 -238 -218 446 -167 132 222 -193 69 57 -67 69 -33 -201 116 -111 60 -104 -311
3454c11J47M35l30K2L50k17k44K88M2m37K01Q4m3k80K04O30o81j87P51n66j42
$$ -311 -164 271 -59 -37 313 96 -148 140 182 -255 -54 30 -13 -293 -89 541 -140 -327 424 -142 -284
3475b84J48J96J93m49O07j4o14K82J45l21k13N23L13p92J99L86k84J66l26K90
$$ -284 -136 60 253 -196 411 397 -217 65 210 -111 -324 199 512 -280 -81 305 21 187 -139 151
3495A51l67k19Q63m41k01M08j88K81m86J39J00j66K45n9M5j56J66J77j11o5qJ62
$$ 151 -216 -435 428 -13 -214 194 6 287 -199 -60 40 -126 119 60 105 -51 115 292 181 116 108 270
3517B70k62m13M48J25k51J4o5J15J36j06J87j16k72K03K52k42J65p3l10J80J58
$$ 270 8 -405 43 168 -83 -69 -134 -19 117 11 198 82 -190 13 265 23 188 115 -195 -15 143
3538A43j62j51j11J95J15j74Q0L50l94J08P9J61m18K5J67J3j53r8J73o4m3n6J84
$$ 143 -19 -170 -281 -86 29 -145 -65 285 -109 -1 78 239 -179 -154 13 26 -127 -225 -52 -116 -159 -215 -31
3561c1k45K81KK97m06J58L5N9k65L20J00k12J28k66J13j85J92K34l62j49M28k45
$$ -31 -276 5 7 304 -102 56 91 150 -115 205 305 93 221 -45 68 -117 75 309 -53 -202 226 -19
3583a9p9K9J04j70J86r1j75K36j04qL21k57O1j4m4k2J45Q2m5l97J37K62l65K96
$$ -19 -98 -69 35 -135 51 -40 -215 21 -83 -91 230 -27 34 20 -24 -46 99 181 136 -261 -124 138 -227 69
3607F9J20o7j83L07k54r8K22p5n9K5K91j10l18l43P56j55j58K26lK00l57R9q9
$$ 69 189 122 -61 246 -8 -106 116 41 -18 7 298 188 -130 -473 283 128 -30 196 193 393 36 135 46
3630D6Q6l61M25k04Pj29K12j21K64k52l0J01r4K84j88l21L45N2m14L57nk65J06
$$ 46 132 -229 196 -8 -1 -130 82 -39 225 -27 -57 44 -50 234 46 -275 70 122 -292 65 60 -205 -99
3653i9K27l78J94o3K88J75m62QM48k32k20K79n2N6m38J79K83m66L15P6m7N0Jk35
$$ -99 128 -250 -56 -119 169 344 -118 -110 338 106 -114 165 113 169 -269 -90 193 -273 42 118 71 121 122 -113
3677a13L66n20L17J88n03r3N11k82j00K43j52L22j91n8mj6j25L19k13K39j72R0
$$ -113 253 -267 50 238 -265 -358 153 -129 -229 14 -138 184 -7 -65 -69 -85 -210 109 -104 135 -37 53
3699E3K16m11J85m5J53j9j3j78j27J17J98k36L23M0l58L78j41m9j53J87k53j32
$$ 53 269 -142 43 -2 151 132 119 -59 -186 -69 129 -107 216 256 -102 276 135 86 -67 120 -133 -265
3721b65K23j34J20J77j52j58K20k1j75k2K08J5j44M7Q2o8kr5k9J28m8j20K26j29
$$ -265 -42 -176 -56 121 -31 -189 31 10 -165 -187 21 36 -108 -61 21 -47 -49 -144 -173 -45 -93 -213 13 -116
3745a16K24k53J0J57J36m07K45K15O6j80j68K43l5l66L23r7P5rJ1l1j8p8Q2J36
$$ -116 108 -145 -135 22 158 -249 -4 211 277 97 -71 172 137 -229 94 -3 72 63 74 43 25 -53 29 165
3769A65k70K26k18N6k8J36l55O0M93j44o3j32J15j76m3K22k5oJ25K6j06j00j90
$$ 165 -105 121 -97 -41 -69 67 -288 -228 265 121 58 -74 41 -135 -178 44 19 13 138 164 58 -42 -232
3792b32L49n3o5%R7J16P8m19qNrJ9J88J3m75O10l50K17j41K23k43J92k48L29n5
$$ -232 117 64 -1 -1 96 212 290 -129 -137 -132 -141 -122 66 79 -396 214 -136 81 -60 163 -80 112 -136 193 138
3817A38k84L85k32l3N9J62k18j9J24j88NJ2K1k04J22J42o3K05Ok96J37j54J20
$$ 138 -146 239 7 -26 33 195 -23 -42 82 -106 -101 -89 -68 -272 -150 -8 -71 134 140 -156 -19 -173 -53
3840e3J34j42O6K33k01l11M67j43Q3N9k79rM5J64j67r6K9p3M23m62L44j96j9J35
$$ -53 81 -61 5 238 37 -274 193 50 133 192 -87 -96 -51 113 -54 -150 -121 -194 229 -233 111 -85 -104 31
3864C1N9j15J4K11k54k6J71m8j17K46j43k41J36n9R6J32o5l7L2p0q9K7J3O3j08
$$ 31 90 -25 -11 200 -54 -80 91 43 -74 172 29 -212 -76 -135 -39 93 28 -9 23 -47 -136 -109 -96 -33 -141
3889a41K57k08P4k05L61m06L82J5j09k2r2O5o3J7j53L96k24J31j20m2j52K66n3
$$ -141 116 -92 -18 -223 138 -268 114 129 20 -2 -94 -29 -92 -75 -228 168 -56 75 -45 -87 -239 27 -26
3912b6m0J11K63l68J51l75N76k47m6Q0J13j2n83M89j15j60J32k10K32LM8j98J61
$$ -26 -66 45 308 -60 91 -284 292 45 -1 79 192 180 -403 86 -29 -189 -57 -267 -35 -32 16 -182 -21
3935b1n8N1L1L7Q7j80K02k64J48k58K30K06k07N1j22J74J71m71J9L46k15J5K1
$$ -21 -79 -28 3 40 127 -53 149 -115 33 -225 5 211 4 55 -67 107 278 -193 -174 172 -43 -28 -7
3958gL5M0rJ10J07k11j78Q3R1j85J03L6k20J08J61NK9l42M11j90J86l01K49Q4
$$ -7 28 68 59 169 276 65 -113 -30 61 -124 -21 15 -205 -97 64 69 98 -244 167 -23 163 -138 111 195
3982A95RM7k13K82m11O6j70J87j82K26J95j55J26j54P0k5k12K66J79l91J06K2
$$ 195 204 251 38 320 -91 -25 -195 -8 -190 36 231 76 202 48 118 93 -119 147 326 -65 41 63
4004F3J41l42q8J56R1K34j92m8k00L03j87K14p3l6p6j06J08j49M00n34M30L4q7
$$ 63 204 -138 -226 -70 21 255 63 15 -185 118 -69 145 72 36 -40 -146 -38 -187 213 -321 109 143 56
4027E6j1J1j21q1q1K0K29j59J53O9o5J43k35K26j76n5J77k27K38j04j99oJ77L8
$$ 56 45 56 -65 -146 -227 -207 22 -137 16 85 20 163 -72 154 -22 -77 100 -127 111 7 -192 -198 -21 17
4051A7k50L56l62L02j52j29K17Qo2J28Q7l21K94j57r1r0L60k91Q1O2J14J6k04
$$ 17 -233 123 -239 63 -89 -218 -1 7 -55 73 160 -161 133 -24 -115 -205 155 -136 -55 7 121 137 -67
4074f7O9j26n2J79N1j8r8p0l3Q8J08l46K69K12l62L37j86N6n1K56N5l52p9K28
$$ -67 2 -124 -176 3 54 36 -62 -132 -165 -77 31 -315 -46 166 -196 141 -45 11 -40 216 271 -81 -160 68
4098F8J35j33O5j15K1p2k44L73j37k6j75J37K08q6P9l02J75J6L1J9j22J71M41
$$ 68 203 70 135 20 41 -31 -275 98 -39 -65 -240 -103 105 19 98 -204 -29 -13 18 37 -85 86 527
4121E27k39k18J1j92K04j79K48j32l51O42j63k78J75J52k37J03j71K23k01q7K5
$$ 527 288 70 81 -111 93 -86 162 30 -321 321 158 -120 55 207 -30 73 -98 125 -76 -163 -138
4142a38M26n3j22l8j09Oo7k00K32L56n38K29l13J87K57q7o0J35j62j75M8M47O8
$$ -138 288 235 113 75 -34 -28 -95 -295 -63 293 -245 -16 -329 -142 115 28 -32 103 -59 -234 -186 261 329
4165C29m53K57k9pk27Q6L70n88J79P5k35K83j95J0K52k1j29J12j28N9j81q9L81
$$ 329 -124 133 104 97 -130 -44 326 -262 -83 -8 -243 40 -155 -145 107 86 -43 69 -59 0 -181 -270 111
4188A11l0j45J98j52q9R4r9N9K37m46R5K16k0k25K46l0K26j16o5M3J62l74L91
$$ 111 81 -64 134 -18 -107 -13 -112 -53 184 -262 -167 49 29 -196 50 20 246 130 65 108 270 -104 287
4211B87k4l78K72qp0o9N9J07O1m24K85j55o5O1J32j03l0mM2ql2RK18k65K79j05
$$ 287 263 -115 157 149 79 10 69 176 237 -187 98 -57 -122 -61 71 -32 -62 -66 -24 -32 -64 -55 163 -102 177 72
4237G2l16J39M0N9j21J35o1K78j75LN0l16L43rk07r3M80k71p1r4Q4J53k17LK22
$$ 72 -244 -105 -65 -6 -127 8 -53 225 50 53 103 -213 130 121 -86 -179 301 30 -41 -135 -51 102 -115 -112 110
4262A10j13j6J91k29m1q1J05J99k82nJ88qM4J45l49K96kl05K80k97K13O5j44j72
$$ 110 -3 -19 172 -57 -98 -179 -74 125 -157 -162 26 18 62 207 -142 154 152 -153 127 -170 43 108 -36 -208
4286b08N91k85j65P9J18L8k43J12J88k55rK81j19q3l2J22j48K73l05k4o9O9kO0
$$ -208 383 98 -67 12 130 168 -75 37 225 -30 -39 242 123 40 8 130 -18 255 -50 -74 -143 -74 -76 -16
4310a6J45J38l40M1N5j52O9J55j61l9P2k21K75j19r9P5K84l28J49j55j39K98o4
$$ -16 129 267 -73 -32 23 -129 -60 95 -66 -105 -33 -254 21 -98 -197 -122 162 -166 -17 -172 -311 -13 -77
4333g7j50J71kk03K2R0n2J09j88O14l31k27M15j09n8J7Kr1j10J21j62J81k7K45
$$ -77 -227 -56 -58 -261 -239 -149 -201 -92 -280 334 3 -224 191 82 24 41 43 -48 -158 -37 -199 -18 -45 200
4357B00k55m1K27K9j84J76l17p1K90j22l22L13K35k03J7l01N88k42k7m7J26l8
$$ 200 -55 -96 131 160 -24 152 -165 -236 54 -68 -390 -77 158 -45 -28 -329 259 17 -10 -57 69 31
4379C1O0j20J12O3k61L21n1j95k6l8J43M6r7k50N8J45J35j17N7j52J34l2m4K55
$$ 31 91 -29 83 146 -115 206 155 -40 -66 -104 39 85 -12 -262 -204 -59 76 -41 16 -136 -2 -34 -78 177
4403A77NL4k99k60P22k37k50J27m5MK55l75J6K98k41K15k42q8L51J8j58%j99J7
$$ 177 182 216 -83 -343 379 142 -108 19 -26 -22 233 -142 -126 172 -69 146 -96 -184 167 185 27 27 -172 -155
4427a55K98j52jJ35r1J33j36k61K94J48k50O6j60K06K0J98k95o6K37k6O9qk52
$$ -155 143 -9 -10 125 34 167 31 -230 64 212 -38 28 -132 74 94 292 -3 -69 168 142 211 203 -49
4450d9J96j92K28N1l82J81p6L9J16j94p9L05m35M54l76J86J32J80k04j65p3J02
$$ -49 147 -45 183 234 -148 33 -43 -4 112 -82 -161 144 -291 163 -213 -27 105 285 81 -84 -157 -55
4472e5k41K85K65l88o4O17o08J21k31M07k53J02K86k48J60m1k4o4M2N8K7j56n4
$$ -55 -296 -11 254 -134 -198 419 -189 -68 -299 108 -145 -43 243 -5 155 114 90 26 68 126 153 -3 -57
4495e7J82N7o2mk28j45L89l2L3m8m9k1O6j8j54Q7r0K68m24M92k17P5j46q0l50
$$ -57 125 182 120 116 -112 -257 132 100 133 85 36 15 81 63 -91 -4 -94 174 -250 242 25 100 -46 -126 -476
4520d76M65o7L45j94MJ83k62k6K07j64l61L90m3P8k35m8J98J2k71L65Qk23J06
$$ -476 -11 -78 267 73 77 260 -2 -28 179 15 -346 44 1 79 -156 -204 -6 6 -265 100 108 -115 -9
4543iK84l08J86k97L20l47l8K09N5k76K28l8j48L19k97J12J66l77L75q5k29P8
$$ -9 275 -33 153 -144 176 -171 -209 0 55 -221 7 -31 -179 140 -157 -45 121 -256 119 34 -195 -117
4565a17j8L6J26q4J62MO2j23k2q5r8M09k47K7J57j24o17O74j57o6J92P1l72K35
$$ -117 -135 -99 27 -57 105 109 171 48 26 -59 -157 252 5 32 189 65 -552 122 -35 -101 91 162 -210 25
4589B5k08K92j64j10L53k61J97q7J1N7j07q2K57l72J15J25J30l71J08K61Ol64
$$ 25 -183 109 -55 -165 188 -73 124 37 48 105 -2 -84 173 -199 -84 41 171 -200 -92 169 175 -189
4611a89J21L50m41j37q6N51m72K25M11l10p8L27j35j29N9J1j12o3O3J65m1j52
$$ -189 -68 282 -159 -296 -382 169 -303 -78 333 23 -55 272 137 8 67 78 -34 -97 -34 131 90 -62
4633f2K00m3J4m78K81K49n27M80rj06j33K72J8j12k84J14J65j12L2K93k51j61
$$ -62 138 95 109 -369 -88 161 -366 114 105 -1 -134 138 156 44 -240 -126 39 -73 -41 252 1 -160
4655a60J46n1J18j13l4J38J9j15O2k24J05J00K47l1k15L4J76l09P7K13j79j30
$$ -160 -14 -65 53 -60 -94 44 63 -52 10 -214 -109 -9 238 207 -8 26 202 -107 -30 183 4 -126
4677a26N1L58k54KK62j81r8J21j52R5j68K18J50k48J14jl00K40LJ56j25j97p0
$$ -126 -75 283 29 31 293 112 14 135 -17 78 -90 128 278 30 144 143 -157 83 86 242 117 -80 -150
4700a50J48k05J49J55k17K28K65j17j16k34J00o2Q1m6R1nk45J60J73r5l64K09
$$ -150 -2 -207 -58 97 -120 108 373 256 140 -94 6 -56 25 -21 70 65 -180 -20 153 58 -306 -97
4722i7K89j37q1Q7j2j21L49k03J5k75K61j19k2o6K99o7n61P81k95j30J6K88n33
$$ -97 192 55 -26 61 49 -72 277 74 89 -186 75 -44 -66 -132 167 100 -461 320 25 -105 -89 199 -334
4745c34K62O9j65J32J32j18P1m67O46k98j7o6J07J32l7J34k50J99n63M28K51m21
$$ -334 -72 -3 -168 -36 96 -22 49 -418 228 -70 -87 -153 -46 86 49 183 -67 132 -431 -3 248 -173
4767a73R3J13P3j96L9J86j1j51J46j9l56L07R4j96p0R3j91L67j52N7N4J09l96
$$ -173 -80 33 106 -90 -51 135 124 -27 119 100 -256 51 145 -51 -121 -28 -219 148 -4 53 107 216 -180
4790a80K56Q0j62K21k72J0J24k41K88j61j14J28J06k35K8M21l33J12m4r9J34J3
$$ -180 76 156 -6 215 -57 -47 77 -164 124 -37 -151 -23 83 -152 -124 297 -36 76 32 -67 67 80
4812H0L4R5n72M68J90k21q5J47m2n6k59L31lj28n8k05J23j86N77l20j50J34M64
$$ 80 114 209 -363 105 295 74 -11 136 94 38 -221 110 107 -21 -79 -284 -161 -347 230 -90 -240 -106 358
4835C58n77L64n9L12m70M1J2k46K81L3l73L55k5o2n3l4J92jJ4m02M23N1K77m26
$$ 358 -219 145 86 398 -72 -31 -19 -265 16 49 -324 31 6 -56 -109 -143 49 48 62 -340 83 134 411 -15
4859a5J53j83K41j59j33Q6j05J13O4J72M7m76J14k4R9J15j97j89M29k9m0m9K46
$$ -15 138 -45 196 37 -96 -10 -115 -2 62 234 281 -195 -81 -105 -6 109 -88 -277 152 123 83 34 280
4882B80l75OON7J72n16k2K89r2J91K60o81K91P9K29j08k14J92n2n8k5K3J78Ko8
$$ 280 -95 -89 -83 -26 146 -370 -392 -103 -195 -4 256 -425 -134 -55 174 66 -148 44 -8 -66 -91 -68 110 112 44
4907D4N9k23K96j92N3j80p1K78j99J13J02j18N3K19k67K44k05j91K19n7J64q4
$$ 44 103 -120 176 -16 37 -143 -214 64 -135 -22 80 -38 15 234 -33 211 6 -185 34 -23 141 57
4929E7K20k60n6k49L57j01JK1R8k12R4K06l03K48l09J93O1l36L47n7k3j06M57
$$ 57 277 17 -39 -288 69 -32 -31 -10 88 -124 -30 176 -127 121 -188 5 66 -270 77 20 -3 -109 348
4952C48k81j00l5k86K67k21L29K5j47K8K81k29K7J3O7k06Q8l6K46j71l21N34k01
$$ 348 67 -33 -68 -354 -87 -308 21 46 -101 -73 208 -21 6 19 86 -120 -32 -68 178 7 -314 220 19
4975A9o4L04j70K10l69J10j61K15j67N8Lo7K32l21J25L24P1m10J01M6j83J53k26
$$ 19 -45 259 89 299 -70 40 -121 94 -73 -15 -12 -79 153 -168 -43 281 352 -58 43 89 -94 59 -167
4998a67J98j6m0J42l35L00m0j5j07K81j92J32m7m56O03k82j35J43N4l03J88M2
$$ -167 31 15 -25 117 -218 82 42 27 -80 201 9 141 94 -362 241 -41 -176 -33 21 -282 -94 -52
5020e2j37M23l81K26J48l29L54l9l18K8R9k73M09j46Q2j96R4Q8L7j82J47M3j11
$$ -52 -189 234 -147 79 227 -102 252 213 -105 -77 22 -251 158 12 94 -102 -8 80 117 -65 82 125 14
5043A4P0k2k52K03p0J35J55k53J11n7j91L05K01k78j38kO1K37k65j14J10j4J8
$$ 14 84 62 -190 13 -57 78 233 -20 91 34 -157 148 349 71 -67 -69 -8 229 -36 -150 -40 -54 -36
5066c6K32k44K24l5l36J6L77j08l24K17J60jl04K62P3k48J25K02k09p0J89j61
$$ -36 196 -48 176 141 -195 -179 198 90 -234 -17 143 142 -162 100 173 -75 50 252 43 -27 162 1
5088Am2N1O3n9j48k08M56j75Q8J66k81K2J45j10J99j45%K3L1k04K45j84J27rJ20
$$ 1 -41 10 73 14 -134 -342 114 -61 27 193 -88 -66 79 -31 168 23 23 46 77 -127 118 -66 61 52 172
5113A72k99J69oJ99j12j38L17q8k59K81Q9k51j13J67j0q3k16j07K19m0J91M24
$$ 172 -127 42 36 235 123 -15 302 214 -45 236 325 74 -39 128 118 35 -181 -288 -69 -109 82 506
5135E06l46m73L03M6j39J28J16K84m85L6J63k6n5L0k0k32P4K79j55j62KK91k10
$$ 506 160 -313 -10 36 -103 25 141 425 -60 -24 139 113 58 88 68 -164 -90 189 34 -128 -126 165 -45
5158d5k0L1j84L8J51j2K01l86P5M68o01J46L31m6k7j44J23j26M7o8R2j63%J01
$$ -45 -65 -34 -218 -180 -29 -41 160 -226 -151 317 -284 -138 193 147 120 -24 99 -27 20 -48 44 -119 -119 -18
5182a8N0j46m5J20j94J45m8m2Q6j72L15n0Pj05L09k06O3J5k88K28k26L33L5m69
$$ -18 32 -114 -159 -39 -233 -88 -136 -178 -92 -264 51 1 8 -97 212 6 69 84 -204 24 -202 131 166 -303
5206c03M14j24k46p2Q33o82L7K24l8r5N1m6K45k72L4J74j20l04L78j6L6J52m86
$$ -303 111 -13 -259 -331 502 -180 -143 81 43 -52 -1 -47 198 -74 -40 134 14 -290 88 72 108 260 -226
5229b26K16r8M3L80n61j10N24o1j19J13l11J57k2O7L9o0j25R5J98l40J45L25M6
$$ -226 -10 -108 -65 315 -246 -356 168 107 -12 101 -210 -53 -75 -8 31 -29 -154 -59 139 -201 -56 269 315
5252C15l67J10l7O1J4J33M2j21l98L09N3k59l8M24L7n36J65L5j38L76Q3j14k67
$$ 315 -52 58 21 82 96 229 271 150 -248 61 114 -145 -183 241 278 -258 -93 -58 -196 180 263 149 -118
5275a18J85j19Q6j42N2j31MR0K64l66j1K15l5n4N0J08L6l71J58K80m18J82M34
$$ -118 67 -52 34 -108 -56 -187 -183 -93 171 -195 -206 9 -26 -80 -30 78 114 -257 -99 181 -237 -55 379
5298C79n16K04J10n52N53j0n9K31l75l18PM30O4J3l14L38J91o36J62L28m76K57
$$ 379 -137 67 177 -375 178 168 109 340 -35 -353 -346 84 148 161 -153 185 376 -260 -98 230 -246 11
5320A1K05o5k42K75j48M3j71L90k09k61K8O84p63M04j47l15K75m02N69j31R3k32
$$ 11 216 151 -91 184 36 79 -92 298 89 -172 -144 540 -223 181 34 -281 -6 -408 161 30 123 -109
5342a09L47p18L05P83n11k45O4J39k43j62K49J92q8j84L45k90l8J33J8O7p5k08
$$ -109 238 -480 -175 608 97 -148 -84 55 -188 -350 -101 91 3 -181 164 -126 -164 -31 -13 54 -21 -229
5364b29K17j0J16J41k33k42M43j09J52m34K94M3P0n15M38l68K25K64o6m00K67
$$ -229 -12 -22 94 235 2 -240 203 94 246 -188 106 149 219 -296 142 -226 -1 263 197 -203 64
5385F4K08j15j78K2m4P9k31M38j06m8K12k98k53L01j22o2P9M3L25m02j3K33M18
$$ 64 272 157 -21 1 -43 36 -195 243 137 89 301 3 -250 51 -71 -133 -54 -11 314 -88 -101 132 550
5408E50o43m2L26p5p7l26L71K35j27j61K87o07K58M12n62R6n7ML21j98k51N05
$$ 550 -93 -135 191 116 39 -287 84 319 192 31 318 -289 -31 381 -181 -85 -142 -138 183 -15 -266 239
5430B39j38k93M50l48k06M02l19J09n5J42L4j61j5N14m14J43J07k49O5j36J62
$$ 239 101 -192 258 -90 -296 106 -213 -104 -159 -17 17 -144 -159 355 -59 84 191 -58 7 -129 33
5451C3K4R0m03O4J93K7K8j72k84N16j31J04J01k63k8K70m15J92j36m0l6L86q6
$$ 33 57 147 -256 -192 1 28 56 -116 -400 116 -15 89 190 -73 -101 169 -246 -54 -190 -230 -266 120 34
5474C4j25N4J46J23k93K05P4n37L63j02K21J97l84p7j8j7P0K71l14K72J16l37
$$ 34 -91 -37 109 232 -61 144 218 -319 44 -58 163 360 -24 -101 -119 -136 -66 205 -109 163 279 -58
5496e8k47M68n5M8j96j34L79j83p0K29k29Q7J62k9k67L4n4qN9K15P8r2l65L43
$$ -58 -305 163 108 156 -40 -174 205 22 -48 181 -48 39 201 172 -95 -61 -115 -123 -64 151 229 137 -228 115
5520A15k62K86k77P6N3K66k76j57P1L27J26m39K43q7K1J8p3N7J47k11r3N1j5j22
$$ 115 -147 139 -138 -62 -9 257 -19 -176 -105 222 348 -91 152 65 86 104 31 88 235 24 -69 -18 -33 -155
5544a55J90P0J70k80k53P1L11O7j88K10r4J49J56p34M92k53J39jk44J22K37l51
$$ -155 35 105 275 -5 -258 -187 124 191 3 213 119 268 424 -310 182 -71 68 67 -177 -55 182 -169
5566a69J59Ll01K50R5m6J38o5j85K39ln0m12M25r8K63l30J14K62m11J39K3j40
$$ -169 -10 -7 -308 -58 37 -9 129 64 -121 118 115 65 -347 78 -20 243 -87 27 289 -122 17 40 -100
5589a00L43j54l77K13j04p5L17l10M37K12m98L3J14j40r0J13k6j14L82k70J20
$$ -100 243 89 -288 -75 -179 -254 63 -247 190 402 -96 -63 51 -89 -179 -66 -92 -206 176 -94 26
5610B6k42oK84q2j93O72p25M94K35o34L78m4L1n6K7k21O4p4J4p1j43M99j05k70
$$ 26 -216 -222 62 -20 -213 459 -266 228 463 -171 207 163 194 138 165 -56 8 -66 -52 -123 -266 233 128 -142
5634a42L04l20L8J49J07l21L34K6j76J37j40k96J06R3M2p8M0k04L86k50L35o9
$$ -142 162 -158 -120 29 136 -185 149 175 -1 136 -4 -300 -194 -101 -59 -137 -97 -301 85 -165 170 101
5656A01k96k4j27J92L48j80Q2J02j41k38R1J08J66m59K58J56n1j5L55n26j66L91
$$ 101 -195 -219 -346 -154 194 14 96 198 57 -181 -90 18 184 -275 -17 139 88 73 428 -98 -264 127
5678A27k42l1L00o6P9k29Q7L12o98J91L56k02L4J43k13J16j1k93M17J0o11P12
$$ 127 -115 -146 154 88 167 -62 25 337 -361 -170 186 -16 18 161 -52 64 53 -240 177 187 -424 288
5700B88k47k63M56m21Q9P9k32K33K7j73J65L6q1J94k83r4L36k96L29J74l30j38
$$ 288 41 -222 234 -187 -98 -19 -251 -18 9 -164 1 37 -44 150 -133 -227 109 -187 142 316 -14 -152
5722a52K28j61J23J12m1n5J0K68o1m52nM23l74J26L82l44k5J13k12r5O8J76K7
$$ -152 76 -85 38 150 109 54 64 332 271 -181 -186 237 -137 -11 371 27 2 115 -97 -192 -124 52 79
5745G9l10K1K85l16J95K79m43J49J32j27m4MK7QK37l69K21k14k0K47j09j63N3
$$ 79 -231 -210 75 -241 -46 233 -210 -61 71 -56 -100 -96 -69 -61 176 -193 28 -186 -206 41 -68 -231 -178
5768a78R2l6K08j34J24j50K2N38l44N0j44RJ6K69n08J52K73k68K8K84l77k78L45
$$ -178 -86 -122 86 -48 76 -74 -52 486 142 192 48 57 73 342 -166 -14 259 -9 19 303 -74 -352 -7
5791gj09O8j65M57k46J63j06M4k72J33R6J2k13K54O5K49m74k64N53k55j55L82
$$ -7 -116 -48 -213 244 -2 161 55 99 -173 -40 56 68 -145 109 174 423 -51 -315 238 -17 -172 210
5813B10k54j71L14q4q9k9r8M02n1k69K68j67q6j02J67j25J80j6J5l2n1j43J96
$$ 210 -44 -215 99 15 -74 -103 -201 201 150 -119 149 -18 -104 -206 -39 -164 16 0 15 -17 -68 -211 -15
5836a5j73L28r6j70J06p7L15k24MJ16l7p6R2J03m10L28k54J05J78j00k8J17j75
$$ -15 -188 140 44 -126 -20 -97 218 -6 -2 114 77 1 93 196 -214 114 -140 -35 143 43 15 132 -43
5859d3kN40m42qJ52k80j58K30k9Q5m13K98L02m47K20L23k08k1j92L7J35l65J94
$$ -43 -45 495 53 45 197 -83 -241 -11 -40 45 -368 -70 232 -215 5 328 120 99 -93 -56 79 -286 -92
5882i2K90m12L31J39l43j54J53K31j18j33K61mm34J58L73p9l02J13M9n51P20k98
$$ -92 198 -214 117 256 -87 -241 -88 143 25 -108 153 149 -285 -127 246 167 -135 -22 27 -524 196 -102
5904a02J59K98l72J62k8m41M44J73k14j58n7O3L6J53o3K30l81P6J57l46K04p2
$$ -102 57 355 -17 145 117 -324 120 293 79 -79 -136 -73 -37 116 53 283 -98 -22 135 -211 -7 -79
5926g9j78K69k54L38j73J55K57m7l92QM13m06M23l76P0R8k64J37R2l85L11J99
$$ -79 -257 12 -242 96 -77 78 335 288 -104 -96 317 -89 334 -42 28 126 -138 -1 91 -294 17 216
5948B16m29J97K7J71l87q1J27K78l32K88Q9m45L3M09l67J96K07j0k46o2J2k4R8
$$ 216 -213 -16 11 182 -205 -286 -159 119 -213 75 164 -281 -248 161 -206 -10 197 187 -59 -121 -109 -133 -35
5971c5m3NN3m83Q25j47k29J92k37o6L90l87J63J08j25K67l46p7J35J06N0j58o3
$$ -35 -78 -73 -20 -503 322 175 -54 138 -99 -165 225 -162 1 109 -16 251 -95 -172 -37 69 119 -39 -102
5994a02JK08j42J62n5k29M37m5R4k55n8M3l23K73m3J73k57m6J83l06K99l92J80
$$ -102 -101 107 -35 127 72 -157 280 235 329 74 16 59 -264 9 -34 139 -118 -164 19 -287 12 -380 -200
6017b00K06L0j82K06p3r6K71ll53L38k30M2k01N0K69Rl39L70j16k40K35J7Q6J03
$$ -200 6 36 -146 60 -13 -109 162 159 -194 144 -86 -44 -245 -195 74 83 -256 114 -2 -242 -7 10 96 199
6041A99l50J10k9k26L12Nm6J71l01j97J22L24r9Q4lj53M0J8r7J86k38R8K23n10
$$ 199 -151 -41 -70 -296 16 21 -25 146 -155 -352 -230 94 -5 79 76 -77 -37 -19 -116 70 -168 -70 153 -357
6065c57N41K5k16j75J90n5N9l9KK60k08J24Qor9j82j71L64j26o4K66l01K55j47
$$ -357 184 209 -7 -182 8 -47 12 -27 -25 235 27 151 159 153 54 -128 -299 65 -61 -125 141 -160 95 -52
6089e2P7j66L47k47J15o8k97M99n39K59J34k22%L19j70k3R4K41q5k44k4K14k07
$$ -52 25 -141 206 -41 74 6 -291 208 -331 -72 62 -160 -160 159 -11 -34 60 301 216 -28 -52 162 -45
6112d5j47K51j60j58L69k18j51N90o49K93J22j94Q6o2j09J02J01j39L73k18k88
$$ -45 -192 59 -101 -259 110 -108 -259 331 -318 -25 97 -97 -11 -73 -182 -80 21 -118 255 37 -251
6133b51L28j22l8J31L3j75r9j12J89K43n27N34k86l0J40l3K62j22nk80J67M0J0
$$ -251 77 -45 -83 48 81 -94 -193 -305 -116 127 -400 134 -152 -182 -42 -75 187 65 60 -220 -53 -13 -3
6156cK00l59K44N8n8J80m61K29M7m56L94j88K08m0J05k7J24l10M2j32J14L18l02
$$ -3 197 -162 82 140 82 262 -199 30 77 -379 15 -173 35 -5 100 73 197 -113 -71 -203 -89 229 -73
6179g3K53j33o5r9J25O8k30J68k45J98K02r7j60M96m20J22j30J51L1p5j17K39
$$ -73 180 47 -18 -117 8 76 -154 14 -231 -33 169 72 -88 408 -12 110 -20 131 162 87 -30 209
6201B09j30j84K14R4j06j21j27M24j86k71L53l31K60r4k52L59p0q0p9p2J12PJ85
$$ 209 79 -105 109 203 97 -24 -151 273 87 -184 169 -162 98 4 -248 111 41 -39 -118 -190 -78 -71 114
6224A14k08j11J47j19L41j37j43K83r9j31nP5k21K42j22j63L43QQ3k19qK76m34
$$ 114 -94 -205 -58 -177 164 27 -116 167 68 -63 -68 7 -214 28 -94 -257 86 94 177 -42 -50 226 -208
6247b08N31l7m85O7M01j54j15L32n59K09R2j43J75j94J4R7j00q2M61l14R8j45
$$ -208 323 286 -199 -132 269 115 0 332 -227 -18 74 -69 106 -88 -74 23 -77 -159 302 -12 86 -59
6269e9j11K01k14M31k89j90L91K2l15L8O6o6K1k7J02J06j0j54p2J46J1p9J92l48
$$ -59 -170 31 -183 248 -41 -231 160 182 -133 -95 -29 -95 -74 -101 1 107 97 -57 -129 17 28 -51 141 -207
6293b07L72k4k31K24j15n4J73l19J56J62l42L50k96j5K74j49K1l0l2K51p6l36
$$ -207 165 141 -90 134 19 -35 138 -181 -25 137 -205 145 -151 -166 108 -41 -20 -50 -82 169 93 -243
6315b43K09J76k80L8n8K83k8j86m7O6J83k28K60m64J7L93k31J96m0M4o6p2K41
$$ -243 -34 142 -138 -100 -158 125 97 -89 -136 -70 113 -115 145 -319 -302 91 -140 56 16 60 -6 -78 163
6338A63J38m95K6M83p81L07K65L4k50J31j90K40j6k37K77Mn93N11L8j19j65O9
$$ 163 301 -194 -168 315 -466 -159 106 140 -110 21 -169 71 55 -182 95 99 -494 17 55 -64 -229 -160
6360a60J66j92J2M68j35p02N33R6k28L56r0J34k19j30K38O7m15m0L37k69M31O
$$ -160 6 -186 -174 294 159 -543 -10 86 -142 214 124 258 39 -91 147 214 -201 -241 96 -173 258 264
6382B64j31j05m3N8J63l80K19L6Pk3j42J11j07J35j6j44L3j9N47m30r1K17r2k54
$$ 264 133 28 -15 43 206 -174 45 81 88 65 -77 34 -73 62 46 -98 -65 -84 463 33 -58 159 67 -187
6406a87N0L25m4l0k37Q3pQ1K84j94Oj25K5J14k87n0K26k0N9O0k43J36NN6k54K66
$$ -187 -137 188 144 114 -123 -40 -47 34 318 124 130 5 30 144 -143 -193 33 13 72 132 -111 25 30 86 -168 98
6432I8m5j24J33k20M79k70r0L33q1o3l05K64j52J62J3j71K18R4j92J01m01J55
$$ 98 53 -71 62 -158 321 51 -39 294 213 150 -155 109 -43 119 132 -39 179 273 81 182 -219 -64
6454f4K80l30J83j97K2J50k09P3K19q4m5L99n76J32J32Q0j31l02J09K29k15m2
$$ -64 216 -114 69 -128 -106 44 -165 -92 127 43 -2 397 -179 -47 85 165 34 -268 -159 70 -145 -187
6476a87K73k39K02J69k99J16j80K68j68O8o5K20k31n2M69l06j65K08O1j77J63
$$ -187 86 -153 49 218 -81 35 -145 123 -45 23 -42 178 -53 -105 364 58 -107 101 162 -15 148
6497A48l48M50l16m6J65ol50N08j61j6l3O4k36J45j33J38k04J68Pj0K38kk48r7
$$ 148 -200 250 -66 -112 53 47 -303 205 44 28 -5 59 -177 -32 -165 -27 -231 -63 -56 -66 172 170 -78 -175
6521a75M57o24J20L64m87K50M02n09j07M25j72K0j38j48L38k15J32J64o4J08m6
$$ -175 282 -342 -222 142 -345 -95 307 -202 -309 116 -56 -36 -174 -322 16 -199 -67 97 33 141 95
6542I5P7m56J23R4J25m0l92L82k42M18k14K04j29On7n0K15m44K67j50J47L36l39
$$ 95 172 -284 -161 -67 58 18 -374 8 -234 184 -30 174 45 51 -6 -56 159 -285 -18 -168 -21 315 -24
6565b4M3K09l25j63L04j81L1J18R1l75O2j15K95J55j22K06k78J96R7n4r5j3l38
$$ -24 19 228 -97 -260 44 -137 -106 12 103 -272 -210 -325 -30 125 3 209 -69 127 224 170 75 62 -276
6588b76N14k39j40J16J21k33M30k37r8L23l93LL57n69M15J35m63L01mk73L84k15
$$ -276 238 -1 -141 -25 96 -137 293 56 -42 281 -112 -109 248 -321 94 229 -234 67 63 -210 174 -41
6610d1mK65k00n13O63k53j11L41p7j53J40m38M96k05j1M36m59J53N1k23J49J61
$$ -41 -45 220 20 -493 170 -83 -194 147 70 -83 57 -381 115 -90 -101 335 -124 29 80 -143 6 167
6632A67k92L2J59k02K53k62L7L67k62j17K80j77j03O8m8J82K07n15m4K18Q0J69
$$ 167 -125 -93 66 -136 117 -145 -108 259 -3 -120 160 -17 -120 -52 -100 82 289 -226 -270 -52 28 197
6654A97L8k17K8Or5K26k31J24K21n60K24j39N9J44J37m43R0M42l85K37Q1o8k4
$$ 197 235 18 46 52 -43 183 -48 76 297 -263 -39 -178 -119 25 162 -281 -191 251 -134 103 184 116 92
6677I2j51k8P5R5j98K10k56J87j14j23J90J05p6j20J49j62K65j35p5J23j20J34
$$ 92 -59 -87 -12 83 -115 95 -161 26 -88 -211 -21 84 8 -112 37 -125 140 5 -70 53 -67 67
6699F7J8j14J11k35J61l7lJ96j18n4j04L87m14J1L1k10L50K63n20L53k9k43J60
$$ 67 85 -29 82 -153 8 -29 -32 164 46 -8 -112 275 -139 -128 -97 -307 43 306 -214 139 110 -133 27
6722B7j18m1L73k70K00k63Q5J96k97Pj9J92l31J08J12j01K08j64Q7J25l06L04
$$ 27 -91 -132 241 -29 171 -92 -7 189 -108 -101 -120 72 -259 -151 -39 -140 68 -96 -9 116 -190 114
6744A14q7L7j87J20j82K60k00N16k67n0L5j84j95L75J75l62L0J60k27J14Qr4K76
$$ 114 27 64 -123 -3 -185 75 -125 391 124 74 109 -75 -270 105 280 -82 -52 108 -119 -5 3 -91 185
6767A85m04J98J90l02J3J93j69L86m23M2L53k79k34N05k53K2q7l38O43j70j22
$$ 185 -219 -21 169 -133 -120 73 -96 290 -133 -91 262 -17 -251 254 1 23 -64 -402 241 71 -51
6788e1K26j60J34kK5l35J65L0j12L27j46L8k55K25K12k86m84L84J49j66J57j11
$$ -51 175 15 149 147 172 -163 2 32 -80 247 101 139 -116 109 321 35 -449 -65 84 -82 75 -36
6810c6j9J51rNK8j53J78M2k23l4J87k54K05L1n9P3k4QJ24k65qO6n5K23m92K11
$$ -36 -55 96 87 92 120 -33 145 187 -36 -70 117 -137 68 99 40 113 89 97 221 -44 -52 14 -41 182 -310 -99
6836i9k0K7j65L75j90K10p0j16K00j92j6J59j32Q0J51k00J28j38Kj01L94j56L4
$$ -99 -119 -92 -257 118 -72 138 68 -48 152 -40 -56 103 -29 51 202 2 130 -8 -6 -107 287 131 165
6859A65m48N27j91m4N0j30L1j42M19k9k39K17l94K4L26k19J7J03m7j24j55M42
$$ 165 -283 244 53 9 59 -71 -40 -182 237 208 -31 186 -208 -184 142 -77 -60 43 -4 -128 -283 159
6881A59j89LL2K43k8o83O06j75J67j23R4j61L01K02l58J23j14K8P0J34k49j85
$$ 159 -30 -27 5 248 220 -463 143 -32 135 12 106 -55 246 448 90 213 99 127 197 331 82 -103
6903a03J38r1l23L80l76L9K68J57O4p3j40n2K60j89k1M20m8l76K42j59j15J19
$$ -103 35 -56 -379 1 -375 -336 -68 89 153 80 -60 -112 148 -41 -62 358 310 -66 176 17 -98 21
6925B1J0K02k15j46M09k36l96N28l24O2K75k29k3J8K11k83J21k35K76p6j89J47
$$ 21 31 233 18 -128 281 45 -351 177 -147 -85 190 -39 -62 -44 167 -116 5 -230 46 -30 -219 -72
6947g2r0j10J23O0K45j07j88J66j3O6o2J70m13N40j16j6rOok47r0K85J34m39J63
$$ -72 -162 -272 -149 -89 156 49 -139 27 14 80 18 188 -225 315 199 183 174 180 174 -73 -163 122 256 -183 -20
6972b0k02r6M93j36K8J13R8l41J76j10O3Q1L1l09L21r7M7l86M83pl93j06K98j2
$$ -20 -222 -318 175 39 67 180 278 -63 113 3 66 147 178 -131 190 93 140 -246 237 230 -163 -269 29 17
6996A7L5lk99J63P0q5J55j50P9K90k32m3P6o9j75J90N4n6J8R1j0j26l35M36j91
$$ 17 52 49 -250 -87 -17 -102 53 -97 -18 272 40 -3 73 4 -171 19 73 17 35 126 116 -10 -345 91 -100
7021a00qL6N1Q7Q6j45k53J12K21n2J51j85Q3K7k34L0K27k03J00j49K40o7k51K10
$$ -100 -108 -72 -21 66 152 7 -246 -134 87 35 186 1 84 111 -123 -93 134 -69 31 -118 122 55 -196 14
7045A4k73K98l26J89l7N4R4J02k34K6R0o1O6j30J2J79k40KK7L44k82K28j0j11
$$ 14 -259 39 -287 -98 -135 -81 13 115 -119 -93 -3 -64 2 -128 -116 63 -177 -175 -148 196 -86 142 132 21
7069B1j47J86k55K48Mk96K64L0J22m8N1j16l5j63J06o0J87k34K34M6P0j75J2J20
$$ 21 -126 60 -195 53 57 -239 25 55 177 129 180 64 29 -134 -28 -88 99 -135 99 145 215 40 52 172
7093A72k39J9L31l84q4M5M07n45K73j10O27l33k77K5J46p5oK51l12K85j26Mk53
$$ 172 -67 -48 283 -101 -185 -140 267 -278 -5 -115 512 179 -98 -73 73 -2 -8 243 -69 216 90 94 -159
7116a59j14M46o7l2j43Q7j30K44k69j6J38K36k9P4k16k47L17j67j97M28M2k09
$$ -159 -273 173 106 74 -69 18 -112 132 -137 -153 -15 221 192 266 50 -197 120 -47 -244 184 226 17
7138A7j19O1k9q1K26k9QJ24l76n8J26J11k43L89j47P0n4n1j18K27q0k08L18m9
$$ 17 -102 -41 -70 -151 75 46 54 178 -198 -256 -130 -19 -262 127 -20 50 -4 -55 -173 54 -26 -234 84 35
7162C5K60l06l59L47J47m43P7L91r6Rj30J2K18r9j43N8j61L75n8J58l26K29k59
$$ 35 295 -11 -370 -23 124 -319 -242 149 53 62 -68 -56 162 63 -80 -22 -183 192 134 292 -34 195 -64
7185f4L06k78O4l3k9pK21l92K67L5m52K71J68r1J7q9K0k9J05k19K96K3j65K49
$$ -64 242 -36 28 -5 -34 -41 180 -212 55 90 -362 -91 77 -14 3 -86 -66 -95 10 -209 87 110 -55 194
7209A94m9k23K79q0k57M4j69O11n18p7M32k35J25J16j45j79L8j90J85M8p5K86
$$ 194 145 -78 201 121 -136 -92 -261 350 -168 -245 187 -48 77 193 48 -131 -93 -283 -98 -50 -125 161
7231A61j93J05M8m9o3Q1k2j00K2NR7j6j15k17K20K26q0j37k24L29k57L72j08j09
$$ 161 -32 73 121 72 9 90 68 -32 -10 -5 92 76 -39 -256 -36 190 110 -27 -251 78 -179 193 85 -24
7255b4j7L25l85K94j29k21K30j25M4j33J72J32P8n05L49J13l92K07j94J06K47
$$ -24 -41 284 -101 193 64 -157 73 -52 -8 -141 31 163 241 -264 85 198 -194 13 -181 -75 172
7276A72j32L9K5r5k20K32l9m5j80K45K90l80l3j32J76J67j13j56jJ62O9k6j05
$$ 172 40 79 104 9 -211 21 -18 -63 -243 2 292 -88 -121 -253 -77 90 -23 -179 -180 -18 51 25 -80
7299h0P3K47k19o1LQ7j79J3K54N4j61L0Nk32Q6Q0j10j78Q4K12OJRj2J49k13j31
$$ -80 -7 240 21 -40 -37 50 -129 -116 138 192 31 61 66 -166 -80 0 -110 -288 -204 8 14 15 24 12 161 -52 -183
7326a83J6M5r5R4j00J60mQ8j75q4K42j45k2R6K86o42M62j52K80r5j59j2M9O1J4
$$ -183 -167 -122 -217 -123 -223 -63 -67 21 -154 -238 4 -141 -163 -67 219 -423 39 -113 167 72 -87 -99 -50 11 25
7351B5o9k35K78L28l87J86J03j71N3n5J23m80N15l9l9n6o2P3j04J71l20K24n2
$$ 25 -44 -279 -1 327 -60 126 229 58 111 56 179 -301 214 175 136 80 18 91 -13 158 -162 62 10
7374A0J26k24n7J79j0j03l2K43l74J85O9j37J15q3Q0j66K62o5j30Rj30L10RJ09
$$ 10 136 -88 -145 34 24 -79 -111 132 -242 -57 12 -125 -10 -93 -13 -179 83 18 -112 -103 -233 77 86 195
7398A95m63J75K89j95K90n49J48L23k51J2J1N3R9O8k54o5K59j12j02j10L57k98
$$ 195 -268 -93 196 1 291 -258 -110 213 -38 -26 -15 38 137 205 -49 -114 145 33 -69 -179 178 -120
7420a20m6L7L57j82k09K33m30P22l64j05J99Jk78P7k27L95j03K41J68j08k32j
$$ -120 -166 -129 228 46 -163 70 -360 362 -2 -107 92 93 -185 -108 -335 60 -43 198 366 258 26 25
7442B5J94l97J58J46J55j06k19j48K83j15m9k8NL71l92K68p7Qj32N2R6j92J74
$$ 25 219 -178 -20 126 281 175 -44 -192 91 -24 -73 -101 -96 275 -117 151 74 82 -50 2 98 -94 80
7465H0j96L35k55K08o7r6j74L89k33k10K54Kj5k8k33L53Oj87P2j18L83l03k5j94
$$ 80 -116 219 -36 172 105 9 -165 224 -9 -219 35 37 22 -6 -239 114 120 -67 5 -113 270 -33 -58 -252
7489b52M97k85l1P5k32P1M3K78j33J40l65K02L49m02J83j82L47n79lK51Mj70J23
$$ -252 245 -40 -71 4 -228 -157 -114 164 31 171 -194 8 357 -45 138 -44 303 -276 -279 -28 -24 -194 -71
7512g1K49r4n1l44O2J86J09j16N8m0r3J46m4l5R1k3m1kJ02k54K03j17L03l06L27
$$ -71 178 84 33 -311 -249 -63 46 -70 -12 -52 -145 1 -43 -78 13 -10 -51 -53 49 -205 -2 -119 184 -122 205
7537B05m2j30l13N51m25K8K14O0q6k76J30J84l41K20j06P8J01P1j00K47k40j31
$$ 205 163 33 -280 271 -154 -126 88 148 62 -214 -84 100 -241 -21 -127 -49 52 123 23 270 30 -101
7559a01L47l87rK55J36j83j05J6K18l41K04N4k33k2L5K1N4j37M21l98O4r5J54
$$ -101 246 -141 -150 105 241 58 -47 -31 187 -154 50 104 -129 -151 -116 -95 -41 -178 243 -155 -91 -186 -32
7582c2K07j74k74J32K74m09M05l21L72n4k36j09J68m4J12j05K33j97mN3j43K61
$$ -32 175 1 -273 -141 133 -276 129 -192 180 126 -110 -219 -51 -95 17 -88 145 -52 -56 -3 -146 115
7604A15o2k15j3J92L9j21L18j08k16M8K37k6k61O4N0j0l5j54J59L3m6j34K9K68
$$ 115 53 -162 -175 17 56 -65 253 145 -71 -23 214 188 -73 -9 41 31 -4 -158 1 34 -12 -146 -117 151
7628A51j5k07Q6m2J07n6J34k22J38l00J75lJ8J3j61K30r4L2j49K25j79J09K4Q6
$$ 151 136 -71 15 -27 80 24 158 -64 74 -226 -51 -54 -36 -23 -184 46 -48 -16 -165 60 -119 -10 14 100
7652A00j12r9R9N3l5l52K78K00o5L84m29k26M07k31L5K35k11N7j59j52L16j54
$$ 100 -12 -111 -12 41 6 -346 -68 132 67 451 22 -204 203 -28 7 242 31 88 -71 -223 93 -61
7674f1J44O0k15R0R7N2j51k90J59J26l9N2K85j65k53M66n26m6J71p6j9J74j25
$$ -61 83 143 -72 18 115 167 16 -274 -115 11 -28 24 309 144 -109 357 -169 -215 -44 -120 -139 35 -90
7697i0J83l47m3L99J1j67oJ1J35Jr5R3r8q2J83N2k60K59j29R3J09k4k34o6J14
$$ -90 93 -254 -297 102 113 -54 -60 -49 86 87 -8 85 -13 -95 88 140 -120 139 10 103 212 188 -46 -112 2
7722Bn8J02j47J38J23l05K60j33nQ8r7K2K40m25j66M63m9r6j02J29m1O0l2K3N2
$$ 2 -56 46 -101 37 160 -145 115 -18 -23 65 -32 -10 230 -195 -361 102 53 -43 -145 -16 -57 3 -29 -6 46
7747D6k29L43j98O5Q2l00K85l15j8K21K7m8Q2j48J73Q9m6l16K73m3j31p1K38m0
$$ 46 -183 160 -38 27 109 -191 94 -221 -239 -18 9 -39 43 -105 68 157 111 -205 68 25 -106 -177 61 21
7771B1l00J57J59j5j98O1J09J29j05r4j5J65k79J86J00j28K07j09K0j76K12R9
$$ 21 -279 -122 37 22 -176 -115 -6 123 18 -76 -91 74 -205 -19 81 -47 160 51 71 -105 107 206
7793B06k98M4o0L58k00j45K49k91J76k80K6L51n4o9j39M9RM49o08L1L47l64M05
$$ 206 -92 -48 -108 250 50 -95 154 -137 39 -241 -215 136 82 13 -126 -77 -68 381 -227 -196 151 -213 192
7816A92j77r5K83k67J5J3o7N3K26j93k0K8m19M36p2k20L14K37k32J11L9j04l2
$$ 192 15 -80 203 -64 -49 -36 -103 -50 176 -17 -37 -9 -428 8 -64 -284 30 267 35 146 185 81 49
7839D9k51J84J14n9Oj62k17N10k09j24J11K09kj51K15k08j19K77k66j2j13J69
$$ 49 -202 -18 96 37 43 -119 -336 174 -35 -159 -48 161 159 8 223 15 -104 173 -93 -105 -218 -49
7861d9ll03J79R3J28ok16K17o1J37P9j52j6M8J2k78L54j1o3j3K7l19K54Q4k00
$$ -49 -52 -355 -176 -83 45 39 -177 40 -21 116 195 43 27 75 87 -191 163 152 89 76 103 -216 38 122 -78
7886g8P9j66K36j81p3L65k69P4Q7O9j5l39J91O3j81k56O17j13j84j35M46k72J39
$$ -78 1 -165 71 -110 -183 182 -87 -13 74 143 128 -211 -20 43 -138 -394 223 110 -74 -209 237 -35 104
7909A04P6J12n15K38j58K61k32N0J10m20O07m8j96J14j55K02l19K47J33m39P8
$$ 104 180 292 -223 15 -143 118 -114 -64 46 -374 233 185 -11 103 -52 150 -169 78 211 -228 -150
7930a50j05J79J48m9q6Q9J06k03J35j20Q8p4J17l0o8k0ol8L04l54K22j6o0J90
$$ -150 -255 -76 72 23 -63 26 132 -71 64 -56 32 -42 75 45 -23 -43 -49 -87 217 -137 85 69 9 199
7954A99l93K18J09l19Q3K21K0k93L85l49K20o3j77k6K92k49j39M51k31J62j92
$$ 199 -194 24 133 -186 -103 118 138 -155 230 -119 101 38 -139 -165 127 -122 -261 190 -41 121 -71
7975g1L08n6l34K60k47N63m38J98l29M0J34k25L19r0m4J79j57PQ5k30J52j59n8
$$ -71 237 181 -153 107 -140 423 -15 183 -146 -106 28 -197 122 32 -12 167 10 17 102 -128 24 -135 -193
7998a93K02K23j29l21L71k61O1J27l26L66j65K16j61j40K01j88O5K08j20r9L90
$$ -193 9 232 103 -218 153 -108 -47 80 -246 120 -45 171 10 -130 71 -117 -52 156 36 -63 327
8019C27m87K31L4k27M55l63J0K69j59J12Rk29J37k77K28K4j7M1j35J20rK15l33
$$ 327 -160 71 105 -122 333 -30 -20 249 90 202 211 -18 119 -158 70 94 77 118 -17 103 94 309 -24
8042b4J53j5k06O1j3%J48j06n4n3M2K10j49O9p7O3K15j62K3p0J39j13k16j15K13
$$ -24 129 114 -92 -31 -44 -44 104 -2 -56 -109 -67 143 -6 63 -14 49 264 102 125 55 194 81 -135 -250 -37
8067c7R0j90K88K6j08j66K15Q6k62L6K23k02J77j53m6M3l71M50l23L18L3p7p7
$$ -37 53 -137 151 177 69 -97 118 204 -58 -22 201 -1 176 23 -23 20 -351 99 -224 94 127 50 -27
8090b7l25K72k8n7Q1Q9M7K08m26J40p8Q2O2NK54j41k96Q4J89j05j23K11j83n3
$$ -27 -352 -80 -108 -165 -84 5 52 260 -166 -26 -104 -22 40 45 299 158 -138 -54 135 30 -93 118 -65 -118
8114a18N6j81K51J9oj65J48k62J69J12jO5j59L23j37k57L30j63J65k15J53q1N1
$$ -118 -62 -243 8 27 21 -144 4 -258 -89 23 22 87 -72 251 114 -143 187 24 189 -26 127 46 97
8137I7j91l13L10K23j47M8J46j2jk42j91J39J52k9J99j10K44j23l19L96m31N9
$$ 97 -94 -407 -97 126 -21 27 173 161 160 -82 -273 -134 18 -11 188 78 322 199 -120 276 -155 -96
8159i6l9J27K3r9J13JQ7k74P8NR0P5k71J39o4k05K24L14j43n9N1k67L42j25L8
$$ -96 -135 -8 15 -84 29 30 117 -157 -79 -74 16 91 -180 -41 -105 -310 -86 228 85 26 77 -190 152 27 65
8184F5j83J47j56M24k58r1O7
$$ 65 -118 29 -127 297 39 -52 15
8191A5
$$ Imaginary data points
##PAGE= N=2
##DATA TABLE= (X++(I..I)), XYDATA
0@%%%%%%%qJ6j6K4l2M0n6O5p9J02j28J58j90K26k72L27l86M50n26O15p14Q25r49
$$ 0 0 0 0 0 0 0 0 -8 8 -8 16 -16 24 -32 33 -46 56 -72 86 -104 122 -150 177 -209 241 -285 330 -384 441 -508
30e08J089j244J414j602J815k049K303k584K893l230L599m002M444m927N453o030
$$ -508 581 -663 751 -851 964 -1085 1218 -1366 1527 -1703 1896 -2106 2338 -2589 2864 -3166
46c166O658p342Q094q920R827j0824J1929j3157J4525j6062J7802j9788K2078
$$ -3166 3492 -3850 4244 -4676 5151 -5673 6256 -6901 7624 -8438 9364 -10424 11654
59A1654k4758K7944l1798L6577m2691N0829o2252P9577j09291J73928n58661L72534
$$ 11654 -13104 14840 -16958 19619 -23072 27757 -34495 45082 -64209 109719 -448942 -76408
71g6408O06390j065288J60000N62065k91314k98149N67472k5264n73859K32529
$$ -76408 529982 -535306 -375306 186759 -104555 -402704 164768 139504 -434355 -201826
81b01826O42904m86039l79655O46138K21469n16955O8981L15176r4331j82971
$$ -201826 441078 -44961 -424616 221522 442991 -73964 -4983 310193 215862 32891
91C2891M6070k7893j82244J07626L68364k20448m06673K43207K51507k08001o6094
$$ 32891 78961 51068 -131176 -23550 344814 124366 -282307 -39100 212407 4406 -61688
102f1688Q1731m3505o9152J4165L5483m1799L4342J47482j11320r0210K25639
$$ -61688 20043 -23462 -92614 -78449 -42966 -84765 -50423 97059 -14261 -104471 121168
113A21168k3259j82607J13250k351n4381K23110k9765l02096P4044K81357p5145
$$ 121168 97909 -84698 28552 26201 -28180 194930 165165 -136931 -62887 218470 143325
124A43325k42164J22918J68251k57997o0667K62403j80220j44825L56910n7634
$$ 143325 -98839 24079 192330 -65667 -126334 136069 -44151 -188976 167934 110300
134A10300m06906J48597L04928j79162k37263J77993J90830j90409m1592K22791
$$ 110300 -296606 -148009 156919 -22243 -259506 -81513 109317 -81092 -122684 100107
144A00107j49296j45276L25458M7979l31808K6976K64439l0256k23106M6587K40554
$$ 100107 -49189 -194465 130993 178972 -152836 -125860 138579 108323 -114783 -68196 172358
155A72358q7051j55593J59481l8151j97544J77824J21612k24221o2723J69071
$$ 172358 85307 -70286 89195 51044 -146500 31324 152936 -71285 -134008 35063
165C5063L9131j43825k2303J63801l1678j26223J04107j808j18957J11568M5397
$$ 35063 74194 -69631 -91934 71867 40189 -86034 18073 16265 -102692 8876 54273
176E4273j12625M1902P5249j014k6634o5710L2288P7361k5948k5045k4218m91
$$ 54273 -58352 -16450 58799 57785 31151 -34559 -2271 75090 49142 24097 -121 -612
188f12N8711n0640j9762R5185o4274n4080Q8128o1780o6392R1625R928p0843k6776
$$ -612 58099 7459 -12303 82882 18608 -35472 52656 -9124 -75516 16109 26037 -44806 -71582
201g1582N5882P5736q4335o0685J11737j1661n9339P9906k0505p6021M5160M7759
$$ -71582 -15700 60036 -24299 -84984 26753 15092 -44247 35659 15154 -60867 -15707 32052
213C2052M575m3151j1603Q6799m4250r2705R5478J3228r8993M0772K6634n1735
$$ 32052 36627 -6524 -18127 68672 24422 -68283 27195 40423 -58570 -17798 8836 -42899
225d2899o5J8837K7548k6602m6769P9550J5379q8843M4623L8442m8606K1116J5800
$$ -42899 -42964 -24127 3421 -23181 -69950 9600 24979 -63864 -19241 19201 -29405 -8289 7511
238G511P558J7784m6914K8952N9997o5211K852N7376n0920j9710K4911k36l537
$$ 7511 15069 32853 -14061 14891 74888 9677 12529 69905 18985 -725 24186 23950 20413
251B0413l9570K2509N0802q3009q431R0157n8691m1704O0676j8725l0451J2694
$$ 20413 -19157 3352 54154 -28855 -37286 52871 -5820 -47524 13152 -5573 -36024 -23330
263b3330J5565J0674n1428J0972Q6109n4724m1663Q3504j8941m2640M5462L892
$$ -23330 -7765 2909 -48519 -37547 48562 -6162 -47825 35679 16738 -25902 19560 23452
275B3452j7182j2791K328M5958l3818l3836P1138k0571n4618N3282m353l8408
$$ 23452 6270 -6521 -4193 41765 7947 -25889 45249 24678 -29940 23342 18989 -19419
287a9419J6544j0046K112j911k6805L7062l287m1844M7779N576l4091L5740n363
$$ -19419 -2875 -12921 -10809 -12720 -39525 -2463 -5750 -47594 185 5761 -28330 7410 2047
300B047j2499K9838k3488N866K5072l4617J8986K3598l3479J8204M259j8985K7379
$$ 2047 -10452 19386 -4102 1764 26836 -7781 11205 34803 1324 19528 23787 4802 32181
313C2181k3774j5348L5449l8902j2943M3452k9197j4291J8541j4036J6745l422
$$ 32181 8407 -6941 28508 -10394 -23337 20115 -9082 -23373 -4832 -18868 -2123 -5545
325e545j7062L1490k7956j8672O0042k3397l9199L7445m471o041J9019q791J1429
$$ -5545 -22607 8883 -19073 -37745 22297 -1100 -40299 -2854 -7325 -13366 5653 -3138 8291
338H291j1148j4391N1732j6464m5227M6495n613l5863L5531J395j7048N663o740
$$ 8291 -2857 -17248 34484 18020 -27207 19288 13675 -22188 13343 14738 -2310 3353 -3387
351c387K0303m936k5634M1367j3809n0881M8093R168l9868K5453l137k0192K2224
$$ -3387 16916 11980 -13654 27713 13904 -36977 11116 20284 -19584 5869 2732 -17460 4764
364D764P975P793j7374k5498M6553K21m3871L6688p182m3747M6994R319m0478
$$ 4764 12739 20532 3158 -22340 24213 24434 -19437 17251 10069 -33678 13316 22635 -17843
377a7843J2918J0694q85r896j1525L4047j4740m0917M9863j899n0896M9591J6605
$$ -17843 -4925 5769 4884 -5012 -16537 17510 2770 -38147 11716 9817 -41079 8512 25117
390B5117n0742J6985K9138o854k0996p157L8581j4543m5168M9913L498n9999M2791
$$ 25117 -25625 -8640 20498 13644 -7352 -14509 24072 9529 -35639 14274 17772 -42227 564
403E64K2288n4232J3750L0117j5391k0231k776L3043q688l8561M1125P099m4733
$$ 564 22852 -31380 -17630 12487 -2904 -23135 -25911 7132 -1556 -40117 1008 8107 -36626
416c6626M1101J0368m9570L5103L0965k9919j0082K822J9535R238k0854J1078
$$ -36626 4475 14843 -34727 376 31341 1422 -8660 -5838 13697 22935 2081 13159
428A3159n930j3616N0827j4076n5934M7541J8072m2387J9593Q678k9197J851J3533
$$ 13159 7229 -6387 44440 30364 -25570 21971 40043 -2344 17249 25927 -3270 -1419 12114
441A2114L806k7172k441N4607m0742o4571P8691K7458p7395J7414L5954l4891
$$ 12114 15920 -11252 -13693 40914 172 -64399 14292 41750 -35645 -18231 17723 -17168
453a7168l277L5772J791m8446P447Q0659l8207p9834P9959L2704r1519K0830O0615
$$ -17168 -20445 15327 17118 -31328 -23881 56778 18571 -61263 18696 51400 -40119 -19289 41326
466D1326m0590k6585K9111L213m0788R896P0560m5257r1868P3700N7648p6564
$$ 41326 736 -25849 3262 6475 -34313 -24417 46143 886 -90982 -17282 40366 -36198
478c6198q203L8514j0745J0127J3339j8003j9931Q557N1295p298o0530K9648L8766
$$ -36198 -44401 -5887 -16632 -6505 6834 -11169 -31100 -22543 28752 21454 -39076 -9428 29338
491B9338k4353M731k690o313M8096p652n3799J1158K3994M575o470j9698O654
$$ 29338 4985 9716 7026 713 48809 41157 -12642 -1484 22510 27085 20615 917 7571
504G571P819R435J9032n6546k8961R5082P08r8013J8420M7853l3093j1859M0486
$$ 7571 15390 24825 43857 -12689 -41650 53432 54140 -43873 -25453 22400 -10693 -22552 17934
517A7934L914n5321J3398P2931o2528o6966J09317J9511j21886L1801R4399n2445
$$ 17934 21848 -33473 -20075 52856 -9672 -76638 32679 52190 -69696 -37895 56504 4059
529D059n9452N2939L9061n6242n525P1396n9060q0764J09069M7741j15067Q033
$$ 4059 -55393 -2454 36607 -19635 -25160 46236 -12824 -93588 15481 63222 -51845 -43812
541d3812Q9364l6171n8671L6172M5163l7213k8439N0965j4848n3984P0480L3334
$$ -43812 45552 9381 -49290 -13118 32045 -5168 -33607 17358 2510 -51474 19006 52340
553E2340r0791l07P6980l24m5958k6516J8366K9675l00O321j5030k9963L7166
$$ 52340 -38451 -38758 38222 37898 -8060 -34576 -16210 13465 13165 19486 4456 -25507 11659
566A1659K2534l8174L558J2289n535J6502k5338k7585M7950K6059l5524k3771
$$ 11659 34193 -3981 -423 11866 6331 22833 -2505 -30090 17860 43919 8395 -15376
578a5376K1595L0972k8588l1145K8841j4453j5684O9414j6420r0800M1799P2006
$$ -15376 6219 37191 8603 -22542 6299 -8154 -23838 45576 29156 -61644 -19845 52161
590E2161m3767m4742M2446K6831o2175j5058P4302k4565n7930P7510J9819r5415
$$ 52161 8394 -36348 6098 32929 -29246 -44304 29998 5433 -52497 25013 44832 -50583
602e0583K3079P8039m5573o0022M5592N2982m9728l6426O3427m722o0905N7843
$$ -50583 -27504 50535 4962 -55060 -9468 43514 -6214 -42640 20787 16065 -44840 13003
614A3003L7550p6082k242N7819k3800m5139K6177N0471k6300m7807L8156J7643
$$ 13003 50553 -25529 -27771 30048 6248 -38891 -12714 37757 11457 -36350 1806 19449
626A9449m5909K3635K6459m6497J685L8398j2451k3830L888K7112Q406k5285L875
$$ 19449 -26460 -2825 23634 -22863 -21178 17220 4769 -19061 -15173 11939 20345 -4940 -1065
639a065J0949j4622J2198O44k0329K8722J0865l0377P866M763j3733J7603P911
$$ -1065 9884 -4738 7460 8104 -12225 16497 27362 -3015 4851 9614 -4119 13484 21395
652B1395j9618j3214R229K0720k1727k1871M3538N35m4948K5180J7276l6485O015
$$ 21395 1777 -11437 -2208 18512 -3215 -25086 18452 18987 -25961 -781 16495 -19990 -13975
665a3975K4971j2700j8207J2146K7863k5020l2980M8167J8056m9932J3556K9616
$$ -13975 10996 -1704 -19911 -7765 20098 -4922 -37902 10265 28321 -21611 -8055 21561
677B1561l0495q947K5169O753j8444p940K9665m722m1438K8934L0112m2213m786
$$ 21561 -8934 -17881 7288 14041 -4403 -12343 17322 12600 -28838 96 30208 -12005 -16791
690a6791K8304j1568j0638N510N109k753j1698J6953J1666l1403M503K5702j5394
$$ -16791 11513 -55 -10693 -5183 -74 -2827 -14525 2428 14094 -17309 -12806 12896 -2498
703b498k996J1160m749M459p221m258J9670p564r143J8306q573j2391R184L022
$$ -2498 -5494 5666 917 5376 -1845 -6103 13567 6003 -3140 15166 6593 -5798 3386 6408
717F408K351r805q740K1551o612k1727K3156K497k2795J1596R492o732o870m523
$$ 6408 8759 -1046 -9786 11765 5153 -16574 6582 9079 -13716 -2120 7372 640 -6230 -10753
731a0753J5413j960j9767K2983P874l1092J0193J8797j2391l821N528O387p092
$$ -10753 4660 2700 -17067 5916 13790 -17302 -7109 11688 -703 -4524 1004 7391 299
744B99j5646K3266J0417l3802J0629K4632k3941m216J9364m477j3167l340J7603
$$ 299 -15347 7919 18336 -15466 -4837 19795 -4146 -8362 11002 6525 -6642 -9982 7621
757G621N801k7994P534K2803k5357k970K6977r399j5546N130R892M385j6386L693
$$ 7621 13422 -14572 -7038 15765 -9592 -12562 14415 5016 -10530 -5400 4492 8877 -7509 -3816
771c816K0772k3184o912L1504r559k0498J2739O452m724p184L476J1884j9434
$$ -3816 16956 -6228 -13140 18364 8805 -11693 1046 7498 2774 -4410 -934 10950 -8484
784h484p550K9897j0075k2253J9953K851j3742M857N566L391j0703p625K2438
$$ -8484 -16034 13863 3788 -18465 1488 4339 -9403 -4546 1020 4411 -6292 -13917 8521
797H521l435j9804J8952M392j8540Q609Q819k587o494p615J5153K631j9111J3597
$$ 8521 5086 -14718 4234 8626 -9914 -1305 7514 4927 -1567 -9182 5971 8602 -10509 3088
811C088P877k1984Q934J4355j0763m228n09O097L474j4081P988R824k0253N453
$$ 3088 10965 -11019 -2085 12270 1507 -2721 -3230 2867 6341 -7740 248 10072 -10181 -4728
825d728J6676j3119k839O296k218K878o026K628J0953j5421l15J8115j1029m262
$$ -4728 11948 -1171 -4010 2286 68 2946 -3080 -452 10501 -4920 -5235 12880 1851 -2411
839b411J0755o001m04K60j110R220j0308q719J6213n179q090R636o418l672M882
$$ -2411 8344 2343 1939 2199 1089 10309 1 -8718 7495 2316 -5774 3862 -2556 -6228 -1346
854a346k554N362n339j1718J6816K244j6727J0294M756q651L725J043K595j514
$$ -1346 -3900 1462 -3877 -15595 1221 3465 -13262 -2968 1788 -6863 -3138 -2095 500 -1014
868a014q480J4464P60k0095J6413J0848k2233L002J3473n319m338k25O856j061
$$ -1014 -9494 4970 5730 -14365 2048 12896 -9337 -6335 7138 1819 -2519 -2744 4112 3051
882C051j2068J5067L900k3775J2756J7195k1328j831J4226l469m076p12O147R02
$$ 3051 -9017 6050 9950 -13825 -1069 16126 -5202 -7033 7193 3724 -352 -1064 5083 5985
896E985j0985J0824O141k1335J1450J5884k0724j040J4498n067k883o90N38K543
$$ 5985 -5000 5824 11965 -9370 2080 17964 -2760 -3800 10698 5631 2748 2058 2596 5139
910E139n456O664p81j9169J3869J4894k3400j413J3819r094M21N067o774k167
$$ 5139 -317 6347 5566 -13603 266 15160 -8240 -9653 4166 -4928 -4507 560 -6214 -8381
924h381K300R358m290j7124J6200J2187k3755N178J6954j4723R65R957r875k621
$$ -8381 -6081 3277 -1013 -18137 -1937 10250 -13505 -8327 8627 -6096 -5131 4826 -5049 -7670
938g670R417O808r488j4140J7402J0718k2287N577J3850j7149N151J3318j5174
$$ -7670 1747 8555 -933 -15073 2329 13047 -9240 -3663 10187 -6962 -1811 11507 -3667
951c667l544J2718J955q823n404J4659K679k0844Q539J2906j5931Q103R167k2710
$$ -3667 -7211 5507 7462 -1361 -6765 7894 10573 -10271 -1732 11174 -4757 3346 12513 -10197
965a0197K067K2600n387j5437Q92J5302j98j6398J0281N439j8731J6365J2922
$$ -10197 -8130 14470 9083 -6354 -5462 9840 9642 -6756 3525 8964 -9767 6598 19520
978A9520l1677J169K8705j0756k0447Q198J6925o775j6328J1695K485k0239K1787
$$ 19520 -12157 -10988 17717 6961 -13486 -5288 11637 4862 -11466 229 2714 -17525 4262
991D262J5620l8635j753L6476p888k3899P275J5645m784j0738J2350n62k2031
$$ 4262 19882 -18753 -20506 15970 8082 -15817 -8542 7103 2319 -8419 3931 3369 -18662
1004a8662J9074J9565l1985m021L0201q352j8807O529J0419r2p953M102J426j3507
$$ -18662 412 19977 -12008 -16029 14172 5820 -12987 -6458 3961 3869 -4084 18 1444 -12063
1018a2063J2517J3576k3288l82K1323q108q938L284n03N670J632l863l23l116
$$ -12063 454 14030 -9258 -9640 11683 3575 -5363 -2079 -2582 3088 4720 857 534 -2582
1032b582O742K748j4892R237J3307j4674K95N651j1556P869J1906j2497p769R408
$$ -2582 4160 6908 -7984 1253 14560 -114 181 5832 -5724 2145 14051 1554 -6215 3193
1046C193J0172j0987j7104J7643J0945k1387O539J0937k2276L263K2280j2297
$$ 3193 13365 2378 -14726 2917 13862 -7525 -986 9951 -12325 -9062 13218 921
1058I21j5440J3177J5261j4600j9842J9677J3751k2694O120J6261k2683j613K3684
$$ 921 -14519 -1342 13919 -681 -20523 -846 12905 -9789 -3669 12592 -10091 -11704 11980
1071A1980r124j7164J0215J7188q438k1299J1772J5104j7272K513J6275j6584
$$ 11980 2856 -14308 -4093 13095 4657 -16642 -4870 10234 -7038 -4525 11750 -4834
1083d834m110J6224n982j0208O231J0820n34j4513J395J2451q704p36R489r000
$$ -4834 -8944 7280 1298 -8910 -2679 8141 7607 -6906 -5511 6940 -1764 -2500 6989 -2011
1097b011J692Q239j0612j732O746l41L604k221n691L481o45J106N15o818J0539
$$ -2011 -319 7920 -2692 -4424 2322 1981 5585 3364 -2327 1154 509 1615 2130 -4688 5851
1112E851M503j8559L371J1071j0031J318Q325o296m350K381N188m309r459J4845
$$ 5851 10354 -8205 -4834 6237 -3794 -2476 5849 -447 -4797 -2416 2772 -1537 -10996 3849
1126C849R103k1983J993J5543j1294l466J2204j065o260r4O272j790j3187J0560
$$ 3849 12952 -9031 -7038 8505 -2789 -6255 5949 4884 -1376 -1470 4802 3012 -10175 385
1140C85J3605j7766l427J4420p972o151P747J450k160k882K499L201j0611J578
$$ 385 13990 -3776 -7203 7217 -755 -6906 841 2291 131 -2751 -252 2949 -7662 -6084
1154f084J3307p648m804Q687m182k087J284k008O261J74p112O267j459n267O177
$$ -6084 7223 -425 -5229 3458 -724 -2811 -1527 -3535 2726 2900 -4212 2055 596 -4671 1506
1169A506J97k06J101m317N044j24j1452R840P273j2004K081O775o176k743J543
$$ 1506 1703 1497 2598 -1719 3325 3201 -8251 1589 8862 -3142 -1061 5714 -462 -3205 -1662
1184a662N486j044r696Q580M837j6268M883J4269j0705m193Q544J008n843m239
$$ -1662 3824 2780 -6916 1664 6501 -9767 -4884 9385 -1320 -5513 3031 4039 -1804 -6043
1198f043Q775L784j3147N846J2959j5827m208J4300k653p587L399M439j856j0168
$$ -6043 2732 6516 -6631 -785 12174 -3653 -7861 6439 3786 -3801 -402 4037 2181 -7987
1212g987N038J1747j2366l771J5082o084r324Q078K581l373l809L628Q558r531
$$ -7987 -2949 8798 -3568 -7339 7743 1659 -7665 413 2994 -379 -4188 -560 7998 -1533
1226a533o028J3800l199r781R749L330p692k115L222N738n520n542J2233j958
$$ -1533 -7561 6239 3040 -6741 3008 6338 -1354 -3469 -247 5491 -29 -5571 6662 4704
1240D704j3717R859O127j0354J69N442J290m628m415R406o65j3109R743Q514j3645
$$ 4704 -9013 846 6973 -3381 -3212 2230 3520 -1108 -5523 3883 3218 -9891 -148 8366 -5279
1255e279k78Q787k702m283P87P136j266j2138Q332R603j4288n20J3237n978o178
$$ -5279 -5557 3230 528 -3755 -2968 4168 2902 -9236 -904 8699 -5589 -6109 7128 1150 -5028
1270e028N322M590l420q428O829Q277j3991p21J4522q152o950J0460K260n993
$$ -5028 294 4884 1464 -6964 -135 8142 -5849 -6570 7952 -200 -7150 3310 5570 -423
1284d23k954M914M485j0040o5J3391q576p776J2817M80q533K036L896N1o023n03
$$ -423 -3377 1537 6022 -4018 -4083 9308 732 -7044 5773 6253 -2280 -244 3652 3703 -2320 -2823
1300b823R653o752p435J2294M44r880N119L234l498k904K69N851l355p670R135
$$ -2823 6830 78 -7357 4937 5381 -4499 620 3854 356 -2548 -2279 3572 217 -7453 1682
1315A682K635r699L813M637m500j420J93L448q84p906P120N700j0816K686R364
$$ 1682 4317 -5382 -1569 3068 -1432 -2852 -2659 789 -95 -8001 -881 4819 -5997 -3311 6053
1330F053o740l511M274K924k334o163O223N092j1239K809J1484r877m577R967
$$ 6053 -687 -4198 76 3000 666 -5497 726 5818 -5421 -2612 8872 -1005 -5582 4385
1344D385o76o369p03N523J887r179L155J0088j0056l140J2656m735p784O064K761
$$ 4385 3709 -2660 -3363 2160 4047 -5132 -1977 8111 -1945 -5085 7571 2836 -4948 1116 3877
1359C877l084l766L488N864p474k145R635m883n333P448k157m398L322P87J26
$$ 3877 793 -2973 515 6379 -1095 -3240 6395 1512 -3821 3627 1470 -2928 394 1181 1307
1374A307j559j972N733j451n004M239o10k181K827l821R93L780n309J947M129
$$ 1307 -252 -2224 3509 2058 -2946 1293 683 -1498 1329 -2492 -1499 2281 -3028 -1081 3048
1389C048o765J293M905l914k305Q88M205L69p971M500P699r915J82R007o867l650
$$ 3048 -3717 -2424 2481 -1433 -3738 -2850 1355 1724 -6247 -1747 5952 -3963 -3781 5226 -1641 -5291
1405e291Q383j64o270q43P729J167j1025L931J0190j0065k917J1246n063o647
$$ -5291 3092 2928 -3342 -4185 3544 4711 -6314 -2383 7807 -2258 -5175 6071 1008 -5639
1419e639Q394J761o343j682P011K826j1070J872J0773q111m343J0175n045n308
$$ -5639 2755 4516 -1827 -3509 3502 6328 -4742 -2870 7903 -208 -4551 5624 579 -4729
1433d729P757N61n375m23M755J822p481R61P428n843j694O938n627k569Q487l273
$$ -4729 3028 3589 -1786 -2209 2546 4368 -3113 -2152 5276 -567 -2261 4677 -950 -3519 4968 1695
1449A695n732M279K292j818l555J411K979m861J864N621r068L58J0603p228n545
$$ 1695 -4037 242 2534 716 -2839 -1428 1551 -3310 -1446 4175 -4893 -4535 6068 -1160 -6705
1464f705P899J263m238j54K731O1m756M474M236j0334J608J1937q616p113J0000
$$ -6705 1194 2457 -1781 -1935 796 857 -3899 575 4811 -5523 -3915 8022 -594 -7707 2293
1479B293R41o066J737K881j655l468M696L468r824K040J1753q993o257J0335j047
$$ 2293 3234 -2832 -1095 1786 131 -3337 1359 4827 -4997 -2957 8796 -197 -6454 3881 2834
1494B834n118L306J717k815j488M313P07q017L548R110q899m081R410l368m655
$$ 2834 -2284 1022 2739 -76 -1564 2749 3456 -4561 -1013 8097 -802 -4883 4527 1159 -3496
1509c496O418q32m633K215L909k757o284N213O993r323j676R273o413l985Q559
$$ -3496 2922 2090 -2543 -328 3581 824 -5460 -247 6746 -2577 -4253 5020 -1393 -5378 3181
1524C181k158o004N103M098m894n389O061N324r105N07R362p333m254R680l261
$$ 3181 1023 -4981 122 4220 -674 -6063 -2 5322 -3783 -3276 6086 -1247 -5501 4179 918
1539I18o388O525M122n628m415N104M216p648J10Q549o488l390Q566m333n114
$$ 918 -5470 1055 5177 -451 -4866 238 4454 -3194 -3084 5465 -1023 -4413 4153 -180 -5294
1554e294O963K691m641j987L136K069n590P98O171n106j150O451n429m322P549
$$ -5294 1669 4360 -281 -2268 868 2937 -2653 -1855 4316 -790 -1940 4511 -918 -5240 2309
1569B309Q1l761R41J372j63k805J081L155m125J417N591o702k904Q187k593l748
$$ 2309 2390 -1371 -430 942 779 -2026 -945 2210 -1915 -498 5093 -1609 -4513 3674 1081 -2667
1585b667M269L34k255o50J348P14l681K504N439o579k569P437k984m259N213M61
$$ -2667 1602 1936 -319 -969 379 1093 -2588 -84 5355 -1224 -3793 3644 660 -3599 1614 2075
1601B075k290k73N99N61l216J428N096m690k788O360l193l719M363L98j744J107
$$ 2075 -215 -488 111 672 -2544 -1116 3980 -710 -3498 2862 -331 -4050 313 711 -1033 74
1617G4l66J27j651n6L913j829j755M591k546k512L144j726M71K897k883m71J222
$$ 74 -292 -165 -1816 -1872 2041 212 -1543 3048 502 -2010 1134 -592 -121 2776 -107 -578 644
1634F44j343P65k16M00K134l456J63L185m239m96N751k665k527L024j35j700p30
$$ 644 -699 66 -150 250 2384 -1072 -909 2276 -1963 -2459 3292 627 -1900 1124 989 -711 -1441
1651a441J526K916m184l83N108n038k163O281j251l388K661J005j674k246J584
$$ -1441 85 3001 -1183 -1566 3542 -1496 -3659 2622 1371 -2017 644 1649 -25 -2271 -687
1666f87M251m297j628O196k990m950M872J343l192N89J011J189l587j092N639
$$ -687 3564 -733 -2361 3835 845 -4105 767 2110 -1082 -493 518 1707 -1880 -2972 2667
1681B667j562m439N263N09n062J572K034m30p74m75L284j226m657M273J895m534
$$ 2667 1105 -3334 1929 2438 -2624 -1052 982 552 -222 -697 2587 1361 -3296 977 2872 -1662
1697a662J499K896k304j635N5K317P4m047L915K186o227Q86M990l607j309K543
$$ -1662 -163 2733 429 -1206 -1151 1166 1240 -2807 1108 3294 -2933 -2047 2943 -664 -1973 570
1713E70J394j783l120L240K428n590J168N710m698k894M286M77k174q21K973J231
$$ 570 1964 181 -2939 301 2729 -2861 -1693 4017 -681 -3575 711 1188 -986 -1807 1166 2397
1729B397n464M17N608m281k489N720K1l973J309K223l30l405J240M638l683l838
$$ 2397 -3067 -2650 2958 -1323 -3812 1908 1929 -2044 -735 1488 1158 -2247 -1007 3631 -52 -3890
1745c890O530r67m787L455K599k214j621P88K913l065k936N813J04n797L498K934
$$ -3890 2640 1673 -3114 341 2940 726 -895 -107 2806 -259 -3195 2618 2722 -3075 423 3357
1761C357l525n34J833J347k443k359L958R8n280K961L762m705j14K926o73j641
$$ 3357 -168 -702 1131 2478 35 -2324 1634 1732 -3548 -587 3175 -1530 -1644 1282 609 -1032
1777a032j381L302N69m518K011M092m949j98M270j436k350J45K450L1m345J960
$$ -1032 -2413 889 1458 -3060 -1049 3043 -1906 -2104 2166 730 -1620 -1475 975 1006 -3339 -1379
1793a379M923n017j556O308j835m159K221K603j670l295K408M015n428r29O757
$$ -1379 3544 -1473 -3029 3279 1444 -2715 -494 2109 439 -2856 -448 3567 -1861 -2790 3967
1808C967k510m558M631J113l982n32K564J117l851J80N610k806m192N554N0m673
$$ 3967 1457 -3101 1530 2643 -1339 -1871 693 1810 -2041 -1861 3749 943 -3249 2305 2355 -2318
1824b318K182K028j725j485M99L040j787k522M359O1m462J970J313k000J94R2
$$ -2318 -136 1892 167 -1318 -819 2221 434 -2088 2271 2332 -2130 -160 1153 -847 -653 -561
1840e61P58K00k145K251J398l134N05J896j268J35j185J123J903l550L64L951
$$ -561 197 397 -1748 503 1901 -1233 -728 1168 -100 35 -1150 -27 1876 -1674 -1310 2641
1856B641k921j781L891r26k990J006K156n10l774K551M372n191j789O560k233
$$ 2641 -280 -2061 1830 904 -2086 -1080 1076 566 -3208 -657 3715 -1476 -3265 3295 1062
1871A062m640M116J905l933j236L979J483n329Q27O373m484m358O514J48n984
$$ 1062 -3578 538 2443 -1490 -2726 1253 2736 -2593 -1766 4607 123 -4235 2279 2427 -3557
1886c557K900L017k320j826K550K536m490r13N938k612m764N118N58l888K002
$$ -3557 -657 2360 40 -1786 764 3300 -1190 -2103 3835 1223 -3541 1577 2135 -1753 249
1901B49J119j318l21M52J231j823j169L120q39k706K638n25j288K441j340j183
$$ 249 1368 50 -271 181 1412 -411 -1580 1540 701 -2005 633 108 -1180 1261 -79 -1262
1917a262K520r65j077Q76J31o1r21N28J258l024L91M549l800k315N373p50l850
$$ -1262 1258 293 -784 92 223 162 -759 -231 1027 -1997 -1606 2943 -857 -3172 2201 1451 -2399
1934b399J812K321j721k244K330K274m578J73O131m111l969O246N73n547J291
$$ -2399 -587 1734 13 -2231 99 2373 -2205 -2032 4099 -12 -3981 2265 2838 -2709 -1418
1949a418L368j733k524K138K830m182j069O467l307m339N533J035m720J154K284
$$ -1418 1950 217 -2307 -169 2661 -1521 -2590 3877 570 -3769 1764 2799 -1921 -767 1517
1964A517q87j750R74K401l105q02M243k146l273M080L5k920J699P94j130K42K07
$$ 1517 630 -1120 -146 2255 -850 -1652 2591 445 -2828 1252 1287 -1633 66 860 -270 -28 179
1981A79K7r78L56K328k480p82L485k012k012L320r35k362K907j45k324M19J786
$$ 179 206 -772 -416 1912 -568 -1350 2135 123 -1889 1431 496 -1866 1041 896 -1428 -1009 777
1998G77N48k910O54L941l820j597M693j942l177M281M21l533J85K479J65l211
$$ 777 1325 -1585 -931 3010 -810 -2407 2286 344 -2833 1448 1869 -1664 -1479 1000 1165 -2046
2014b046J232L846l497k304N232j724l791L728J203l307K04K168K62k817Q71L211
$$ -2046 -814 3032 -465 -2769 2463 739 -3052 676 1879 -1428 -1224 944 1206 -1611 -740 2471
2030B471k178k222L578j051k849L276M33k521O19Q58n3j097j4J923j343q16K122
$$ 2471 293 -1929 1649 598 -2251 1025 1458 -1063 -444 414 361 -736 -750 1173 -170 -986 1136
2047A136r66j895K868l41j847J898k58q41N66m94O29o48k10J567j631j083K938
$$ 1136 170 -1725 1143 802 -1045 853 595 -246 320 -174 455 -193 -403 1164 -467 -1550 1388
2064A388j764j391L011n05k046J466N6q76M4R10R91k280l64L297k279j765L722
$$ 1388 -376 -1767 1244 739 -1307 159 215 -661 -617 293 1284 -996 -1360 1937 -342 -2107 1615
2081A615r69k348K307K67j423QO77P94j212n23K466j670k146L398k29k469K617
$$ 1615 646 -1702 605 872 -551 -543 134 928 -284 -807 1659 -11 -2157 1241 1012 -1457 1160
2098A160l92j760N47L38R30q98o18K199j552j741K675o72j733K144J00j522J137
$$ 1160 768 -992 -445 -107 823 -75 -693 1506 -46 -1787 888 216 -1517 627 727 -795 342
2115C42l72O6k27l22J897j076j805K651j063j709K361J9j592R38k8k44O2n93J319
$$ 342 -30 36 -191 -513 1384 308 -1497 1154 91 -1618 743 762 -830 108 80 -164 -102 -695 624
2134F24k73j539J510J09j626J526L78j095J213o84k59N50j234R10O01j370J130
$$ 624 351 -1188 322 431 -1195 331 709 -386 827 143 -116 434 -800 110 711 -659 471
2151D71K86j787J086r7q8Q00j039J69J036j669L3J635j278M8Q13m60K33o17J98
$$ 471 757 -1030 56 -41 -129 671 -368 -199 837 -832 -799 836 -442 -394 419 -41 192 -425 -227
2170b27J343j640j98K028j791q06J608k81j63K56J25P65j365m10K164j245j217
$$ -227 1116 -524 -722 1306 -485 -1291 317 36 -127 129 254 1019 -346 -756 1408 163 -1054
$$ [...]
8191C
##END NTUPLES=NMR FID
##END=
