##TITLE=1H_102-2024
 DMSO-d6
 8 sc, 
 5.12.2024
##JCAMPDX= 6.0         $$ Bruker NMR JCAMP-DX V2.0
##DATA TYPE= NMR FID
##DATA CLASS= NTUPLES
##ORIGIN= UXNMR, Bruker Analytische Messtechnik GmbH
##OWNER= root
$$ XWIN-NMR		Version 3.5
$$ Thu Dec  5 14:16:53 2024 Russian Standard Time (UT+4h)  she@DPX200
##.OBSERVE FREQUENCY= 200.1315
##.OBSERVE NUCLEUS= ^1H
##.DELAY= (6, 6)
##.ACQUISITION MODE= SIMULTANEOUS
##.ACQUISITION SCHEME= undefined
##.AVERAGES= 8
##.DIGITISER RES= 18
##SPECTROMETER/DATA SYSTEM= spect
##.PULSE SEQUENCE= zg30
##.SOLVENT NAME= CDCl3
##.SHIFT REFERENCE= (INTERNAL, CDCl3, 0, 15.7039)
##AUDIT TRAIL= $$ (NUMBER, WHEN, WHO, WHERE, WHAT)
$$ ##TITLE= Audit trail, XWIN-NMR		Version 3.5
$$ ##JCAMPDX= 5.01
$$ ##ORIGIN= Bruker BioSpin GmbH
$$ ##OWNER= she
$$ F:/spectra/data/she/nmr/H-F/1/audita.txt
$$ ##AUDIT TRAIL=  $$ (NUMBER, WHEN, WHO, WHERE, WHAT)
(   1,<2024-12-05 14:15:47.20 +0400>,<she>,<DPX200>,
      <created by zg, POWCHK disabled, PULCHK disabled
       configuration hash MD5:
       00 E9 B6 7A A2 85 ED C7 34 08 36 98 17 FE 4E 26
       data hash MD5: 16K
       14 09 6E 53 C9 5D 71 80 E3 92 AF C0 C5 E9 88 D5>)
$$ ##END=
$$ 
$$ hash MD5
$$ 55 15 7B F7 F0 1A 6F 5B 39 C4 E3 0D C6 84 BF 80
##$RELAX= 
##$RELAX= 
##$RELAX= 
##$RELAX= 
##$RELAX= 
##$RELAX= 
$$ Bruker specific parameters
$$ --------------------------
##$DU= <F:/spectra>
##$EXPNO= 1
##$NAME= <H-F>
##$PROCNO= 1
##$TYPE= <nmr>
##$USER= <she>
##$AMP= (0..31)
100 100 100 100 100 100 100 100 100 100 100 100 100 100 100 100 100 100 
100 100 100 100 100 100 100 100 100 100 100 100 100 100 
##$AQSEQ= 0
##$AQ_mod= 1
##$AUNM= <au_zg>
##$AUTOPOS= <>
##$BF1= 200.13
##$BF2= 200.13
##$BF3= 200.13
##$BF4= 200.13
##$BF5= 200.13
##$BF6= 200.13
##$BF7= 200.13
##$BF8= 200.13
##$BYTORDA= 1
##$CFDGTYP= 0
##$CFRGTYP= 5
##$CHEMSTR= <none>
##$CNST= (0..31)
1 1 145 1 1 1 1 1 1 1 1 1 1 1 1 1 1 1 1 1 1 1 1 1 1 1 1 1 1 1 1 1 
##$CPDPRG= <>
##$CPDPRG1= <>
##$CPDPRG2= <>
##$CPDPRG3= <>
##$CPDPRG4= <mlev>
##$CPDPRG5= <mlev>
##$CPDPRG6= <mlev>
##$CPDPRG7= <mlev>
##$CPDPRG8= <mlev>
##$CPDPRGB= <>
##$CPDPRGT= <>
##$D= (0..31)
0 1.2 0 0 0 0 0 0 0 0.06 0 0.03 0 0 0 0 0.0002 0 0 0 0 0 0 0 0 0 0 0 0 
0 0 0 
##$DATE= 1733393746
##$DBL= (0..7)
120 120 120 120 120 120 120 120 
##$DBP= (0..7)
150 150 150 150 150 150 150 150 
##$DBP07= 0
##$DBPNAM0= <>
##$DBPNAM1= <>
##$DBPNAM2= <>
##$DBPNAM3= <>
##$DBPNAM4= <>
##$DBPNAM5= <>
##$DBPNAM6= <>
##$DBPNAM7= <>
##$DBPOAL= (0..7)
0.5 0.5 0.5 0.5 0.5 0.5 0.5 0.5 
##$DBPOFFS= (0..7)
0 0 0 0 0 0 0 0 
##$DE= 6
##$DECBNUC= <off>
##$DECIM= 24
##$DECNUC= <off>
##$DECSTAT= 4
##$DIGMOD= 1
##$DIGTYP= 9
##$DL= (0..7)
0 120 120 120 120 120 120 120 
##$DP= (0..7)
150 150 150 150 150 150 150 150 
##$DP07= 0
##$DPNAME0= <>
##$DPNAME1= <>
##$DPNAME2= <>
##$DPNAME3= <>
##$DPNAME4= <>
##$DPNAME5= <>
##$DPNAME6= <>
##$DPNAME7= <>
##$DPOAL= (0..7)
0.5 0.5 0.5 0.5 0.5 0.5 0.5 0.5 
##$DPOFFS= (0..7)
0 0 0 0 0 0 0 0 
##$DQDMODE= 0
##$DR= 18
##$DS= 0
##$DSLIST= <SSSSSSSSSSSSSSS>
$$ [...]
##$SUBNAM2= <"">
##$SUBNAM3= <"">
##$SUBNAM4= <"">
##$SUBNAM5= <"">
##$SUBNAM6= <"">
##$SUBNAM7= <"">
##$SUBNAM8= <"">
##$SUBNAM9= <"">
##$SW= 24.0689530833862
##$SWIBOX= (0..15)
0 0 2 0 0 0 0 0 0 0 0 0 0 0 0 0 
##$SW_h= 4816.95568400771
##$TD= 16384
##$TD0= 1
##$TE= 0
##$TE2= 300
##$TE3= 300
##$TEG= 300
##$TL= (0..7)
0 120 120 120 120 120 120 120 
##$TP= (0..7)
150 150 150 150 150 150 150 150 
##$TP07= 0
##$TPNAME0= <>
##$TPNAME1= <>
##$TPNAME2= <>
##$TPNAME3= <>
##$TPNAME4= <>
##$TPNAME5= <>
##$TPNAME6= <>
##$TPNAME7= <>
##$TPOAL= (0..7)
0.5 0.5 0.5 0.5 0.5 0.5 0.5 0.5 
##$TPOFFS= (0..7)
0 0 0 0 0 0 0 0 
##$TUNHIN= 0
##$TUNHOUT= 0
##$TUNXOUT= 0
##$USERA1= <user>
##$USERA2= <user>
##$USERA3= <user>
##$USERA4= <user>
##$USERA5= <user>
##$V9= 5
##$VALIST= <valist>
##$VCLIST= <CCCCCCCCCCCCCCC>
##$VD= 0
##$VDLIST= <DDDDDDDDDDDDDDD>
##$VPLIST= <PPPPPPPPPPPPPPP>
##$VTLIST= <TTTTTTTTTTTTTTT>
##$WBST= 1024
##$WBSW= 4
##$XGAIN= (0..3)
0 0 0 0 
##$XL= 0
##$YL= 0
##$YMAX_a= 128678
##$YMIN_a= -98157
##$ZGOPTNS= <>
##$ZL1= 120
##$ZL2= 120
##$ZL3= 120
##$ZL4= 120
##$ABSF1= 10
##$ABSF2= 0
##$ABSG= 5
##$ABSL= 3
##$ALPHA= 0
##$AQORDER= 0
##$ASSFAC= 0
##$ASSFACI= 0
##$ASSFACX= 0
##$ASSWID= 0
##$AUNMP= <proc_1d>
##$AZFE= 0.1
##$AZFW= 0.1
##$BCFW= 1
##$BC_mod= 2
##$BYTORDP= 1
##$COROFFS= 0
##$CY= 11.3945322036743
##$DATMOD= 1
##$DC= 2
##$DFILT= <>
##$DTYPP= 0
##$F1P= 15.6554695791079
##$F2P= 12.8336369535428
##$FCOR= 0.5
##$FTSIZE= 0
##$FT_mod= 4
##$GAMMA= 1
##$GB= 0.15
##$INTBC= 1
##$INTSCL= 1
##$ISEN= 128
##$LB= 0.24
##$LEV0= 0
##$LPBIN= 0
##$MAXI= 10000
##$MC2= 0
##$MEAN= 0
##$ME_mod= 0
##$MI= 1.114404
##$NCOEF= 0
##$NC_proc= 0
##$NLEV= 6
##$NOISF1= 3.799351
##$NOISF2= 2.8
##$NSP= 1
##$NTH_PI= 0
##$NZP= 0
##$OFFSET= 15.70392
##$PC= 1
##$PHC0= -26708.65
##$PHC1= 15.38744
##$PH_mod= 1
##$PKNL= yes
##$PPARMOD= 0
##$PSCAL= 0
##$PSIGN= 0
##$REVERSE= no
##$SF= 200.130013532006
##$SI= 16384
##$SIGF1= 3
##$SIGF2= 2
##$SINO= 400
##$SIOLD= 16384
##$SREGLST= <1H.CDCl3>
##$SSB= 0
##$STSI= 0
##$STSR= 0
##$SW_p= 3612.71676300578
##$SYMM= 0
##$S_DEV= 0
##$TDeff= 0
##$TDoff= 0
##$TI= <>
##$TILT= no
##$TM1= 0
##$TM2= 0
##$TOPLEV= 0
##$USERP1= <user>
##$USERP2= <user>
##$USERP3= <user>
##$USERP4= <user>
##$USERP5= <user>
##$WDW= 1
##$XDIM= 8192
##$YMAX_p= 0
##$YMIN_p= 0
$$ End of Bruker specific parameters
$$ ---------------------------------
##NTUPLES= NMR FID
##VAR_NAME=  TIME,          FID/REAL,        FID/IMAG
##SYMBOL=    X,             R,               I
##VAR_TYPE=  INDEPENDENT,   DEPENDENT,       DEPENDENT
##VAR_FORM=  AFFN,          ASDF,            ASDF
##VAR_DIM=   8192,          8192,            8192
##UNITS=     SECONDS,       ARBITRARY UNITS, ARBITRARY UNITS
##FACTOR=    0.0002076,     1,               1
##FIRST=     0,             0,               0
##LAST=      1.7004516,     0,               0
##MIN=       0,             -98157,          0
##MAX=       1.7004516,     128678,          0
$$ Real data points
##PAGE= N=1
##DATA TABLE= (X++(R..R)), XYDATA
0@%%%%%%%%%%jRj6J6j6J6k4L2l2L8m6N1n9P2q2R1j06J21j37J55j76J99k24K50
$$ 0 0 0 0 0 0 0 0 0 0 0 -1 8 -8 8 -8 8 -16 16 -16 22 -24 27 -32 40 -42 49 -57 64 -73 82 -94 105 -119 131
34A31k78L11l47L85m27M74n23N80o42P08p86Q71r66J076j200J341j509J709j948
$$ 131 -147 164 -183 202 -225 249 -274 306 -336 372 -414 457 -509 567 -633 708 -801 908 -1040
53a040K249k633L143l867M975o902J1249m2238J6123M6159m1669m7320k1985L0237
$$ -1040 1209 -1424 1719 -2148 2827 -4075 7174 -35064 -18941 27218 -14451 -61771 -83756 -53519
67e3519K8318K137k5568j0612P845J6660N187m743j5997j5701p719J5852L3687
$$ -53519 -25201 -23064 -48632 -59244 -51399 -34739 -29552 -34295 -50292 -65993 -73712 -57860 -24173
80b4173K3151k2189m9713k5233K8576N0451J6969l3348l9627K636L8971K1749
$$ -24173 -1022 -23211 -72924 -98157 -69581 -19130 -2161 -35509 -75136 -72500 -33529 -11780
92a1780k1547l6367p494K9910L5187N113k4713k6233r821R572K2120K2114N784
$$ -11780 -33327 -69694 -77188 -47278 -12091 -6978 -31691 -57924 -67745 -58173 -36053 -13939 -8155
105h155j8324k6091q160K1813K8971j12k9078j8691J9609L8625J2396l3785m2949
$$ -8155 -26479 -52570 -60730 -38917 -9946 -10058 -39136 -57827 -38218 407 12803 -20982 -63931
118f3931m26M3136L9431j744l2950k6853L247K2180J5497l05o700n832j691O467
$$ -63931 -64357 -21221 18210 16466 -16484 -43337 -40090 -17910 -2413 -2718 -9418 -15250 -16941 -10474
132a0474J0930L887j1803j9232l165K6749L4530J184l7437l6595M982M1648L2393
$$ -10474 456 4343 -7460 -26692 -29857 -3108 31422 32606 -4831 -41426 -36444 5204 37597
145C7597j0160l5552j6396J8715K4952J535j9782j5859O679K0224J3024l402j3194
$$ 37597 27437 -8115 -24511 -5796 19156 20691 909 -14950 -8271 11953 24977 21575 8381
158H381j5402r493P945K3635K0461m650k9373k4691Q421L2667J6787j8814k8837
$$ 8381 -7021 -16514 -8569 15066 35527 30877 1504 -23187 -14766 17901 34688 15874 -12963
171a2963k628K8130K3608j1575l4535j7273J8160L0342J1850j2641k2346j1821
$$ -12963 -15591 12539 36147 24572 -9963 -27236 -9076 21266 33116 20475 -1871 -13692
183a3692L550J0668J1255O564o547j6279p711J0166J7529J120k1037j9963R229
$$ -13692 -10142 526 11781 18345 11798 -4481 -12192 -2026 15503 16623 -4414 -24377 -15148
196a5148L2370J7519k0190l6454j3463K2533L1810O950k0665k1067n41J2900R636
$$ -15148 17222 34741 14551 -21903 -35366 -12833 18977 25927 5262 -15805 -16346 -3446 6190
209F190j785q466n754J288O575Q624L778j0111j8801q233J5863K6626R726k0507
$$ 6190 4405 -4061 -9815 -8527 -1952 6672 10450 339 -18462 -26695 -10832 15794 25520 5013
223E013l0070o396K4148K4023j914k2760j4784R891K1625N794j6004j7996j058
$$ 5013 -25057 -31453 -7305 16718 14804 -7956 -22740 -12849 8776 14570 -1434 -19430 -20488
236b0488J4040J5462M384q606j4411r553J768J3594J5997J955j6601j6972K080
$$ -20488 -6448 9014 13398 4792 -9619 -19172 -17404 -3810 12187 14142 -2459 -19431 -17351
249a7351J8776J3528r222k3164o290J9316K3719l55k3996k1653L587K3129J6353
$$ -17351 1425 14953 5731 -17433 -23723 -4407 19312 18957 -5039 -26692 -23105 24 16377
262A6377m417j5375j0199N79Q312P266J833m727p638l911P300J2561K848j4980
$$ 16377 11960 -3415 -13614 -13035 -4723 2543 4376 -351 -7989 -11900 -4600 7961 10809 -4171
276d171j8148Q82K2488K0645n412k7025j7813J0421K3969J0193j1712j7663l115
$$ -4171 -22319 -21437 1051 21696 16284 -10741 -28554 -18133 5836 16029 4317 -13346 -16461
289a6461J2497J0823k527r657p348L24P515R461M194o244j3747j0519O191J9752
$$ -16461 -3964 6859 4332 -5325 -12673 -12349 -4834 4627 8821 2577 -11170 -21689 -15498 4254
303D254J2730j0128k1164r174J3151K0006K001j7988j5034O570J8871R558r594
$$ 4254 16984 6856 -14308 -23482 -10331 9675 11676 -6312 -21346 -14776 4095 13653 4059
316D059j7130p245Q664J4149O417l910r501r275j111Q519J1284K815r870j2459
$$ 4059 -13071 -20316 -11652 2497 8914 5004 -4497 -13772 -14883 -6364 4920 7735 -2135 -14594
330a4594p8J5128J1503o877j8173r303J1817K1176O773j5678j9180k855J4423
$$ -14594 -14672 456 11959 5082 -13091 -22394 -10577 10599 17372 1694 -17486 -20341 -5918
343e918J4459J462j1157r655L25P404O029J245n825p532k199P957J0737L401j0356
$$ -5918 8541 10003 -1154 -10809 -10484 -3080 2949 4194 -1631 -9163 -11362 -3405 7332 10733 377
358C77j5252l484J4945J7232R12j6519j5712K176J7375J1260o704j5127n287Q639
$$ 377 -14875 -18359 -3414 13818 14730 -1789 -17501 -15325 2050 13310 6606 -8521 -13808 -5169
372e169J2527K451q601j0668k042O696R488N645l647j1083q596K968J2100J1001
$$ -5169 7358 9809 1208 -9460 -11502 -4806 4682 10327 6680 -4403 -12999 -10031 2069 13070
386A3070l624j5291r137Q604J5454M718j2095j5275m49J5784J3821m092j4919
$$ 13070 9446 -5845 -14982 -6378 9076 13794 1699 -13576 -14025 1759 15580 11488 -3431
399c431j0048L958J1898P791k104q484n697q07O033P872K333p772r737q05J1010
$$ -3431 -13479 -9521 2377 10168 8064 -420 -6117 -6924 -891 6981 9314 1542 -8195 -9000 2010
414B010J1716j719j5585j1486O124J7338R166q210j6370o084J0067J2888K475
$$ 2010 13726 12007 -3578 -15064 -8940 8398 17564 9354 -7016 -13100 -3033 9855 12330
427A2330q445q964j556P214Q038J143o118p553l459N712J0518N421p324j3063
$$ 12330 3885 -5079 -6635 579 8617 9760 3642 -3911 -7370 -1658 8860 14281 6957 -6106
441f106n035R105J4449L793j2044j3244N7J2512J0866k934j2800q334N426J2129
$$ -6106 -11141 -2036 12413 16206 4162 -9082 -9025 3487 14353 11419 -1381 -9715 -4289 7840
455G840N082n260r749n387L464R316O014k442q282q089J505J0068Q167k855j1527
$$ 7840 12922 7662 -2087 -7474 -4010 5306 11320 8878 596 -7493 -5988 4080 12247 9392 -2135
470b135p731M728J3261O442q483j4000l648R960J2557J912j0682j0968j79R495
$$ -2135 -9866 -5138 8123 14565 6082 -7918 -11566 -1606 10951 12863 2181 -8787 -8966 529
484E29Q059l98p451p549l35O219P430Q28o245r045j936Q335J0375K26j0252j1160
$$ 529 8588 8190 739 -6810 -7145 -926 6504 7332 1087 -7958 -9894 -1559 8816 9042 -1210 -12370
500a2370J136J2525J0337m176j3700p245N875J1783N373o898j0681k911O229Q347
$$ -12370 -11234 1291 11628 7452 -6248 -13493 -7618 4165 9538 2640 -8041 -10952 -4723 3624
514C624K724m818q171l621M011Q301M834l531j0170n819O041J2048M007p856j1940
$$ 3624 6348 1530 -6641 -10262 -6251 2050 6884 3353 -6817 -12636 -6595 5453 9460 1604 -10336
529a0336k548J0230J1337k02j0978q657K152R316P905k644q714n381J847P677
$$ -10336 -12884 -2654 8683 8481 -2497 -11154 -9002 314 8219 5575 -3139 -8520 -6673 1004
543A004N885o35p300o729J095Q225Q143r04r911q213L150J0975P474m416j1248
$$ 1004 6889 6254 -1046 -7775 -6680 1545 9688 8784 -1127 -9340 -6190 4785 12259 7843 -3405
558c405n504O554J1570L043p141r341j622P060R116J413o771p607j579N899Q068
$$ -3405 -8909 -2355 9215 12258 5117 -4224 -5846 1214 10330 11743 4972 -2635 -4214 1685 9753
573I753K711o317p815j986O151Q706K118p869q940J28R209Q296j144r867p741
$$ 9753 12464 6147 -1668 -3654 2497 11203 13321 5452 -3488 -3360 5849 14145 13001 3134 -4607
588d607K884J0262N938l314r105n474L645Q427M305l643p225m106K930P769M115
$$ -4607 -1723 8539 14477 11163 2058 -3416 229 8656 12961 9318 2093 -2013 917 8686 12801
603A2801l714q279m445L600R366M918n430j0258m137O380R890K950p692r352j285
$$ 12801 9087 808 -3637 -37 9329 14247 8817 -1441 -5578 802 10692 13642 5950 -3402 -4687
618d687P961P183o00p230o942R17P532N576j150o901o187l05O960P193j24p503
$$ -4687 3274 10457 9857 2627 -4315 -3398 4134 9710 8560 1659 -4528 -4833 2127 9320 9196 1693
634A693p723N11P553P587k506q785n549L068R217M380n158r431l353N799Q433
$$ 1693 -6030 -5519 2034 9621 7115 -1670 -7219 -4151 5066 9446 4288 -5143 -8496 -2697 5736
649E736K649n004p729l489M623O613L172l549o861l748M979P339K078n660q151
$$ 5736 8385 3381 -4348 -7837 -3214 3399 6571 3022 -3839 -7587 -2608 4731 6809 1149 -7002
664g002j359P520Q149L12q390p711O37P646P201q99p456n875J533O180M903j614
$$ -7002 -8361 -841 7308 7620 -770 -8481 -7844 -198 7003 6104 -1352 -7227 -5694 486 5389 3775
680C775o286m489K259O894M825k771p699n398L114Q858M875l670p910m815L642
$$ 3775 -2511 -7000 -4741 2153 6978 4207 -3492 -8890 -5776 3082 7957 4287 -3623 -8438 -4796
695d796Q248L650m374p165k404M800P312J272n776p229k31N794P286R99o436o848
$$ -4796 3452 7102 2728 -4437 -6841 -2041 5271 6543 767 -6462 -6693 -899 6387 7386 950 -5898
711e898j172N954O500J302n569o288j57N508N633m19o133n938J959P719N365l126
$$ -5898 -7070 -1116 5384 6686 1117 -5171 -5328 180 5813 5394 -739 -6677 -4718 3001 8366 5240
727E240p771n478L116Q299M624l115o712m556K605O605L146l072n837k467L448
$$ 5240 -2531 -8009 -4893 3406 8030 4915 -1797 -6353 -3748 2857 6003 2931 -2906 -5373 -1925
742a925O245K548m485p410k548N990P067K933o263p446j594N651O870P33n311
$$ -1925 4320 6868 2383 -5027 -7575 -1585 5482 8415 2152 -5294 -6888 -1237 5633 6366 1055
757A055n840l9N742M649j130n605m267Q69O469N375j650o962n258J193P203N283
$$ 1055 -4785 -4824 918 5567 4437 -1168 -5435 -4566 1903 7278 5628 -1334 -6592 -5399 1804 7087
773G087j029p049m866K046O567L959k799o682k423M147N944K556m454o791k124
$$ 7087 6058 -991 -5857 -3811 2756 6715 3916 -2766 -5189 -1042 4902 7458 3004 -3787 -5911
788e911M429P178K695m653o203k851M253O390J684m525m948j004M731N924m70
$$ -5911 -1482 5696 8391 3738 -2465 -5316 -1063 5327 7011 2486 -2462 -3466 1265 7189 6719
803F719n827n202J225O227N519k82p172n891J337N870N272k76o003m602K034M765
$$ 6719 892 -4310 -3085 3142 8661 8379 1207 -4684 -3347 2523 7795 7519 1516 -3086 -1052 3713
819C713L764k080o005k842L310O145K988m172o567l174L683P203K901l285o439
$$ 3713 7477 5397 -608 -3450 -140 6005 8993 4821 -1746 -4920 -1237 5966 8867 5582 -857
834h57l131L535N485K280l814n542p17M556M854j08n077n835J41N751N554J33
$$ -857 -3988 -453 5032 7312 3498 -2044 -2761 1795 6649 6541 1464 -4371 -4230 1521 7075 7208
850G208n622o214JN233M661M46m578n212P17N112L595j811n557m091K503O821
$$ 7208 1586 -4628 -4627 606 5267 5713 1135 -4077 -3360 1752 5347 3536 -2021 -6112 -3609 3212
866C212L467l357o510l830K580O807L592l323n264l301K771M871J999k789n397
$$ 3212 6679 3322 -3188 -7018 -4438 2369 5961 2638 -2626 -5927 -3156 1715 3714 925 -4472
881d472j233L873N636P07m981o157p51N734N617R90n184n653p87M627M910O9m193
$$ -4472 -5705 -1832 3804 4511 -470 -6627 -7378 -1644 3973 4963 -221 -5874 -6661 -2034 2876 2945 -1248
898a248m161L03M550M077j614n688l249J638O200M368k582o388l842K138N899
$$ -1248 -5409 -5106 -556 3521 1907 -3781 -7030 -5392 808 5176 2594 -3794 -7636 -5498 401
913D01L712j663n234k967K347M304K499k639n051j757M011N324J577m133n997
$$ 401 4113 2450 -2784 -5751 -3404 900 3399 760 -4291 -6048 -2037 3287 4864 731 -5266
928e266j698M673N937J553m389n012j340L859M807M43l825m136N63M199M033j058
$$ -5266 -6964 -2291 3646 5199 810 -4202 -5542 -1683 3124 3567 -258 -4394 -3831 368 4401 3343
944C343m803l945R38N611M337j137n345m621J193N349L730j043m918l359K378
$$ 3343 -1460 -5405 -4467 1144 5481 4344 -1001 -5622 -4429 920 4650 3607 -1311 -4670 -2292
959b292M997J705k553m847j791L274N672J546l512n499k159L148N960K377l818
$$ -2292 2705 4410 1857 -2990 -4781 -1507 4165 5711 2199 -3300 -5459 -2311 3649 6026 2208
974B208n208j193L378M254R86l939l822J86M505L250j34m971m440Q75N009M373
$$ 2208 -3000 -4193 -815 3439 4425 486 -3336 -3150 1355 4605 4471 -500 -4940 -4065 944 5317
990E317k00m627m838M80M547M004j332m366k604J424M648K371k745m675j971K886
$$ 5317 5117 490 -4348 -3868 679 4683 3351 -1015 -3619 -2195 2453 4824 2079 -2596 -4567 -1681
1006a681N297K274l097n389k159K648N078K095k455m930j430K834L954J203l566
$$ -1681 3616 5890 2793 -2596 -4755 -2107 2971 5066 2611 -2319 -3749 -915 3039 4242 676
1021F76l956k96M505L744j26m500m132j66M433M744l48m112m037m27M406L751
$$ 676 -3280 -3576 929 4673 4547 47 -4085 -4251 182 4926 4578 466 -3571 -3998 408 4159
1037D159o31m349k221R64M357K749k509m372l019K444N004L209k588n174k524
$$ 4159 3528 -821 -3042 -2078 2279 5028 2519 -1853 -4872 -2428 2576 5785 3197 -1977 -4501
1052d501J811M982K128j887m392j784K640L802J435l293m131o35L957M398Q7m074
$$ -4501 -2690 2292 4420 2533 -1859 -3643 -1003 2799 4234 941 -3190 -3825 132 4530 4617 543
1068E43m360n41L766M670M19l686l940j32L078L617M5m158l100J434L928K692
$$ 543 -3817 -4358 -592 4078 4497 811 -3129 -3261 -183 3434 3479 -679 -3779 -2345 1583 4275
1084D275j463m384l004J824M562K888j488m308l279J474M423K283j853l618j681
$$ 4275 2812 -1572 -4576 -2752 1810 4698 3210 -1098 -4377 -2903 1520 3803 1950 -1668 -3349
1099c349J989M053J277l120l713r91L289M013J422m046m333q02L894L548R17k999
$$ -3349 -1360 2693 3970 850 -2863 -3854 -565 3448 4870 824 -3509 -4311 -417 3131 4048 1049
1115A049l816j27L113K930j20l548l114J052L846L262j337m252k927Q60M497L388
$$ 1049 -2767 -2894 219 3149 3029 -519 -3633 -2581 1265 4527 3190 -1062 -3989 -3129 1368 4756
1131D756j427m183k765Q89M199K227j497l772j546K119L642J350k693m061j025
$$ 4756 3329 -854 -3619 -2730 1469 3696 2199 -1573 -3119 -1000 2642 3992 1299 -2762 -3787
1146c787K545M241J824k852m527j437K784M055Q24k343l911q58L505K982J76l522
$$ -3787 -1242 2999 4823 1971 -2556 -3993 -1209 2846 3670 1327 -2584 -3442 63 3045 3221 -301
1162c01k775r4L949L256o82m072l084P70L473L653p06m057k434O40L213K522r65
$$ -301 -3076 -3170 779 4035 3353 -719 -3803 -3033 440 4093 3387 -670 -3104 -2464 749 3271 2306
1179B306l762k197J930L635K035k959l464j634K050M199J801k625l615j956K578
$$ 2306 -1456 -3653 -1723 1912 3947 988 -2476 -4110 -2060 2139 3940 1315 -2300 -4256 -1678
1194a678L960P28k009l340j435L102L316K90l347k977K07K954L415Q1l267l630
$$ -1678 2282 3010 1001 -2339 -3774 -672 2644 2934 -413 -3390 -3183 -229 3186 3267 0 -3630
1210c630M23L113L320k68l239l101P77K787K684n39l815k262J815L874J596j662
$$ -3630 -3207 -94 3226 2958 -281 -3382 -2605 182 2866 2327 -1488 -3750 -1935 1939 3535 1873
1226A873l845k283K265L838K001k319k925k155J723L519J513j991l481o15K284
$$ 1873 -1972 -4255 -1990 1848 3849 1530 -1395 -3550 -1827 1692 3205 1214 -2267 -2882 -598
1241e98L376O42l016l392p2K849L632N2k778l521k95L418K700p6k338l150K88
$$ -598 2778 3420 404 -2988 -3060 -211 3421 3473 695 -2826 -3121 297 2997 2921 583 -2567 -2279
1258b279L139K389o48l330k196J217L514J986j195l563k293J290L579K662j739
$$ -2279 860 3249 2601 -729 -2925 -1708 1806 3792 2597 -966 -3259 -1969 1610 4272 2533
1273B533l564j765J579L106J666j766l402j146K486K944J044k488l505m21K573
$$ 2533 -1031 -2796 -1217 1889 3555 1789 -1613 -2759 -273 2671 3715 1227 -2278 -2699 -126
1288a26L476J18k177l355n96K489L022M16k872k580k03L084K767p85k760k455
$$ -126 3350 3468 1291 -2064 -2660 -171 2851 3267 395 -2185 -2388 696 3463 2678 -82 -2537
1304b537N58L301K462j043l628j991R82L193J943j074l226j739J434K801J224
$$ -2537 -1979 1322 3784 2741 -887 -2878 -1896 1297 3240 2166 -1060 -2799 -1365 1436 2660
1319B660j405l023j160J914L194J014k043l272j025K088L407O34k116l044p19
$$ 2660 1255 -1768 -2928 -1014 2180 3194 1151 -2121 -3146 -1058 2349 2983 867 -2177 -2896
1334b896K379K741N02k738k654K88K307K422l71k412j916O0K521K326j67l180
$$ -2896 -517 2224 2726 -12 -2666 -2378 -71 2351 1980 -432 -2348 -2288 233 2559 2392 -788
1350g88k359O91K778K549q97l158k155J168L355J594j584k574j564J768K762J043
$$ -788 -3147 -2456 322 2871 1974 -1184 -3339 -2171 1184 2778 1194 -1380 -2944 -1176 1586 2629
1366B629j742k719j205J691K824J414j828l375p40K071K856Q52k247k835n01K637
$$ 2629 887 -1832 -3037 -1346 1478 2892 1064 -2311 -3051 -980 1876 2728 481 -2354 -2855 -218
1382b18K570p8k083k965J77K967K190l55k456k642P99K578K202n99k582k108O17
$$ -218 2352 2274 191 -2774 -2597 370 2560 2205 -251 -2893 -2094 484 2686 2087 -495 -2603 -1986
1399a986K985J508p20k874j767J372K717J529j463l081o49R57L136J109j716k712
$$ -1986 999 2507 1787 -1087 -2854 -1482 1235 2764 1301 -1780 -2429 -1472 1664 2773 1057 -1655
1415a655p93J409L017N94j741k959m85K279K195K95k180k285%J921K347N48k442
$$ -1655 -2448 -1039 1978 2572 831 -2128 -2613 -334 1861 2156 -24 -2309 -2309 -388 1959 2507 65
1432F5k386j39K623K141o74k475j915P56K532J937q36k628j869J281K798J329
$$ 65 -2321 -2460 163 2304 1630 -845 -2760 -2004 528 2465 1629 -999 -2868 -1587 1211 2540
1448B540j307k520j690J344K810R91q63k908r38J199K745P89j315k442j088J516
$$ 2540 1233 -1287 -2977 -1633 1177 2168 1305 -1603 -2541 -1342 1403 2192 877 -1565 -2653 -1137
1464a137K816N27j812k417k97J866K419J64k460k244L58J875K215j09k200j593
$$ -1137 1679 2206 394 -2023 -2320 -454 1965 2129 -331 -2575 -2217 -342 1873 1764 -436 -2029
1480b029k62K409J960l87k137k023O42K837J526j062k222j983J052K727J444j338
$$ -2029 -2291 118 2078 1691 -446 -2469 -1827 1010 2536 1474 -748 -2731 -1679 1048 2492 1154
1496A154k508j158J496K433J008j107k720o76J392K393O06j520k549l41J599K512
$$ 1154 -1354 -2512 -1016 1417 2425 1318 -1402 -2078 -686 1707 2313 793 -1756 -2097 -498 2014
1512B014M75j939k490j17J895J818O25k150k186p5K229J817J89k004k321L95K521
$$ 2014 2489 550 -1940 -2057 -162 1656 2281 131 -2055 -2130 99 1916 2105 101 -2220 -1825 696
1529F96J390k50k412j702Q10K197J853j198k376j320J397J812J111j000j962j326
$$ 696 2086 1836 -576 -2278 -1468 729 2582 1384 -992 -2312 -915 897 2008 1008 -954 -2280
1545b280J432K275R47j751k166m91J342K113Q91j907k279k11J911J970J4j676
$$ -2280 -848 1427 2374 623 -1543 -2034 -692 1421 2312 405 -1874 -2085 -174 1796 1810 134
1561A34j896n11K327J623K3j965j831L44J847K263p55k417j244N39J855J666k55
$$ 134 -1762 -2273 54 1677 1700 -265 -2096 -1752 95 2358 1603 -814 -2058 -1519 336 2002 1747
1578A747k689j529J029K105R60n18k413q25J015J927O63r73j811j124J544K114
$$ 1747 -942 -2471 -1442 663 1623 1105 -1308 -2133 -1118 809 1472 499 -1312 -2436 -892 1222
1594A222L73j075k045r33J772K268J74j904j759n03K156J495K91j747j908Q3J994
$$ 1222 1595 520 -1525 -2458 -686 1582 1756 -148 -1907 -2410 -254 1241 1532 -215 -2123 -2040 -46
1611d6J482o8k078j608P90J843J265k83k102j625N62K285J201p37j631j552R84
$$ -46 1436 1368 -710 -2318 -1528 315 1580 1297 -805 -2430 -1868 417 1618 881 -750 -2302 -1318
1628a318K012P61j000j909n48J017J916O89j136j970p65J179J990Q54j662j845
$$ -1318 694 1455 455 -1454 -2002 -985 931 1620 484 -1486 -2251 -1072 918 1772 110 -1735
1644a735j85J268J789K96j535j894J49J697J524M56k111j760K82K198J301m52
$$ -1735 -1920 -652 1137 1433 -102 -1996 -1847 -150 1374 1830 -281 -2041 -1759 439 1740 1288
1660A288j737j786O42J878J497o60k037r96P19J605J519p70j873j197Q63J854
$$ 1288 -449 -2235 -1593 285 1782 1122 -915 -1911 -1192 413 1932 1162 -711 -1908 -1045 809
1676H09J191j267j832r19J125J847Q56q04k035o81J337J813M36j764j853O0J612
$$ 809 2000 733 -1099 -2018 -893 954 1810 1006 -1029 -1710 -373 1440 1876 112 -1741 -1681 -69
1693f9J707L6j498j652m30J885J996l62j623j429J20J487J656l71j736j205O32
$$ -69 1638 1674 176 -1476 -1906 -21 1975 1613 -10 -1439 -1319 168 1824 1453 -283 -1488 -856
1710h56J750R70m66j914j205R70J752J083j098j602j107J156J648O32q07j760
$$ -856 894 1864 1398 -516 -1721 -751 1001 2084 986 -616 -1723 -567 1081 1713 906 -854
1726h54p49J084J831Q24j463j813j87R88J945J54j373j565l20J451J699k25q35
$$ -854 -1603 -519 1312 2136 673 -1140 -1327 -339 1606 1760 387 -1178 -1498 -47 1652 1427 592
1743E92j772J6J324J381j79j508j318O61J178J386p67j516j049L94K061N93m67
$$ 592 -1180 -1164 160 1541 1362 -146 -1464 -803 375 1761 994 -522 -1571 -1177 884 1477 1010
1760A010j493r35O33J540J070r80j501j060J215J893J6j114r21r22J054J385L76
$$ 1010 -483 -1418 -785 755 1825 845 -656 -1716 -501 1392 1408 294 -627 -1549 -495 890 1266
1777A266o92j940k4J061J413M52j631j501K75J449Q37j5j250j180K42J358J237
$$ 1266 574 -1366 -1390 -329 1084 1536 -95 -1596 -1321 128 965 950 -300 -1480 -1238 120 1357
1794A357J19j965j373L39J369J712n20j802q12L49J374J036o36j645m94P43J666
$$ 1357 1476 -489 -1862 -1523 -154 1558 1038 -764 -1576 -1227 147 1183 547 -1098 -1592 -849 817
1811H17P26j044j673q15J320J427N48p78j779m92J175J489K55r66j182n95J293
$$ 817 1543 499 -1174 -1989 -669 758 1306 528 -1251 -1743 -568 921 1176 210 -972 -1567 -274
1828b74J448l82j118j025k86J530J633l90j754j079L52J512R78k17j367r20R3
$$ -274 1174 792 -326 -1351 -1637 -107 1526 1136 -618 -1697 -1345 167 1145 928 -439 -1359 -1266
1845a266J654N33l33j087q46M24J511N53m43j387q17P15J544N64q33j332p88R67
$$ -1266 388 921 588 -499 -1345 -921 590 1143 700 -687 -1504 -789 755 1319 486 -846 -1634 -667
1863f67J474N48j160j010k29O95J714%j511j348R5J387J167L0p59j798N09R44
$$ -667 807 1355 195 -815 -1044 -349 1365 1365 -146 -1494 -1399 -12 1155 1185 426 -1372 -863 81
1881H1J405j17j197j169L93Q99J208l72j407j100P62J541P87n59j749q55J160
$$ 81 1486 1369 172 -997 -604 295 1503 1131 -276 -1376 -614 927 1714 1155 -594 -1449 -289
1898b89J247Q30r43j235m80L45J530N20r45j253m38J074J642J69j140j462j43
$$ -289 958 1788 845 -390 -870 -525 1005 1525 580 -673 -1111 -37 1605 1774 634 -828 -971
1915i71J277J107J28j251r81j27P90J587m70p38r59n5J078P01j40j204p17N15
$$ -971 306 1413 1541 290 -691 -818 -28 1559 1089 351 -608 -663 415 1116 976 -228 -945 -430
1933d30J130J040o58j143q40L07J447J015j080j169n50O15J359O25j258q09n55
$$ -430 700 1740 1082 -61 -901 -594 853 1868 788 -381 -931 -316 1043 1668 410 -399 -954
1950i54P54J024M59p25j176n26J074J059K58o69j359k35Q94J235p4q49j085J81
$$ -954 -200 824 1283 558 -618 -1144 -70 989 1247 578 -781 -1016 -122 1113 1039 190 -895 -714
1968g14R95R62m28q35j199K26J423Q70k34j281q82Q9J206J018l59j351o71Q76
$$ -714 281 1243 815 -20 -1219 -993 430 1300 1066 -215 -1097 -1008 198 1216 857 -494 -1165 -289
1986b89O70N09l07j333p16J046J382K27o72j558k59Q78J059O92j164j316l86J358
$$ -289 381 890 583 -750 -1466 -420 962 1189 517 -1041 -1300 -422 637 1329 165 -1151 -1537 -179
2004a79R01L53q36j150J66Q34J105m75p60j019J38Q10J618p72j144r49M12J134
$$ -179 722 1075 239 -911 -745 89 1194 719 -41 -1060 -922 -112 1506 734 -410 -1359 -947 187
2022A87N11L44j680n36K41J235P75o31j198Q0M43N09R83j059r27k70M45J419K89
$$ 187 698 1042 -638 -1174 -933 302 1077 446 -752 -672 -229 280 1263 204 -723 -993 -548 871 1160
2041A160o77j041n38P78J235M43j324q05Q3Q67R92l9q39j053k69R27J259k56q02
$$ 1160 483 -558 -1096 -318 917 1360 36 -769 -686 181 1173 1134 295 -758 -1027 -100 1159 903 101
2060A01q17J75J142N76l85j268k98M3J188M77r4j206l89J15J201N87n46j116m62
$$ 101 -716 -541 601 1177 792 -476 -774 -731 457 934 840 -366 -755 -640 561 1148 602 -514 -976
2079i76Q71Q74L24o85r22m57O46J351j53n92o30m63Q17Q53p4n02q93j76O63J288
$$ -976 -105 769 1093 408 -514 -971 -325 1026 873 281 -349 -812 5 858 784 282 -611 -787 -124 1164
2099A164R8j196q37N2O32R82L4j058m73K53P43O25k52q27n70O09M62N63k12j126
$$ 1164 1262 66 -771 -719 -87 895 929 -129 -602 -349 394 1019 767 -60 -630 -21 441 1004 792 -334
2119c34l78J76J091M07m27r37o49J067N95L04l60q87k51M61J057J67p07q36m90
$$ -334 -712 -536 555 962 535 -402 -1051 16 611 915 555 -332 -583 -122 935 1102 395 -441 -931
2138i31Q86O52L96n66r50J63M86Q65l10p64l40j02N91J022j8p59j033N0R07Q93
$$ -931 -45 607 1003 437 -513 -350 136 1001 691 -73 -413 -515 76 1098 1080 321 -712 -662 245 1138
2158A138l15q65q65M08Q72P05n80o00m14J5P06O58l55r30j20N30N76K52j43j123
$$ 1138 823 -42 -907 -499 373 1078 498 -102 -516 -501 205 863 508 -422 -542 -12 564 816 673 -450
2178d50k58K98J019L82r92p84R5P68P59J47p36p47N0K31P95K52j124o90M58O23
$$ -450 -708 -410 609 991 -1 -785 -690 78 837 984 248 -499 -449 -218 577 829 -295 -985 -527 96
2198I6O27j3q82n60J0P12R27n59l24p71K04O95Q75q33n56n23Q02L35P11n79j047
$$ 96 723 710 -172 -732 -722 -10 917 358 34 -737 -533 162 1037 204 -352 -875 -73 262 973 394 -653
2219f53k53Q92M98L16p58n35k42M39Q75L38r02n46k45J084M99j36o64q83L30K93
$$ -653 -906 -14 484 800 42 -493 -735 -296 579 917 15 -531 -776 308 807 671 7 -876 -546 -253
2239b53Q43j1m45j017N73M08N25n60k10m95K23L54J009l65o74p16M84P54oJ94
$$ -253 590 579 134 -883 -310 98 623 63 -147 -642 -419 -65 944 579 -95 -811 -327 427 421 615
2259F15j063l05J54P19M48l53o42l84L97J149Jp97r23L13M44O45J89r52P3m79
$$ 615 -448 -753 -599 120 568 215 -427 -811 -414 735 736 -61 -984 -671 -227 418 607 -345 -272 -751
2279g51N08N72O3m78m27m44P97Q82l30m09n64J37N10R69n92o82n74K87R38M18
$$ -751 -243 329 392 -86 -513 -957 -160 722 392 -17 -581 -444 66 1035 443 -239 -813 -526 412 830
2299H30k15j109m72O18O25M37k51q52j72K61P58L27k36p79l54M76N20N89n39p62
$$ 830 615 -494 -966 -348 277 714 463 -389 -561 -300 458 785 549 -230 -584 -108 412 1001 462 -300
2319c00k50N04O78K86p14q18k5Q62Q22k59j197j32K41N64K14j9l94l83M74j65
$$ -300 -550 -46 632 918 204 -614 -639 223 1045 786 -411 -543 -302 262 476 457 63 -320 154 -11
2339a1R22l47n13o30K38P83K77j61p31kN2N61M11o88n88k94O33O65O2n66l27k15
$$ -11 911 564 51 -579 -341 442 719 558 -173 -175 -123 438 849 161 -427 -721 -88 577 639 73 -254 -469
2361d69N51M62k00l70k60l03M66Q30Qn65q29J44P79K29L0q70p4k37R48M90n00
$$ -469 82 544 344 -26 -286 -589 -123 707 715 150 -679 -535 244 473 503 -367 -441 -678 270 760 260
2382B60m79m32K13O29N60o58m43k64N94L84M69p42o14j03L56N39J36l51m21j07
$$ 260 -219 -651 -438 191 751 93 -350 -614 -20 364 833 91 -523 -626 -270 269 405 54 -367 -474
2402d74J26Q68p9n18k71J42J11R83m97l91m47O4L62K77k7j96p51R7M61L95J48
$$ -474 -348 520 441 -77 -348 -206 -95 888 391 0 -447 -383 -21 256 229 33 -718 -621 -160 235 383
2423C83o71k50J31K50N29k04m99j52R3N72M09n03l82k85M6R40p7l12j99j14K31
$$ 383 -288 -538 -407 -157 372 168 -331 -483 -390 182 591 88 -294 -579 -533 407 330 18 -181 -295 -64
2444f4L18N92r60m1n08M89M53M1l45j80n50P35O81j62m31m80j59O04Q20n38o34
$$ -64 254 846 -114 -155 -663 -174 279 320 -25 -205 -755 -20 661 499 68 -412 -571 33 853 315 -319
2465c19j6J80K00N58j17p46j09L22O2O33m70n64J71J69J57K09k04l08n02P27R0
$$ -319 -335 -155 45 603 486 -260 -369 -47 15 648 178 -386 -215 -46 111 320 116 -192 -694 33 123
2486A23N51k01q22O2J94K82L84m77l96k80O15K95L5k84l07J3P7N93q3o19k6m27
$$ 123 674 473 -349 -287 -93 189 573 96 -300 -580 35 330 365 81 -226 -213 -136 457 374 -245 -271 -698
2508f98N10O01J89n02m25J20J35N70o9p11j39P7P79l0%n38l04N06K57K4o16J57
$$ -698 -188 413 602 100 -325 -205 -70 500 431 -280 -419 -342 437 407 407 -131 -435 71 328 352 -264 -107
2530a07j42L29O7J82m51K5k19P2O84j7n8m16m76L18L26L18m34n86J54P25M3j1
$$ -107 -249 80 147 329 -122 -97 -316 -244 440 423 365 -51 -527 -209 117 435 1 -585 -431 294 337 326
2552C26n35l51M25L92j37L56l84m15L73j62O95l58k06j72k96K44Q38l16m88l31
$$ 326 -209 -560 -135 257 120 476 92 -323 50 -112 583 225 19 -153 -449 -205 633 317 -171 -502
2572e02N8N06K04j21n50k54K95R55j22k07o5k88j31L90N0k42k97j6K59P09k65
$$ -502 -444 62 266 145 -405 -659 -364 591 469 262 197 -91 -222 168 218 -24 -321 -337 -78 631 366
2593C66On30l21O70J56R4l13p73J47P56J10k57j34m27K96L9L81j11n54n8qN94
$$ 366 372 -158 -479 191 347 441 128 -645 -498 258 368 111 -23 -450 -154 -115 266 155 -399 -457 -465 129
2615A29M72l3n16m30J50J90L03J27l50m20K68N73k97j99k93l05N00L66N1k59o01
$$ 129 601 568 52 -378 -228 -38 265 392 42 -378 -110 463 166 -33 -326 -631 -131 235 286 27 -574
2636e74J17M57J85p4j07j37k45M92K03k00k67j94j48N16J04R6l96j14J9M29K78
$$ -574 -457 0 185 111 4 -133 -378 114 317 117 -150 -344 -492 24 128 224 -172 -286 -267 162 440
2657D40j44n81j88K18M44K01n55j95k5J42J74RJ1J40k52K8N25l3j43l96J04p4
$$ 440 296 -285 -473 -255 189 390 -165 -360 -385 -243 -69 -60 -49 91 -161 -133 392 359 216 -180 -76 -150
2679a50M03K84n63o15L97K04J94j34k88l94M87L01R3l78%l2J5L36k14K93k53n00
$$ -150 253 537 -26 -641 -244 -40 154 20 -268 -662 -175 126 219 -159 -159 -191 -176 160 -54 239 -14 -514
2701e14L17L75K31M5o69k09N02J01J89k53l82L0L71L54k42m14q1q6K22N22j29
$$ -514 -197 178 409 454 -215 -424 78 179 368 115 -267 -237 134 488 246 -168 -249 -335 -113 409 280
2722B80l13j11j51M98n1J47l00j60J29j90M98j7j54j60k43J24K92J26n27m00J74
$$ 280 -33 -144 -295 203 152 299 -1 -161 -32 -222 276 259 105 -55 -298 -174 118 244 -283 -683 -509
2743e09P93J85m50k20k4M61J44j29L5n18Q2L96k89L18l75j20m0L27L51k1j92m10
$$ -509 284 469 19 -201 -225 236 380 251 286 -232 -150 246 -43 275 -100 -220 -260 67 418 397 205 -205
2765b05J7M5O51j21n52j20K70M1M16j83r7l42L35q2L49l85m10RM09J10Q3j29l66
$$ -205 -188 -143 508 387 -165 -285 -15 26 442 259 162 -180 155 73 422 37 -373 -364 45 155 238 109 -257
2788b57K74k91M21N03j80q16J72p5P05j25k90j81k44N69K06j94m53l3L01k49N41
$$ -257 17 -274 147 650 470 -346 -174 -249 456 331 41 -140 -384 185 391 197 -256 -289 12 -237 304
2809C04R0k47l78k74O19j76K48p3l87j14K78K66k41M7j62m1M21K17l40j08k59
$$ 304 394 147 -231 -505 114 -62 186 113 -274 -388 -110 156 -85 -38 -200 -241 180 397 57 -51 -310
2830c10K64K41p9L2m13K48j75K91L70m01n3m79P7N08K13o40j34K33n5M47j91p1
$$ -310 -46 195 116 148 -265 -17 -192 99 469 68 15 -464 -387 121 334 -306 -440 -207 -262 185 -6 -77
2852g7j84J49J15L01j83j74j16k9M13k35K16l0j06k01J56L0L39l65P5l15P3M39
$$ -77 -261 -112 3 304 121 -53 -169 -198 215 -20 196 166 60 -141 15 45 384 19 94 -221 -148 291
2874B91m3k65k0k7K60L19l75l44J86j85J69J64j41O6k27P2J74K99k81l28p2Q1
$$ 291 248 -17 -37 -64 196 515 140 -204 -18 -203 -34 130 -11 55 -172 -100 74 373 92 -236 -308 -227
2896b27M40p0j47k30O0J98M17k64k20k39K56j98M04N8k40J88k84p7K39o3K2l32
$$ -227 213 143 -4 -234 -174 24 441 177 -43 -282 -26 -224 180 238 -2 186 -98 -175 64 1 23 -309
2918c09N7L53j46K96p0l00j57N17Q5k6k96j82N4L06K15n37J0j75K9N22J04l89
$$ -309 -252 101 -45 251 181 -119 -276 241 326 300 4 -178 -124 182 397 -140 -130 -305 -276 246 350 -39
2940c9J09m71K86J50j70J89r5jj53L63N9q5n46J60J3L19p2j17M5R5J68Mm78M53
$$ -39 70 -401 -115 35 -135 54 -41 -42 -195 168 227 142 -404 -244 -231 88 16 -101 -56 39 207 211 -267 186
2964A86o45N16R9K22j14l83J7k13K30K3O0l45J4K90J25m2n5J92n40L30j24M46
$$ 186 -459 57 156 378 264 -119 -102 -315 -85 -62 -2 -347 -333 -43 82 40 -15 177 -363 -33 -157 289
2986B89m10J72R5l83O99k83k38n5OJ28J46k5p3l7k18O7R3o6k9K36k4K63k16J15
$$ 289 -121 51 146 -237 462 179 -59 -114 -108 20 166 141 68 31 -187 -120 -27 -93 -122 114 90 353 137 252
3010B52j03nm67N07L15l75j11l04M24k28K68n8j85j96K1L31o0P9m58K22R6K87
$$ 252 149 144 -323 184 499 124 13 -291 133 -95 173 115 -70 -266 -245 86 26 105 -353 -131 -35 252
3032B52K04k50m45P4Q1J98r1N1o08M23L88j07k08j07M6N7J35qL2m9n3q7N1L96
$$ 252 456 206 -239 -165 -84 114 23 74 -534 -111 277 170 -38 -145 -99 -42 93 85 117 68 15 -72 -21 375
3056C75j79l55J06J65l55K98Q4j46k58K60K94k82N0Qk3N0p9K52k86k87M92j39
$$ 375 196 -159 -53 112 -243 55 139 -7 -265 -5 289 7 57 65 42 92 13 265 -21 -308 184 45
3078D5o2o0J52n66M25K03j51J22k04p9K73M4J39J0r4l87J33p6J44l2l0k8j3kL46
$$ 45 -17 -77 75 -491 -66 137 -14 108 -96 -175 98 142 281 291 197 -190 -57 -133 11 -21 -51 -79 -92 -94 252
3103B52k43Mj95L46N4j11K8m19L8K90j11j0L63m88J52k90N00P6n4m13j75J48K90
$$ 252 9 13 -182 164 218 107 135 -284 -246 44 -67 -77 286 -202 -50 -340 160 236 182 -231 -406 -258 32
3126C2n5n7m09N40M0o3J23k81k63J38M83l70K47p2k51N1l6N36j02k37j92J4J92
$$ 32 -23 -80 -489 51 91 28 151 -130 -393 -255 228 -142 105 33 -218 -167 -203 333 231 -6 -198 -184 8
3149HoJ46k86N3L18k39k51J93l3J02j15K53M3j12l21K82o6K27o7q1j59M3o7q8
$$ 8 2 148 -138 -85 233 -6 -257 -64 -97 5 -110 143 186 74 -247 35 -31 196 129 48 -111 -68 -135 -223
3173b23K15J28j92j09PL69o3n88N22j48j04N85J63o05j38K25m6j48j11M63l76
$$ -223 -8 120 -72 -181 -174 195 132 -456 66 -82 -186 399 562 -43 -181 44 -2 -150 -261 202 -174
3194a74l3L68k02q6PJ11J65k70J84k40J83L0j48Q5L40n10J13n8k4R8J15j16r6
$$ -174 -207 161 -41 -127 -120 -9 156 -114 70 -170 13 43 -105 -20 320 -190 -77 -135 -159 -61 54 -62 -158
3217a58k39N03R8n5j59j34L61r4oJ50m36J60K24k29o3J31j0k13KJ63k97N29k49
$$ -158 -397 106 204 149 -10 -144 217 123 117 267 -169 -9 215 -14 -77 54 44 -169 -167 -4 -301 228 -21
3240b1j88J86j61J14Q6rJ9j33J95k02L50m92J82k15J18R7J15J57K1l23J32O9P1
$$ -21 -209 -23 -184 -70 16 7 26 -107 88 -114 236 -256 -74 -289 -171 -74 41 198 219 -104 28 97 168
3263A68j13k10p9J6J14J68k28L46pj70J15l4l20mK58q8J05k27L10p3Q6M42n26
$$ 168 55 -155 -234 -218 -104 64 -164 182 175 5 120 86 -234 -238 20 -68 37 -190 120 47 133 575 49
3286D9qk07K07J13rj42K04l20j10N03k69j86m8L36l68M44O9k32K35j40k73J0R4
$$ 49 41 -166 41 154 145 3 207 -113 -223 280 11 -175 -223 113 -255 189 258 26 261 121 -152 -142 -48
3309d8J39J45l11J87j38J83k41K1J7K21l04J63O8L8k02j43L02J39j23J37r8k03
$$ -48 91 236 -75 112 -26 157 -84 -63 -46 175 -129 34 102 140 -62 -205 97 236 113 250 152 -51
3331e1J95m21K02J45j60j8J88J52l24j33L39j24L20j08j65j80j06L50M1k96j35
$$ -51 144 -277 -75 70 -90 -108 80 232 -92 -225 114 -10 310 202 37 -143 -249 101 142 -154 -289
3352b89K18lJ44pk74J97J10oJ92l29L28l66J69k35L12r8Q2n17L91J64j80J22J71
$$ -289 -71 -74 70 63 -211 -14 96 90 282 -47 281 -85 84 -151 161 63 145 -372 19 183 3 125 296
3375B96n60J90j52J09J90K1J47p9m10L3K18j7M2J85Mn37N23l89J63M7k27PJ58
$$ 296 -264 -74 -226 -117 73 94 241 162 -248 -215 3 -14 28 213 217 -320 203 -186 -23 24 -203 -196 -38
3398c8J07k20K34j41J76k55oL50k48R0k28K81N4k18L08k22J16m72M51k48K54k55
$$ -38 69 -151 83 -58 118 -137 -143 207 -41 49 -179 102 156 -62 246 24 140 -332 119 -129 125 -130
3420a30R7K33j74k52PL74l52K09m9%n8K6M92k41j56M04l51k7m9n1J98k46J10n31
$$ -130 -33 200 26 -226 -219 155 -197 12 -37 -37 -95 -69 423 182 26 430 79 52 3 -48 150 -96 14 -517
3444e17M45L15j65m3k49L59j69P2J46n30J41J78L19j01j64j8j86L31k18J6j3M
$$ -517 -72 243 78 35 -214 145 -24 48 194 -336 -195 -17 302 201 37 19 -167 164 -54 -38 -51 -47
3466d7L37j20j87j2M1k4Rq8m7J33J82k21J84k98K53j99n5J41r3J24L7j12J63q4
$$ -47 290 170 -17 -29 12 -12 -3 -91 -138 -5 177 -44 140 -158 95 -104 -159 -18 -111 13 50 -62 101 17
3490A7P0j46M14l55j07K95k53J97j61m6J02j19j63J44R4J34k9K3l3n6J59K74p02
$$ 17 87 -59 355 0 -107 188 -65 132 -29 -75 27 -92 -255 -111 -17 117 88 111 78 22 181 455 -247
3513b47M68N0j67l99K58K8j43j61N21o6l33J71K26k08j55Q0k9n9J71K36k33J93
$$ -247 221 271 104 -295 -37 -9 -152 -313 208 142 -191 -20 206 -2 -157 -77 -106 -165 6 242 9 202
3535B02k2l35l0K10n8K9j0K39l26L09r5j67L7J53o5k4l7j99M21p8l62K16K41m9
$$ 202 180 -155 -185 25 -33 -4 -14 225 -101 208 113 -54 -17 136 71 47 10 -189 232 154 -208 8 249 200
3559B00k53j16K36r8J9j6l2o5J94J31j48J39k26K0k91K18k2j7J15M7K15j43j72
$$ 200 -53 -169 67 -31 -12 -28 -60 -125 69 200 52 191 -35 -15 -306 -88 -110 -127 -12 35 250 107 -65
3582f5o7J09K2k43J04rL16l78K84m3n8L6l24L15Q3J09m22K03j89J96J87k20k05
$$ -65 -132 -23 -1 -244 -140 -149 167 -211 73 30 -28 8 -316 -1 82 191 -231 -28 -217 -21 166 -54 -259
3605b59J52L05k12K40r3J91n21L29k51qJ27L7l55J56K44l49M99j11j48p3J00J35
$$ -259 -107 198 -14 226 133 324 -197 132 -119 -127 0 37 -318 -162 82 -267 232 121 -27 -100 0 135
3627A35k2l28p4M00j32po0k2n3j77K90K8j46J06N9J64l69oK61k34L95k21K97l38
$$ 135 113 -215 -289 111 -21 -28 -88 -110 -163 -340 -50 -22 -168 -62 -3 161 -208 -214 47 -187 208 -13 284 -54
3651e4L24l94pm7N3LK95l31J10j49L20k45J55J83n00M04l3j81j58K56K1k0j19
$$ -54 270 -124 -131 -178 -125 -122 173 -158 -48 -197 123 -122 33 216 -284 120 87 -94 -252 4 25 5 -114
3674a14N6J51l41R9M13l10K85O9l31m70K98K68j27o9K5K28n2o3j38J45o0p5J25
$$ -114 -58 93 -248 -149 264 -46 239 308 -23 -493 -195 73 -54 -123 -98 130 78 15 -123 22 -38 -113 12
3697A2L1q2K9j91m7J84R0L56m73R0J5o0J60Om1j59j02K44J25k08j97K18J8M2M98
$$ 12 43 -39 -10 -201 -248 -64 26 382 -91 -1 14 -46 114 120 79 -80 -182 62 187 -21 -218 0 18 60 558
3722E58p10L05n32N35p9k06K64k92J37J50j7j86K99j81Q9j53J1k14K56k62J71
$$ 558 -152 153 -379 156 77 -129 135 -157 -20 130 113 -73 226 45 134 -19 -8 -222 34 -228 -57
3743e7J48J07j46o3p3J42M0l95L47k51M44n63O50k57k12K36n6j30K0j23R9N7P3
$$ -57 91 198 52 -11 -84 58 98 -297 50 -201 243 -320 330 73 -139 97 41 -89 -69 -192 -93 -36 37
3766C7j16N83l85j84l7j3K16k39L58p4k51J60r3J19o4L1Q6J77k60J8J91m80J96
$$ 37 -79 504 119 -65 -102 -115 101 -138 220 146 -105 55 -38 81 17 48 134 311 51 69 260 -220 -24
3789b4J78p6L22m31%p2l9j23K99m14M38j33n9K22o2q5Pp6QK27J60n19N0J29O8
$$ -24 154 78 400 -31 -31 -103 -142 -265 34 -380 58 -75 -134 88 26 -59 -52 -128 -120 107 267 -252 -202 -73 -5
3814eQ4l17M35j61PK62K1n27K77J0Jk55M7L72l68M05l92N8J46n3k12P2K54j16
$$ -5 79 -238 197 36 43 305 326 -201 76 86 87 -168 -121 251 -117 288 -104 -46 100 47 -165 -93 161 45
3838D5n6L71j33K66n89J71q2k22N20k44Mn4K73L5l53k59K68M03k83P4n0k55J25
$$ 45 -11 360 227 493 -96 75 -7 -229 291 47 51 -3 270 305 -48 -307 -39 364 81 155 105 -150 -25
3861b5K0Q1l91K28N9o4K66j09j77M36l30rR2L2K08l50L41n82M22j31M5j72k8m0
$$ -25 -5 76 -315 -87 -28 -92 174 65 -112 324 -6 -15 77 109 317 -33 308 -274 148 17 62 -110 -138 -178
3885a78J97o1J63l70J49j24K36K48l93K01l43K51J03Kl36J04J2L55M9P5m70K21
$$ -178 19 -42 121 -249 -100 -224 12 260 -133 68 -275 -24 79 81 -255 -151 -139 216 265 340 -130 91
3907I1m03P21r4p25P99n29J65J60p9r7m1n5J13J46P3r3m56L96k08J53L6L0o9M1
$$ 91 -312 409 315 -410 389 -140 25 185 106 9 -32 -87 26 172 245 152 -304 92 -116 37 73 103 34 75
3931G5P0n2r4k92M71m97K42J33K06l39j69K54m8j17J80L32m15J80j79L12k24p9
$$ 75 145 93 -1 -293 178 -319 -77 56 262 -77 -246 8 -40 -157 23 355 -60 120 -59 253 29 -50
3953e0k7J94k77L13j54j68%L73J80m46J23N3j05l4l3K67m58K32m23N04j07K94
$$ -50 -77 117 -160 153 -1 -169 -169 204 384 -62 61 114 9 -25 -58 209 -249 -17 -440 64 -43 251
3975B51l18J49k1L4L1k46J17j43K70k23K07k73p3J15J55j30J56k58N8J17j35N69
$$ 251 -67 82 61 95 126 -120 -3 -146 124 -99 108 -165 -238 -123 32 -98 58 -200 -142 -25 -160 409
3997D09l23l78o7L13J2N95n59j09M06o37R7L65L3k37OQ3R4p6K03n38L01l9k4L59
$$ 409 86 -292 -359 -46 -34 561 2 -107 299 -338 -241 124 157 -80 -74 9 103 27 230 -308 -7 -46 -70 289
4021B89k20J25q8K17k72Nj2j19J8K79k44P0L9l20M27l38L09L3j7k74P8Om6J32
$$ 289 69 194 106 323 51 56 44 -75 -57 222 -22 48 87 -233 194 -144 165 198 181 -93 -15 -9 -55 77
4045G7K46n39L46m3k7J61J7J73l78j7k35J37P1j31M3L38l18N5l75K98Q6P5l8R2
$$ 77 323 -216 130 87 60 221 238 411 33 16 -219 -82 -11 -142 -99 239 -79 -24 -399 -101 -15 60 22 114
4069A14J58j77P1o8J1k71Q0R8N9k6j5K41m17K22J12j98K84k01j99J00J41kj87
$$ 114 272 95 166 98 109 -162 -82 16 75 49 34 275 -142 80 192 -6 278 77 -122 -22 119 117 -70
4092g0L83m35j46K94j41O81n86j76K22k8O4J29J09j90pJ49o4l30p5K04K44l50
$$ -70 313 -122 -268 26 -115 566 -20 -196 26 -2 62 191 300 110 103 252 188 -142 -217 -13 231 -119
4114a19m9K26j77k24K88Q4J51k12j56o3M81k11n1P0k04J23j4K14m30L53J44l83
$$ -119 -168 58 -119 -343 -55 29 180 -32 -188 -251 230 19 -32 38 -166 -43 -57 157 -273 80 224 -159
4136a59O7L68k31j94P8M1M6Jl7J31k15o8J84j01K01K6j80o5K77m85L90Q8n37K25
$$ -159 -92 276 45 -149 -71 -30 16 17 -20 111 -104 -172 12 -89 112 138 -42 -107 170 -315 75 163 -374 -149
4160a49K80Qj54K5k66K73J83k34j09K78m61L53L7k5j75N2j6M4q4M83j48l02J31
$$ -149 131 139 -15 10 -256 17 200 -34 -143 135 -326 27 64 39 -136 -84 -100 -56 -140 343 195 -107 24
4183B4K28k18r7Rq7j87N10k77L91l99j32K79J8M17l85k06O7j39L86j24J31k20
$$ 24 252 34 -63 -54 -141 -328 182 -95 296 -103 -235 44 62 479 94 -112 -45 -184 202 78 209 -11
4205a1k31K48qo2J37nn55M45m49N48j46K24m42K37j55L16k40m7J43j40M54k83
$$ -11 -242 6 -2 -64 73 68 -487 -42 -491 57 -89 135 -307 -70 -225 91 -149 -196 -53 -193 261 -22
4227b2q3L18l10J0J03J09N3O7l66J90k01K84k86J79k78K25Q4j54M5r4j38L49j17
$$ -22 -105 213 -97 -87 16 125 178 245 -121 69 -132 152 -134 45 -233 -8 76 -78 -33 -127 -265 84 -33
4250c3K48j08l39Q4J46K33k62j9l7J86j6k01J04L21n41L51k80J1K22k42J11O0
$$ -33 215 107 -232 -148 -2 231 -31 -50 -87 99 83 -118 -14 307 -234 117 -163 -152 70 -172 -61 -1
4272aK2k60R1M25k25q2L76p88K45M02k87Q4J88k79j11m5L28l1r0L69l62j58K53
$$ -1 21 -239 -148 277 52 -30 346 -442 -197 205 -82 2 190 -89 -200 -245 83 52 -38 331 -31 -189 64
4295F4J20k41M9n0o0J31J49k51K5O6j7K73k06K3q2k4j08M6K19l04L90o49N33r8
$$ 64 184 -57 -8 -58 -118 13 162 -89 -64 2 -15 258 52 75 -7 -31 -139 -93 126 -178 212 -437 96 -2
4319bl78J59K31k15kK79L1J2l78K6L10r6Q0L08m4l29k67N71k3l19p0P0L8L49l07
$$ -2 -380 -221 10 -205 -207 72 103 115 -263 -237 73 -23 57 365 321 -8 -275 296 273 -46 -116 -46 -8 341 34
4344C4k35J12L58j33J03j52j93p0L69m14M79m06R2K25k68M59m88N12n37r6J92
$$ 34 -201 -89 269 136 239 87 -106 -176 193 -221 258 -148 -56 169 -99 360 -128 384 -153 -249 -57
4365e7K52l27K12j80K88j34Q9L6J08l55q9J24J5J06Q0l55j3N51m25L64l04O1L87
$$ -57 195 -132 80 -100 188 54 143 179 287 -68 -157 -33 -18 88 168 -187 -200 351 -74 290 -14 47 434
4388D34n83j16K44Jq3K09k29K75j01j11k1L28m24L63j86q5J09j40q7M79l86l15
$$ 434 -149 -265 -21 -20 -103 106 -123 152 51 -60 -81 247 -177 186 0 -85 24 -116 -203 276 -110 -425
4410d25J81J30j50O99l50l80K94J4L3J53m60r0K22J16J42J35R1l01l63L2J87J27
$$ -425 -244 -114 -264 435 85 -295 -1 13 46 199 -261 -351 -129 -13 129 264 355 54 -309 -277 -90 37
4432C7J32m04J15p0J93J0K37l44k55J98P9k07P7Q5L23n5j83P8j44J51J08k15j61
$$ 37 169 -235 -120 -190 3 13 250 -94 -349 -151 -72 -279 -202 -117 206 151 -32 46 -98 53 161 -54 -215
4455b15K79j49Q5j92J38K41m93K86K62m56R4k25N93k75Q6j53J4j15N80k02k89
$$ -215 64 -85 0 -192 -54 187 -306 -20 242 -214 -120 -345 248 -27 59 -94 -80 -195 385 183 -106
4476a06K74m41N26j42k66K61q0n0o2J40J20m1k91O4J66j81r6KrK13M50l37k28
$$ -106 168 -273 253 111 -155 106 26 -24 -86 54 174 133 -158 -94 72 -109 -205 -203 -212 1 451 114 -114
4499a14P3l6K22j95J19j08O3L23o43L00pK0n9J4L76j02k11j24L39p9j43k75L74
$$ -114 -41 -77 145 -50 69 -39 24 347 -296 4 -3 17 -42 -28 348 246 35 -89 250 171 28 -247 127
4522A27qj51K23j01N4j41l0q2P3J70nl0j34j34J33J82l70J38J07o5J5j8K03p1
$$ 127 119 -32 191 90 144 3 -27 -109 -36 134 129 99 -35 -169 -36 146 -224 -86 21 -44 -29 -47 156 85
4546H5rJ61m07L00j2o15N18J43j05J90k6j56P8k43N8j40p2J56j72m6L06j09k56
$$ 85 76 237 -170 130 118 -497 21 164 59 249 223 67 145 -98 -40 -180 -252 -96 -268 -314 -8 -117 -373
4569c73K54%L48K5k49N0j66j14K38k5j00k40L61o1J49P4m8j60O7r2j19J29J7j29
$$ -373 -119 -119 229 254 5 55 -111 -225 13 -12 -112 -352 9 -52 97 171 123 -37 30 -62 -181 -52 -35 -164
4593a64K72K01j00j15k50M6j38J99K88k99l3J24L8j14L55l30k76M4K24j05R6M66
$$ -164 108 309 209 94 -156 -110 -248 -49 239 -60 -93 31 69 -45 310 -20 -296 -252 -28 -133 -37 429
4615D29n85k6K2J99K90n98L53k62Q0M29l25l6J14k2k17p6K42k07K71j98M4J00
$$ 429 -156 -182 -160 39 329 -269 84 -178 -98 331 6 -30 84 62 -155 -231 11 -196 75 -123 -79 21
4637B1k00j06K40j03rL58k1j26M9j3j23K10k24k06K34J8m0M7R4J21m23n1J74M19
$$ 21 -179 -285 -45 -148 -157 201 180 54 103 90 -33 177 -47 -253 -19 -1 -41 6 100 221 -202 -253 -79 340
4661C40l61o5J75R4kl51J3K2Nj3R6r2J60k63J72k9K6J11J52l53K9K12nl7j74n9
$$ 340 -21 -86 89 183 181 -170 -157 -135 -130 -143 -47 -139 21 -242 -70 -99 -73 38 190 -163 -134 78 73 36 -138 -197
4687a97R4pJ54K11k53q2J0l3J99r0J53k22R5J88j20p2r2r4J04M0K5M32o27Q2k55
$$ -197 -103 -110 44 255 2 -80 -70 -103 96 6 159 -63 32 220 100 28 -64 -158 -54 -14 11 443 -184 -102 -357
4712c57O33p7k79jN7q8j7L26k75j58K0M1P5J27J68k33j39J56l2N25l90m8k66J42
$$ -357 276 199 -80 -81 -24 -112 -129 197 -78 -236 -216 -175 -100 27 195 -38 -177 -21 -53 472 82 34 -232 -90
4736i0K5J37J36k07K93m03K32M2r8j44J64J46k27k4L0J19j90J08n4M0k27J70J2
$$ -90 -65 72 208 1 294 -109 123 165 67 -77 87 233 6 -18 12 131 -59 49 -5 35 -192 -22 -10
4759a0J19O8k37k27J99L02p47N65J32k5l06J46N04m44j39j1k60L06J57R0m43K77
$$ -10 109 177 -60 -287 -88 214 -533 32 164 139 -167 -21 483 39 -100 -111 -371 -65 92 182 -261 16
4781A6j13M47m29M4K46p5J1j70M86m34o2L4m12L60K22m53K49j10K02k6P1n4j35
$$ 16 -97 350 -79 -35 211 136 147 -23 463 29 -33 1 -411 -51 171 -282 -33 -143 59 33 104 50 -85
4804h5N5k48M97m3M3n45K31J01O4L33m03m6L72k04m7M2j53l77M54n8l1L41r3l73
$$ -85 -30 -278 219 176 219 -326 -95 6 70 403 0 -46 326 122 75 117 -36 -413 41 -17 -48 293 200 -173
4828a73M23l96j96Q9L21O2l00J21j41J07p5Q2J81Q7k43j08K82k40l10K99j10q0
$$ -173 250 -146 -342 -253 68 130 -170 -49 -190 -83 -158 -76 105 192 -51 -159 123 -117 -427 -128 -238 -318
4850c18N11k75J96N6j44J00l06N32m04r7J72J14k25j99j65M03Q0J6M1l30J71l5
$$ -318 193 -82 114 170 26 126 -180 352 -52 -149 23 137 -88 -287 -452 -49 31 47 88 -242 -71 -106
4872a06M01k20N1k25r1J28J18p9j98j77M47J10p1q9l81L17o6K34jK7j47N3k37
$$ -106 295 75 126 -99 -190 -62 56 -23 -221 -398 49 159 88 -1 -382 -65 -131 103 102 129 -18 35 -202
4895b02J23R0j76J27P8K03j56J9m08L17k03M71l98j05m7k26N27q7J00k49J70k47
$$ -202 -79 11 -165 -38 40 243 87 106 -302 15 -188 283 -115 -220 -267 -493 34 -53 47 -202 -32 -279
4917b79M26J2m0j17j4k23M08j22j52r8m2K42j47K65m06K22j47N4K24j61P9L2k24
$$ -279 147 159 119 2 -12 -235 173 51 -101 -199 -241 1 -146 119 -287 -65 -212 -158 66 -95 -16 16 -208
4940b08J64K21l06m5R2oL5L03l05J40j90j14M2R0K45j15k1K3o8J99M6J10m60j47
$$ -208 -44 177 -129 -174 -82 -88 -53 250 -55 85 -105 -219 -177 -87 158 43 22 45 -23 176 222 332 -128 -275
4964b75L50j58P0j17J77L9J01k07P8m00L43n1J87P0j96m5J12J17j30N6k23k12
$$ -275 75 -83 -13 -130 47 86 187 -20 58 -342 1 -50 137 207 11 -34 78 195 65 121 -102 -314
4986c14M42l3n7J74m55K18K4K11r1p7qk23L27j21K23m79M61k44oL69l33J28m63
$$ -314 128 95 38 212 -243 -25 -1 210 119 42 34 -189 138 17 240 -239 222 -22 -28 341 8 136 -327
5009c27K69Q2J07l89J73k34L58p7K72k40j13K28j99L71m21J67J55m13k0j99L87
$$ -327 -58 24 131 -258 -85 -319 39 -38 234 -6 -119 109 -90 281 -140 27 182 -231 -251 -450 -63
5030f3N4m5j32M5J18J60o2n3k50p2o1L63J15Q4j24l91j9O44j58k30q5M0pM35o2
$$ -63 -9 -54 -186 -141 -23 137 75 22 -228 -300 -361 2 117 201 77 -314 -333 311 153 -77 -162 -122 -129 306 244
5055B44l52K12R4k79MP9J8k22N66k20j68K01j30K63k69n7k60M98K5j73k7K36J2
$$ 244 -108 104 198 -81 -77 2 20 -202 364 144 -24 177 47 310 41 -16 -276 222 247 74 47 283 295
5078B95j39J0Ml35K63J3l2k59n4J80Jl74L95k22o2M95l00OJ31k23j2L54k64N5
$$ 295 156 166 170 -165 98 111 79 -180 -234 -54 -53 -427 -32 -254 -316 179 -121 -115 16 -207 -219 135 -129 -74
5102g4L17l39M60n17K70J46m37K13RJ49K44l20lp1q4NK7q0J01J66Q5l95L35K70
$$ -74 243 -96 364 -153 117 263 -174 39 48 197 441 121 118 47 -37 -32 -5 -85 16 182 267 -128 207 477
5126D77o00K09r4k9J92o3j00k20L48k66L27j66k62J04L38j39j06L22j90L6l86
$$ 477 -123 86 -8 -37 155 92 -8 -228 120 -146 181 15 -247 -143 195 56 -50 272 82 118 -268
5147b68j66K98K39J20k33p2Q4M8k18K99k82J23J13j22L19n47J48K02J2nk23m7
$$ -268 -434 -136 103 223 -10 -82 2 50 -168 131 -151 -28 85 -37 282 -265 -117 85 97 92 -131 -178
5169a78K27r7n7P7p7ok1L11j24N8j55K5j69K79k37K77j74K7R2r4P8j17Q7J15l55
$$ -178 49 -48 -105 -28 -105 -111 -132 179 55 113 -42 -17 -186 93 -144 133 -41 -14 78 -16 62 -55 32 147 -208
5194b08N97k79j40k2o4J34K07k60k20J13o1L10o7n0q7K21k10K6L68k50j52K75
$$ -208 389 110 -30 -52 -116 18 225 -35 -255 -142 -203 107 40 -10 -97 124 -86 -60 308 58 -94 181
5216A81l19J09r6J76n0j36J88l0j29J96nJ7Jk99L8L18j19j78R2K67j85j22k01
$$ 181 -138 -29 -125 51 1 -135 53 23 -106 90 85 102 103 -196 -158 160 41 -137 -45 222 37 -85 -286
5239b86j3O60j7k22l61L40k17J94J4k27K16J27n55J86l5L85j31J52J49l51k92
$$ -286 -299 361 344 122 -239 101 -116 78 92 -135 81 208 -347 -161 -196 189 58 210 359 8 -284
5260b84R2J21J37L7l35M25k86J97j76K24k11M9M65m70q0J43p0N6k51Q2k0Q9K46
$$ -284 -192 -71 66 103 -232 193 -93 104 -72 152 -59 -10 455 -15 -95 48 -22 34 -217 -135 -155 -66 180
5283A80k15J67j45k78L83M2m7q5l05J76J55J19lj51k1L33k69K9O2j86O7l17N05
$$ 180 -35 132 -13 -291 92 134 87 2 -303 -127 28 147 144 -7 -28 305 36 65 127 -59 8 -309 196
5306A96l85L07J30l99R9j04K97m68J65m6J63J35j55L42l40J98k65K19q1K5m44
$$ 196 -189 118 248 -151 -52 -156 141 -327 -162 -208 -45 90 -65 277 -63 135 -130 89 8 33 -411
5327d11Q99m89o1k1J4j26K05J71l65L14j87K22j94K19j56j18q7J23j60K42M17
$$ -411 488 -1 -62 -83 -69 -195 10 181 -184 130 -57 165 -29 190 34 -84 -171 -48 -208 34 451
5348D51o61K26j24j6K30K33k74k07L50j94K07O0k1n47oJ26J54L05O3k26j29j9
$$ 451 -210 16 -108 -124 106 339 65 -142 208 14 221 281 260 -287 -293 -167 -13 292 355 129 0 -19
5370a9J08l20J95Q7k54K98j22L56l40r4R9j98O20m66J92l17RoK92l6k49R5L12
$$ -19 89 -231 -36 51 -203 95 -27 329 -11 -105 -6 -204 416 -50 142 -175 -166 -172 120 84 -165 -70 242
5393B42k80q7Q0J29O7j02j95L6q1K30k74J00J58j15K03M6k99J31K10k13o5L10
$$ 242 -38 -125 -45 84 151 49 -146 -110 -191 39 -235 -135 23 -92 111 157 -142 -11 199 -14 -79 231
5415B31j0l02R4j35J78q6J86j62j28J44K20k39j35N8j09j11L4J56j79J29P6m3
$$ 231 221 -81 13 -122 56 -30 156 -6 -134 10 230 -9 -144 -86 -195 -306 -272 -116 -295 -166 -90 -133
5437a33j6l51N63P7j83j46K48Q7L8m46K30k71M64o9m35N57k66j80M58j56j64j09
$$ -133 -149 -500 63 140 -43 -189 59 146 184 -262 -32 -303 161 92 -343 214 -52 -232 226 70 -94 -203
5459b03Q8K70k33NlQ5J81q0k38L37rk86J65k77Q0L35l2m2J49j97L5k78j86M92
$$ -203 -115 155 -78 -73 -76 9 190 110 -128 209 200 -86 79 -198 -118 217 185 143 292 95 130 -148 -334 158
5483A58k39K17n16N94J22l67K07m1r7j5J7j97j21K16R2L1k59L42j25j99R7N7O3
$$ 158 -81 136 -380 214 336 -31 176 135 38 23 40 -157 -278 -62 30 61 -198 144 19 -180 -83 -26 37
5506C7q7r9j28m1K36J92q9R1k37J71r8L25j54k54J34K79k6j69k27K16l5P1M2j40
$$ 37 -50 -149 -277 -318 -82 110 21 112 -125 46 -52 273 119 -135 -1 278 252 83 -144 72 37 108 150 10
5530A0p2PP1p2k5M9j2j7J59R4j20n7Q6J10l09j18K95J07M1q1M7k39M76m18J41
$$ 10 -62 -55 16 -56 -81 -32 -44 -61 98 192 72 15 101 211 -98 -216 79 186 227 146 193 -46 430 12 153
5555A53j27K45l95J90j87J94j92k71O07k57m31L48o4L04l42L93j51m2j22M1J39
$$ 153 26 271 -124 66 -121 73 -119 -390 217 -40 -471 -123 -187 117 -225 168 17 -25 -147 -106 33
5576C3L00m84N0L58m93M43k51k60L10J27j62J5M6J01j45j94J56L3j82j8J23O7
$$ 33 333 -151 -101 257 -236 207 -44 -304 6 133 -29 -14 32 133 -12 -206 -50 -17 -199 -217 -94 -27
5598b7N3J20O8o8l4rl04J16K66l75J72j62M67q1m55r1J90q8K63l09J63k6m3L32
$$ -27 26 146 214 146 112 103 -201 -85 181 -194 -22 -184 283 202 -253 -344 -154 -242 21 -288 -125 -151 -194 138
5622A38Q9l14J92k3J21k6p1P3l36K98k62M15l29K6k40K12m4j6K11j06K54k68k8
$$ 138 227 -87 105 82 203 177 106 179 -157 141 -121 294 -35 -9 -249 -37 -81 -97 114 8 262 -6 -34
5645c4m35O10o3j62M82l43o8j68K24j85O7l3J83P2j91J56P1n8j31q6K26j34J0
$$ -34 -469 141 78 -84 398 55 -13 -181 43 -142 -75 -108 75 147 -44 112 183 125 -6 -92 134 0 10
5668A0J37n7j13L23k61k09J59p8J99R5k27k19N07k87J82mj75J77j06Oj34k8L5
$$ 10 147 90 -23 300 39 -170 -11 -89 110 205 -22 -241 266 -21 161 157 -18 159 53 59 -75 -103 -68
5691f8J62k37J79rJ5L7K41m92L74l90R8L37j01K67m97J93j66j21L45k07L6k24
$$ -68 94 -143 36 27 42 79 320 -172 202 -188 -90 247 146 413 -84 109 -57 -178 167 -40 -4 -228
5713b28q4J22p1M8j42P98p23N82n25J73J11q0m8L8n0M62j90k25K1j83L12P7j19
$$ -228 -312 -190 -261 -213 -355 443 -280 302 -223 -50 61 -19 -67 -29 -79 383 193 -32 -11 -194 118 195 76
5736G6J46k41%p2p7M23ml77o3L62k48R7J52K4j29K57l83n9J14L44j72Rk36j05
$$ 76 222 -19 -19 -91 -168 255 251 -126 -189 173 -75 22 174 198 69 326 -57 -116 -2 342 170 179 -57 -162
5760a62N35j28l93K07j17J97j44j55J84r9N7P0k00J78O4j05N7k35K69k82O6K06
$$ -162 373 245 -148 59 -58 139 -5 -160 24 -75 -18 52 -148 30 94 -11 46 -189 80 -202 -136 70
5782G0l22L26k17r2N52j36k43J8K90m56M14k80M25k08q3o3r2K00j16k58J94j05
$$ 70 -252 74 -143 -235 317 181 -62 -44 246 -210 204 -76 349 141 58 -5 -97 103 -13 -271 -77 -182
5804a82n9L47m15K08N2k42M03J62J08n72K80m1j65n4K75k35K52k56L93l15j73
$$ -182 -241 106 -309 -101 -49 -291 112 274 382 -190 90 49 -116 -170 105 -130 122 -134 259 -56 -229
5825b29L30k99L5K60J3q2N8k94K48l4p8k9J28n58M53m9J11L27l66Jj4M8K62m36
$$ -229 101 -198 -163 97 110 28 86 -208 40 6 -72 -101 27 -531 -78 -127 -16 311 -55 -54 -68 -20 242 -194
5849a94o5M19jK6j53j17L01r1k90l8L01j2J13nJ36l88j53K6L67j50K12Rn00K04
$$ -194 -259 160 159 185 32 -85 216 125 -165 -203 98 86 199 194 330 -58 -211 -185 182 32 244 253 -247 -43
5873d3l6L35k52L5r5K14j52k13L93l40J32J80p8J34j41j5p0J09m05J71K13o4n2
$$ -43 -79 256 4 39 -56 158 6 -207 186 -154 -22 158 80 214 73 58 -12 97 -308 -137 76 12 -40
5896d0M02r4o17J74M57m17K81k5kq7M1k2k09L85l93j08J0J50K96l58K65j77L58
$$ -40 362 268 -349 -175 282 -135 146 121 119 32 73 51 -158 227 -166 -274 -264 -114 182 -176 89 -88 270
5919B70k53pj93J58j76J1R2M8m0L27j05j61K91k85O7M5J32o2l00L18p4%n3l2p4
$$ 270 17 10 -183 -25 -201 -190 -98 -50 -90 237 132 -29 262 -23 44 89 221 159 -141 177 103 103 50 18 -56
5944e6r4K5K53K20k60r1J87l18Q6P5J34kl20L43j66J84k53P1O4k03J66m5J23j00
$$ -56 -150 -125 128 348 88 -3 184 -134 -48 27 161 159 -161 182 16 200 -53 18 82 -121 45 0 123 23
5968B3P6j56K54p4J72j90j59j91J30J43J5ql74M43k76K29R1l09N2q7K6J50mn%
$$ 23 99 -57 197 123 295 105 -54 -245 -115 28 43 35 -339 104 -172 57 148 -161 -109 -196 -170 -20 -24 -29 -29
5993b9JJ40j97J76J54j61l82N54m27J69R7j08lK13j46j5j75M4P8j09K8K31M2m0
$$ -29 -28 112 -85 91 245 84 -298 256 -171 -2 95 -13 -16 197 51 36 -139 -95 -17 -126 -98 133 175 135
6017A35R3m08P7j9p1j53N12k34J78m9l46K86m24L25M10k38J68q6p5n6j77J5J75
$$ 135 228 -180 -103 -122 -193 -346 166 -68 110 61 -285 1 -423 -98 312 74 242 156 81 25 -152 -137 38
6040C8J33m06J84J10O2j99K71K31l21k10k24L98q8Q9pJ53k9j12j55J21J32j22
$$ 38 171 -235 -51 59 121 -78 193 424 103 -107 -331 67 -21 68 61 214 185 73 -82 39 171 49
6062D9J13k27PJ57l25J38k3lL10j19l2R1j23j29K77k8L5q4j98J04L21n13L22J54
$$ 49 162 -65 -58 99 -226 -88 -111 -114 196 77 45 136 13 -116 161 133 168 84 -114 -10 311 -202 120 274
6086B74l49L84l27M69q81O15j80J4R5k9l35q4J80J02M8J58j53j74J62O0J95m26
$$ 274 -75 309 -18 451 -430 185 5 19 114 85 -250 -334 -154 -52 -4 154 1 -173 -11 49 244 -182
6108a82M33j9l58J32M38j32l18j7q4J62j80j08N81j32R8l70J44q0n4l4p4K06j7
$$ -182 251 232 -126 6 444 312 -6 -23 -107 55 -125 -233 348 216 314 -56 88 8 -46 -80 -154 52 35
6131C5l86L54J00r9J12j6M7Q0k20Oj40O4K21j29k9j49N6l2O4K54m2p3k46K21j86
$$ 35 -351 3 103 4 116 100 147 227 7 13 -127 -63 158 29 0 -149 -93 -125 -61 193 151 78 -168 53 -133
6156a33K71j40J58q7k58N49l25k24L15k17m2J8OJ38L9q6j03N6j7p7qo1N1J42j56
$$ -133 138 -2 156 69 -189 360 35 -189 126 -91 -133 -115 -109 29 68 -18 -121 -65 -82 -159 -167 -228 -177 -35 -191
6181a91M42o84K42K72k26K36K85l03J05m5l17L86o7j69L74j89oo7l52O45l33K33
$$ -191 251 -433 -191 81 -145 91 376 73 178 133 -184 202 135 -34 340 151 145 78 -274 371 38 271
6203B71n33K7M5k0M13Qk95k14M23j09K84n65K44k5j45L28j20J59k84L92j47Q2
$$ 271 -262 -235 -190 -210 203 211 -84 -298 125 16 300 -265 -21 -46 -191 137 17 176 -108 284 137 219
6225B19k69j48J96m4l2j05L32l43L27l38K05R2j78RJ8J0J78j49J34k60M65k25
$$ 219 -50 -198 -2 -46 -78 -183 149 -194 133 -205 0 92 -86 -77 -59 -49 129 -20 114 -146 319 94
6247I4nr2M7m7NJ58k20J40k01n2K28J83l33P9j44j5O8M4N60m72j05J98k15J44
$$ 94 89 -3 44 -3 2 160 -60 80 -121 -173 55 238 -95 -16 -160 -175 -107 -63 497 25 -80 118 -97 47
6271D7j83J49N3j72L01j73oj33M7j04J35m5l5J83n0j15J10J24R8n10L92j34M05
$$ 47 -136 13 66 -106 195 22 16 -117 -70 -174 -39 -84 -119 64 14 -101 9 133 231 -279 113 -21 384
6294C84q6l71P7k60M54k28J69nJ1j50M6m2j39R8J55k29K80kl01P3j67L35m03K85
$$ 384 298 -73 4 -256 198 -30 139 134 145 -5 41 -1 -140 -42 113 -116 164 162 -139 -66 -233 102 -301 -16
6318a6O6O6L82n63r5K89Jj3J28l95K29K04m31P8j87K74l01K59k3J05l89M91r7
$$ -16 50 116 498 -65 -160 129 130 117 245 -150 79 283 -148 -70 -257 17 -284 -25 -48 57 -332 159 62
6341F2k06J21J34j99R3L2qj6j08q6J48k31L49j77Q5rL4Q0l11L50J7n7k80M35k18
$$ 62 -144 -23 111 -88 5 37 29 13 -95 -181 -33 -264 85 -92 -7 -16 18 98 -213 137 154 97 -183 252 34
6366C4K46m76k30M47O9j42J22l29M7J96J24K9l11K59j8L24k64n3j23p1K80l67
$$ 34 280 -196 -426 21 90 -52 70 -259 -212 -16 108 137 -174 85 67 391 127 74 -49 -120 160 -207
6388b07N69p16K99K27l37L03j34J71k42k26K08L30n67K45L10l11j93J70J99l34
$$ -207 362 -354 -55 172 -165 138 4 175 -67 -293 -85 245 -322 -77 233 -78 -271 -101 98 -236
6408b36J79OO4J64l26Q5r7L08k91L26k81L07k99J77mm0K25l90J71r8k62J51M08
$$ -236 -57 -51 13 177 -149 -64 -161 147 -144 182 -99 208 -91 86 82 42 267 -123 48 -50 -312 -161 247
6431B47n23N02l31J90J95j57l59K75k87K02kPj76J06M8k49N01p3J58n1k47j8K6
$$ 247 -276 226 -105 85 280 123 -236 39 -248 -46 -48 -41 -217 -111 -63 -312 189 116 274 223 -24 -42 -16
6454a6K77l62K8O8J03j02k42K9J51q4l9L75j37O4J7o9j10L4j95J41j6k0R7l0K2
$$ -16 261 -101 -73 -5 98 -4 -246 -217 -66 -150 -189 186 49 113 130 61 -49 -15 -210 -69 -85 -105 -8 -38 -16
6479a6m6j52K13K52k94K62k52j98m8L20J92m59J39kL52n01P8j16J59J98l63J30
$$ -16 -62 -214 -1 251 -43 219 -33 -231 -279 41 233 -226 -87 -89 263 -238 -160 -276 -117 81 -282 -152
6501a52N4J64k55K00k37l3K20L29l47Q1J26j31k36J16O6j46Q7j75K84mj43J30
$$ -152 -98 66 -189 11 -226 -259 -39 290 -57 24 150 19 -217 -101 -35 -181 -94 -269 15 11 -132 -2
6523bJ33J49l59l9j23l2N96n67K49J04k63K30J11l60m0N29n88M3J51M92m07M9
$$ -2 131 280 -79 -118 -241 -273 323 -244 5 109 -154 76 187 -173 -213 316 -272 -229 -78 414 7 56
6545E6j86o3Q4J1j21M7M52p5l71j53K40k89L70k07K63k39O8O9R8Q3k57M47l99
$$ 56 -130 -193 -109 -98 -219 -172 280 205 -166 -319 -79 -368 2 -205 58 -181 -113 -44 54 137 -120 327 -72
6568g2j29L48k78J97j71J74j5J42k52l6M7J92j1k17R0r6j2J80k33K23j15K69l71
$$ -72 -201 147 -131 66 -105 69 54 196 -56 -92 -45 147 136 -81 9 -87 -99 81 -152 71 -44 225 -146
6591a46p1J59K83j12l47L85k21R3j55L43l84K64J18k40J24nL9l25J07N5m05L17
$$ -146 -217 -58 225 113 -234 151 -70 23 -132 211 -173 91 209 -31 93 88 127 -198 -91 -36 -441 -124
6613a24L70n08J86K46Jj16K02j50k36N03k51k2k45MM07l16K82l39j86L27j21o0
$$ -124 246 -262 -76 170 171 55 257 107 -129 374 123 101 -144 -140 267 -49 233 -106 -292 35 -86 -146
6635a46k43K65n7J0J28K6n2k61N58m39J1J72J46j22K38j71L75l01l5K0k17K65
$$ -146 -389 -124 -181 -171 -43 -17 -69 -330 228 -211 -200 -28 118 -4 234 63 438 137 102 122 -95 170
6657A70J6j37J16m6J10l16J55K96j95m8p1k01J53o1l67M31l06J98K25M7q5l27
$$ 170 186 49 165 119 229 -87 68 364 169 121 50 -151 2 -59 -426 5 -301 -103 122 169 84 -243
6679b43J81o1R9q0J74q9K80j40J61k08k3j18M12n22NM14q3m07J73k47L25J10p7
$$ -243 -62 -123 -24 -104 70 -19 261 121 282 74 51 -67 345 -177 -172 242 159 -248 -75 -322 3 113 36
6702C6J80k16K07k29k10J50K41M7o1k5r6R2l60M98l97N62r2m61K65k22K41q8R
$$ 36 216 0 207 -22 -232 -82 159 206 145 120 24 116 -244 254 -143 419 327 -134 131 -91 150 62 71
6725G1q7J11kq9o3j32M11k90o6J16K2j36J11nr0K0j74L6L59k03j83K96K71k18
$$ 71 -16 95 93 4 -59 -191 220 -70 -136 -20 2 -134 -23 -28 -118 -98 -272 -236 123 -80 -263 33 304 86
6749H6k88N51l02J18j30l04K72j20J67k33J29J53Rk36J45j57L13k61K20j29j49
$$ 86 -202 349 47 165 35 -269 3 -117 50 -183 -54 99 108 -128 17 -140 173 -88 132 3 -146
6770a46L86l18m2j51O98k64K12k87j38n6n8K88j62J69K0k87m2O87m73mj04j24
$$ -146 240 -78 -120 -271 427 163 375 88 -50 -106 -164 124 -38 131 151 -136 -178 509 36 32 -72 -196
6792a96L76k46K55j64k18M79j04j61j98M20m96J64K17J9nm63M00N2p5o4J00R9
$$ -196 180 -66 189 25 -193 286 182 21 -177 243 -253 -89 128 147 142 -321 79 131 56 -8 92 191
6814A91l93J39L32l74K68o9k79K37P2j48R9q8r2J30j78k4K93k47J98j2p5j2j11
$$ 191 -202 -63 269 -105 163 94 -185 52 124 -24 75 -13 -105 25 -153 -177 116 -131 67 55 -20 -32 -143
6837a43K37l01J29K97k89j99K27on1L61k19k14K33l81J85J88j43nQ1J5j40J23
$$ -143 94 -207 -78 219 -70 -269 -42 -48 -99 262 43 -171 62 -319 -134 54 -89 -94 -13 2 -138 -15
6859a5K14K63n48J63k74Q6j07k6j6J68j24%K76k26J5o5L71m27M40l36M35l61j8
$$ -15 199 462 -86 77 -197 -111 -218 -244 -260 -92 -216 -216 60 -166 -151 -216 155 -272 168 -168 267 -94 -112
6882a12J68mk6k20L39O5j84K42j69J36j83j70K23l51j45L01L4K73l51Q0p1K05
$$ -112 56 52 26 -194 145 210 26 268 99 235 52 -118 105 -246 -391 -90 -56 217 -134 -54 -125 80
6904H0j64K82k32J39k7k64%Q6J33l17j04M96J01l0k4m67J74j46m7J40M4J92J53
$$ 80 -84 198 -34 105 78 -186 -186 -100 33 -284 -388 108 209 179 155 -312 -138 -284 -331 -191 -147 45 198
6927A98k64J32np3q5j51L8M20Kk0j13N0k37N1JK6j33J70J6k81K27o3Q5J40o2r2
$$ 198 -66 66 61 -12 -97 -248 -210 210 212 192 79 129 -108 -57 -56 -30 -163 7 23 -258 -31 -94 -9 131 69 -23
6953b3R5j02J8j81N88k94l08j08r7L92ML6j62L02n8j19O6J33l53J98p1k54J75
$$ -23 72 -30 -12 -193 395 101 -207 -315 -412 -20 -16 20 -142 160 102 -17 49 182 -171 27 -44 -298 -123
6976a23K07k23n8o1L36l2k07J92K7%k04L49k47K17o7r5k47R6J86J88m37J74M59
$$ -123 84 -139 -197 -258 78 46 -161 31 58 58 -146 203 -44 173 106 11 -236 -140 46 234 -203 -29 430
6999D30o17K91K92l48J26o3k93k0J20n5K15O2J00l46Lj27K72k05k9J34J49n4j70
$$ 430 -187 104 396 48 174 111 -182 -202 -82 -137 78 140 240 -106 -103 -230 42 -163 -192 -58 91 37 -133
7022a33N20p72M66J99r9k02P4k19J79r3j0J24K44m01L50l29L06k75J80P2l56Q4
$$ -133 387 -385 81 280 181 -21 53 -166 13 -80 -90 34 278 -123 227 -102 204 -71 109 181 -175 -91
7044i1m3K4N2P6J5O0j32R3k27J02m9n7N70n0l52K53l23Jj68K35L3l7k3J27Q3k93
$$ -91 -134 -110 -58 18 33 93 -39 54 -173 -71 -120 -177 393 343 -9 244 -79 -78 -246 -11 22 -15 -38 89 172 -121
7070a21p5K66k04O4M49m42R7p8j14K90m09N57k76K2o8K14k74J35k71K3K76j27
$$ -121 -196 70 -134 -70 379 -63 34 -44 -158 132 -277 280 4 26 -42 172 -102 33 -238 -215 61 -66
7092f6L20k70j37R0M72m40J66l34K60J8p1J33m32K08n9P2k10J21OM5K57j0n1j21
$$ -66 254 -16 -153 -63 409 -31 135 -199 61 79 8 141 -291 -83 -142 -70 -280 -159 -153 -108 149 139 88 -33
7116c3J95m7j39O1m3K59k45j02J74r5L1o4M5J12j04k8J30Q3l79m0J42Q7k0J20
$$ -33 162 115 -24 37 -6 253 8 -94 80 -15 16 -48 -3 109 5 -23 107 190 -189 -229 -87 0 -20 100
7140A00N9j43J04k80K03J9n5Q5k24M55l02K62m54J62K10K2k14J08n0j02k20L7
$$ 100 159 16 120 -160 43 62 7 92 -132 323 21 283 -171 -9 201 223 9 117 67 -35 -255 -218
7162b18K21k81J09J76K47j45Rk76J53j20r1J60Q6R2l56O5K39q1k85L87rl10P7
$$ -218 3 -278 -169 7 254 109 118 -158 -5 -125 -216 -56 30 122 -234 -169 70 -11 -296 91 82 -228 -151
7185a51P9j12j53K00J58j36k71J08J53p6J53J83j2l15O5k1J15O3j62K77j25K10
$$ -151 -72 -184 -337 -137 21 -115 -386 -278 -125 -201 -48 135 123 -192 -127 -148 -33 30 -132 145 20 230
7207B30l23M3j12J93q1N3K41k21O2j35J9k47L89l16J74M0n6O8k44q9L9K34Om48
$$ 230 -93 -50 -162 31 -50 3 244 23 85 -50 -31 -278 111 -205 -31 9 -47 21 -223 -312 -273 -39 -33 -481
7231d81O79j35k69J56L42j96Pp3k69L74k70RK22j44J0k36J33j48M07Q8j95o2j41
$$ -481 198 63 -206 -50 292 96 103 30 -239 135 -135 -126 96 -48 -38 -274 -141 -289 118 206 11 -51 -192
7254a92K47j7K9l13K00M11n32K02k78N70l02pR3j69M72k23p9j52K23j70j19kJ74
$$ -192 55 38 67 -246 -46 365 -167 35 -243 327 25 18 111 -58 414 191 112 -40 183 13 -106 -108 66
7277F6l5j41j21M30J76l16J0J40M1j66N6j07j28J30K55o8k38Q8k09L2Q4L84j89
$$ 66 31 -110 -231 199 375 59 69 209 250 84 140 33 -95 35 290 222 -16 72 -137 -105 -21 363 174
7300A74o85P22k35J07j97K30j73o9K57M6P9l57r2l5L36l11m8L46J6l1k50L63k41
$$ 174 -511 211 -24 83 -114 116 -57 -126 131 177 256 -101 -193 -228 108 -203 -251 95 111 80 -170 193 -48
7323d8n2K04O4j47j22K11j10j19J85k48L99O5n3r6j41K33j01K1j85K61j20J50
$$ -48 -100 104 168 21 -101 110 0 -119 66 -182 217 282 229 133 -8 225 124 145 -40 221 101 251
7345B51l90K51k31L6L32K27n04j89K11J58K4m99J68k18M78j27j71O8L15k48j28
$$ 251 -139 112 -119 -83 249 476 -28 -217 -6 152 176 -323 -155 -373 105 -22 -193 -125 190 -58 -186
7366a86K52j85L48L4n2k98Kl53L50K4K8j8JL56k97j04J7J0J82n7k99J67p3j16
$$ -186 66 -119 229 263 211 -87 -85 -438 -88 -64 -36 -54 -53 303 6 -98 -81 -71 111 54 -245 -78 -151 -267
7390b67K12L67k97l71J11K5K80m3K70m14J78K5m10K55k57K79l0K08k17K89n0j26
$$ -267 -55 312 15 -356 -245 -220 60 17 287 -127 51 76 -334 -79 -336 -57 -87 121 -96 193 143 17
7412A7j22R3o4K09N3k89L60k33J09k31P6K50j79j29qL2K62l11p9M31p0k83J29
$$ 17 -105 -12 -76 133 186 -103 257 24 133 -98 -22 228 49 -80 -88 -56 206 -105 -184 247 177 -106 23
7435B3j1q7K06k46K71L3J54l64J0J13N7mL6k6o3j1j75M53m42k20J30o7P6L22j02
$$ 23 12 -75 131 -115 156 189 343 -21 -11 102 159 155 191 165 102 91 -84 369 -73 -293 -163 -230 -154 168 66
7460F6L3J91m15N00n24o7P5K07J6j33m7OK27r1j2j2j78N8R4k60K16J48j21J21
$$ 66 99 290 -125 375 -149 -216 -141 66 82 -51 -98 -92 135 44 32 20 -158 -100 -6 -266 -50 98 -23 98
7484I8M3r9J69rl37n5J0k7L27j5Kj31J02j41l2M53j07j67n1j33p0J02J23j02J33
$$ 98 141 42 211 202 -135 -190 -180 -207 120 105 107 -24 78 -63 -95 358 251 84 33 -100 -170 -68 55 -47 86
7509H6k46J81J3J18j90MK08jl3m19N37l56K34k40L53m49j5N8K87j37l63J48L2
$$ 86 -160 21 34 152 -38 -34 174 173 140 -279 258 -98 136 -104 249 -200 -215 -157 130 -7 -370 -222 -190
7532a90L3L3k05J82J59j17L02k92k34j3N13k62K40j96k06L32n3K09K6n9J23m73
$$ -190 -157 -124 -329 -147 12 -105 197 -95 -329 -342 171 -91 149 -47 -253 79 26 235 261 202 325 -148
7554a48J02j40M64k40j23J62n4J79o9j75L6j34L7N62l61J3j85k6J60q2N0Q7k46
$$ -148 -46 -186 278 38 -85 77 23 202 133 -42 -6 -140 -103 459 98 111 -74 -100 60 -22 28 115 -131
7577a31J50j6N9l0n0oJ63l6j36K71m22K19o5j03j40L65l4j1j88n9M5N3l78N68
$$ -131 19 3 62 32 -18 -24 139 103 -33 238 -184 35 -30 -133 -273 92 58 47 -141 -200 -155 -102 -480 88
7601H8prk47M08k78R6l28J55K63k87K66j43K46j04M5j87O4R5j09j00L77l25K61
$$ 88 81 72 -175 233 -45 51 -277 -122 141 -146 120 -23 223 119 164 -23 41 136 27 -73 304 -21 240
7624B40m01J45K56m07j11L35k6L44l56l71J41P10k18k2m5k10mK53m61J26j01M77
$$ 240 -161 -16 240 -167 -278 57 31 375 19 -352 -211 499 281 259 214 4 0 253 -208 -82 -183 294
7646B94l17j16K31o2K37l06L8k58N26k78Rl05J87J83o9j11j35K35j2P9M0j87r8
$$ 294 -23 -139 92 30 267 -39 -1 -259 267 -11 -2 -307 -120 63 -6 -117 -252 -17 -29 50 90 -97 -195
7669a95j4J73k71K99J11k32K02J02k78J2L56j26l15L50m18j66L61l4K9k54M13
$$ -195 -209 -36 -307 -8 103 -129 73 175 -103 -91 265 139 -176 174 -244 -410 -49 -83 -54 -308 105
7690A05j12r9Q5j66J44K45j96j83N47m12o0N1j29J00l4P4k46K49j36J61J89l27
$$ 105 -7 -106 -21 -187 -43 202 6 -177 370 -42 -102 -51 -180 -80 -114 -40 -286 -37 -173 -12 177 -150
7712a50K54R7k26J36o7j38k97L12L57j92K41m70J7K37k29J23L1K3l6L17j32k01
$$ -150 104 201 -25 111 44 -94 -391 -79 278 86 327 -143 -126 111 -118 5 36 59 23 340 208 7
7734GQ2l16J67J0J7L54k33j1J13l31L97q8k77j54J07K26k28K1J88L9j58o3R6k40
$$ 7 89 -227 -60 -50 -33 321 88 77 190 -141 256 168 -109 -263 -156 70 -158 -137 51 90 -68 -131 -35 -275
7758b75K36j95N57k09k00K19M8j23k26j21P57m58k12O1M86r5m36J99j69J23n1
$$ -275 -39 -234 323 114 -86 133 181 58 -168 -289 468 10 -202 -141 345 250 -186 13 -156 -33 -84
7779h4Q0j2m70M37N5L9j09L05n33M9M41J74j89j89k30J81J29m6n1k71L85j47L38
$$ -84 -4 -16 -486 -49 6 45 -64 241 -292 -243 198 372 183 -6 -236 -55 74 28 -23 -294 91 -56 282
7802B82l37J07j1p1n3L8L2Q9j00j18j0J41k02J74J37m53K57J96N2k69J43j74K0
$$ 282 -55 52 41 -30 -83 -45 -13 76 -24 -142 -152 -11 -213 -39 98 -355 -98 98 150 -119 24 -150 -130
7825a30p1K89m1l50M88n62N38j52J91k57j96J50k03K17J95j38j32K29pQ8l59Q8
$$ -130 -201 88 47 -303 185 -377 161 9 200 -57 -253 -103 -306 -89 106 -32 -164 65 58 146 -213 -125
7847a25K21k77k6L69L53m69L1L9r9k19J50k78L21k03m8J92PJ1j32K42K11k19n3
$$ -125 96 -181 -207 162 515 46 77 116 17 -202 -52 -330 -9 -212 -260 -68 -61 -50 -182 60 271 52 -1
7870aL3j68L81n42J84L4K60l49j77L87O2J12l03J11k07L57k86J15j61Q5L13k73
$$ -1 32 -136 245 -297 -113 -79 181 -168 -345 42 104 216 -87 24 -183 174 -112 3 -158 -73 240 -33
7892c3r5K75l6k87K57o9J47k46L15k17j52K39j83j18RP9L25r8J52k49j14N37l94
$$ -33 -128 147 111 -176 81 12 159 -87 228 11 -141 98 -85 -203 -194 -115 210 112 264 15 -99 438 44
7915D4j32K40n11J27L39l1k76J02r0K34j05J28p8j80K99k03L3R4j37L01l60J08
$$ 44 -88 152 -359 -232 107 76 -200 -98 -188 46 -59 69 -9 -189 110 -93 -60 34 -103 198 -162 -54
7937e4J93k07L61j65J86n47L34oj28p4M25j47k98K62k87J31k2J2M29k99j36K00
$$ -54 139 -68 293 128 314 -233 101 95 -33 -107 318 171 -127 135 -152 -21 -43 -31 398 99 -37 163
7959A63k40L49l19k11L86j86N5j8K31J55k34k20J75j14M0p1J85q2J31j93N6K14
$$ 163 -77 272 -47 -258 128 -58 -3 -21 210 365 131 -89 86 -28 12 -59 126 44 175 -18 38 252
7981B52j28J32j08n1J66m16%L59k36J14l19j8P4K1K1j86K51J26J30l63K12J96
$$ 252 124 256 148 97 263 -153 -153 206 -30 84 -235 -253 -179 -158 -137 -323 -72 54 184 -179 33 229
8003B29J38k86j28j92N66k17j21l24N54k81K32j07O8j98k27L99j92J99l96M68
$$ 229 367 81 -47 -239 327 110 -11 -335 219 -62 170 63 131 -67 -294 105 -87 112 -284 184
8023A84L2m31rL78m3p1K02l74K83k32L4J80l64J61q1J39k9P8k51j23M69k26R9
$$ 184 216 -215 -224 154 111 40 242 -132 151 -81 -47 133 -231 -70 -151 -12 -41 37 -214 -337 132 -94 5
8046EK55m98M11m1q0j00l01L17j92L11l63P2P6J60K36j08r3J23j48K29l71r3J99
$$ 5 260 -238 173 132 52 -48 -349 -32 -224 87 -276 -204 -128 32 268 160 67 190 42 271 -100 -193 6
8069Fk68n0N85l38K2j36j75M35l97K86J13R6L4l30J9K66j02J36j35J30j86K20
$$ 6 -262 -312 273 -65 -43 -179 -354 81 -316 -30 83 179 213 -117 -98 168 66 202 67 197 11 231
8091B31j20k25L45k23j32N54m89Q7o1M91o33J64O9l43P6K41lQ2N8j00J6K7j28
$$ 231 111 -114 231 8 -124 430 -59 28 -33 458 -175 -11 58 -285 -209 32 29 111 169 69 85 112 -16
8114a6J10k19o7Q9m9N00o97n0M46j69l7J14K16k9J25J96o09J22J82j56q8j8K51
$$ -16 94 -125 -192 -103 -152 348 -349 -399 47 -122 -159 -45 171 142 267 463 -146 -24 158 2 -86 -104 147
8137A47l87J07M9L8j07L35J27m10n0l7K81j93J04r1j14L02J5K55j81q7l28K45
$$ 147 -240 -133 -84 -46 -153 182 309 -101 -151 -188 93 -100 4 -87 -201 101 116 371 190 103 -225 20
8159B0j31J11K00k78j98K32L57k40m2J40l03M25m09K52k82n2pn0M02j4l06J48
$$ 20 -111 0 200 -78 -276 -44 313 73 31 171 -132 293 -116 136 -146 -198 -205 -255 147 133 -173 -25
8181b5k19M21n5j88O2j56J13J12J6K90
$$ -25 -244 177 122 -66 -4 -160 -47 65 81 371
8191C71
$$ Imaginary data points
##PAGE= N=2
##DATA TABLE= (X++(I..I)), XYDATA
0@%%%%%%%%%qJ6j6J6j6K4l2L2m0M8n6P0p9Q9j04J21j39J60j83K08k34K63k97L34
$$ 0 0 0 0 0 0 0 0 0 0 -8 8 -8 8 -8 16 -16 16 -24 24 -32 38 -41 48 -56 65 -74 86 -97 111 -123 140 -157 177
33A77l74M18m66N18n76O39p10P89q71R61j065J181j312J457j619J806k022K277
$$ 177 -197 221 -245 273 -303 336 -374 415 -456 505 -560 621 -691 766 -853 953 -1069 1208
51A208k583K952l413M010m812N961p755J0974j8578O8149P2565p6943l9921l543
$$ 1208 -1375 1577 -1836 2174 -2638 3323 -4432 6542 -12036 56113 128678 51735 11814 8271
65H271M7948K3491r168l3090n805J2569J6092n529j2363j7031n633M704K1152
$$ 8271 56219 79710 70542 37452 31647 44216 60308 54779 42416 25385 19752 24456 45608
78D5608K0484K16l6988m2021l410M4772M1498o516m7268l3981J6101L9872Q725
$$ 45608 66092 66308 29320 -12701 -16111 28661 70159 63643 16375 -17606 -1505 38367 47092
91D7092l2840l1901O455L5970K3329j5537l6877k1282O634K1359K0397P380j2004
$$ 47092 14252 -17649 -11194 24776 48105 32568 -4309 -25591 -18957 2402 22799 30179 18175
104A8175k6401j9554M064K7426K0413j2599l1511j0125K6069K9613o895m1486
$$ 18175 -8226 -27780 -23716 3710 24123 11524 -19987 -30112 -4043 25570 18675 -22811
116b2811k9761J9387M9229K3334k5561m1914j6661J8338K8691R502j0310j2866
$$ -22811 -52572 -33185 16044 39378 13817 -28097 -44758 -26420 2271 11773 1463 -11403
128a1403l980J737O817O788k247j2348j0291P487K6605J8967j5643m0968k0569
$$ -11403 -15383 -13646 -6829 -41 -2288 -14636 -24927 -17440 9165 28132 12489 -28479 -49048
141d9048K5887M4624J7228k7449l8186m470K8772K3256p344k3459q478J4987K0650
$$ -49048 -23161 21463 38691 11242 -26944 -31414 -2642 20614 13270 -10189 -18667 -3680 16970
154A6970M538j3866j5995p113M173J5588K1065O869j7437k8643j0562K1619L2916
$$ 16970 21508 7642 -8353 -15466 -11293 4295 25360 32229 14792 -13851 -24413 -2794 30122
167C0122N727k7081k4324R086L0121J3850k1627l1706k120L0251K7757k025k5353
$$ 30122 35849 8768 -15556 -6470 23651 37501 15874 -15832 -17952 12299 40056 38031 12678
180A2678k0402q92J4766J4695O822k614j1463j2801n99J4374J3248n308j9869
$$ 12678 -7724 -8616 6150 20845 27667 25053 13590 789 190 14564 27812 22504 2635
193B635j0424J7521K8163L105l0258k9981L476L3485K6621p559k9744j7564R575
$$ 2635 -7789 9732 37895 41000 10742 -19239 -15763 17722 44343 36784 7040 -10524 -949
206i49J8534O780p263j0159k455N481O588L804l166j1161j2752K631K0742J9246
$$ -949 17585 24365 17102 6943 4488 9969 16557 20361 17195 6034 -6718 -4087 16655 35901
220C5901n058k6907k3083P389L0212J7921j3780k5901p792J6975J9244k413k0610
$$ 35901 30843 3936 -19147 -11758 18454 36375 22595 -3306 -11098 5877 25121 22708 2098
233B098j3143Q039J8580J0098n942j5105j2166m02R953J4247Q829p781j8885j0912
$$ 2098 -11045 -3006 15574 25672 19730 4625 -7541 -7943 2010 16257 25086 17305 -1580 -12492
247a2492R884J9373O647j5488j9280J792K3242J6064j1813k6779j1772J5530K5613
$$ -12492 -2608 16765 23412 7924 -11356 -9564 13678 29742 17929 -8850 -20622 -5092 20521
260B0521Q422j5505j8947n084Q701J0780N261l121p585n255O70P988Q974l801
$$ 20521 28943 13438 -5509 -10593 -1892 8888 14149 11028 3443 -1812 -1142 6846 15820 12019
274A2019j5697j0206R915K2859R966j6210k6841p178K0822K3326R94j8966j6283
$$ 12019 -3678 -13884 -3969 18890 28856 12646 -14195 -21373 -551 22775 23769 4803 -11480
287a1480L904J6188P767p958j1364l155N838Q846N698l266r981j0659j433J2198
$$ -11480 -7576 8612 16379 8421 -2943 -6098 -260 8586 14284 11018 1037 -9622 -11055 1143
301A143J7554K719j6934j9504P4J8830J6398n903k0492r499J3432J8031J391j6087
$$ 1143 18697 21416 4482 -15022 -14948 3882 20280 14377 -6115 -15614 -2182 15849 17240 1153
315A153j5547P84J5779J2488j051j0481j0865l494N341J0637P129l696j1951q434
$$ 1153 -14394 -13610 2169 14657 13606 3125 -7740 -11234 -5893 4744 11873 8177 -3774 -12208
329a2208N142J4939O019j2331j6381o68J6884J6761l641k0675j4939P139J8802
$$ -12208 -7066 7873 13892 1561 -14820 -15488 1396 18157 14516 -6159 -21098 -13959 4843
342D843J0376o726j4559p057N819R256L581k910o769n198K370Q960P071k840j2696
$$ 4843 15219 8493 -6066 -13123 -7304 1952 5533 2623 -4146 -9344 -6974 1986 9057 6217 -6479
357f479j0777M788J7328J2061q368j9232r526J0126J8415N569j3136j4371L84
$$ -6479 -17256 -12468 4860 16921 8553 -10679 -20205 -10079 8336 13905 769 -13602 -13218
370a3218J3008R774l167j2358p957M374J0285P054j283p671r958k883Q318J2403
$$ -13218 -210 9564 6397 -5961 -13918 -9544 741 7795 6512 -1159 -11117 -14000 -5682 6721
384F721M545r538j4043l038J2796J4097k854j5607j0101O655J7241P296j0415
$$ 6721 11266 1728 -12315 -15353 -2557 11540 8686 -6921 -17022 -10367 6874 14170 3755
397C755j6739l661J0652J2629K836p693r454l071M203P258N451k262r429o321
$$ 3755 -12984 -16645 -5993 6636 9472 1779 -7675 -10746 -6543 715 6166 3904 -5525 -11846
411a1846M426J1211O769p509j4814n611J2304J6656J605j4482j4448R88J4697
$$ -11846 -7420 3791 10560 3051 -11763 -17374 -5070 11586 13191 -1291 -15739 -14751 -54
424e4J1154l952j1577o996L979R250M830k583q217m733J680P739P927o37j0324
$$ -54 11100 7148 -4429 -11425 -7446 1804 6634 4051 -4166 -8899 -7219 520 8447 7810 -2514
439b514j0093J589J2697J1265k957j4187j0426P039J4311O169q788j2566l073
$$ -2514 -12607 -11018 1679 12944 9987 -4200 -14626 -7587 6724 12893 4105 -8461 -11534
452a1534J0425J1559O9r912q317o23P929R071J642o964q229l385N911J0097M305
$$ -11534 -1109 10450 10519 607 -7710 -8333 -404 8667 10309 3345 -4884 -8269 -2358 7739 12044
467A2044p295j1132k181R037J1661R37j2119j1313K643J4075R017n138j2653p511
$$ 12044 4749 -6383 -8564 473 12134 13071 952 -10361 -7718 6357 15374 10236 -2417 -9928
481i928O131J1739M962n247r498m348M277P902M954l903p569n776K711J0040O827
$$ -9928 -3797 7942 12904 7657 -1841 -6189 -1912 5990 10944 7041 -528 -6304 -3593 6447 13274
496A3274m663j2369o077O401J3028N434r155j3662j886J0221J1049o46j0614q727
$$ 13274 8611 -3758 -9835 -3434 9594 15028 5873 -7789 -9675 546 11595 10949 335 -8392
510h392J804R620O216j956p593o393K34P110O987j96p038q705j131R356R210p48
$$ -8392 -6588 3032 9248 7292 -301 -6694 -6460 650 7637 7441 403 -8302 -9433 -77 9133 8385
526H385j1286r364K814J2358P695n825j2307n176O820J0590L100p179r300k071
$$ 8385 -2901 -12265 -9451 2907 10602 4777 -7530 -12706 -5886 4704 7804 625 -8675 -10746
540a0746O290P449K294n175p841l332M716Q510L872n162j0222m173P737J0983
$$ -10746 -4456 2993 5287 112 -7729 -11061 -6345 2165 6037 875 -9347 -13520 -5783 5200
554E200J757q775j0165p42J0441R161k179r950p184L104R561O129l496q640m650
$$ 5200 6957 -1818 -11983 -12725 -2284 6877 4698 -5252 -12436 -9332 229 6358 2862 -5778 -10428
569a0428K617P538N792j467q013o121K113Q594O310k343r257n772M070J0573N092
$$ -10428 -7811 -273 5519 4052 -3961 -10082 -7969 625 6935 4592 -4665 -10437 -6367 4206 9298
584I298n863j0470l250O505J1094K409p878q647j395P299Q431P08o474o592n38
$$ 9298 3435 -7035 -10285 -3780 7314 9723 1845 -6802 -8197 -898 7533 8241 1767 -4825 -5363
599e363O193O849O69o435o811k89P433P549N16q097q747J071J0066P956j888r564
$$ -5363 830 7679 8348 1913 -4898 -5187 2246 9795 10311 2214 -6533 -5462 4604 12560 10672 1108
615A108o993L418R764M405m213q127l831N042P983K775m936p152l005L938Q061
$$ 1108 -5885 -2467 7297 11702 7489 -638 -4469 573 8556 11331 6395 -757 -3762 176 8237
630H237L992m230q350m199M446Q931L741n812q990j889O555Q167P91p864q085
$$ 8237 12229 7999 -351 -4550 -104 8827 12568 6756 -2234 -4123 2432 10599 11390 3526 -4559
645d559Q11Q699O724j837p365o731J071O802O081o56o523o024K53O569N824j596
$$ -4559 -3748 4951 11675 9838 2473 -4258 -3187 3615 9696 9040 2517 -3507 -3254 3315 9139 7543
661G543p494n477K255Q764N552m676r500m414M847Q926L539n024q217l246M949
$$ 7543 49 -5428 -3173 5591 11143 6467 -3033 -7447 -2600 6326 9865 4841 -3376 -6622 -1673
676a673O723K131m303o790j790N291O239J267n863o758j596O803P545M43o458
$$ -1673 5050 7181 2878 -3912 -5702 -411 5828 7095 1232 -5526 -7122 -319 7226 7669 1211
691A211p760o31O426P435k57o705n893Q02O629N702k262p650m205L276P364L980
$$ 1211 -6549 -7180 -754 6681 6424 -281 -6174 -5372 1257 6959 4697 -2953 -7158 -3882 3482 7462
707G462k549p918m970L532P384M126k094p001m842L128P054L256l906o702k503
$$ 7462 4913 -3005 -7975 -4443 2941 7067 4973 -2028 -6870 -3742 3312 6568 2662 -4040 -6543
722f543M763P458J596o019p544j190O458P634J373o430p164j086N749O026L16
$$ -6543 -1780 5678 7274 1255 -6289 -7479 -1021 6613 7986 1556 -5608 -6694 -945 5081 5397
737E397n219m998P0N282N049q33o264n682J718P252N702k144p492o205K346P690
$$ 5397 178 -4820 -4750 532 5581 4748 -1516 -7198 -5480 1772 7474 5330 -2162 -8367 -6021 1669
753A669N166k730o710m165K876O310K343l461n776k034L982O099K116m497p066
$$ 1669 6835 4105 -2605 -6770 -3894 2416 4759 1298 -4478 -6512 -2530 3569 5685 1188 -5878
768e878k450M621P747K577m794p606j975M664O284R69m729n933O0O342N059j395
$$ -5878 -8328 -3707 4040 6617 1823 -5783 -7758 -3094 3190 4159 -570 -6503 -6443 -101 4958 3563
784C563o126n260J676O627M976q87o660n492Q13O396N575j493n812l969J747N810
$$ 3563 -2563 -7823 -6147 480 5456 4569 -2091 -7583 -6770 -374 5201 3708 -2104 -6073 -4326 1484
800A484L436k988o307k562M428O306K763m222p031k656M335O702L001m147o029
$$ 1484 4920 1932 -4375 -6937 -2509 3797 6560 2338 -4693 -7349 -3014 3688 6689 2542 -3487
815c487k239L816N970J311m343m991n68N487N743o25o118n358N22N971O307k58
$$ -3487 -5726 -1910 4060 5371 1028 -3963 -4531 956 6699 6074 -44 -5402 -4880 1091 7398 7140
831G140o022n188j89N281N463k56n712l967J761N686L206k513o311k813L874O433
$$ 7140 1118 -4070 -4259 1022 6485 6229 517 -3450 -1689 3997 7203 4690 -1621 -4434 -560 5873
847E873K636l086o459l618K805O404L384k723n414k886K644N561J687l405n573
$$ 5873 8509 5423 -1036 -4654 -1849 4555 7939 5216 -198 -3084 -440 5121 6808 3403 -2170
862b170q52N169N636L70o017n956K4N349N698N62n083n656K09M293M519O7m861
$$ -2170 -3022 2147 7783 8153 2136 -3820 -3796 1553 7251 7813 2730 -2926 -2717 1576 6095 6162 1301
879A301m273J508M969L517k106n717m035K268P003L825l039o426l764J918O214
$$ 1301 -2972 -1464 3505 7022 4916 -801 -4836 -2568 4435 8260 5221 -1205 -4969 -3051 3163
894C163L460k951n009k346K583M499K116l592n266j180M098N735R61m912o129
$$ 3163 6623 3672 -1337 -3683 -1100 3399 5515 1923 -3343 -4523 -425 5310 6271 1359 -4770
909d770j238M931N684J212m646n077p60M044M075R5m331l628N87N057L749j567
$$ -4770 -6008 -1077 4607 5819 1173 -3904 -4664 -620 3455 3550 -781 -4409 -3822 1235 4984 3417
925C417n735m046J640N976M463j895n934m040J341N599L711k256m710k388K334
$$ 3417 -2318 -6364 -4724 1252 5715 3820 -2114 -6154 -4813 786 4497 2241 -2469 -4857 -2523
940b523M640J687k634n675j520L955N764J589m136n970j810L945N681J652l740
$$ -2523 2117 3804 1170 -4505 -6025 -2070 3694 5283 1147 -4823 -6633 -2688 2993 4645 905
955I05m745j102L928M054o7m014l753N18M940M033q87n536l962R50M901M694j88
$$ 905 -3840 -4942 -1014 3040 2973 -1041 -4794 -4276 664 4697 3810 -1726 -5688 -4738 163 4857 4669
972D669n486m415J127M674L585j316m641k745K337M575K101k952m750k189K856
$$ 4669 -817 -5232 -4105 569 4154 2838 -1803 -4548 -2211 2364 4465 1513 -3237 -5426 -2570
987b570N928K482l283n491k376K698N420J875l354m366r24L226M164M75m537l490
$$ -2570 3358 5840 2557 -2934 -5310 -2612 2808 4683 1329 -3037 -3961 -735 3429 3904 -633 -4123
1003d123P08M073M276l19n096m337L48M754L837R5m190l989K88M534L113j040
$$ -4123 -3415 658 4934 4615 -481 -4818 -4470 284 4121 4216 26 -3963 -3675 859 3972 2932
1019B932m414k693J884M786K549k939m779k366K589M965K797k790m635k375J892
$$ 2932 -1482 -4175 -2291 2495 5044 2105 -2674 -5040 -2451 2514 5311 2521 -2114 -4489 -2597
1034b597M512K607k607m166j367L166L802P46l746m395J6M672L923J09m130m700
$$ -2597 1915 4522 1915 -2251 -3618 -452 3350 4096 350 -4045 -4029 643 4566 4675 545 -4155
1050d155l76M159M420L50l627l946k1L841L396j189m287k495J517M396K989k020
$$ -4155 -4531 -372 4048 4398 771 -3175 -3196 645 4041 2852 -1435 -3930 -2413 1983 4972 2952
1066B952n083k723K179M726L395k272m759k399K125L794J826j693l918j137K366
$$ 2952 -2131 -4854 -2675 2051 5446 3174 -1585 -3984 -1859 1935 3761 2068 -1850 -2987 -621
1081f21M003N40l224m175r91M160M776K22l537m504q00L588M103N51l456l380
$$ -621 3382 3922 698 -3477 -4468 -308 4468 4690 1153 -3351 -4151 -563 3540 4091 635 -2745
1097b745l21L864K687n25l808k741Q52M270L309j229m892l251J103N001L020j212
$$ -2745 -3066 798 3485 2960 -848 -3589 -2737 1533 4842 3613 -1279 -4530 -3427 1574 4594 3382
1113C382m925k144J643L690K144j974l512j972K430M348J236k795m493j100K812
$$ 3382 -1543 -3687 -2044 1646 3790 1816 -1696 -3668 -1238 3110 4346 1551 -2942 -4042 -1230
1128a230M768R98l208l937j189K563M041J268l066l733n8L332K802k14l823l056
$$ -1230 3538 4536 1328 -2609 -3798 -1235 2806 4074 1008 -2725 -2783 549 3351 3137 -686 -3742
1144c742J071L944K913m18m206l481J069L807L497j161l569k938J252L920K016
$$ -3742 -2671 1273 4186 3768 -438 -3919 -2850 957 4454 3293 -276 -3214 -1962 1958 3974
1159C974j944l776j368K354L558J927k464m442j485K680L871K006k712m395j314
$$ 3974 2030 -1746 -3114 -760 2798 4725 2261 -2181 -3666 -986 2885 4891 2179 -2216 -3530
1174c530K792L795J37j954l674kL224K817k42l141l451L27M009K870P1l678l737
$$ -3530 -738 3057 3194 1240 -2434 -2436 788 3605 3363 222 -3229 -2902 1107 3977 4048 370 -3367
1191c367M01L558L319q45l370k512N18L276K971j773l735j393J388L694J727j716
$$ -3367 -2966 592 3911 3066 -304 -2816 -2298 978 3949 2176 -1559 -2952 -1564 2130 3857 2141
1207B141l864k029J945L845J757j801l708j722K088L278R48j813l526p19K687
$$ 2141 -1723 -3752 -1807 2038 3795 1994 -1714 -3436 -1348 1930 2878 1065 -2461 -3180 -493
1222d93L509M52l631l243K2L240L446k37l003l180k09K837L362j18l322k435M36
$$ -493 3016 3468 -163 -3406 -3384 -144 3302 3065 62 -3118 -3327 -490 2872 2754 -568 -3003 -2567
1239b567L060K657r47l657k352J408L879J954j340l657k676K199L412J879j453
$$ -2567 493 3150 2203 -1454 -3806 -2398 1481 3435 2095 -1562 -4238 -2039 1373 3252 1799
1254A799l341j699J636L784Q59k044l253q50K567L078Q96k867l407q56L257L469
$$ 1799 -1542 -3241 -1605 2179 3038 994 -2259 -3109 -542 2536 3432 565 -2842 -3698 -441 3028
1270C028M57l054l166J69K595K569L22k765k669L52L070J933n09l021k407J133
$$ 3028 3485 431 -2735 -2566 29 2598 2920 155 -2514 -2162 908 2841 2332 -689 -3096 -1963
1286a963L424K220r68l337k577J371L317K407j566k853j615J096K861J736j755
$$ -1963 1461 3681 2713 -624 -3201 -1830 1487 3894 2328 -525 -2140 -1044 1817 3553 1798
1301A798l376q28K081L207J085k302l492q96K419K930J048k379k854n94K249L097
$$ 1798 -1578 -2406 -325 2882 3967 1665 -1827 -2723 -304 2626 3674 1295 -1559 -2153 96 3193
1317C193P2k615k616M84K520K080j95l118k286N80L104K393n40l278k252J137
$$ 3193 3265 650 -1966 -1482 1038 3118 2923 -195 -2481 -1901 1203 3596 3056 -222 -2474 -1337
1333a337K761J909r96l053j504J403K912J386j743k908j562K069L427K88j502
$$ -1337 1424 3333 2337 -716 -2220 -817 2095 3481 1738 -1170 -2732 -663 2764 3052 1550
1348A550k778j578J918L035J082j772l383o01K079L212k42j939k961K91K560K424
$$ 1550 -1228 -2806 -888 2147 3229 1457 -1926 -2527 -448 2764 2522 583 -2378 -2087 473 2897
1364B897l24k770j985p2K708K032j19k702k215M80K913J791l69k786k401J293
$$ 2897 2573 -197 -2182 -2254 454 2486 2367 -335 -2550 -2070 843 2634 2265 -521 -2922 -1629
1380a629K923J680j189l136j435J628K696J328j816k690o40J070K752J094j618
$$ -1629 1294 2974 1785 -1351 -2786 -1158 1538 2866 1050 -1640 -2280 -1210 1542 2636 1018
1395A018k446j081J802K540O93j984k688k08K479K135M82k354k318k28K448K536
$$ 1018 -1428 -2509 -707 1833 2526 542 -2146 -2354 125 2260 2742 388 -1930 -2158 290 2826
1411B826m04k386k147J08K763K049p95k650j750P85K906J432j184k334j331R74
$$ 2826 2422 36 -2111 -2003 760 2809 2014 -636 -2386 -1601 1305 2737 1553 -781 -2112 -1138
1427a138K591J691j534k741j005R83K627J307j661k296j116J654K419J173k164
$$ -1138 1453 3144 1610 -1131 -2136 -1153 1474 2781 1120 -1176 -2292 -638 1781 2954 790
1442G90k579n73K356J948M90k065k362k47K743J798k16j930k303J78J696K366
$$ 790 -1789 -2362 -6 1942 2432 367 -1995 -2242 501 2299 2083 153 -2150 -1972 -276 2090
1458B090J18k306j898J98K119K013m05k599j995J082K583J780j257k765j058Q58
$$ 2090 2208 -98 -1996 -1798 321 2334 1929 -670 -2665 -1583 1000 2780 1523 -1242 -2300 -1442
1474a442L050R16j444k320j341J578K466O73j435k258q30J454K771J75j460k695
$$ -1442 1608 2524 1080 -1240 -2581 -1003 1463 2136 701 -1557 -2387 -933 1838 2013 553 -2142
1490b142n82K170K856j83k050k079k09K103K339k7k448j896K53K472J723m38k248
$$ -2142 -2724 -554 2302 2119 69 -2010 -2219 -116 2223 2196 -252 -2148 -1895 577 2300 1862 -386
1507c86j806O26K102J532p05k418j679J183K415J352j195k065j190J137K333J237
$$ -386 -2192 -1566 536 2068 1363 -1055 -2734 -1551 864 2216 1021 -1044 -2234 -1097 1236 2473
1523B473j451k333q66J298K382P22j709k062n92J591K097P36k116j936j70J814
$$ 2473 1022 -1311 -2177 -879 1503 2225 516 -1546 -2138 -547 1550 2286 170 -1766 -1936 -122
1539a22K061j48j634j876l68K324J814j5k348j662M31J968K148j238j689j765
$$ -122 1939 1791 157 -1719 -2087 237 2051 2036 -312 -1974 -1543 425 2573 1335 -354 -2119
1555b119P64K698J054n20k761j224J149K077J358j104k137p69P11K298M08p14
$$ -2119 -1355 1343 2397 1877 -884 -2108 -959 1118 2476 1372 -765 -1534 -823 1475 1883 1169
1571A169k292j172J939K205N33j862j866p81J816K480j76j534j974l36J595K315
$$ 1169 -1123 -2295 -356 1849 2382 520 -1346 -2127 -311 2169 1993 459 -1515 -1851 -256 2059
1587B059l91j649j579J2J983J928o83j960j738P00J931J672j99k770j222N64K196
$$ 2059 1668 19 -1560 -1548 435 2363 1680 -280 -2018 -1318 613 2285 2086 -684 -1906 -1342 854
1604H54J194j312j683j255J489K089L73p43k216q33R10K534N43j281k044q84J461
$$ 854 2048 736 -947 -2202 -713 1376 1749 1006 -1210 -2043 -1133 1401 1944 663 -1381 -2265 -804
1621h04J964R25k030j686m03J842J724l1j698j564J68J583J788m27j646j472L09
$$ -804 1160 2085 55 -1631 -2034 -192 1532 1501 -197 -1761 -1593 -10 1778 1351 -295 -1767 -1458
1638a458J594J932o88j926j596O34J994J322r50k044q99Q29K240P52j065j942
$$ -1458 136 2068 1380 -546 -2142 -1508 486 1808 858 -1186 -2085 -1256 984 1736 671 -1271
1654a271j085J034K229R38j493j506j067J064K057R76j778j843k88J509J804J32
$$ -1271 -2356 -1322 907 1845 352 -1154 -2221 -1157 900 1876 98 -1745 -2033 -524 1280 1412
1670A412j342j962j58J872J627k62j527j633R2J800J434k22j344j634L23J661
$$ 1412 70 -1892 -2050 -178 1449 1187 -340 -1973 -1881 -81 1353 1131 -213 -1847 -1524 137
1686A37J244n14j666j476P59J905J454j243j613q92N69J797J108p77j862j188
$$ 137 1381 867 -799 -2275 -1516 389 1843 600 -1013 -1905 -1336 461 1569 792 -1070 -2258
1702b258J261J745Q04r82j881n97J385J673r3j001j595m50J909J470K89j954j560
$$ -2258 -997 748 1552 570 -1311 -1908 -523 1150 1057 56 -1539 -1989 -80 1390 1679 -275 -1835
1719a835R2J664J493j44j562j600P32J285J191p3j696j328N61J688J300o66j634
$$ -1835 -1743 -79 1414 1270 -292 -1892 -1160 125 1316 1243 -453 -1781 -1220 468 1768 1102 -532
1736e32j297R40J665J075r16j536r54P87J556Q92n61k058n80J036J895L29j046
$$ -532 -1829 -889 776 1851 935 -601 -1555 -768 788 1680 1119 -939 -1519 -483 1412 1741 695
1753F95j586q59J433J650O15j608j585l28J515J628j56j102j511m2J463J398k68
$$ 695 -891 -1750 -317 1333 1948 340 -1245 -1573 -58 1570 1414 312 -1199 -1241 222 1620 1352
1770A352j582j283M60J463J519o57j429j343N44J920J015j016j395q80M25J708
$$ 1352 -230 -1513 -1053 410 1929 1272 -157 -1500 -956 964 1979 963 -432 -1312 -887 821
1786H21P70p79j336j021Q94J758N17r97j571m21P37J840M44j095j551n69J012
$$ 821 1591 812 -524 -1545 -651 1107 1624 627 -944 -1365 -628 1212 1656 561 -990 -1559 -547
1803e47J662K15j113j139n98J197J833m88j005j306l5J597J057jj282j550J65
$$ -547 1115 1330 217 -922 -1520 -323 1510 1022 17 -1289 -1324 273 1330 1329 47 -1503 -1338
1820a338J839Q66l32j469o46o9J771O00n56j541m64M51J287R21j082j343o57P96
$$ -1338 501 1367 1035 -434 -1080 -1149 622 1222 666 -875 -1339 -888 399 1320 238 -1105 -1762 -966
1838i66J940N07j142j503l96J194R47K91p18j435J10J128J158Lj413j507K61R46
$$ -966 974 1481 339 -1164 -1560 -366 581 872 154 -1281 -1171 -43 1115 1118 -295 -1802 -1541 -595
1856e95J810j15j501j452J79J622R72j69j509q37P37R02Q33m60j200n23L75J265
$$ -595 1215 1100 -401 -1853 -1674 -52 920 751 -758 -1595 -858 44 877 417 -783 -1306 -931 334
1874C34O78n36j618p64J091J159J005j260j056p54O99J898M04j449q99l23J026
$$ 334 1012 476 -1142 -1906 -815 344 1349 89 -967 -1721 -1022 876 1280 -169 -1068 -1391 -365
1891c65J010L13j255r87l87J453J558k10j335r30j51J214J247k72r89j368M07
$$ -365 645 958 -297 -1284 -1671 -218 1340 1130 -205 -1135 -1286 -72 1175 903 -86 -1454 -1047
1908a047R54J202l11j378n12O4J715Q64r21j148q54M56J280Q92n21j332l51N74
$$ -1047 -93 1109 798 -580 -1092 -1028 687 1551 630 -518 -1372 -916 364 1256 735 -597 -948 -374
1926c74J091O72j146j118l12J092J060M54r78j572n6J308J276J06j290j171L21
$$ -374 717 1389 243 -875 -1187 -95 965 1419 441 -1131 -1187 121 1397 1503 213 -958 -637
1943f37J078P30O7j173r48J93R06J517m32j330j222M80J503Q59l87j530p12M28
$$ -637 441 1171 1238 65 -883 -690 216 1733 1301 -29 -1251 -771 732 1591 1204 -326 -1038 -610
1961f10J438P24n98j165p40M68J253O95q78q14q65P45J358M89r94j185l36J178
$$ -610 828 1552 954 -211 -951 -483 770 1465 587 -227 -1092 -347 1011 1500 506 -679 -1015 163
1979A63N66M62n63j340j29R22Q84k6q05r10N1R63J182o70p44j306N19J082J461
$$ 163 729 1191 628 -712 -841 81 965 939 134 -776 -725 238 1420 750 6 -1300 -781 301 1762
1998A762q63r71j015K52J080J083o30r68q12O27J024K42r3j266o72P34J189M68
$$ 1762 899 -72 -1087 -835 245 1328 698 -270 -1082 -455 569 811 718 -548 -1220 -486 703 1171
2016A171p81j317k94P05J026K71k64j357m78J294Q95L0j110r16J22R40Q41j2j068
$$ 1171 390 -927 -1221 -516 510 781 517 -840 -1318 -24 871 901 -209 -1125 -1003 -63 778 766 -302
2035c02q66L54O82J033m03n34q57j04J203O85k12j087r50Q65Q74N96m77j345k71
$$ -302 -1168 -814 -132 901 498 -36 -893 -997 206 891 679 -408 -1358 -493 381 977 500 -845 -1116
2054a116L40Q93P00l94j082l25O00P13O21p52r38o5O20R72q9p59p64n4P24Q38
$$ -1116 -776 117 817 423 -659 -984 -384 329 950 198 -740 -805 -185 787 698 -61 -825 -879 -155 683
2074F83k7n83j157K5J221O81J45j023q37J00Q69P05l95o48o50J37J188N39n94
$$ 683 656 73 -1084 -1059 162 843 988 -35 -872 -772 97 802 407 -241 -891 -754 434 973 379
2093C79n34r26N53J075M32l79j211o22R33P02N71m33j284R2L00Q09M45m20j275
$$ 379 -155 -1081 -528 547 979 600 -611 -1233 -300 402 973 540 -744 -652 -352 457 902 482 -793
2112g93k06Q80O04K18o75q08J16O19Q70k73p48n05k55J156P11j96q50q43L34P23
$$ -793 -999 -119 485 703 28 -780 -664 -45 825 552 -196 -701 -956 200 911 715 -135 -978 -644 79
2132G9Q49k43j000m28L73P55J82L2r35m10M12R68M1n8j170j7K02R37L00k98j116
$$ 79 928 685 -315 -743 -370 385 567 599 -336 -746 -334 634 675 617 -553 -570 -368 569 869 571 -545
2153e45k96P19P76M30o48j000m08P54J039n8r64k82j48M35Q98p7o13m10k76J003
$$ -545 -841 -122 654 1084 436 -564 -972 -218 821 763 -201 -483 -631 -196 702 625 12 -398 -674 329
2173C29J64J59o66o90K9P76M47n2o95n81J12R60O78n95r20m51P41M98M06p6q12
$$ 329 493 652 -14 -704 -675 101 548 496 -199 -780 -668 292 970 375 -545 -996 -255 243 649 573 -239
2194b39l39J75Q91M98o34o51J2L2P42J25n90l67n30M75J017J25o52j013N84N19
$$ -239 -578 -403 488 986 352 -299 -287 -255 487 612 22 -345 -875 -400 617 742 90 -923 -339 180
2214A80M25L87j047o62J43J011J78J10q55o39L98O15O40k91q37p96P82N26L55
$$ 180 605 992 -55 -717 -574 437 615 725 -130 -769 -371 244 884 593 -244 -1040 -258 268 623
2233F23J15j099m70J93R23O86p35o71k76L65J024J44o22q93m30P00J127k69k06
$$ 623 738 -361 -831 -638 285 971 236 -435 -711 -346 678 822 200 -693 -1123 -423 704 435 229
2252B29n90LO81L28j75r5q04m5N18M74J33o08o72R5Q44L54l33o52m57K87O22O12
$$ 229 -361 -358 323 651 476 381 -423 -468 50 524 657 49 -623 -528 316 670 337 -315 -772 -485 137 749
2274G49n34n77m57K76Q47M96o51p29j85L46N01K38l55n58q4M24P33K20p53n15
$$ 749 215 -362 -819 -543 304 800 149 -580 -765 -419 82 320 -35 -593 -677 -253 480 700 -53 -568
2294e68j17N83P22k33o91n96O4Q53M03J25o97q06L11P30K40j80p29j4n0O32O18
$$ -568 -685 -102 620 387 -304 -900 -836 17 420 545 -152 -958 -647 83 323 143 -586 -600 -650 -18 600
2315F00l25n96k29L6Q09P8m5n96n82J85Q52K66m10n61k47O16O28q5l23l91l45
$$ 600 275 -321 -550 -514 295 373 328 -268 -850 -665 187 453 43 -518 -765 -149 479 394 71 -320 -665
2336f65N18O65O1n62m60k46P40K38L15k89j025j86R96N29l6o33l60K41K05O76
$$ -665 -147 518 579 17 -443 -689 51 289 604 315 -710 -896 100 629 593 -40 -400 -159 46 722
2356G22J30j042l63Q7P94k1k33L2q98N73N39J82j64m03l49k29J090M67m99o56
$$ 722 852 -190 -553 -466 328 307 74 106 -792 -219 320 502 338 -65 -414 -643 447 914 415 -241
2376b41m86M48R27L35q59m13j13K1Q16o2k39r67N07O21J25j19j96p17N51l6M75
$$ -241 -727 -279 648 983 124 -289 -402 -381 435 373 134 -833 -326 295 420 301 105 -612 -61 -97 378
2397C78N1j62m39k62O17K58K05n62q39J30J071L41j42r76l76M37O15K43l50o14
$$ 378 429 267 -172 -434 183 441 646 84 -755 -625 446 787 645 -331 -707 -270 345 588 238 -376
2417c76J02M97r6M5k31m19j44J68N44R5k91k85j24K80N25L15m56p85j7N03O15
$$ -376 -274 223 127 172 -59 -478 -622 -454 90 185 -106 -391 -515 -235 290 605 149 -636 -653 -150 465
2438D65j50m09m85Q7M58L47j05n08n6J17L29M10l1q40J17Q7N58j57J03p62j90
$$ 465 315 -94 -579 -492 -34 313 208 -300 -356 -239 90 500 469 -371 -254 -167 391 234 337 -425 -615
2459f15K45O55L20l87n47o53O04J022l24n54k65N9N03J44J29l07n95j09J32N85
$$ -615 -370 285 605 218 -329 -982 -378 644 320 -234 -499 -440 63 207 336 29 -566 -675 -543 42
2479D2M59l41l86rL07L91l06k83o71N14Q1N78j99l44m10M0P48K36l70n60l5M46
$$ 42 501 160 -226 -235 72 463 157 -126 -797 -283 -202 376 177 -167 -577 -537 211 447 77 -483 -518 -72
2501g2L01L3k54j68J65pM46j12L9n53n69L49O57L24p10k65R4L20L99J0p00j69
$$ -72 229 262 8 -160 5 -2 444 332 371 -182 -751 -402 255 579 -131 -396 -302 18 417 427 -273 -442
2523d42l7N30J02r4L7l44K16j27L72N5m22J87m82O36L64l90k60l04M3N71L45j48
$$ -442 -479 51 153 59 96 -248 -32 -159 213 268 -154 33 -449 187 551 161 -99 -403 -360 211 556 408
2545D08p64m5P2M99M5J89r10K69J34L96O3m81l83K00L22M22Pk08o90l4k2L06M99
$$ 408 -356 -401 -329 170 215 404 -506 -237 -103 293 356 -125 -508 -308 14 436 443 235 -455 -489 -511 -205 294
2568B94k11l42r9J13M99J21m11l98K56K96Q1K57k97p25N82L27R0l34pp09M99J75
$$ 294 83 -259 -358 -245 254 375 -36 -434 -178 118 199 456 159 -566 16 343 433 99 92 -617 -118 57
2590E7J79q3o7n12J37M71K47m7n16%k31M83J34j82l78j3M98J43j54j40j69k70
$$ 57 236 153 86 -426 -289 182 429 382 -134 -134 -365 118 252 70 -308 -321 177 320 166 26 -143 -413
2612d13l1L80O57n40l96q6L27J85K10k58j55n01L60P39l28p2q33N22J82M80l99
$$ -413 -444 -64 593 53 -343 -429 -102 83 293 35 -120 -621 -261 478 150 78 -755 -233 -51 429 30
2633C0j71k84O00K4K83l91k08l03O9L07L07O8m11j35k20N75M48n03m44K42P6L24
$$ 30 -141 -425 175 199 482 91 -117 -420 -351 -44 263 331 -80 -215 -435 140 588 85 -359 -117 -41 283
2655B83K7m28j85j09L64K51n1m66P0K61J67J16k87J07k73p7J78J04Q3k80j83J43
$$ 283 310 -118 -303 -412 -48 203 152 -314 -244 17 184 300 13 120 -153 -230 -52 52 135 -145 -328 -185
2677a85J30M69l90j41j41j19O10Q5l02o6l04Q3N21k98n1r5k74J28Q61m60J56m62
$$ -185 -55 414 24 -117 -258 -377 233 318 16 -50 -354 -271 250 -48 -99 -194 -468 -340 521 61 217 -245
2699b45q2R1L60L01m11m21j76L12O86R0o13k19j51P40M80p68O3m09L94J82k46
$$ -245 -327 -236 124 425 14 -407 -583 -271 415 505 -108 -327 -478 262 742 -26 37 -372 22 204 -42
$$ [...]
8191I5
##END NTUPLES=NMR FID
##END=
