##TITLE=1H_101-2025
 200.13MHz, CDCl3,
 8 sc
 
 11.8.2025
##JCAMPDX= 6.0         $$ Bruker NMR JCAMP-DX V2.0
##DATA TYPE= NMR FID
##DATA CLASS= NTUPLES
##ORIGIN= UXNMR, Bruker Analytische Messtechnik GmbH
##OWNER= pz
$$ XWIN-NMR		Version 3.5
$$ Mon Aug 11 14:42:23 2025 Russian Standard Time (UT+4h)  she@DPX200
##.OBSERVE FREQUENCY= 200.1313
##.OBSERVE NUCLEUS= ^1H
##.DELAY= (6, 6)
##.ACQUISITION MODE= SIMULTANEOUS
##.ACQUISITION SCHEME= undefined
##.AVERAGES= 8
##.DIGITISER RES= 18
##SPECTROMETER/DATA SYSTEM= spect
##.PULSE SEQUENCE= zg30
##.SOLVENT NAME= CDCl3
##.SHIFT REFERENCE= (INTERNAL, CDCl3, 0, 14.3821)
##AUDIT TRAIL= $$ (NUMBER, WHEN, WHO, WHERE, WHAT)
$$ ##TITLE= Audit trail, XWIN-NMR		Version 3.5
$$ ##JCAMPDX= 5.01
$$ ##ORIGIN= Bruker BioSpin GmbH
$$ ##OWNER= she
$$ F:/spectra/data/she/nmr/H-C/1/audita.txt
$$ ##AUDIT TRAIL=  $$ (NUMBER, WHEN, WHO, WHERE, WHAT)
(   1,<2025-08-11 14:41:10.64 +0400>,<she>,<DPX200>,
      <created by zg, POWCHK disabled, PULCHK disabled
       configuration hash MD5:
       00 E9 B6 7A A2 85 ED C7 34 08 36 98 17 FE 4E 26
       data hash MD5: 16K
       F0 0E 2C 38 4A C0 F2 9C E9 C1 F3 44 AF 8C C1 4C>)
$$ ##END=
$$ 
$$ hash MD5
$$ 58 9F C0 AA 8E 93 39 35 42 27 4D 51 37 B8 91 D0
##$RELAX= 
##$RELAX= 
##$RELAX= 
##$RELAX= 
##$RELAX= 
##$RELAX= 
$$ Bruker specific parameters
$$ --------------------------
##$DU= <F:/spectra>
##$EXPNO= 1
##$NAME= <H-C>
##$PROCNO= 1
##$TYPE= <nmr>
##$USER= <she>
##$AMP= (0..31)
100 100 100 100 100 100 100 100 100 100 100 100 100 100 100 100 100 100 
100 100 100 100 100 100 100 100 100 100 100 100 100 100 
##$AQSEQ= 0
##$AQ_mod= 1
##$AUNM= <au_zg>
##$AUTOPOS= <>
##$BF1= 200.13
##$BF2= 200.13
##$BF3= 200.13
##$BF4= 200.13
##$BF5= 200.13
##$BF6= 200.13
##$BF7= 200.13
##$BF8= 200.13
##$BYTORDA= 1
##$CFDGTYP= 0
##$CFRGTYP= 5
##$CHEMSTR= <none>
##$CNST= (0..31)
1 1 145 1 1 1 1 1 1 1 1 1 1 1 1 1 1 1 1 1 1 1 1 1 1 1 1 1 1 1 1 1 
##$CPDPRG= <>
##$CPDPRG1= <>
##$CPDPRG2= <>
##$CPDPRG3= <>
##$CPDPRG4= <mlev>
##$CPDPRG5= <mlev>
##$CPDPRG6= <mlev>
##$CPDPRG7= <mlev>
##$CPDPRG8= <mlev>
##$CPDPRGB= <>
##$CPDPRGT= <>
##$D= (0..31)
0 0.7 0 0 0 0 0 0 0 0 0 0.03 0 0 0 0 0 0 0 0 0 0 0 0 0 0 0 0 0 0 0 0 
##$DATE= 1754908870
##$DBL= (0..7)
120 120 120 120 120 120 120 120 
##$DBP= (0..7)
150 150 150 150 150 150 150 150 
##$DBP07= 0
##$DBPNAM0= <>
##$DBPNAM1= <>
##$DBPNAM2= <>
##$DBPNAM3= <>
##$DBPNAM4= <>
##$DBPNAM5= <>
##$DBPNAM6= <>
##$DBPNAM7= <>
##$DBPOAL= (0..7)
0.5 0.5 0.5 0.5 0.5 0.5 0.5 0.5 
##$DBPOFFS= (0..7)
0 0 0 0 0 0 0 0 
##$DE= 6
##$DECBNUC= <off>
##$DECIM= 32
##$DECNUC= <off>
##$DECSTAT= 4
##$DIGMOD= 1
##$DIGTYP= 9
##$DL= (0..7)
0 120 120 120 120 120 120 120 
##$DP= (0..7)
150 150 150 150 150 150 150 150 
##$DP07= 0
##$DPNAME0= <>
##$DPNAME1= <>
##$DPNAME2= <>
##$DPNAME3= <>
##$DPNAME4= <>
##$DPNAME5= <>
##$DPNAME6= <>
##$DPNAME7= <>
##$DPOAL= (0..7)
0.5 0.5 0.5 0.5 0.5 0.5 0.5 0.5 
##$DPOFFS= (0..7)
0 0 0 0 0 0 0 0 
##$DQDMODE= 0
##$DR= 18
##$DS= 0
##$DSLIST= <SSSSSSSSSSSSSSS>
$$ [...]
##$SUBNAM0= <"">
##$SUBNAM1= <"">
##$SUBNAM2= <"">
##$SUBNAM3= <"">
##$SUBNAM4= <"">
##$SUBNAM5= <"">
##$SUBNAM6= <"">
##$SUBNAM7= <"">
##$SUBNAM8= <"">
##$SUBNAM9= <"">
##$SW= 18.0517328524113
##$SWIBOX= (0..15)
0 0 2 0 0 0 0 0 0 0 0 0 0 0 0 0 
##$SW_h= 3612.71676300578
##$TD= 16384
##$TD0= 1
##$TE= 0
##$TE2= 300
##$TE3= 300
##$TEG= 300
##$TL= (0..7)
0 120 120 120 120 120 120 120 
##$TP= (0..7)
150 150 150 150 150 150 150 150 
##$TP07= 0
##$TPNAME0= <>
##$TPNAME1= <>
##$TPNAME2= <>
##$TPNAME3= <>
##$TPNAME4= <>
##$TPNAME5= <>
##$TPNAME6= <>
##$TPNAME7= <>
##$TPOAL= (0..7)
0.5 0.5 0.5 0.5 0.5 0.5 0.5 0.5 
##$TPOFFS= (0..7)
0 0 0 0 0 0 0 0 
##$TUNHIN= 0
##$TUNHOUT= 0
##$TUNXOUT= 0
##$USERA1= <user>
##$USERA2= <user>
##$USERA3= <user>
##$USERA4= <user>
##$USERA5= <user>
##$V9= 5
##$VALIST= <valist>
##$VCLIST= <CCCCCCCCCCCCCCC>
##$VD= 0
##$VDLIST= <DDDDDDDDDDDDDDD>
##$VPLIST= <PPPPPPPPPPPPPPP>
##$VTLIST= <TTTTTTTTTTTTTTT>
##$WBST= 1024
##$WBSW= 4
##$XGAIN= (0..3)
0 0 0 0 
##$XL= 0
##$YL= 0
##$YMAX_a= 687579
##$YMIN_a= -778677
##$ZGOPTNS= <>
##$ZL1= 120
##$ZL2= 120
##$ZL3= 120
##$ZL4= 120
##$ABSF1= 10
##$ABSF2= 0
##$ABSG= 5
##$ABSL= 3
##$ALPHA= 0
##$AQORDER= 0
##$ASSFAC= 0
##$ASSFACI= 0
##$ASSFACX= 0
##$ASSWID= 0
##$AUNMP= <proc_1d>
##$AZFE= 0.1
##$AZFW= 0.1
##$BCFW= 1
##$BC_mod= 2
##$BYTORDP= 1
##$COROFFS= 0
##$CY= -3
##$DATMOD= 1
##$DC= 2
##$DFILT= <>
##$DTYPP= 0
##$F1P= 0
##$F2P= 0
##$FCOR= 0.5
##$FTSIZE= 0
##$FT_mod= 4
##$GAMMA= 1
##$GB= 0.15
##$INTBC= 1
##$INTSCL= 1
##$ISEN= 128
##$LB= 0.25
##$LEV0= 0
##$LPBIN= 0
##$MAXI= 10000
##$MC2= 0
##$MEAN= 0
##$ME_mod= 0
##$MI= 1.114404
##$NCOEF= 0
##$NC_proc= 0
##$NLEV= 6
##$NOISF1= 3.799351
##$NOISF2= 2.8
##$NSP= 1
##$NTH_PI= 0
##$NZP= 0
##$OFFSET= 14.38212
##$PC= 1
##$PHC0= -1562.693
##$PHC1= 16.99229
##$PH_mod= 1
##$PKNL= yes
##$PPARMOD= 0
##$PSCAL= 0
##$PSIGN= 0
##$REVERSE= no
##$SF= 200.129724274929
##$SI= 16384
##$SIGF1= 3
##$SIGF2= 2
##$SINO= 400
##$SIOLD= 16384
##$SREGLST= <1H.CDCl3>
##$SSB= 0
##$STSI= 0
##$STSR= 0
##$SW_p= 3205.1282051282
##$SYMM= 0
##$S_DEV= 0
##$TDeff= 0
##$TDoff= 0
##$TI= <>
##$TILT= no
##$TM1= 0
##$TM2= 0
##$TOPLEV= 0
##$USERP1= <user>
##$USERP2= <user>
##$USERP3= <user>
##$USERP4= <user>
##$USERP5= <user>
##$WDW= 1
##$XDIM= 8192
##$YMAX_p= 0
##$YMIN_p= 0
$$ End of Bruker specific parameters
$$ ---------------------------------
##NTUPLES= NMR FID
##VAR_NAME=  TIME,          FID/REAL,        FID/IMAG
##SYMBOL=    X,             R,               I
##VAR_TYPE=  INDEPENDENT,   DEPENDENT,       DEPENDENT
##VAR_FORM=  AFFN,          ASDF,            ASDF
##VAR_DIM=   8192,          8192,            8192
##UNITS=     SECONDS,       ARBITRARY UNITS, ARBITRARY UNITS
##FACTOR=    0.0002768,     1,               1
##FIRST=     0,             0,               0
##LAST=      2.2672688,     0,               0
##MIN=       0,             -778677,         0
##MAX=       2.2672688,     687579,          0
$$ Real data points
##PAGE= N=1
##DATA TABLE= (X++(R..R)), XYDATA
$$ [...]
$$ plain form
2039 521 -476 -122 708 -499 152 504 -232 544 262 -407 316 -310 -394 504 -777 -213 485 -562 110
2058 110 176 -652 560 -67 -579 926 23 -156 965 -264 319 768 -579 317 194 -524 431 -254 -500
2077 -500 474 -632 -307 553 -857 -52 10 -582 256 -42 -423 523 130 -203 733 -428 32 620 -855
2096 -855 174 248 -613 367 -236 -439 233 -462 -279 386 -475 322 399 -543 502 347 -311 813 -165 -310
2116 -310 832 -563 70 811 -640 31 297 -739 299 -174 -352 336 -479 -244 608 -177 209 808
2134 808 -381 413 356 -412 813 -20 -218 540 -414 -399 310 -714 186 141 -951 165 -88 -594 429
2153 429 -26 -120 871 -325 255 869 -339 486 305 -339 433 -57 -429 429 -611 -316 522 -861 -142
2172 -142 339 -556 243 346 -153 905 -183 -281 996 -174 194 719 -509 361 273 -469 319 -424 -514
$$ packed form
2039E21r97L54Q30j207O51L52p36P76k82o69P23o26q4Q98j281N64O98j047O72
2058A10O6q28J212o27n12J505r03j79J121j229N83M49j347Q96j23p18R55o85k46
2077e00R74j106L25Q60j410Q05O2n92Q38k98l81R46l93l33R36j161M60N88j475
2096h55J029P4q61R80o03k03O72o95J83O65q61P97P7r42J045j55o58J124r78j45
2116c10J142j395O33P41j451O71K66j036J038m73j78O88q15K35Q52p85L86N99
2134H08j189P94n7p68J225q33j98P58r54J5P09j024R00m5j092J116k53n06J023
2153D29m55r4R91j196N80O14j208Q25j81o44P72m90l72Q58j040K95Q38j383P19
2172a42M81q95P99J03m99J058j088r8J277j170L68N25j228Q70q8p42P88p43r0
$$ plain form
2191 -514 586 -520 -235 476 -627 26 690 -303 453 311 -286 834 -253 -85 646 -342 41 385
2209 385 -542 -73 241 -590 240 -342 -393 514 -314 -183 722 -247 8 652 -271 594 415 -313 628 30
2229 30 -20 603 -309 -125 485 -645 -95 174 -610 153 -156 -526 487 -270 -164 465 -191 267 703 -434
2249 -434 596 292 -452 821 -193 -461 535 -471 -470 428 -611 -22 408 -866 286 102 -322 799
2267 799 -165 -83 490 -21 211 665 -508 246 213 -531 425 -33 -620 309 -367 -426 390 -573 175 371 -625
2288 -625 390 581 -549 721 -7 -47 562 -479 146 420 -756 -54 346 -804 197 -112 -373 536
2306 536 -287 -145 735 -631 183 427 -370 386 230 -364 539 -159 -386 531 -499 -62 433 -737 -67
2325 -67 437 -969 191 -115 -383 768 -148 -228 732 -437 -133 542 -254 685 341 -347 401 147 -340
$$ packed form
2191e14J100j106K85P11j103O53O64r93P56j42n97J120j087J68P31r88L83L44
2209C85r27M69L14q31Q30n82n1R07q28J31R05r69K55O44r23Q65j79p28R41n98
2229C0n0O23r12J84O10j130N50K69p84P63l09l70J013p57J06O29o56M58M36j137
2249d34J030l04p44J273j014k68R96j006JQ98j039N89M30j274J152j84m24J121
2267G99r64Q2N73n11K32M54j173P54l3p44R56m58n87R29o76n9Q16r63P48J96r96
2288f25J015J91j130J270p28m0O09j041O25K74j176P02M00j150J001l09k61R09
2306E36q23J42Q80j366Q14K44p97P56j56n94R03o98k27R17j030M37M95j170O70
2325f7N04j406J160l06k68J151r16q0R60j169L04O75p96R39l44o88P48k54m87
$$ plain form
2344 -340 362 -118 -235 659 -496 -203 397 -792 252 -23 -291 510 221 -146 473 -337 -46 267 -497
2363 -497 28 306 -733 401 -65 -574 455 -372 -503 730 -724 305 556 -608 483 285 -416
2380 -416 734 103 -215 415 -241 -70 584 -601 209 34 -461 381 -116 -548 348 -365 -179 325 -454
2399 -454 121 583 -597 294 438 -589 518 -131 -347 832 -147 -394 657 -404 -425 -7 -367 176
2417 176 21 -622 687 -183 -221 715 -235 399 466 -446 217 224 -485 352 -38 -318 672 -157 -240 333 -603
2438 -603 -73 481 -798 242 139 -269 480 41 -290 728 -371 63 379 -312 260 67 -790 380
2456 380 130 -688 433 -330 -596 510 -477 14 475 -176 189 263 -439 800 72 -245 712 5 -46 486
2476 486 -32 137 300 -580 120 27 -603 370 -195 -519 540 -507 166 343 -415 205 302 -234 361 -84
$$ packed form
2344c40P02m80j17Q94j155K93O00j189J044k75k68Q01k89l67O19q10K91L13p64
2363d97N25K78j039J134m66n09J029q27j31J233j454J029K51j164J091j98p01
2380d16J150o31l18O30o56J71O54j185Q10j75m95Q42m97m32Q96p13J86N04p79
2399d54N75M62j180Q91J44j027J107o49k16J179r79k47J051j061k1M18l60N43
2417A76j55o43J309q70l8R36r50O34O7r12O63Pp09Q37l90k80R90q29q3N73r36
2438f03N30N54j279J040j03m08P49m39l31J018j099M34L16o91N72j93q57J170
2456C80k50q18J121p63k66J106r87M91M61o51L65P4p02J239p28l17R57p07n1N32
2476D86n18J69J63q80P00r3o30R73n65l24J059j047O73J77p58O20R7n36N95m45
$$ plain form
2496 -84 -83 809 -267 -171 95 -461 31 465 -642 343 -40 -621 458 -328 -316 649 -99 -123 549 -248 472
2517 472 382 -281 566 86 -532 540 -435 -95 364 -594 -184 122 -276 226 191 -447 440 48 -312 699
2537 699 -38 -232 535 -413 105 273 -331 245 98 -628 607 -297 -375 359 -457 -147 339 -609 149 227
2557 227 -541 668 -153 -300 772 -269 54 578 -434 98 351 -595 324 163 -536 495 -210 -454
2575 -454 636 -587 -50 558 -387 176 164 -394 462 397 -386 311 -70 -181 233 -448 -25 299 -554 116
2595 116 173 -612 294 -342 -159 471 -131 -128 602 -570 145 437 -296 773 -6 -294 515 -491 -302 185
2615 185 -286 30 119 -549 184 37 -509 214 -89 -374 273 -142 34 771 -572 220 350 -533 393 51
2635 51 -519 416 -382 -146 281 -319 203 427 -556 -9 163 -394 552 199 227 410 -29 35 218 -151 206
$$ packed form
2496h4JQ92j076R6K66n56M92M34j107R85l83n81J079p86J2R65p48k4O72p97P20
2517D72r0o63Q47m80o18J072r75L40M59r58M10L06l98N02l5o38Q87l92l60J011
2537F99p37j94P67r48N18J68o04N76j47p26J235r04p8P34q16L10M86r48P58P8
2557B27p68J209q21j47J072j041L23N24j012N32K53r46R19j61o99J031p05k44
2575d54J090j223N37O08r45N63j2n58Q56o5p83O97l81j11M14o81M23L24q53O70
2595A16N7p85R06o36J83O30o02LP30j172P15K92p33J069p79k88Q09j006J89M87
2615A85m71L16Q9o68P33j47n46P23l03k85O47m15J76P37j343P92J30q83R26l42
2635E1n70R35p98K36M27o00N22K24r83N47J72n57R46l53K8J83m39O4J83l69L57
$$ plain form
2656 206 449 -749 218 128 -506 444 -341 -382 513 -294 -80 211 -116 502 449 -200 375 131 -265 677 -162
2677 -162 -180 453 -571 -239 162 -725 218 -104 -436 217 -43 -384 587 10 -145 365 -116 82 282 -655
2697 -655 315 284 -273 355 -89 -232 244 -418 -147 279 -520 122 99 -398 613 -135 -165 302 -184 -86 326
2718 326 -289 166 488 -303 -25 -106 -331 212 -273 -605 330 -242 -43 342 -372 193 122 -256 221 -270 -458
2739 -458 516 -370 -195 429 -49 72 292 -523 78 -5 -299 176 -258 -475 -122 -300 -48 446 -352 259
2759 259 273 -387 235 78 -296 430 -161 -7 546 -458 4 321 -192 -260 144 -344 403 -180 -376 379
2779 379 -178 200 401 -247 148 347 -136 317 146 -116 525 -286 -103 356 -152 175 283 -616 37 38 -499
2800 -499 227 303 -361 459 -48 -103 460 -59 214 223 -970 214 3 -404 474 -294 -143 251 -400 -144 111
$$ packed form
2656B06K43j198R67r0o34R50p85m1Q95q07K14K91l27O18n3o49N75k44l96R42q39
2677a62j8O33j024L32M01q87R43l22l32O53k60l41R71n77j55N10m81J98K00r37
2697f55R70l1n57O28m44j43M76o62K71M26p99O42k3m97J011p48l0M67m86R8M12
2718C26o15M55L22p91K78q1k25N43m85l32R35n72J99L85p14N65p1l78M77m91j88
2739d58R74q86J75O24m78J21K20q15O01q3k94M75m34k17L53j78K52M94p98O11
2759B59J4o60O22j57l74P26n91J54N53j004M62L17n13o8M04m88P47n83j96P55
2779C79n57L78K01o48L95J99m83M53j71k62O41q11J83M59n08L27J08q99O53Jn37
2800d99P26P6o64Q20n07n5N63n19K73Rj193J184k11m07Q78p68J51L94o51K56K55
$$ plain form
2821 111 -559 -26 178 -492 378 -9 -243 629 -173 5 378 -376 0 427 -374 274 154 -497 -115 -99
2841 -99 -383 141 -408 -193 558 -271 160 539 -303 348 105 -406 427 -141 -94 605 -435 -136 366 -597
2861 -597 94 199 -552 479 -175 -58 627 55 -163 346 -371 99 54 -377 331 168 -49 283 -19 -300
2881 -300 331 -285 -399 227 -242 15 191 -335 -39 125 -324 338 16 -180 423 -247 133 350 -496 157
2901 157 121 -453 352 -11 -398 490 -341 -111 126 -199 -69 79 -456 575 54 -405 557 -70 -188 570
2921 570 -29 162 497 -147 7 -79 -495 286 -299 -474 471 -163 -160 360 -261 80 274 -79 209 239 -140
2942 -140 230 114 -274 423 -276 -84 499 -396 -114 198 -244 233 -212 -275 102 -63 74 323 -412 44
2962 44 117 -315 172 308 -233 143 91 -44 184 -457 -509 119 -335 -84 198 -578 186 81 -196 271 -133
$$ packed form
2821A11o70N33K04o70Q70l87k34Q72q02J78L73p54L76M27q01O48j20o51L82J6
2841i9k84N24n49K15P51q29M31L79q42O51k43n11Q33n68M7O99j040K99N02r63
2861e97O91J05p51J031o54J17O85n72k18N09p17M70m5m31P08j63k17L32l02k81
2881c00O31o16j14O26m69K57J76n26K96J64m49O62l22j96O03o70L80K17q46O53
2901A57l6n74Q05l63l87Q88q31K30K37l25J30J48n35J031n21m59R62o27j18P58
2921E70n99J91L35o44J54q6m16P81n85j75R45o34LN20o21L41J94l53K88L0l79
2942a40L70j16l88O97o99J92N83q95K82L12m42M77m45o3L77j65J37K49p35M56
2962D4P3m32M87J36n41L76n2j35K28o41n2O28m54K51K82p76P64j05k77M67m04
$$ plain form
2983 -133 -43 580 14 -28 188 -247 -3 155 -489 241 -232 -248 364 -407 -84 493 -591 296 370 -567 389
3004 389 224 -186 416 -244 -101 535 -339 28 124 -471 95 183 -481 173 78 -287 222 -232 -189 396 -203
3025 -203 -92 10 -60 192 190 -291 653 84 8 601 13 -8 267 -172 -127 192 -383 403 103 -82 382 -276
3047 -276 -131 418 -288 -95 464 -189 244 22 -72 465 260 -437 276 -143 -225 299 -486 -128 -4 -350 99
3068 99 18 -240 206 -133 -467 698 -116 -50 354 -143 233 83 -516 459 -104 -375 272 -105 -47 302 -181
3089 -181 -181 94 -145 98 282 -179 419 129 -318 288 -247 399 447 -416 99 386 -298 600 39 -337 299
3110 299 133 -476 489 -179 -76 503 -205 308 72 -132 601 -245 -68 381 -18 -34 359 -374 177 158 -360
3131 -360 131 53 -327 280 -61 -93 333 -354 -176 470 -257 275 119 -12 305 -112 -221 83 -34 -21 231
$$ packed form
2983a33R0O23n66m2K16m35K44J58o44P30m73j6O12p71L23N77j084Q87P4r37R56
3004C89j65m10O02o60J43O36q74L67R6n95N66Q8o64O54r5l65N09m54M3N85n99
3025b03J11J02p0K52km81R44n69p6N93n88k1K75m39M5L19n75P86l00j85M64o58
3047b76J45N49p06J93N59o53M33k22r4N37k05o97P13m19q2N24p85L58J24l46M49
3068I9q1k58M46l39l34J165q14O6M04m97L76j50n99R75n63k71O47l77N8L49m83
3089a81%K75k39K43J84m61N98k90m47O06n35O46M8q63N15K87o84Q98n61l76O36
3110B99j66o09R65o68J03N79p08N13k36k04P33q46J77M49l99j6L93p33N51j9n18
3131c60M91p8l80O07l41l2M26o87J78O46p27N32j56j31L17m17j09L04j17J3K52
$$ plain form
3152 231 -415 70 169 -726 211 -110 -522 361 0 -87 200 -137 223 311 -365 21 174 -321 373 -245 -261
3173 -261 265 -73 -387 251 -297 137 141 -293 73 0 -291 229 6 -466 281 250 -39 166 -378 171 -37
3194 -37 -359 235 37 -426 320 -154 -332 419 -253 119 232 -475 117 -43 -266 490 -34 71 358 -163
3214 -163 -2 359 -368 94 132 -543 184 -25 -186 560 -72 -358 244 -188 28 263 -198 353 37 -288
3234 -288 205 49 -111 517 -54 -26 90 -248 -152 228 -279 113 37 -349 449 -92 -238 500 -206 350 489
3255 489 -319 28 330 -136 514 -54 -334 225 -434 -60 27 -346 -119 287 -239 94 28 -110 -102 77 -296
3276 -296 229 -216 -29 361 -401 71 35 -490 3 72 -276 210 -137 -141 199 -211 -214 200 -243 237 312 -256
3298 -256 213 -116 -168 452 -55 -247 325 -64 -166 315 -220 305 -149 -257 204 -143 -197 378 -340 30 185
$$ packed form
3152B31o46M85R9q95R37l21m12Q83l61q7K87l37L60Q8o76L86J53m95O94o18j6
3173b61N26l38l14O38n48M34Mm34L66p3k91N20k23m72P47l1k89K05n44N49k08
3194c7l22N94j98m63P46m74j78P51o72L72J13p07N92j60k23P56n24J05K87n21
3214a63J61L61p27M62L8o75P27k09j61P46o32k86O02m32K16K35m61N51l16l25
3234b88M93j56j60O28n71K8J16l38R6L80n07L92p6l86P98n41j46P38p06N56J39
3255D89q08L47L02m66O50n68k80N59o59L74Q7l73K27M06n26L33o6j38QJ79l73
3276b96N25m45J87L90p62M72l6n25M93O9l48M86l47mL40m10lM14m43M80P5n68
3298b56M69l29n2O20n07j92N72l89j02M81n35N25m54j08M61l47n4N75p18L70J55
$$ plain form
3319 185 -198 196 215 81 483 178 -379 398 -60 153 378 -445 113 91 -601 166 18 -27 303 -95 -190
3340 -190 477 -314 -148 443 -196 124 393 -275 240 180 -180 298 -184 -275 77 -382 -112 333 -287 -52 104
3361 104 -451 253 -7 -34 458 35 -32 51 -268 -1 76 -452 329 -87 -268 284 -435 -186 181 -223 36
3382 36 156 -251 16 265 -446 409 100 -24 673 -67 133 255 -246 -19 40 6 53 -119 -282 -76 -17 -338
3404 -338 184 -37 -100 116 -450 72 399 -339 284 115 -518 514 -32 -164 16 -323 56 284 -436 198
3424 198 132 -282 1 -347 -194 361 -238 -208 401 8 501 320 -73 74 74 -214 277 -180 -196 126 -181 -243
3446 -243 142 -326 273 381 -165 263 -78 -353 289 72 -295 165 -296 128 115 -562 22 149 -336 -2
3466 -2 147 -526 5 -276 -127 59 -251 205 356 -437 223 114 -341 363 -54 24 0 -139 76 48 -443 220
$$ packed form
3319A85l83L94J9j34M02l05n57P77m58K13K25q23N58k2o92P67j48m5L30l98r5
3340a90O67p91J66N91o39L20K69o68N15o0l60M78m82r1L52m59K70M45o20K35J56
3361A04n55P04k60k7M92m23o7Q3l19K67P7n28P81m16j81N52p19K49L67m04K59
3382C6J20m07K67K49p11Q55l09j24O97p40K00J22n01K27N9l4M7j72j63K06N9l21
3404c38N22k21o3K16n66N22L27p38O23j69o33J032n46j32J80l39L79K28p20O34
3424A98o6m14K83l48J53N55n99L0O09l93M93j81l93J47%k88M91m57j6L22l07o2
3446b43L85m68N99J08n46M28l41k75O42k17l67M60m61M24j3o77N84J27m85L34
3466bJ49o73N31k81J49J86l10M56J51p93O60j09m55P04m17P8k4j39K15k8m91O63
$$ plain form
3488 220 31 -202 251 -190 -300 131 -216 -223 402 -266 83 377 -360 25 150 -162 427 -168 76 23 -246
3509 -246 -119 45 -336 248 168 -268 212 -20 -151 252 -265 -26 321 -392 91 415 103 232 227 -10 314
3530 314 -78 33 305 -495 -215 118 -37 -129 55 -335 133 -31 -71 395 -115 79 54 30 222 385 -221
3551 -221 -441 170 -412 226 -76 -291 231 -350 -190 111 -558 19 140 -270 229 19 -115 103 -56 -44
3571 -44 246 -41 46 90 -160 162 197 -309 206 16 -505 172 -92 -53 329 150 63 187 -186 367 194 -66
3593 -66 247 -48 -249 318 -322 -141 84 -112 110 100 -273 239 195 -251 99 -109 -162 56 -38 -149 155 -31
3615 -31 169 128 -38 393 -78 -246 283 -274 -138 -97 -423 214 -117 -224 448 -61 -155 324 184 -34 -3 -130
3637 -130 83 141 -149 250 109 -472 127 -159 39 71 -146 -269 184 -143 -6 -2 -102 51 197 -66 292
$$ packed form
3488B20j89k33M53m41j10M31l47pO25o68L49K94p37L85J25l12N89n95K44n3k69
3509b46J27J64l81N84q0m36M80k32j31M03n17K39L47p13M83L24l12J29nk37L24
3530C14l92J11K72q00K80L33j55r2J84l90M68j64m0M66n10J94k5k4J92J63o06
3551b21k20O11n82O38l02k15N22n81J60L01o69N77J21m10M99k10j34K18j59J2
3571d4K90k87Q7M4k50L22L5n06N15j90n21O77k64L9L82j79q7J24l73N53j73k60
3593f6L13k95k01N67o40J81K25j96K22j0l73N12m4m46L50k08n3K18r4j11L04j86
3615c1K00m1j66M31m71j68N29n57J36M1l26O37l31j07O72n09r4M79j40k18L1j27
3637a30K13N8k90L99j41n81N99k86J98L2k17j23M53l27J37Mj00J53J46k63L58
$$ plain form
3658 292 -122 -237 262 -442 -282 -41 -177 352 -156 -344 79 -81 -379 363 -109 -318 317 -168 -91 557
3678 557 -314 371 -130 147 206 104 -22 242 -249 -108 43 -58 146 -22 -226 165 -40 -199 326 -9
3698 -9 -50 249 -52 -15 4 -164 113 -104 -90 268 97 -55 144 -198 62 198 -200 46 -99 -86 133 108 -94
3721 -94 343 -51 105 205 107 71 485 23 218 68 -219 110 -148 3 144 180 314 -31 -499 51 -41 -321
3743 -321 -68 61 50 365 -130 -43 524 38 -23 186 -316 -232 191 -274 -44 -23 -35 95 -56 -90 170 -204
3765 -204 -40 28 93 230 9 -279 279 68 -314 596 -109 -46 78 -89 -118 164 -112 -14 -115 -139 -36 -248
3787 -248 -244 264 112 169 160 -105 44 96 -320 266 -81 -14 256 -51 -34 112 -91 37 184 -42 -36 277 -207
3810 -207 113 58 -120 131 -5 28 267 -168 166 121 45 70 -92 -173 74 -210 -217 125 64 66 65 -65 -53 139 -66
$$ packed form
3658B92m14j15M99p04J60K41j36N29n08j88M23j60k98P42m72k09O35m85P7O48
3678E57q71O85n01K77N9j02j26K64m91J41J51j01K04j68k04L91k05j59N25l35
3698im1K99l01L7J9j68K77k17J4L58j71j52J99l42K60J36l98K46j45J3K19k5k02
3721i4M37l94J56J00r8l6M14m62J95j50k87L29k58J51J41L6J34l45m68N50r2k80
3743c21K53J29j1L15m95Q7N67m86o1K09n02Q4M23m65K30K1j2J30j51l4K60l74
3765b04J64O8O5J37k21k88N58k11l82R10p05O3J24j67k9K82k76R8j01k4J03k12
3787b48MN08j52N7rk65J49N2m16N86l47O7K70l07J7J46k03J28J47k26OL13m84
3810b07L20n5j78K51j36L3K39m35L34m5p6K5j62q1K47k84pL42o1Kjj30J2J92k05
$$ plain form
3835 -66 237 -310 -180 -20 -81 -119 -1 -105 96 108 -151 -47 2 -307 353 -342 -221 79 25 155 28 -151
3857 -151 292 107 -86 7 43 -97 228 -325 -104 -88 -8 24 318 -121 322 147 1 192 293 -354 269 -118
3879 -118 190 91 244 199 -145 50 -255 122 -235 304 -121 -160 33 -190 -63 127 -126 76 -124 -228 -19
3900 -19 -28 -22 237 -27 148 241 -241 -97 89 16 -15 247 -127 277 -256 -271 -36 -215 117 269 42 116 255
3923 255 -135 70 146 -136 123 14 29 84 64 279 23 -86 181 -48 -180 117 -53 -387 198 -400 -210
3944 -210 214 -335 -285 137 -128 205 118 -124 457 34 -146 317 -179 185 -42 -267 29 61 -150 155 224
3965 224 22 -344 61 -128 -9 -207 113 35 -159 167 138 -129 202 -215 107 -82 128 331 123 -62 -8
3986 -8 109 -133 199 71 -124 137 -2 -34 283 23 -94 -40 -328 140 -127 -147 126 -250 -97 -56 -90 -8 -89
$$ packed form
3835f6L03n47J30J60o1l8J18j04K01J2k59J04M9l09O60o95J21L00n4J30j27j79
3857a51M43j85j93R3L6j40L25n53K21J6Q0L2K94m39M43j75j46J91J01o47O23l87
3879a18L08r9J53m5l44J95l05L77l57N39m25l9J93k23J27J90k53K02k00j04K09
3900a9rOK59k64J75R3m82J44J86p3l1K62l74M04n33j5K35j79L32J52k27P4J39
3923B55l90K05P6k82K59j09J5N5k0K15k56j09K67k29j32K97j70l34N85n98J90
3944b10M24n49N0M22k65L33q7k42N81m23j80M63m96L64k27k25K96L2k11L05O9
3965B24k02l66M05j89J19j98L20p8j94L26k9k67L31m17L22j89K10K03k08j85N4
3986hJ17k42L32j28j95K61j39l2L17k60j17N4k88M68k67k0K73l76J53M1l4Q2q1
$$ plain form
4009 -89 10 56 55 -209 203 -111 14 -208 -257 130 188 -183 -130 30 -234 -255 256 -335 140 92 -66 14 -26 -102
4033 -102 34 -289 -30 127 -154 132 384 -107 -60 -59 -156 -236 -83 -102 162 13 45 190 60 7 -19 33 -53 114
4057 114 46 279 -29 90 248 41 18 -191 -6 207 -132 25 307 -183 -38 8 -159 -90 -125 85 96 21
4079 21 32 326 -142 -289 218 148 221 16 -24 97 -162 -383 130 29 -59 199 -73 -83 437 -46 6 146 -171
4102 -171 36 140 -42 221 -38 -156 98 -36 -83 170 -137 -153 7 -195 216 99 -80 18 160 99 -89
4123 -89 -186 -52 -1 -77 154 -100 -155 305 301 -232 179 -146 -194 -100 -153 -207 85 -189 -1 178 -129 -25 -106 -13
4147 -13 47 -4 84 144 -229 150 106 -55 55 42 121 316 2 -213 307 -15 -53 85 -231 -58 110 -443 97
4170 97 -342 3 405 254 -156 203 -362 -36 -129 -390 -5 -24 -107 -15 49 -83 278 57 -257 44 -140 -84
$$ packed form
4009h9R9M6jk64M12l14J25k22m9L87N8l71N3J60k64k1N11n91M75m8j58Q0m0p6
4033a02J36l23K59J57k81K86K52m91M7Jr7q0J53j9K64j49L2J45j30n3k6N2q6J67
4057A14o8K33l08J19J58k07k3k09J85K13l39J57K82m90J45M6j67O9l5K10J1p5
4079B1J1K94m68j47N07p0P3k05m0J21k59k21N13j01q8K58k72j0N20m83N2J40l17
4102a71K07J04j82K63k59j18K54j34m7K53l07j6J60k02M11j17j79R8J42o1j88
4123h9r7J34N1p6K31k54n5M60mn33M11l25m8R4n3n4K92k74J88J79l07J04q1R3
4147a3O0n1Q8O0l73L79m4j61J10j3P9J95l14k15N20l22l8J38l16J73J68n53N40
4170I7m39L45M02j51m10L59n65L26r3k61L85j9q3R2O4j32L61k21l14L01j84N6
$$ plain form
4192 -84 -83 -198 80 260 71 198 84 -246 70 -190 -67 -179 -100 124 130 -30 159 187 36 88 -100 82 -40
4215 -40 -94 186 -33 77 77 15 -86 -98 -59 -46 -89 -339 -18 -50 -292 -89 132 -302 167 -65 -128 186 -21 11
4239 11 93 58 52 383 31 -16 271 25 74 -66 -48 44 -88 168 10 -68 8 289 -195 7 18 -134 300 -112
4263 -112 -63 -68 -245 -135 59 -421 44 231 69 214 40 18 332 156 100 -88 -20 -30 -148 -50 254 -63 -295
4286 -295 268 49 -18 -5 -188 -60 -171 -47 69 82 70 0 -54 -100 148 5 283 77 60 163 -129 -246 13
4309 13 57 0 -44 166 -57 -115 -95 164 -46 -325 49 58 -51 -70 9 -272 213 -344 -179 161 211 -174 86 -167
4333 -167 94 -57 -294 1 -112 -159 -36 -223 183 -87 -98 -55 258 -113 82 -29 -34 -182 78 -179 121 52
4355 52 286 232 -96 35 -208 -111 156 -126 51 75 4 -237 -122 14 -48 0 1 119 132 -70 -134 -228 -106 24
$$ packed form
4192h4Jj15K78J80j89J27j14l30L16k60J23j12P9K24Oj60J89K8j51N2j88J82j22
4215d0n4K80k19J10%o2j01j2L9J3m3k50L21l2k42K03K21m34M69k32o3L14k07L2
4239A1Q2l5oL31l52m7K87k46M9j40J8R2j32K56j58p8P6K81m84K02J1j52M34m12
4263a12M9nj77J10J94m80M65J87j62J45j74k2L14j76n6j88O8j0j18R8L04l17k32
4286b95N63k19o7J3j83J28j11J24J16J3j2p0n4m6K48j43K78k06j7J03k92j17K59
4309A3M4n7m4K10k23n8K0K59k10k79L74Rj09j9P9k81M85n57J65L40N0l85K60k53
4333a67K61j51k37K95j13m7J23j87M06k70j1M3L13l71J95j11nj48K60k57L00o9
4355E2K34n4l28J31k43R7K67k82J77K4p1k41J15J36o2M8JJ18J3k02o4r4J22J30
$$ plain form
4379 24 -81 -25 259 -188 217 -2 -100 242 74 -16 325 -70 -216 217 -69 95 200 -3 51 -57 -512 -39
4401 -39 108 -123 185 -105 -291 96 89 219 184 -239 -118 207 -83 175 -191 -342 -100 -132 -56 273 -151 321
4423 321 -3 -135 103 123 -151 142 -268 -73 104 149 117 87 -3 -63 131 -105 -3 -21 182 375 -238 -32
4445 -32 178 82 189 -56 -116 -55 228 -59 -19 -243 -13 -129 -140 261 110 -310 -99 163 21 97 -146 -95 -28
4468 -28 -146 175 218 -143 -53 12 21 235 168 -32 -37 167 -211 158 23 -70 202 -80 29 198 -320 -150 -39
4491 -39 -155 30 -162 -76 -68 -324 -28 157 -261 -145 59 -45 96 -156 -158 228 -43 -72 7 -97 94 163 -140
4514 -140 333 43 -89 264 -21 232 -262 -158 -95 -196 -92 220 -166 -149 328 -149 -148 46 -56 107 190 -325
4536 -325 -104 63 95 241 238 -235 6 64 6 52 -144 106 331 -21 90 171 -276 -46 123 -181 228 -120
$$ packed form
4379B4j05N6K84m47M05k19r8L42j68r0L41l95j46M33k86J64J05k03N4j08m55M73
4401c9J47k31L08k90j86L87pJ30l5m23J21L25k90K58l66j51K42l2P6L29m24M72
4423C21l24j32K38K0k74K93m10J95J77M5l2l0r0o0J94k36J02j8K03J93o13K06
4445c2K10r6J07k45o0O1K83k87M0k24K30j16j1M01j51m20K11K62j42P6k43N1O7
4468b8j18L21M3l61R0O5RK14o7k00nK04l78L69j35r3K72k82J09J69n18J70J11
4491c9j16J85j92Q6Qk56K96J85m18J16K04j04J41k52kL86k71k9P9j04J91O9l03
4514a40M73k90j32L53k85K53m94J04O3j01J04L12l86J7M77m77JJ94j02J63Q3n15
4536c25K21J67L2J46lm73K41N8n8M6j96K50K25l52J11Q1m47K30J69l04M09l48
$$ plain form
4558 -120 -350 -43 -34 -239 210 -123 150 225 39 19 -22 -35 111 -77 157 32 31 238 327 -265 415 122 -10
4581 -10 -44 3 -214 95 -138 157 210 -210 179 90 100 77 8 -16 15 58 -37 121 -125 -174 48 10 77 33 -283
4606 -283 184 -377 -1 89 -63 -218 80 126 92 -75 -160 112 -97 -224 255 87 148 214 -303 180 -132 -315
4628 -315 90 -97 -207 394 94 -54 80 -382 -144 70 -33 31 -132 -56 -39 -11 -160 171 -3 -70 62 163
4650 163 82 86 -74 46 -62 128 132 115 -124 292 -17 -196 173 -164 25 -44 -51 296 -5 -131 162 -335 144
4673 144 111 25 -110 5 -21 -188 -21 -51 86 13 -33 180 38 18 312 -38 -63 44 -279 64 -130 -177 71
4696 71 -126 62 181 -80 209 228 -134 -125 414 60 273 -74 -378 362 -92 156 5 82 40 -97 -476 -257
4718 -257 147 -192 8 -129 -113 132 124 221 -81 -227 97 40 -85 326 102 103 -59 43 305 53 -95 52
$$ packed form
4558a20k30L07Rk05M49l33K73P5j86k0m1j3J46j88K34j25jK07Q9n92O80k93j32
4581a0l4M7k17L09k33K95N3m20L89q9J0k3o9k4L1M3r5J58k46m9K22l8O7m4l16
4606b83M67n61L76R0j52j55K98M6l4j67q5K72k09j27M79j68O1O6n17M83l12j83
4628c15M05j87j10O01l00j48J34m62K38K14j03O4j63P6J7K8j49L31j74o7J32J01
4650A63q1Mj60J20j08J90Mj7k39M16l09j79L69l37J89o9pL47l01j26K93m97M79
4673A44l3q6j35J15k6j67J67l0J37p3m6K13j42k0K94l50k5J07l23L43j94m7K48
4696G1j97J88J19k61K89J9l62RN39l54K13l47l04P40m54K48j51P7m2j37l79K19
4718b57M04l39K00j37J6K45qR7l02j46L24n7j25M11k24Jj62J02K62k52j48J47
$$ plain form
4740 52 80 -409 171 400 -207 85 3 -163 99 -116 62 79 -129 108 -79 15 101 -86 -281 112 -130 -132 -45
4763 -45 -101 -107 321 -156 79 187 -40 -69 -264 66 110 -140 144 7 -92 -48 9 -165 59 148 -108 153 -405
4786 -405 6 192 -143 -445 148 60 -58 50 -181 109 79 181 307 -86 -184 38 -222 35 9 118 141 356
4808 356 51 157 -278 -219 265 -85 -300 183 -294 -4 265 -125 -246 184 -240 257 -41 153 -65 -190
4828 -190 127 -54 -284 65 116 -141 95 -76 39 197 -82 -56 90 -200 136 144 -229 132 140 -588 12 146
4850 146 -127 336 -121 -22 93 -136 124 103 -231 -72 38 -142 184 -24 -151 204 -322 104 -66 -185 -9
4871 -9 340 -39 307 72 -272 -30 145 117 -34 -222 -9 37 -325 304 -68 -124 121 107 100 56 -166 -87 -72 -213
4895 -213 -87 80 62 286 -110 -162 56 61 14 213 -344 179 -26 -386 95 277 -156 381 72 -28 172 -201
$$ packed form
4740E2K8m89N80K29o07K92q2j66K62k15J78J7k08K37j87R4Q6j87j95L93k42kQ7
4763d5n6oM28m77K35J08k27k9j95L30M4k50K84j37r9M4N7j74K24Q9k56K61n58
4786d05M11J86l35l02N93q8j18J08k31K90l0J02J26l93r8K22k60K57k6J09K3K15
4808C56l05J06m35N9M84l50k15M83m77K90K69l90j21M30m24M97k98J94k18j25
4828a90L17j81k30L49N1k57K36j71J15J58k79K6J46k90L36Ql73L61Qp28O00J34
4850A46k73M63m57R9J15k29K60k1l34J59J10j80L26k08j27L55n26M26j70j19J76
4871iL49l79L46k35l44K42J75k8j51j88K13M6l62O29l72n6K45j4pm4k22P9J5j41
4895b13J26J67j8K24l96n2K18Nm7J99n57N23k05l60M81J82m33N37l09j00K00l73
$$ plain form
4917 -201 -55 30 -111 257 9 -442 96 -34 -193 65 -24 -20 33 -135 141 -209 -92 -84 -233 -126 183 -294
4939 -294 -95 47 -19 -54 89 -193 165 -91 -37 107 -63 -161 199 -260 -194 190 -174 -123 448 207 233 -185
4961 -185 -142 200 -155 -89 13 -66 -194 -62 70 188 204 -217 249 -84 -88 -22 -150 78 442 -205 -23 146
4983 146 -220 -130 -55 -194 82 -52 -127 96 96 204 -73 -294 -59 342 -233 314 38 -193 150 -166 -340 212
5005 212 14 -37 39 -279 -12 303 -135 0 98 34 470 -50 -104 167 -188 182 141 -34 209 265 -254 149
5027 149 -135 -61 125 -175 -104 193 -376 -95 -164 -197 -87 -41 -46 193 -74 -242 -68 -226 221 247 -188 -4 164
5050 164 -183 245 -71 11 161 -280 -335 64 -285 -123 70 -200 312 -287 3 154 -341 -162 46 -61 -86
5071 -86 -182 12 244 36 -272 -120 139 -86 -155 -58 -213 91 -285 11 128 -328 179 -79 -8 20 -124 -71
$$ packed form
4917b01J46Q5j41L68k48m51N38j30j59K58q9MN3j68K76l50J17Qj49J07L09m77
4939b94J99J42o6l5J43k82L58k56N4J44j70r8L60m59O6L84l64N1N71k41K6m18
4961a85M3L42l55O6J02p9j28J32J32J18J6m21M66l33mO6j28K28L64o47J82J69
4983A46l66R0P5j39K76j34p5K23%J08k77k21K35M01n75N47k76k31L43l16j74N52
5005B12j98n1P6l18K67L15m38J35R8o4M36n20n4K71l55L70m1j75K43N6n19M03
5027A49k84P4J86l00P1K97n69K81o9l3J10M6nK39k67j68J74j58M47K6m35J84J68
5050A64l47M28l16Q2J50m41n5L99l49J62J93k70N12n99K90J51m95J79K08j07k5
5071h6r6J94K32k08l08J52K59k25o9R7j55L04l76K96J17m56N07k58P1K8j44N3
$$ plain form
5093 -71 -208 38 -97 158 -89 -88 159 -347 251 -7 -50 288 -76 94 151 -208 121 367 -18 339 30 -217
5115 -217 58 220 -195 -83 -101 1 66 -266 183 43 -215 245 165 -300 104 -221 64 332 -258 -236 173
5136 173 -31 -18 36 -140 230 -15 -24 240 -216 -95 -182 -172 -24 44 -360 120 176 40 -14 -51 -39 447 -43 -83
5160 -83 65 14 268 262 -316 148 -97 -508 -2 -273 76 8 -169 -216 121 -207 131 73 -150 267 -73 -93 262
5183 262 -35 37 3 -57 12 -30 10 170 -91 -13 159 -113 -95 -73 -117 -5 228 28 293 158 -192 108 -203
5206 -203 35 223 -35 184 18 -423 193 239 -16 32 -45 -214 419 -129 -200 18 -117 130 232 -56 -150 0
5228 0 -114 65 -106 -144 103 -222 -282 100 -184 -7 207 207 209 -145 -87 171 9 104 -30 -310 11 133 -144
5251 -144 -61 68 -148 16 -92 -270 -35 -39 -226 38 -67 -95 114 -238 48 114 -115 120 -262 -96 424 -127
$$ packed form
5093g1j37K46j35K55k47JK47n06N98k58m3L38l64J70N7l59L29K46l85L57l09k47
5115b17K75J62m15J12j8J02O5l32M49j40k58M60q0m65M04l25K85K68n90K2M09
5136A73k04J3N4j76L70k45rK64m56J21q7J0J48O8m04M80N6j36n4l7J2M86m90m0
5160h3J48n1K54on78M64k45m11N06k71L49o8j77m7L37l28L38n8k23M17l40k0L55
5183B62k97P2l4o0O9m2M0J60k61P8J72k72J8K2m4J12K33k00K65j35l50L00l11
5206b03K38J88k58K19j66m41O16M6k55M8p7j69O33n48p1K18j35K47J02k88r4J50
5228@j14J79j71l8K47l25o0L82k84J77K14%Kl54N8K58j62R5j34k80L21J22k77
5251a44Q3J29k16J64j08j78K35mj87K64j05k8K09l52K86O6k29K35l82J66N20n51
$$ plain form
5273 -127 -47 10 -166 -49 190 -69 131 -183 -195 165 -30 111 226 178 -25 64 -171 135 154 -274 334 -30
5295 -30 28 194 -82 194 164 -245 -175 -37 -238 84 -26 -130 261 -15 51 121 -35 -196 110 -265 -10 199
5317 199 -262 -22 -44 -86 -140 -88 10 57 -102 -65 102 -31 55 -11 -291 45 167 -267 180 -103 156 50 -269
5340 -269 132 21 -186 57 150 11 83 -164 -11 196 -433 29 94 -110 218 37 -66 5 -46 -12 74 -173
5362 -173 203 333 174 44 -106 -282 245 4 -80 64 -21 -165 307 197 56 -7 92 246 -39 -351 -27
5383 -27 -47 -88 119 78 94 179 -138 -83 -90 -104 161 -188 66 200 25 -155 171 -38 148 -33 -348 83 30 42
5407 42 224 -3 -235 164 -2 -87 -104 -288 268 211 -272 136 24 178 277 -24 -27 235 -385 1 421 83
5429 83 -30 153 -61 93 29 -429 166 -25 -161 136 -181 -331 -7 -222 137 147 -326 97 111 -213 270
$$ packed form
5273a27Q0N7j76J17K39k59K00l14j2L60j95J41J15m8k03Q9k35L06J9m28O08l64
5295c0N8J66k76K76l0m09P0J38k01L22j10j04L91k76O6P0j56j61L06l75K55K09
5317A99m61K40k2m2n4N2R8M7j59L7J67j33Q6o6k80L36J22m34M47k83K59j06l19
5340b69M01j11k07K43R3j39P2k47J53K07o29M62O5k04L28j81j03P1n1L4Q6k47
5362a73L76J30j59j30j50j76N27k41q4J44q5j44M72j10j41o3R9J54k85l12L24
5383b7k0m1K07m1J6Q5l17N5pj4K65l49K54J34j75j80L26k09J86j81l15M31n3J2
5407D2J82k27k32L99j66q5j7j84N56n7m83M08j12J54R9l01lK62o20L86M20l38
5429H3j13J83k14J54o4m58N95j91j36K97l17j50L24k15L59J0m73M23J4l24M83
$$ plain form
5450 270 19 -173 160 -195 -71 27 -257 -207 268 -217 200 32 -65 356 -88 238 191 -117 -139 153 -335 -34
5472 -34 23 -245 41 -11 -95 331 -221 -33 94 -271 102 -78 -103 299 75 -259 130 -154 -67 213 -135 -35
5494 -35 250 -346 122 138 -211 -220 48 -273 13 5 -64 -62 31 29 29 -127 -173 -89 -247 -123 -226 -36 109 19 -63 -224
5520 -224 -236 260 -109 -95 -138 -69 -89 -85 -108 -98 -80 -263 209 286 -102 105 -15 -61 134 -8 -83 100 -238 201
5544 201 124 -222 -1 207 -47 395 -306 -441 -113 -179 -149 125 -255 67 -187 90 -14 -198 31 192 189 -38
5566 -38 138 -477 13 392 30 -125 38 -297 36 128 -4 95 -95 -171 124 -169 384 199 -189 220 101
5587 101 104 376 -61 -30 269 -159 -62 181 -56 75 130 -118 129 -144 -85 296 -183 -132 170 -45 -108 144 -13
5610 -13 -37 -112 -374 118 -42 -219 -31 -157 250 175 -223 93 59 -137 140 2 -46 -77 -290 152 174 -283 -146
$$ packed form
5450B70k51j92L33l55J24R8k84N0M75m85M17j68r7M21m44L26m7l08k2K92m88L01
5472c4N7k68K86n2q4M26n52J88J27l65L73j80k5M02k24l34L89k84Q7K80l48J00
5494c5K85n96M68J6l49rK68l21K86qo9KR3k%j56m6Q4j58J24j03J90J45r0q2j61
5520b24j2M96l69J4m3O9k0Mk3J0J8j83M72P7l88K07j20m6J95j42p5J83l38M39
5544B01p7l46K21K08k54M42p01j35L28o6L0K74l80L22k54K77j04j84K29J61lk27
5566c8J76o15M90L79l62j55J63l35L33R2j32R9j90p6K95k93N53j85l88M09j19
5587A01LK72m37L1K99m28R7K43k37J31N5k48K47k73N9L81m79N1L02k15o3K52j57
5610a3k4p5k62M92j60j77J88j26M07p5l98L16l4j96K77j38m8l1k13M42K2m57J37
$$ plain form
5633 -146 31 -84 -115 -52 -234 232 66 -201 219 -55 49 156 51 269 53 -241 303 -246 -145 128 12
5654 12 -110 126 -170 -144 59 -38 -13 -133 -244 168 16 -253 21 -68 -125 -66 -330 98 -39 -204 104 -15
5676 -15 113 173 -170 -60 -21 -56 89 -99 -284 27 151 -196 -29 23 -248 63 -51 -272 -149 -143 49 -2 12
5699 12 189 308 -93 -16 -67 -51 58 -394 28 51 -139 143 5 27 -124 -71 81 392 60 273 166 -252
5721 -252 -82 57 69 -146 17 -36 169 10 -187 64 -265 -73 240 56 -130 229 -214 306 -30 -102 121
5742 121 75 -23 222 -420 -51 -48 -86 -24 100 64 86 -104 -351 172 -183 -160 178 -46 8 98 -285 -7 149 -329
5766 -329 -383 213 -266 92 -79 72 -25 -271 -76 53 -284 267 -247 9 473 107 -291 -236 -121 190 48
5787 48 -388 133 190 -343 99 73 -17 144 119 -41 -48 145 30 -27 -403 199 -10 223 18 -292 -63 4 71
$$ packed form
5633a46J77j15l1O3j82M66j66k67M20k74J04J07j05K18k16k94N44n49J01K73j16
5654A2j22K36k96K6K03r7K5j20j11M12j52k69K74q9n7N9k64M28j37j65L08j19
5676a5J28O0l43J10L9l5J45j88j85L11J24l47J67N2k71L11j14k21J23OJ92n1J4
5699A2J77J19m01P7n1J6J09m52M22K3j90K82j38K2j51N3J52L11l32K13j07m18
5721b52J70J39J2k15J63n3K05j59j97K51l29J92L13j84j86L59m43N20l36p2K23
5742A21m6r8K45o42L69Ll8O2J24l6K2j90k47N23l55K3L38k24N4R0l83K78J56m78
5766c29n4N96m79L58j71J51r7k46J95J29l37N51n14K56M64l66l98N5J15L11j42
5787D8m36N21N7n33M42k6r0J61k5j60pJ93j15n7l76O02k09K33k05l10K29O7O7
$$ plain form
5810 71 -113 224 -77 -84 231 -368 -60 -68 -88 -20 -105 45 -54 130 54 -62 -194 195 -166 -136 281 155 -19 202
5834 202 -146 52 249 -144 -128 -73 -240 16 -63 276 89 -144 -28 18 -170 32 -143 -89 91 105 -30 -21 -31
5857 -31 -209 49 -150 -155 -81 121 -100 111 -140 260 -27 266 19 -75 -99 15 12 146 201 -78 43 -41 -130 51
5881 51 -155 2 -31 49 95 -19 -364 -212 -39 -236 98 284 -147 -168 -75 -13 226 117 -284 72 192 135 41
5904 41 -296 146 -29 -132 59 104 -52 27 -2 -87 24 34 -91 111 13 321 -24 64 18 -271 185 185 -77 -39
5928 -39 125 -239 82 -485 -130 7 -86 75 36 158 120 97 7 -196 82 -128 57 -31 -130 48 -244 58 230
5951 230 -115 -69 181 59 67 -20 131 148 74 60 102 -223 149 81 174 219 62 -10 131 -261 -122 197 137 -161
5975 -161 -53 -327 -35 -49 -153 -149 -94 -173 -29 -5 26 91 365 69 52 -227 -189 134 -83 336 31 -215 184
$$ packed form
5810G1j84L37l01pL15n99L08qk0O8q5J50r9J84p6j16j32L89l61L0M17j26j74K21
5834B02l48J98J97l93J6N5j67K56p9L39j87k33J16M6j88K02j75N4J80J4j35Rj0
5857c1j78K58j99nP4K02k21K11k51M00k87K93k47r4k4J14lJ34N5k79J21q4q9J81
5881E1k06J57l3Q0M6j14l45J52J73j97L34J86m31k1R3O2K39j09m01L56J20n7r4
5904D1l37M42j75j03J91M5j56P9k9q5J11J0j25K02r8L08l45Q8m6k89M56%k62L8
5928c9J64l64L21n67L55J37r3J61l9J22l8k3r0k03K78k10J85q8r9J78k92L02J72
5951B30l45M6K50j22Qq7J51J7p4j4M2l25L72o8R3M5j57p2J41l92J39L19o0k98
5975a61J08k74K92j4j04MN5p9J44K4L1O5K74k96j7k79L8L23k17M19l05k46L99
$$ plain form
5998 184 -204 -232 -134 -94 23 -226 52 38 175 5 78 38 41 89 128 -122 113 71 -101 14 -194 203 226 -263
6022 -263 105 -245 -68 -35 114 -291 -3 -109 197 209 -43 104 -1 -326 -300 67 67 314 -283 104 -48 -252
6044 -252 157 22 -146 102 -77 64 -264 -341 -123 247 -50 135 -8 -93 8 77 89 -51 -175 -176 -43 -234
6066 -234 95 290 -148 310 -137 5 -80 -134 -305 217 40 174 61 -193 247 -14 42 71 -6 -280 270 -107
6088 -107 -109 -174 -132 -30 -45 -85 200 -36 -110 115 -42 56 62 -317 31 114 -297 -253 189 -222 60 60 -179 44 -100
6113 -100 -306 459 -202 -72 73 115 105 170 -305 -24 -13 -119 291 -210 -36 -60 -211 -286 -50 -128 0 197
6135 197 -6 264 -159 -141 -40 -55 -242 58 -217 100 -160 -102 14 -169 -267 45 -18 -251 -57 -186 -53 -8
6157 -8 1 304 -12 -55 368 100 28 43 -280 -58 -127 -232 6 50 -220 -202 -109 59 166 11 63 -4 -92 72 90
$$ packed form
5998A84l88k8R8M0J17k49K78j4J37j70P3m0LM8L9k50K35m2j72J15k08L97K3m89
6022b63L68l50J77L3J49m05K88j06L06J2k52J47j05l25K6L67%K47n97L87j52k04
6044b52M09j35j68K48j79J41l28p7K18L70k97J85j43q5J01O9J2j40j24jJ33j91
6066b34L29J95m38M58m47J42q5n4j71N22j77J34j13k54M40k61N6K9p7k74N50l77
6088a07ko5M2J02j5m0K85k36p4K25j57R8Ol79L48Q3m11M4M42m11K82%k39K23j44
6113a00k06P65o61J30J45M2j0O5m75K81J1j06M10n01J74k4j51p5K36p8J28J97
6135A97k03K70m23J8J01j5j87L00k75L17k60N8J16j83r8L12o3k33J94j29J33M5
6157hRL03l16m3M23k68p2J5l23K22o9j05K38M4k70J8R3J68J07j55N2o7q8J64J8
$$ plain form
6182 90 -120 -58 -148 -197 351 -47 -151 136 -51 -112 182 124 -133 -21 -412 197 74 -74 161 144 127 67 175
6205 175 175 434 -230 135 34 110 106 -198 -38 79 -100 -162 197 -246 57 278 -309 -31 -88 -151 -111 -23 -105 114
6229 114 60 -9 199 -72 129 106 185 -200 -31 -165 -47 -57 75 -40 -103 35 64 -123 10 -5 -76 50 -216
6252 -216 6 266 -52 172 210 18 -44 50 -24 29 63 -219 128 26 -89 144 36 38 146 -195 -59 106 -145
6275 -145 -146 -67 -192 381 93 142 73 -88 -44 134 394 73 -59 147 51 116 146 -93 92 -152 282 -85 -56
6298 -56 65 -152 194 251 -121 -46 -486 2 194 -127 -74 144 -47 258 15 -332 399 -21 183 191 -286 -74
6320 -74 296 -32 -159 -149 -403 290 54 -198 188 -113 -242 -99 -155 97 -169 -223 213 -210 -178 142 -136 -203
6342 -203 21 -38 51 83 -7 127 -176 -194 172 51 -91 -120 179 47 60 146 27 123 -211 48 38 -132 2
$$ packed form
6182I0k10O2r0m9N48l98j04K87j87o1K94n8k57J12l91O09j23j48K35j7j7o0J08
6205A75%K59o64L65j01P6ml04J60J17j79o2L59m43L03K21n87K78n7o3M0Q8q2K19
6229A14n4o9K08k71K01k3P9l85J69j34J18j0J32j15o3J38K9j87J33j5p1J26k66
6252b16K22K60l18K24L8j92o2R4p4N3L4k82L47j02j15K33j08KJ08l41J36J65k51
6275a45jP9j25N73k88M9o9j61M4J78K60l21j32K06r6O5L0k39J85k44M34l67K9
6298e6J21k17L46N7l72P5m40M88J92l21N3K18j91L05k43l47P31m20K04Qm77K12
6320g4L70l28j27J0k54O93k36k52L86l01j29J43n6K52k66n4M36m23L2L20k78o7
6342b03K24n9Q9L2r0J34l03j8L66j21j42k9K99j32J3Q6j19R6l34K59j0j70J34
$$ plain form
6365 2 -88 -73 224 -72 -14 182 -24 196 -75 -56 -28 284 -196 42 -49 -10 9 -75 60 -32 -9 -39 364 -283 52
6390 52 230 -61 323 14 -143 10 -177 243 -105 213 112 121 -176 206 -115 -114 405 118 -118 214 57 425
6412 425 186 -379 -215 193 -27 -229 -73 -122 215 88 -125 -71 -59 -2 269 -25 76 -14 -61 45 83 -83
6434 -83 285 -56 325 92 -109 -67 -22 -139 239 -52 -253 120 -52 305 256 -339 136 -83 282 149 -5
6455 -5 -123 167 -30 -77 418 -35 -303 -59 -199 -86 25 33 47 105 71 122 -16 -301 -146 -102 41 -256 -193 -222
6479 -222 -123 -438 48 -195 -392 149 -15 340 -345 -247 -138 -143 82 -92 80 -49 -33 -147 -46 19 -213 48
6501 48 196 -75 179 -90 105 57 -135 76 -64 -230 -165 -223 -136 40 -60 -111 99 37 50 434 -133 -82 144
6524 144 -53 -6 120 37 -129 -181 33 162 82 -268 140 18 -47 121 -118 88 164 70 -123 232 -230 -8
$$ packed form
6365Br0J5K97k96N8J96k06K20k71J9K8L12m80K38r1L9J9q4J35r2K3l0M03o47L35
6390E2J78k91L84l09j57J53j87M20l48L18j01Rk97L82l21JN19k87k36L32j57L68
6412D25k39n65J64M08k20k02J56m9L37j27k13N4J2N7K71k94J01r0m7J06L8j66
6434h3L68l41L81k33k01M2M5j17L78k91k01L73j72L57m9n95M75k19L65j33j54
6455ej18K90j97m7M95m53k68K44j40J13J11QJ4N8l4N1j38k85J55M4J43k97O3k9
6479b22R9l15M86k43j97N41j64L55o85R8J09nK25j74J72j29J6j14J01O5k32K61
6501D8J48k71K54k69J95m8j92K11j40j66O5n8Q7J76j00n1K10o2J3L84n67N1K26
6524A44j97M7J26q3j66n2K14J29q0l50M08j22o5J68k39K06P6r4j93L55m62K22
$$ plain form
6546 -8 -337 57 312 -111 167 108 -26 34 -78 -324 160 148 93 301 -167 109 55 37 -113 259 -20 138 163
6569 163 27 160 -135 -16 -67 240 -216 -207 -126 178 114 -272 131 45 -113 -97 -183 163 202 -190 72 289 -346
6592 -346 -210 -190 -24 24 179 -67 49 -24 130 110 -146 171 124 18 161 -99 -122 -10 -23 17 48 -136 -28
6615 -28 69 -106 92 53 -217 -124 -144 -133 142 -5 95 -69 -107 -229 223 235 190 59 136 142 -79 -45 136 56 -217
6640 -217 -27 -341 -3 39 23 246 157 277 -18 103 -18 79 262 74 144 -185 102 207 -39 62 11 38
6662 38 -122 -165 142 33 62 230 -62 -153 -68 -42 207 144 28 90 69 -16 -140 -132 -75 23 -120 -120 23 -84 -286
6687 -286 169 -195 -89 89 -48 -374 -25 -316 65 73 -53 278 -50 -103 156 55 182 -16 -247 15 -134
6708 -134 -312 -165 -133 -167 316 23 -162 300 -157 -34 80 42 348 -325 25 -63 -52 173 240 88 194 65
$$ packed form
6546hl29L94K55m23K78n9j34O0j12k46M84j2n5K08m68K76n4j8j50L72k79J58K5
6569A63j36J33k95J19n1L07m56RQ1L04o4l86M03q6j58J6q6L46L9l92K62K17o35
6592c46J36K0J66M8J55k46J16p3J54k0k56L17m7j06J43k60k3J12j3M0L1j84J08
6615b8R7j75J98l9k70R3k0J1K75j47J00j64l8j22M52J2m5j31P7Ok21L4J81q0k73
6640b17J90l14L38M2j6K23q9J20k95J21j21R7J83j88P0l29K87J05k46J01n1K7
6662C8j60m3L07j09K9J68k92r1Q5K6K49o3j16O2k1q5j24QN7R8j43%J43j07k02
6687b86M55l64J06J78j37l26L49k91L81Qj26L31l28n3K59j01J27j98k31K62j49
6708a34j78J47L2l4M83k93j85M62m57J23J14l8L06o73L50q8J1K25O7j52J06j29
$$ plain form
6730 65 -132 65 -154 -159 -74 -195 -384 -2 -82 359 152 -56 -168 128 -207 -318 136 -66 -121 -64 30 -58 67
6753 67 209 -11 -225 77 26 10 -11 -103 58 228 -11 -22 -40 -46 -162 -187 -269 86 -137 -224 264 -61 -31 -29 -12
6778 -12 -194 31 15 -70 269 -35 216 32 -35 -190 -175 -178 106 49 -81 77 -248 571 84 -123 56 -3 -87
6801 -87 131 -7 -138 155 54 62 5 -299 -8 49 -248 -156 252 -122 -192 -276 -123 -170 -39 20 -66 -115 50 281
6825 281 98 208 51 -20 208 -254 353 68 -135 104 151 73 205 109 0 194 -87 -243 286 4 -80 94
6847 94 -15 59 144 -116 -57 16 -89 -120 -35 54 -91 -49 301 101 -210 144 -60 -41 93 -253 121 -47 86
6870 86 -148 310 99 166 95 -84 117 44 169 -56 -96 24 71 19 30 117 164 127 -43 3 150 102 -176 64
6894 64 84 114 -61 -57 30 -71 -174 39 11 148 266 15 -7 -126 -143 95 -27 -107 -104 199 115 -126 288 98
$$ packed form
6730F5j97J97k19nQ5j21j89L82q0M41k07k08j12K96l35j11M54k02n5N7R4q8J25
6753F7J42k20k14L02n1j6k1r2J61J70k39j1j8oj16k5q2L55k23q7M88l25L0KJ7
6778a2j82K25j6q5L39l04K51j84o7j55J5lK84n7j30J58l25Q19m87k07J79n9q4
6801h7K18j38j31K93j01Qn7l04K91N7k97R2M08l74p0q4J53m7J31N9q6m9J65K31
6825B81j83J10j57p1K28m62O07k85k03K39M7p8J32r6j09J94k81j56N29k82q4J74
6847I4j09P4Q5k60N9P3j05l1Q5Q9j45M2L50k00l11L54k04J9J34l46L74j68J33
6870H6k34M58k11O7p1j79K01p3J25k25m0J20M7n2J1Q7M7l7j70M6J47m8k78K40
6894F4K0L0j75MQ7j01j03K13k8J37J18k51k2j19j7K38j22q0LL03q4k41M14j90
$$ plain form
6918 98 62 -106 -32 83 -119 -14 222 -25 -42 -125 49 183 17 -52 75 -268 -343 76 -131 3 18 -18 29
6941 29 23 95 -106 -38 -19 137 -179 -95 251 -267 55 6 -265 47 43 -110 -71 -84 344 426 -35 -118 388 90 -73
6966 -73 90 -212 -67 -125 22 132 -40 -128 -49 -56 284 226 104 356 -374 50 116 -241 -12 5 110 121 217 -165
6990 -165 -131 110 7 94 53 -247 292 18 -173 70 140 -42 142 137 -41 117 -262 160 -74 7 -8 -160 39
7013 39 91 -105 -7 131 26 276 -144 65 -159 -2 -305 161 -173 -116 -55 323 -194 -108 68 -47 224 -364
7035 -364 -122 -171 378 17 -103 68 72 -146 144 98 -71 214 45 -133 -39 -61 127 154 -48 94 119 144 -152
7058 -152 40 -52 -231 -35 -24 163 -66 -138 -18 175 146 -165 -161 -1 -15 111 138 -337 -17 13 62 140 -169 -124
7082 -124 104 -121 -292 -65 36 161 74 227 15 -182 -179 57 120 -339 -67 122 -101 94 -196 -113 -145 7
$$ packed form
6918I8l6j68P4J15k02J05K36k47j7q3J74J34j66o9J27l43p5M19k07J34J5l6M7
6941B9oP2k01O8J9J56l16Q4L46n18L22m9k71L12mj53L9j3M28Q2m61q3N06k98j63
6966g3J63l02J45n8J47J10j72q8P9pL40n8j22K52p30M24O6l57K29J7J05J1R6l82
6990a65L4K41j03Q7m1l00N39k74j91K43P0j82J84nj78J58l79M22k34Q1j5j52J99
7013C9N2j96R8J38j05K50m20K09k24J57l03M66l34N7O1L78n17Q6J76j15K71n88
7035c64K42m9N49l61j20J71Mk18K90m6j69K85j69j78R4k2J88K7k02J42K5K5k96
7058a52J92r2j79J96J1J87k29p2J20J93k9l11MJ60j4J26K7m75L20L0M9P8l09M5
7082a24K28k25j71K27J01J25q7J53k12j97LK36O3m59K72J89k23J95k90Q3l2J52
$$ plain form
7104 7 66 6 -71 7 -300 -217 2 -67 -8 21 36 -212 -213 -236 -125 -133 -75 -137 472 119 139 -147 -134 -105 -190 -40 -271
7131 -271 -164 -32 -43 -83 -118 -93 -153 -24 -241 -5 -96 -5 -19 485 102 32 -45 18 256 -22 121 -155 -302 -60
7155 -60 108 185 78 2 -229 95 -165 48 -276 21 39 86 25 -48 -16 33 117 104 -33 83 -86 -120 23 135
7179 135 118 48 51 9 -160 27 -259 205 -63 53 -358 57 24 -177 6 37 -25 15 62 -58 -93 -85 155 5
7203 5 -323 -8 34 17 124 -79 17 -78 -50 -50 281 -89 44 134 79 -165 -267 73 -15 260 -34 -21 167 -250
7227 -250 -51 -159 37 65 11 165 -70 62 184 -23 -230 3 88 -34 5 40 -166 3 -161 -111 405 -5
7249 -5 111 31 -70 66 -161 93 91 8 -108 -69 -259 220 7 50 -125 -54 122 78 84 12 230 -169 9 5 -294
7274 -294 198 59 -240 150 -2 6 252 141 -163 150 -176 44 19 -22 -60 104 -178 24 -80 31 -60 -146
$$ packed form
7104GN9o0p7P8l07Q3K19o9N9K9J5k48jk3J11qN8o2O09l53K0k86J3K9q5J50k31
7131b71J07J32j1m0l5K5o0J29k17K36r1R1j4N04l83p0p7O3K38k78J43k76j47K42
7155f0J68P7j07p6k31L24k60K13l24K97J8M7o1p3L2M9Q4j3j37J16j69l4J43J12
7179A35j7p0Lm2j69J87k86M64k68J16m11M15l3k01J83L1o2M0M7j20l5QK40j50
7203El28L15M2j7J07k03R6r5K8%L31l70J33R0n5k44j02L40q8K75k94J3J88m17
7227b50J99j08J96K8n4J54k35J32J22k07k07K33Q5j22L9L5k06J69j64N0N16m10
7249eJ16q0j01J36k27K54kq3j16L9j90M79k13M3j75P1J76m4Op2K18l99J78mk99
7274b94M92j39k99L90j52QK46j11l04L13l26K20k5m1l8J64k82K02j04J11r1q6
$$ plain form
7296 -146 56 230 -115 -67 -95 84 36 -62 111 76 -167 49 164 -169 27 -38 -395 197 182 24 -310 -243 -274
7319 -274 -52 -37 -180 -102 98 194 -205 -152 51 141 -161 -180 -41 -81 93 49 111 -37 -96 -82 -229 -70 279 -4
7343 -4 282 174 -141 64 -45 -6 48 164 -88 137 -19 -44 -52 -19 131 201 -92 -19 224 -203 185 -112 -235
7366 -235 14 23 63 -57 20 -63 24 -235 322 12 149 -74 -284 -140 -55 -66 -71 -35 -40 78 66 -180 -226 1 -129
7391 -129 363 38 -52 97 -234 104 203 -200 -95 -137 -243 37 -165 -62 298 138 265 40 -269 57 192
7412 192 -47 -108 63 -146 -71 235 -38 -41 14 -208 102 186 113 122 -145 -27 216 -134 -40 26 64 147 35 -427
7436 -427 202 -172 -75 34 12 135 -38 -271 -58 93 -171 -244 -91 -96 -291 107 370 169 80 110 -170 -28
7458 -28 238 -104 38 117 -35 89 142 -176 322 -73 -28 -4 125 -67 163 -173 54 -25 -48 -8 329 -65 -225
$$ packed form
7296a46K02J74l45M8k8J79m8r8J73l5k43K16J15l33J96o5l57N92j5j58l34O7l1
7319b74K22J5j43P8K00R6l99N3K03R0l02j9J39m0J74m4O2j48n9J4j47J59L49k83
7343dK86j08l15K05j09L9N4J16k52K25j56k5qL3J50P0k93P3K43m27L88k97j23
7366b35K49RM0j20P7q3Q7k59N57l10J37k23k10J44Q5j1nL6nJ18j2k46m6K27j30
7391a29M92l25r0J49l31L38R9m03J05m2j06K80k02J03L60j60J27k25l09L26J35
7412A92k39o1J71k09P5L06k73lN5k22L10Q4p3Rk67J18K43l50R4O6L8Q3j12m62
7436d27O29l74R7J09k2J23j73k33K13J51k64p3J53nj95L98K63k01q9L0k80J42
7458b8K66l42J42P9j52J24N3l18M98l95M5K4J29j92K30l36K27p9k3M0L37l94j60
$$ plain form
7481 -225 95 -2 5 -248 248 267 -316 408 -64 85 331 11 -234 -62 -133 60 -201 -134 -34 63 141 26 -45
7504 -45 -5 -93 282 31 216 38 -158 -2 47 2 103 -223 211 48 106 77 -13 -192 -142 144 65 85 68 53
7528 53 94 -413 144 -23 -216 -45 -99 -21 13 -128 -179 144 -161 -6 -221 70 -3 168 85 15 -6 40 287 42
7552 42 28 124 3 229 -203 -178 183 -65 -45 46 -8 -45 -134 -125 20 -95 -225 -30 -271 -56 47 -81 118 101
7576 101 24 194 -10 59 74 60 35 228 -60 -235 51 33 105 82 -81 140 249 -304 36 -172 185 208 178
7599 178 185 53 -146 -147 73 88 -74 147 -5 134 -31 -59 -71 229 -240 68 -20 -3 75 -13 196 390 -118 152
7623 152 -77 36 -22 -19 345 198 116 -45 15 -87 277 -55 106 8 -301 -58 -123 -136 -17 -95 -157 44 214
7646 214 -56 -42 -164 -23 -50 -69 -110 -14 -179 124 52 -128 51 -91 -186 -38 17 130 186 -123 -52 13 -82 166
$$ packed form
7481b25L20r7Pk53M96J9n83P24m72J49K46l20k45J72p1J93k61O7J00R7P8j15p1
7504d5M0q8L75k51J85j78j96J56M9m5J01l26M34j63N8k9r0j79N0K86p9K0j7j5
7528E3M1n07N57j67j93J71n4P8L4j41n1L23l05J55k15K91p3J71q3p0k1M6K47k45
7552D2j4R6j21K26m32K5L61k48K0R1n4l7q9RJ45j15j30J95k41K15J03j28J99j7
7576A01p7J70k04O9J5j4k5J93k88j75K86j8P2k3j63K21J09n53L40k08L57K3l0
7599A78Pj32j99jK20J5j62K21j52J39j65k8j2L00m69L08q8J7P8q8K09J94n08K70
7623A52k29J13n8LL64j47q2j61O0j02L64l32J61r8l09K43o5j3J19p8o2K01J70
7646B14k70J4j22J41k7j9m1R6j65L03p2j80J79j42r5J48N5J13N6l09P1O5r5K48
$$ plain form
7670 166 75 -51 39 -108 127 69 -354 17 33 136 100 89 -157 142 105 6 137 135 91 12 -190 151 152 -51 38
7695 38 123 -295 -60 -123 -140 226 -34 -84 142 96 197 533 -32 -100 105 201 74 142 -218 -63 -204 -141 57
7718 57 -466 219 -58 30 61 212 -124 44 76 45 232 180 95 82 -175 62 24 -110 -265 -68 110 123 -8
7741 -8 98 -10 -48 223 99 -147 132 -50 -49 141 -2 -216 -55 99 -148 246 -340 -95 -12 -114 150 -34
7763 -34 -164 77 -77 -69 -24 -213 -59 -12 79 89 -239 -383 17 -2 -443 -24 -191 -113 267 -2 271 160 223
7786 223 83 -203 77 41 41 -61 256 -175 271 -39 33 33 201 -132 216 -242 -281 148 -192 -103 65 41 -39
7809 -39 44 -56 -152 -167 90 186 -156 -146 24 97 -37 120 -237 299 221 -108 247 47 80 -197 -80 -190 143
7832 143 -386 201 138 -8 -14 -36 -138 162 91 216 -152 -158 67 203 -81 272 92 -178 53 -82 -55 -84 151
$$ packed form
7670A66r1j26R0j47K35n8m23L71J6J03l6j1k46K99l7r9J31km4p9k02L41Jk03Q9
7695C8Q5m18K35o3j7L66k60n0K26m6J01L36n65o8K05R6j27O8l60J55j41O3J98
7718E7n23O85k77Q8L1J51l36J68L2l1J87n2q5j3k57K37l8j34j55J97J78J3j31
7741hJ06j08l8K71j24k46K79j82JJ90j43k14J61J54k47L94n86K45Q3j02K64j84
7763c4j30K41j54QM5j89J54M7R1J0l28j44M00j9m41M19j67P8L80k69K73j11O3
7786B23j40k86K80l6%j02L17m31M46l10P2%J68l33L48m58l9M29l40Q9J68k4q0
7809c9Q3j00r6j5K57R6l42J0J70P3j34J57l57N36p8l29L55k00L3k77J17j10L33
7832A43n29N87o3j46ok2j02L00p1J25l68oK25J36k84L53j80k70K31j35K7k9K35
$$ plain form
7855 151 19 334 -133 -52 251 -20 -122 -45 -131 214 -62 26 -251 42 9 25 -162 119 111 -282 97 -6 -55
7878 -55 -229 71 -18 29 -61 208 122 -154 68 40 -82 -36 86 16 200 -74 -111 -147 -283 19 58 -112 -315 -144
7902 -144 -47 32 37 -168 257 -122 -65 -15 -96 2 280 -56 67 -49 -278 208 -89 -2 73 -133 265 -68 -10 -121
7926 -121 131 -1 -37 -56 4 165 -25 264 26 -50 -365 52 -65 -2 44 39 289 17 72 -195 -14 170 95
7949 95 118 152 42 -131 -50 1 28 83 196 236 32 -123 276 127 100 175 66 108 211 14 -141 209 -14 -32
7973 -32 -110 -57 101 254 101 -42 -94 146 198 -392 -22 71 -10 85 0 -192 183 27 51 147 41 -45 100 75
7997 75 28 79 99 113 -20 71 100 -9 -128 199 216 123 202 -170 -136 86 29 -86 241 -86 87 92 -19 -45 -23
8022 -23 78 186 -96 -57 -46 32 31 22 -180 95 34 -29 79 252 467 -249 -414 57 150 70 130 125 246 -79 -78 -283
$$ packed form
7855A51j32L15m67Q1L03k71j02P7q6L45k76Q8k77K93l3J6j87K81ql93L79j03m9
7878e5j74L00q9M7r0K69q6k76K22k8j22M6J22p0J84k74l7l6j36L02L9j70k03J71
7902a44R7P9Nk05M25l79N7N0q1R8K78l36J23j16k29M86k97Q7P5k06L98l33N8j11
7926a21K52j32l6j9O0J61j90K89k38p6l15M17j17O3M6nK50k72N5k67J81J84p5
7949I5K3L4j10j73Q1N1K7N5J13M0k04j55L99j49k7P5j09M2J03j97j55L50k23j8
7973c2p8N3J58J53j53j43n2K40N2n90L70R3q1R5q5j92L75j56K4R6j06q6J45k5
7997G5m7N1K0J4j33R1K9j09j19L27J7r3P9l72L4K22n7j15L27l27J73Nj11k6K2
8022b3J01J08k82L9J1P8jrk02K75o1o3J08J73K15p16j65M71R3q0O0nJ21l25Jk05
$$ plain form
8048 -283 -69 84 -52 -134 -37 165 232 21 -55 -54 81 -98 133 29 -265 -207 38 128 39 17 -51 -51 245 -18
8072 -18 8 21 -112 -142 40 0 44 -60 43 10 253 101 23 -20 226 94 8 11 27 -216 -105 -136 132 10 -209
8097 -209 83 77 -288 49 92 -16 3 -35 5 125 147 -211 102 150 159 -44 173 203 20 -14 -42 5 -141 40 96
8122 96 -81 144 -109 -312 -14 -6 -74 -22 -109 287 -27 -97 42 51 -11 -76 207 -93 -226 34 -114 108 22 -221
8146 -221 -184 -28 42 -173 184 488 -67 117 216 55 -24 119 -169 356 -115 140 26 92 235 41 165 132
8168 132 170 -282 105 175 46 122 13 -61 36 -40 107 279 -164 212 -105 -83 -104 271 114 57 179 92 19
$$ packed form
8048b83K14J53j36q2R7K02O7k11p6JJ35j79K31j04k94N8K45R0q9k2o8%K96k63
8072a8K6J3j33l0J82m0M4j04J03l3K43j52p8m3K46j32q6LJ6k43J11l1K68j22k19
8097b09K92ol65L37M3j08J9l8M0J20K2l58L13M8Rk03K17L0j83l4k8M7j46J81N6
8122I6j77K25k53k03K98Qo8N2q7L96l14p0J39Ro2o5K83l00j33K60j48K22q6k43
8146b21L7J56P0k15L57L04n55J84R9j61p9J43k88N25m71K55j14O6J43j94J24l3
8168A32L8m52L87P0j29P6j09p4R7p6J47J72m43L76l17K2k1L75j57n7J22q7p3
8191A9
$$ Imaginary data points
##PAGE= N=2
##DATA TABLE= (X++(I..I)), XYDATA
$$ plain form
0 0 0 0 0 0 0 0 8 -8 8 -8 16 -16 24 -32 40 -48 56 -72 88 -104 128 -152 178 -209 248 -289 337 -389 449
29 449 -517 590 -670 766 -865 976 -1102 1240 -1387 1549 -1730 1926 -2142 2375 -2633 2909
45 2909 -3215 3547 -3914 4311 -4750 5231 -5765 6356 -7010 7745 -8573 9514 -10591 11847
59 11847 -13319 15086 -17246 19961 -23491 28282 -35196 46106 -65970 113931 -477029 -315793
71 -315793 244484 -626978 -533571 -161781 97011 277426 162122 -79610 417429 687579
81 687579 190774 -136002 273090 405804 57735 -201620 -189366 17536 188702 -244554
91 -244554 -451667 94649 204699 -266943 -281306 -62257 83440 53551 -295319 -291771 194364
102 194364 200670 -139405 -109985 206597 358800 153848 -31609 172117 353732 151592
$$ packed form
0@%%%%%%Qj6J6j6K4l2M0n6P2q8J04j28J60j92K32k80L30l87M57n37O26p26Q38
29D49r66J107j260J436j631J841k078K342k627K936l279L656m068M517n008N542
45B909o124O762p461Q225r061R981j0996J2121j3366J4755j6318J8087k0105K2438
59A1847k5166K8405l2332L7207m3452N1773o3478Q1302j12076J79901n90960J61236
71c15793N60277q71462R3407L71790K58792J80415j15304k41732M97039K70150
81F87579m96805l26776M09092J32714l48069k59355J2254K06902J71166m33256
91b44554k07113N46316J10050m71642j4363K19049J45697k9889l48870L548M86135
102A94364O306l40075K9420L16582J52203k04952j85457K03726J81615k02140
$$ plain form
112 151592 -149673 -124113 117021 29959 -300272 -336170 -116865 53903 -99581 -379604
122 -379604 -92479 313144 54917 -166297 44243 194052 247747 70359 -199876 64460
132 64460 341040 96 -252409 -13665 194248 59324 -161848 -128626 70774 134901
142 134901 -54963 -261548 -54982 211389 -48524 -271673 -53530 112501 90229 -59478
152 -59478 -159150 124877 285102 -17691 -120310 91130 184489 79171 -128732 -122231 111749
163 111749 86730 -151595 -185496 5742 124881 -47980 -192707 -5593 153557 56637
173 56637 -97678 -83041 138744 157742 -97758 -103756 78306 106822 24146 -125345 -77057
184 -77057 169760 71506 -168967 -66709 89635 68324 -53060 -141853 147 135061 -6267
$$ packed form
112A51592l01265K5560K41134q7062l30231l5898K19305J70768j53484k80023
122c79604K87125M05623k58227k21214K10540J49809N3695j77388k70235K64336
132F4460K76580l40944k52505K38744K07913j34924k21172L3222J99400O4127
142A34901j89864k06585K06566K66371k59913k23149K18143J66031k2272j49707
152e9478r9672K84027J60225l02793j02619K11440R3359j05318k07903O501K33980
163A11749k5019k38325l3901J91238J19139j72861j44727J87114J59150r6920
173E6637j54315J4637K21785J8998k55500n998J82062K8516q2676j49491M8288
184g7057K46817r8254k40473J02258J56344k1311j21384q8793J42000J34914j41328
$$ plain form
195 -6267 -133769 -35836 124168 88673 -98800 -67462 106605 95875 -15201 -91891 -19671
206 -19671 141661 22634 -161796 -28833 85944 18438 -57771 -103007 18039 127407 -32165
217 -32165 -117644 24908 104801 37731 -76924 -50961 95303 74041 -54823 -72650 15053
228 15053 99952 1055 -127601 -8645 92229 6421 -61984 -66644 33527 102304 -52116
239 -52116 -104044 50021 78570 -410 -58498 -38104 84668 67424 -73974 -55096 49814
250 49814 71095 -16328 -99409 2239 92562 -8320 -74556 -33127 42306 69292 -52451
261 -52451 -86934 58475 71443 -23437 -50068 -16385 74570 49853 -83550 -40226 67250
272 67250 39099 -33534 -68153 7412 81432 -13662 -76351 -2706 51322 38074 -46963 -63184
$$ packed form
195f267j27502R7933J60004l5495j87473L1338J74067j0730j11076p6690P2220
206a9671J61332j19027j84430J32963J14777o7506p6209m5236J21046J09368j59572
217c2165q5479J42552P9893o7070j14655K5963J46264k1262j28864j7827Q7703
228A5053Q4899r8897j28656J18956J00874q5808o8405m660J00171O8777j54420
239e2116n1928J54065K8549p8980n8088K0394J22772j7244j41398J8878J04910
250D9814K1281q7423q3081J01648R0323j00882o6236M1429P5433K6986j21743
261e2451l4483J45409J2968r4880k6631L3683R0955k4717j33403M3324J07476
272F7250k8151p2633l4619P5565P4020r5094o2689P3645N4028j3248q5037j6221
$$ plain form
284 -63184 60449 62457 -46449 -45347 10716 55249 21171 -77629 -23996 75244 17945 -46772
296 -46772 -36787 22119 67391 -21904 -75101 22430 56547 528 -46887 -36332 54316 46693
308 46693 -58744 -37731 34900 41564 1842 -61760 -9624 79001 6284 -60308 -14282 33377
320 33377 42689 -29273 -67414 31967 56631 -22422 -44155 -11615 49709 38527 -60196 -35783
332 -35783 53128 32799 -24364 -50385 797 67319 -5306 -67720 -102 42786 25307 -27128
344 -27128 -49645 38927 63594 -29089 -41174 11931 44108 20426 -59274 -33015 54685 15189
356 15189 -46051 -35141 7365 46635 -7747 -60905 11150 52181 9186 -26091 -24730 40257
368 40257 50110 -37587 -35526 28334 29883 -1144 -43093 -17797 52875 8731 -47684 -11490 20914
$$ packed form
284f3184J23633K008j08906J102N6063M4533l4078r8800N3633R9240n7299o4717
296d6772R985N8906M5272q9295n3197R7531L4117n6019m7415J0555R0648p623
308D6693j05437K1013P2631O664l9722o3602N2136Q8625p2717o6592M6026M7659
320C3377R312p1962l8141R9381K4664p9053k1733L2540O1324j1182r8723K4413
332c5783Q8911k0329n7163k6021N1182O6522p2625o2414O7618M2888j7479n2435
344b7128k2517Q8572K4667r2683j2085N3105L2177k3682p9700K6259Q7700l9496
356A5189o1240J0910M2506L9270n4382n3158P2055M1031m2995l5277J361O4987
368D0257R853q7697K061O3860J549l1027m1949K5296P0672m4144n6415L6194L2404
$$ plain form
381 20914 26908 -13915 -52301 15103 45288 -21557 -35632 -3709 27922 24486 -35673 -23542
393 -23542 43956 27866 -13218 -21012 8695 50128 1073 -47825 3864 29426 2142 -26290
405 -26290 -39138 17074 34673 -37576 -33558 18006 21377 7808 -27299 -16138 46582 20476
417 20476 -31910 -10549 21215 29411 -6796 -36401 12308 33375 -4965 -21422 -15645 20526
429 20526 26352 -35172 -27580 23642 8416 -10343 -22817 -14766 34603 9145 -37789 2925 27560
442 27560 11522 -1802 -19147 12027 35458 -9337 -24349 2219 17839 7431 -29921 -18205
454 -18205 24427 4799 -16128 -12020 -2178 28438 3120 -35809 10452 26941 -6906 -7214 -11105
467 -11105 5956 28258 -16282 -26040 19521 15398 -7075 -14425 -5476 20157 5783 -19288 -6817
$$ packed form
381B0914N994m0823l8386O7404L0185o6845j4075L1923L1631l436o0159J2131
393b3542O7498j6090m1084p794K9707M1433m9055m8898N1689K5562k7284k8432
405b6290j2848N6212J7599p2249M018N1564L371j3569l5107J1161O2720k6106
417B0476n2386K1361L1764Q196l6207k9605M8709K1067l8340j6457N777L6171
429B0526N826o1524P592N1222j5226j8759j2474Q051M9369k5458m6934M0714K4635
442B7560j6038j3324j7345L1174K3431m4795j5012K6568J5620j0408l7352J1716
454a8205M2632j9628k0927M108R842L0616k5318l8929M6261J6489l3847l08l891
467a1105J7061K2302m4540r758M5561m123k2473p350Q949K5633j4374k5071J2471
$$ plain form
480 -6817 8124 15979 -5354 -26436 13513 22853 -14200 -6517 960 4545 18674 -16465 -20820
493 -20820 23169 4797 -16970 -3423 -3873 11133 8047 -21368 -748 19710 2451 -6897 -5838
506 -5838 9844 14543 -9560 -7584 4017 4625 7140 -15895 -12535 21703 -2545 -17953 6228
519 6228 -2527 3465 9886 -20466 800 23700 -9389 -9088 7878 1817 6192 -1171 -9055 6657
533 6657 8615 -1252 -9736 -1989 14572 -4923 -14247 7408 -2150 -3620 6676 -15773 -899 19426
547 19426 -12591 -6484 14003 -3206 4458 4774 -9338 9913 8747 -9420 -287 2513 1569 -358
561 -358 -8855 14 2307 -3568 -152 -7510 810 10738 -10231 -2894 11390 -5195 3743 5382 -10949
576 -10949 10865 8114 -13976 5381 5796 -7408 5298 -3782 -6958 8290 -2046 -7760 625
$$ packed form
480f817J4941P855k1333k1082L9949R340l7053P683P477L585J4129l5139m355
493b0820M3989j8372k1767J3547m50J5006l086k9415K0620K0458j7259r348J059
506e838J5682M699k4103J976J1601O08K515k3035L360L4238k4248j5408K4181
519F228q755N992O421l0352K1266K2900l3089L01J6966o061M375p363p884J5712
533F657J958r867q484P747J6561j9495r324K1655r558j470J0296k2449J4874K0325
547A9426l2017O107K0487j7209P664L16j4112J9251j166j8167R133K800r44j927
561c58q497Q869K293n875L416p358Q320R928k0969P337J4284j6585Q938J639j6331
576a0949K1814k751k2090J9357M15j3204J2706r080l176J5248j0336n714Q385
$$ plain form
589 625 1576 1410 -4529 -975 6060 -3006 2723 3644 -8401 9352 7098 -13739 6997 7138 -10744
604 -10744 6363 -286 -10317 9451 -1882 -11392 6059 -396 -4486 2304 -2754 1150 3158 -341
618 -341 2731 -717 4707 4958 -6038 4926 4649 -8277 4985 -398 -10366 7632 -3156 -11713
632 -11713 7990 -2806 -7140 7562 -3633 -1648 9103 -3116 584 6414 -988 2445 1433
645 1433 -1084 1656 -2334 1006 -889 -6107 5254 -1705 -8295 7151 -2016 -6317 8489 -4604
659 -4604 -4488 10021 -5620 -3169 8740 -4481 426 5660 -3758 2707 3324 -2531 1703 -572 464
674 464 190 -5597 1811 -957 -6090 3824 -3096 -4087 8321 -4422 -2910 10151 -3634 -573 8155
689 8155 -4653 1587 5436 -6204 1528 2087 -4393 1443 -2204 -1847 2449 -3423 59 1359 -2751
$$ packed form
589F25R51j66n939L554P035r066N729R21j2045J7753k254k0837K0736J41j7882
604a0744J7107o649j0031J9768j1333r510J7451o455m090O790n058L904K008l499
618c41L072l448N424K51j0996J0964k77j2926J3262n383r968J7998j0788q557
632a1713J9703j0796m334J4702j1195J985J0751j2219L700N830p402L433j012
645A433k517K740l990L340j895n218J1361o959o590J5446r167m301J4806j3093
659d604J16J4509j5641K451J1909j3221M907N234r418O465O17n855M234k275J036
674D64k74n787P408k768n133R914o920r91J2408j2743J512J3061j3785L061Q728
689H155j2808O240L849j1640P732N59o480N836l647L57M296n872L482J300m110
$$ plain form
704 -2751 3684 -1198 -3147 6416 -2263 -2086 6522 -4064 431 5908 -6337 2285 5032 -6253 2206
719 2206 1645 -5228 2818 -2033 -3982 2967 -2827 -927 1779 -2709 3688 1063 -2655 5557 -76
734 -76 -944 5201 -3616 824 4710 -6535 974 2970 -6547 1922 -99 -5801 4276 -1155 -4417
749 -4417 4475 -1038 -606 3111 -2057 3160 2363 -2727 3498 322 -1074 3766 -4026 -444 3770 -5632
765 -5632 -427 1482 -5069 2981 -248 -5767 5344 77 -3515 4106 -701 789 4261 -3691 1262
780 1262 3416 -2881 1642 -1146 -1869 4141 -3269 -2444 3702 -3351 -71 870 -5261 3724 1482 -5175
796 -5175 3426 672 -1162 4818 -3024 110 6433 -2819 -569 2659 -1868 2171 -1674 -4390 3245
811 3245 -1770 -3647 878 -3329 1713 2376 -5270 2970 3679 -2472 3138 -320 -347 6002 -2821 -2197
$$ packed form
704b751O435m882j949R563q679J77Q608j0586M495N477j2245Q622K747j1285Q459
719B206n61o873Q046m851j949O949n794J900K706m488O397k625l718Q212n633
734g6q68O145q817M440L886j1245P509J996r517Q469k021n702J0077n431l262
749d417Q892n513M32L717n168N217p97n090O225l176j396M840p792L582M214r402
765e632N205J909o551Q050l229n519J1111n267l592P621m807J490L472p952M953
780A262K154o297M523k788p23O010p410Q25O146p053L280R41o131Q985k242o657
796e175Q601k754j834N980p842L134O323r252K250L228m527M039l845k716P635
811C245n015j877M525m207N042O63p646Q240P09o151N610l458k7O349q823O24
$$ plain form
827 -2197 4702 -2057 -673 137 -4463 2909 523 -5752 1314 449 -912 1568 -4014 910 4168 -3321
843 -3321 717 1970 -918 4591 -1452 -3016 5792 -354 -2665 1363 -3018 1362 1389 -6879 1005 2398
859 2398 -3624 892 -1517 -820 4991 -2218 -1624 4142 -375 1822 178 -2847 4681 605 -4069 2175
875 2175 -887 -244 1690 -5275 142 3946 -4060 -384 505 -1546 3881 -1934 -3338 5323 516 -1506
891 -1506 2190 -1007 2670 2072 -4305 1222 1904 -2035 388 -3086 -537 3600 -4180 -1796 2553 -1450
907 -1450 1739 -282 -3057 5521 1017 -3128 3064 -361 467 2699 -4262 210 4167 -3210 -860
922 -860 527 -1124 2767 -2720 -2796 3307 -912 -1028 35 -2667 3355 1539 -3835 2836 1507 -411
938 -411 2986 -2304 176 4989 -3721 -1681 2399 -2838 368 -885 -4602 2253 526 -3377 1131
$$ packed form
827b197O899o759J384Q10m600P372k386o275P066q65j361K480n582M924L258p489
843c321M038J253k888N509o043j564Q808o146k311M028m381M380K7q268P884J393
859B398o022M516k409O97N811p209N94N766m517K197j644l025P528m076m674O244
875B175l062O43J934o965N417L804q006L676Q89k051N427n815j404Q661m807k022
891a506L696l197L677n98o377N527O82l939K423l474K549M137p780K384M349m003
907a450L189k021k775Q578m504m145O192l425Q28K232o961M472L957p377K350
922h60J387j651L891n487p6O103m219j16J063k702O022j816n374O671j329j918
938d11L397n290K480M813q710K040M080n237L206j253l717O855j727l903M508
$$ plain form
953 1131 294 1536 1951 -2418 2051 3037 -1666 1183 -1134 -820 3321 -3620 -2504 2936 -2158 -636
969 -636 810 -3342 2674 1825 -4052 2047 2073 -1825 1752 -1092 -482 3249 -1640 -810 1197 -528 1436
986 1436 -1220 -1834 2786 -1341 -1811 1010 -2627 1032 1442 -4346 1895 2606 -2779 2569 822 -1303
1002 -1303 4353 -527 -2108 3143 -885 -1477 52 -2851 211 -236 -2875 188 -630 140 1454 -1849
1018 -1849 1866 3634 -1664 2097 1765 -1777 3212 -649 -3486 3079 -1099 -3354 1748 -1795 -677
1033 -677 1960 -2564 -30 2143 -770 499 -183 26 2066 -1394 -41 1781 -964 1499 -20 -2030
1049 -2030 3247 -285 -2452 2758 -1094 -1755 2124 -3115 -1613 2742 -2851 -811 1451 -1689 953
1064 953 647 -743 2270 737 72 1024 -1112 1102 460 -2502 1304 -519 -1986 1757 -1802 -1165
$$ packed form
953A131q37J242M15m369M469R86m703K849k317L14M141o941J116N440n094J522
969f36J446m152O016q49n877O099K6l898L577k844O10L731m889Q30K007j725J964
986A436k656o14M620m127m70K821l637L659M10n788O241P11n385N348j747k125
1002a303N656m880j581N251m028n92J529k903L062m47k639L063q18P70J314l303
1018a849L715J768n298L761l32l542M989l861k837O565m178k255N102l543J118
1033f77K637m524K534K173k913J269o82K09K040l460J353J822k745K463j519k010
1049b030N277l532k167N210l852o61L879n239J502M355n593K040K262l140K642
1064I53l06j390L013j533o65R52k136K214o42k962L806j823j467L743l559O37
$$ plain form
1080 -1165 3239 -2131 -796 2768 -1832 445 1726 -2642 1543 1311 -1868 907 326 -261 1296 -901
1096 -901 101 1182 -1038 1028 -489 -1158 2142 -1574 -1618 2363 -1868 -359 1905 -2344 1212 1795
1112 1795 -2684 1287 1784 -1526 1873 181 -1381 1521 -799 -978 436 -1113 128 -18 -1578 1243
1128 1243 -558 -872 1717 -1262 194 2076 -1778 941 1950 -1984 1247 799 -1845 1941 -31
1143 -31 -2349 1285 -965 -963 807 -1338 -64 652 -1087 618 -119 -277 1602 -1373 275 2134 -1240
1160 -1240 717 1135 -1983 1671 549 -2436 1464 -259 -1817 1324 -886 -1084 1586 -1343 -221
1175 -221 1139 -584 647 387 -484 1494 -391 -334 1143 -1014 503 619 -1791 853 525 -2199 1140
1192 1140 -466 -1386 1522 -1196 -1161 1797 -703 -130 1299 -732 811 681 -1261 1082 138 -209 740
$$ packed form
1080a165M404n370J335L564m600K277J281m368M185k32l179K775n81n87J557k197
1096i01J002J081k220K066j517o69L300l716m4L981m231J509K264m249L556N83
1112A795m479L971M97l310L399j692j562K902k320j79J414j549J241j46j560K821
1128A243j801l14K589k979J456J882l854K719J009l934L231m48k644L786j972
1143c1k318L634k250KJ770k145J274P16j739J705p37j58J879k975J648J859l374
1160a240J957M18l118L654j122k985L900j723j558L141k210j98K670k929J122
1175b21J360j723J231k60q71J978j885N7J477k157J517J16k410K644l28k724L339
1192A140j606r20K908k718L5K958k500N73J429k031J543j30j942K343r44l47R49
$$ plain form
1209 740 -955 82 686 -1611 157 317 -1382 1257 -587 -1418 1852 -313 -803 1415 -945 177
1225 177 1605 -1063 688 1071 -1266 472 -104 -872 926 -1031 -591 507 -1080 167 -12 -1368
1241 -1368 1328 85 -1290 1594 60 -198 1638 -916 133 1600 -1449 -62 966 -1412 360
1256 360 -57 -1032 1203 -85 -1016 424 -835 584 623 -1178 598 370 -735 1181 -14 -360 1414
1273 1414 -956 -193 1358 -1060 153 445 -1514 904 205 -1487 543 -135 -711 618 -789 37
1289 37 989 -489 411 277 -556 985 -228 -633 1314 -558 -402 1143 -1155 42 728 -1614 357
1306 357 455 -1162 613 -147 -636 1132 -271 -102 920 -627 330 575 -445 860 257 -1065 822
1323 822 -568 -565 775 -1212 -17 784 -1280 349 391 -902 630 312 -605 1256 34 -269 1191
$$ packed form
1209G40j695J037O04k297J768J60j699K639j844q31L270k165m90K218k360J122
1225A77J428k668J751L83k337J738n76p68J798j957M40J098j587J247j79j356
1241a368K696j243j375K884j534k58J836k554J049J467l049J387J028k378J772
1256C60m17r75K235j288r31J440j259J419L9j801J776k28j105J916j195l46J774
1273A414k370P63J551k418J213K92j959K418o99j692K030o78n76J329j407Q26
1289C7R52j478R00j34q33J541j213m05J947j872J56J545k298J197O86k342J971
1306C57R8j617J775p60m89J768j403J69J022j547R57K45j020J305o03j322J887
1323H22j390LJ340j987J195Q01k064J629M2j293J532l18r17J861j222l03J460
$$ plain form
1340 1191 -270 248 434 -783 344 102 -959 194 -732 -577 780 -1117 87 831 -739 585
1356 585 512 -640 974 278 -720 1107 -125 -272 726 -970 -64 204 -1257 83 27 -495 722 -473
1374 -473 -357 851 -208 171 879 -648 400 444 -876 715 285 -806 808 -351 -501 952 -1026
1391 -1026 -136 558 -940 157 148 -897 584 44 -547 598 -124 -64 644 -243 328 666 -498 627
1409 627 86 -556 718 -643 -959 773 -927 -321 762 -645 307 755 -652 735 491 -246 575
1426 575 -180 -360 467 -757 -47 412 -594 266 -31 -735 508 -135 -648 649 -200 -110 842 -594 271
1445 271 1005 -914 866 538 -474 687 -22 -460 693 -195 -131 384 -721 -212 240 -727 440 -326
1463 -326 -424 657 -83 42 831 -260 -30 766 -705 328 317 -758 326 -251 -532 483 -531 -400
$$ packed form
1340A191j461N18J86j217J127k42j061J153r26J55J357j897J204P44j570J324
1356E85p3j152J614o96r98J827j232j47R98j696R06K68j461J340n6n22J217j195
1374d73J16J208j059L79P08j527J048M4j320J591m30j091J614j159j50J453j978
1391a026Q90O94j498J097rj045J481n40n91J145p22O0P08q87N71L38j164J125
1409F27n41o42J274j361l16J732j700O06J083j407R52M48j407J387k44p37Q21
1426E75p55j80Q27j224P10M59j006Q60k97p04J243o43n13J297q49R0R52j436Q65
1445B71P34j919J780l28j012J161p09m38J153q88O4N15j105N09M52r67J167p66
1463c26r8J081p40J25P89j091K30P96j471J033j1j075J084n77k81J015j014J31
$$ plain form
1481 -400 442 -616 35 464 -551 595 397 -179 375 128 -155 821 -414 61 707 -556 -178 212
1499 212 -577 337 -53 -770 450 -439 -380 800 -444 134 625 -559 79 273 -166 641 111 -315 582
1518 582 -236 -141 533 -605 -33 298 -945 281 -13 -693 669 -349 -593 787 -282 -296 900 -492
1536 -492 221 547 -468 387 122 -607 816 -405 -336 199 -521 -293 456 -701 158 208 -570 746 43
1555 43 -573 834 -67 7 1081 -509 -189 720 -832 208 207 -923 224 -104 -150 548 -320 -142 314
1574 314 -526 44 298 -632 481 -84 -246 796 -373 1 554 -478 102 624 -721 344 156 -654
1592 -654 517 -189 -600 408 -203 -247 747 -716 383 409 -487 798 156 -282 642 -229 -328 577 -547
1611 -547 -160 246 -911 171 205 -714 372 -130 -580 594 -140 -276 505 -270 288 506 -284 297 123
$$ packed form
1481d00Q42j058O51M29j015J146j98n76N54k47k83R76j235M75O46j263L78L90
1499B12p89R14l90p17J220q89N9J180j244N78M91j184O38J94m39Q07n30m26Q97
1518E82q18R5O74j138N72L31j243J226k94o80J362j018k44J380j069j4J196j392
1536d92P13L26j015Q55k65p29J423j221O9N35p20K28P49j157Q59N0p78J316p03
1555D3o16J407r01P4J074j590L20R09j552J040jj130J147l28m6O98q68J78M56
1574C14q40N70K54r30J113n65j62J042j169L74N53j032N80N22j345J065j88q10
1592f54J171p06m11J008o11m4R94j463J099K6q96J285o42m38R24q71r9R05j124
1611e47L87M06j157J082L4r19J086n02m50J174p34j36P81p75N58K18p90N81j74
$$ plain form
1630 123 -576 305 -344 -149 477 -459 -298 229 -853 142 231 -388 366 139 -518 502 -96 -371 1085
1649 1085 -545 201 487 -492 170 367 -638 346 -133 -339 454 -453 -115 469 -371 268 379 -720 463
1668 463 144 -449 906 -62 36 747 -622 -384 521 -576 -138 230 -928 56 -292 -538 303 -411 -154
1687 -154 675 -391 453 529 -837 466 466 -507 647 -223 -342 949 -646 -314 798 -766 76 276
1705 276 -957 182 179 -495 755 78 -70 369 -340 325 575 -482 261 188 -520 692 -229 -665 552
1724 552 -494 -430 519 -701 -193 508 -693 253 385 -589 711 143 -261 665 -202 62 621 -431 473
1743 473 109 -776 599 -165 -597 742 -603 -29 553 -659 79 631 -618 757 477 -371 706 -112
1761 -112 -208 854 -380 -269 432 -896 205 -222 -693 288 69 -511 502 -699 -185 822 -531 186
$$ packed form
1630A23o99Q81o49J95O26r36J61N27j082R95Q9o19P54k27o57J020n98k75J456
1649A085j630P46K86r79O62J97j005R84m79k06P93r07L38N84q40O39J11j099J183
1668D63l19n93J355r68R8P11j369K38R05j097M38L68j158R84l48k46Q41p14K57
1687a54Q29j066Q44P6j366J303%r73J154q70j19J291j595L32J112j564Q42K00
1705B76j233J139lo74J250o77j48M39p09O65K50j057P43p3p08J212r21m36J217
1724E52j046O4R49j220N08P01j201R46J32r74J300n68m04R26q67K64N59j052R04
1743D73l64q85J375p64m32J339j345N74N82j212P38N52j249J375k80q48J077q18
1761a12r6J062j234J11P01j328J101m27m71R81k19n80J013j201N14J007j353P17
$$ plain form
1779 186 591 -590 492 214 -904 903 212 -482 406 -38 -298 289 -495 19 413 -844 103 -144
1797 -144 -582 602 -363 -430 1031 -284 325 629 -321 538 186 -612 443 204 -703 547 -498 -551 722
1816 722 -651 -252 252 -642 332 166 -286 865 1 -355 709 -98 -58 689 -581 251 503 -818 609
1835 609 117 -686 587 -388 -368 635 -570 -82 367 -702 368 393 -496 626 14 -192 648 -236 -178
1854 -178 506 -898 237 65 -794 191 -175 -795 717 -702 -403 788 -449 510 550 -654 843 132
1872 132 -529 620 126 -403 265 -280 -331 464 -762 -86 28 -677 303 -146 -567 757 -139 -324 735
1891 735 -391 229 487 -332 722 482 -627 463 89 -527 340 -272 -598 499 -793 -96 230 -610
1909 -610 452 22 -422 924 -142 -442 878 -388 69 450 -588 448 325 -681 425 -84 -746
$$ packed form
1779A86M05j181J082k78j118J807o91o94Q88m44k60N87p84N14L94j257R47k47
1797a44m38J184r65o7J461j315O09L04r50Q59l52p98J055k39r07J250j045n3J273
1816G22j373L99N04q94R74j66m52J151q64l56J064q07M0P47j270Q32K52j321J427
1835F09m92q03J273r75K0J003j205M88M49j069J070K5q89J122o12k06Q40q84N8
1854a78O84j404J135j72q59R85l66o20J512j419K99J191j237R59M0j204J497p11
1872A32o61J149m94n29O68n45n1P95j226O76J14p05R80m49m21J324q96j85J059
1891G35j126O20K58q19J054k40j109J090l74o16Q67o12l26J097j292O97L26q40
1909f10J062m30m44J346j066l00J320j266M57L81j038J036j23j006J106n09o62
$$ plain form
1926 -746 524 -294 -509 474 -266 146 334 -611 537 321 -602 645 -6 -304 743 -324 -204 579
1944 579 -703 120 610 -670 154 92 -701 231 -188 -189 417 -612 201 673 -705 230 261 -496 542 -54
1964 -54 -422 677 -145 -359 381 -563 215 -19 -681 358 -82 -575 680 33 -88 722 -390 61 873
1983 873 -147 428 353 -799 633 -26 -605 469 -405 -291 388 -631 -119 -65 -828 399 -204 -446 683
2002 683 19 -263 672 -468 -46 481 -346 233 553 -508 538 -27 -630 453 -441 -384 479 -485 -44
2021 -44 421 -724 210 377 -340 616 -6 -200 906 -123 -96 585 -614 -4 369 -769 255 34 -815
2040 -815 317 -130 -267 655 -687 -73 741 -194 462 418 -644 711 -53 -345 737 -375 -84 442
2058 442 -664 -10 479 -761 287 -173 -597 655 -338 -223 637 -524 -146 655 -492 347 225 -578
$$ packed form
1926g46J270q18k15R83p40M12J88r45J148k16r23J247o51k98J047j067J20P83
1944E79j282Q23M90j280Q24o2p93R32m19jO06j029Q13M72j378R35L1p57J038n96
1964e4l68J099q22k14P40r44P78k34o62J039m40m93J255o47j21Q10j112M51Q12
1983H73j020N75p5j152J432o59n79J074q74J14O79j019N12N4p63J227o03k42J129
2002F83o64k82R35j140M22N27q27N79L20j061J046n65o03J083q94N7Q63r64M41
2021d4M65j145R34J67p17R56o22j94J106j029K7O81j199O10L73j138J024k21q49
2040h15J132m47j37R22j342O14Q14r35O56m4j062J355p64k92J082j112K91N26
2058D42j106O54M89j240J048m60m24J252r93J15Q60j161L78Q01j147Q39j22q03
$$ plain form
2076 -578 706 171 -446 560 -564 -335 497 -721 105 304 -508 304 167 -529 563 87 -52 908
2094 908 -277 25 656 -300 118 567 -603 604 135 -496 277 -341 -426 489 -697 -241 169 -275 106
2113 106 225 -500 463 417 -79 845 -90 77 715 -608 -20 182 -809 190 -109 -655 352 -429 -268 437
2133 437 -566 71 96 -299 449 472 -270 1005 15 -388 576 -458 -62 576 -679 -85 410 -573 270
2152 270 -65 -585 438 -93 -423 333 -460 -166 621 -403 262 478 -339 347 181 -772 433 -436 -398
2171 -398 713 -503 -134 447 -1052 236 106 -691 704 99 -191 715 -185 -32 1012 -357 396 434
2189 434 -395 512 -340 -531 295 -511 -364 623 -565 -79 363 -462 465 197 -483 539 16 -160 539
2208 539 -240 -59 654 -393 95 392 -304 408 55 -514 137 -350 -466 584 -621 -274 468 -689 149
$$ packed form
2076e78J284n35o17J006j124K29Q32j218Q26J99q12Q12j37o96J092m76j39R60
2094I08j185L02O31r56M18M49j170J207m69o31P73o18q5R15j186M56M10m44L81
2113A06J19p25R63m6m96R24r35J67O38j323N88K02r91R99k99n46J007p81J61P05
2133D37j003O37K5l95P48K3p42J275r90m03R64j034L96O38j255N94M95r83Q43
2152B70l35n20J023n31l30P56p93K94P87j024O65K16q17O86j66r53J205q69L8
2171c98J111j216L69N81j499J288j30p97J395o05k90R06r00J53J044j369P53L8
2189D34q29R07q52j91Q26q06J47R87j188M86M42q25R27k68o80J022n23j76O99
2208E39p79J81P13j047M88K97o96P12l53n69O51m87j16J050j205L47P42j157Q38
$$ plain form
2227 149 225 -495 788 312 -366 464 -9 -334 482 -619 215 358 -697 132 0 -646 392 60 -409
2246 -409 370 -318 -98 750 -420 91 529 -423 544 294 -568 541 -88 -219 266 -706 -99 425 -645
2265 -645 -18 -109 -744 290 13 -281 578 -258 103 585 -191 104 659 -307 478 79 -522 433 -377 -533
2285 -533 286 -452 -388 548 -828 122 167 -578 524 146 -289 554 128 -92 537 -421 264 335 -766 113
2305 113 -162 -569 507 -51 -378 620 -289 -28 367 -287 199 354 -550 793 153 -328 669 -114 -449
2324 -449 649 -323 45 220 -610 2 82 -613 -5 -163 -499 507 -412 65 709 -345 141 567 -653
2343 -653 422 48 -480 472 -273 -392 457 -407 -373 298 -850 397 266 -505 385 40 -311 463 -172
2362 -172 -11 783 -555 271 539 -577 182 156 -417 385 -227 -438 664 -258 -214 602 -283 149 282 -462
$$ packed form
2227A49P6p20J283m76o78Q30m73l25Q16j101Q34J43j055Q29j32o46J038l32m69
2246d09P79o88K20Q48j170N11M38r52R67k50q62J109o29j31M85r72O07N24j070
2265f45O27r1o35J034k77k94Q59q36L61M82p76K95N55r66P85l99o01R55q10j56
2285e33Q19p38O4R36j376R50M5p45J102l78m35Q43m26k20O29r58O85P1j101Q79
2305A13k75m07J076n58l27R98r09K61L95o54M86J55r04J343o40m81R97p83l35
2324d49J098r72L68J75q30O12Q0o95O08j58l36J006r19M77O44j054M86M26j220
2343f53J075l74n28R52p45j19Q49q64L4O71j148J247j31p71Q90l45l51P74o35
2362a72J61P94j338Q26K68j116P59k6n73Q02o12k11J102r22M4Q16q85M32J33p44
$$ plain form
2382 -462 371 -144 -313 546 -341 -321 475 -279 199 493 -629 384 212 -825 379 -83 -521 508 -390
2401 -390 -238 591 -368 303 356 -288 319 410 -50 1017 348 -142 506 -353 5 276 -828 255 151 -452
2421 -452 309 -151 -416 551 -246 -9 497 -412 -22 374 -317 443 216 -591 448 -49 -163 383 -392 -57
2441 -57 13 -756 387 -56 -547 605 113 -534 553 -88 -260 548 -513 -48 340 -364 210 322 -533
2460 -533 346 -25 -595 26 -556 -49 309 -629 6 281 -708 239 346 -299 438 -188 -289 548 -292 -73
2480 -73 546 -514 171 142 -605 159 -40 -270 515 -259 -185 517 -503 -118 279 -728 489 382 -286 622
2500 622 -266 -131 497 -338 101 610 -543 -3 149 -519 254 -54 -873 482 -390 -297 491 -291 32 566
2520 566 -343 375 165 -396 614 21 -219 551 -679 116 407 -656 -269 4 -764 338 -184 -430 684
$$ packed form
2382d62Q33n15j69Q59q87K0P96p54M78K94j122J013j72j037J204m62m38J029q98
2401c90J52Q29r59O71N3o44O07R1m60J067o69m90O48q59L58K71j104J083j04o03
2421d52P61m60k65R67p97K37N06r09L90L96o91P60k27q07J039m97j14N46p75L35
2441e7P0p69J143m43m91J152m92o47J087o41j72Q08j061M65L88p04N74J12q55
2460e33Q79l71n70O21n82N07L58r38O35K75r89R47J07o45P37o26j01Q37q40K19
2480g3O19j060O85k9p47P64j99k30P85p74P4P02j020L85L97j007J217j07o68R08
2500F22q88J35O28q35M39N09j153N40J52o68P73l08q19J355q72R3P88p82L23N34
2520E66r09P18k10n61J010n93k40P70j230P95K91j063L87K73p68J102n22k46J114
$$ plain form
2539 684 -239 -415 638 -55 211 502 -272 374 213 -621 310 -185 -560 479 -312 -277 324 -640 111 306
2559 306 -368 427 38 -299 643 -137 -259 660 -306 -39 665 -446 226 211 -316 306 -195 -337 321 -407
2579 -407 -96 439 -164 83 265 -525 215 60 -121 644 65 -68 472 -183 -194 321 -615 147 44 -473
2599 -473 330 -161 -373 449 -243 -258 622 -371 294 401 -153 518 470 -376 496 65 -65 428 -54 -365 125
2620 125 -680 100 -20 -593 275 -1 -245 545 -89 -226 538 -358 -35 715 -311 136 213 -392 336 -153
2640 -153 -289 553 -530 -422 293 -494 100 180 -379 279 -143 -272 513 131 -202 598 133 85 506 -413
2660 -413 241 54 -487 162 -196 -477 284 -125 -144 234 -607 -110 225 -60 229 -82 -563 405 -99 -244
2680 -244 777 -433 234 499 -666 249 35 -537 136 -70 -271 385 -328 20 448 -463 179 412 -281
$$ packed form
2539F84r23j76J053o93K66K91p74O46j61q34R31m95l75J039p91L5O01r64P51J95
2559C06o74P95l89l37R42p80j22R19r66K67P04j111O72j5n27O22n01j42O58p28
2579d07L11N35o03K47J82p90P40j55j81P65n79j33N40o55j1N15r36P62j03n17
2599d73Q03m91k12Q22o92j5Q80r93O65J07n54O71m8q46Q72m31j30M93m82l11M90
2620A25q05P80j20n73Q68k76k44P90o34j37P64q96L23P50j026M47P7o05P28m89
2640a53j36Q42j083J08P15p87N94Q0n59O58m22j29P85l82l33Q00m65m8M21r19
2660d13O54j87n41O49l58k81P61m09j9L78q41M97L35k85K89l11m81R68n04j45
2680b44J021j210O67K65j165R15k14n72O73k06k01O56p13L48M28r11O42K33o93
$$ plain form
2699 -281 375 188 -302 439 72 -165 513 -538 -386 478 -403 174 157 -527 274 111 -378 343 -5 -285
2719 -285 362 -347 -127 300 -367 433 -32 -439 150 -45 -415 425 -343 -161 344 -745 -203 212 -530 377
2739 377 87 -29 347 283 -294 485 41 -38 386 -539 104 258 -572 425 -105 -253 429 -493 -197 372 -373
2760 -373 -187 206 -455 484 337 -215 541 -112 -173 219 -156 -14 438 -519 182 107 -395 118 -122 -294 200
2781 200 -93 -427 460 -211 -5 235 -309 232 443 -442 442 71 -305 606 -414 69 370 -398 -24 202
2801 202 -266 173 -5 -443 338 -559 -108 479 -244 42 381 -498 230 88 -105 570 128 -196 273 -166
2821 -166 -361 263 -432 176 50 -560 278 -28 -362 404 72 -7 559 -101 99 651 -55 300 1 -499
2841 -499 286 -30 -535 381 -213 -411 322 -638 -225 444 -269 226 186 -80 272 -26 -300 433 -81 29
$$ packed form
2699b81O56j87m90P41l67k37O78j051J52Q64q81N77j7o84Q01j63m89P21l48k80
2719b85O47p09K20M27o67Q00m65m07N89j95l70Q40p68J82N05j089N42M15p42R07
2739C77k90j16L76o4n77P79m44p9M24r25O43J54q30R97n30j48O82r22K96N69p45
2760c73J86L93o61R39j47n52P56o53o1L92l75J42M52r57P01p5n02N13k40j72M94
2781B00k93l34Q87o71K06K40n44N41K11q85Q84l71l76R11j020M83L01p68L74K26
2801B02m68M39j78m38P81q97M51N87p23K86L39q79P28j42j93O75m42l24M69m39
2821a66j95O24o95O08j26o10Q38l06l34P66l32p9N66o60K00N52p06L55k99n00
2841d99P85l16n05R16n94j98P33r60M13O69p13M95m0k66L52k98k74P33n14J10
$$ plain form
2861 29 351 -618 252 62 -391 170 166 -513 281 -173 -39 155 -61 12 395 -335 145 14 -145 219 -172
2882 -172 -99 435 -264 -85 340 -362 31 274 -235 106 16 -446 309 51 -397 388 -188 207 309 -273 211
2903 211 315 -253 441 70 -364 183 -276 91 302 -171 -529 -33 -471 -2 238 -315 189 -45 -149 295
2923 295 -94 -150 342 -408 90 331 11 292 148 -279 186 -353 -163 269 -496 -11 133 -367 96 324
2943 324 -296 182 32 -186 364 172 -203 430 -612 22 280 -476 117 -12 -315 243 -308 -192 420 -384
2963 -384 -240 215 -240 -3 18 -270 211 126 -432 445 112 -139 497 -350 -88 230 -476 193 -242 -567 176
2984 176 -173 -159 261 -126 -177 523 -206 177 174 -244 569 164 -340 425 -101 -217 374 -413 -220 150 -513
3005 -513 -11 152 -438 189 -321 -153 304 -66 -77 250 -99 142 208 -577 502 113 -391 206 -70 -277
$$ packed form
2861B9L22r69Q70j90m53N61mo79P94m54J34J94k16P3L83p30M80j31j59L64l91
2882a72P3N34o99J79M25p02L93K43n09L41r0m62P55k58m48P85n76L95J02n82M84
2903B11J04n68O94l71m34N47m59L67K11m73l58M96m38M69K40n53N04k34j04M44
2923B95l89n6M92p50M98K41l20K81j44m27M65n39J90M32p65M85J44n00M63K28
2943C24o20M78j50k18N50j92l75O33j042O34K58p56N93j29l03N58n51J16O12q04
2963c84J44M55m55K37K1k88M81q5n58Q77l33k51O36q47K62L18p06O69m35l25P43
2984A76l49J4M20l87n1P00p29L83lm18Q13m05n04P65n26j16N91p87J93L70o63
3005e13N02J63n90O27n10J68M57l70j1L27l49K41O6p85J079l89n04N97k76k07
$$ plain form
3025 -277 485 -474 -137 273 -706 293 127 -284 191 -89 -171 196 -250 158 319 -342 -123 416 -453 124
3045 124 82 -349 365 -153 -447 387 -205 -36 341 -254 145 209 -140 573 -154 -206 621 -313 -110 253 -89
3066 -89 -126 229 -494 111 45 -253 165 219 -123 370 -301 -86 342 -278 94 353 -218 158 246 -172 238 -243
3088 -243 -248 137 -91 71 72 -696 248 96 -182 244 101 -242 573 -197 -201 335 -91 341 275 -210 257 342 -258
3111 -258 419 -365 -320 170 -200 -210 309 -255 4 -50 -252 126 152 -58 276 -103 -62 260 -101 202 211 -203
3133 -203 -119 -35 -589 109 -124 -475 233 -413 -242 176 -498 118 216 -324 46 174 -100 373 -217 186 394
3154 394 -215 86 184 -226 309 262 -278 130 -177 -292 161 -284 148 300 -385 -16 326 -158 462 -120 -201
3175 -201 423 58 -241 337 160 22 368 -355 69 -149 -335 198 26 -225 542 -73 -197 402 -323 151
$$ packed form
3025b77P62r59L37M10r79R99j66m11M75k80q2L67m46M08J61o61K19N39q69N77
3045A24m2m31P14n18k94Q34n92J69L77n95L99O4l49P13p27n2Q27r34K03L63l42
3066h9l7L55p23O05o6k98M18N4l42M93o71K15M28o20L72K59n71L76Q8m18M10m81
3088b43nL85k28J62Jp68R44j52k78M26j43l43Q15p70mN36m26M32o6m85M67Q5o00
3111b58O77p84M5M90l70j0N19n64K59n4k02L78K6k10L34l79M1L22l61L03Rm14
3133b03Q4Q4n54O98k33l51P08o46J71M18o74O16R8n40L70J28k74M73n90M03K08
3154C94o09L01R8m10N35m7n40M08l07j15M53m45M32J52o85L69L42m84O20n82q1
3175b01O24l65k99N78j77j38L46p23M24k18j86N33j72k51P67o15j24N99p25M74
$$ plain form
3195 151 81 -381 330 264 -194 167 70 -443 271 -120 -199 30 -255 -77 222 -319 198 -193 -31 526 -207
3216 -207 -255 441 70 33 114 -425 152 127 -407 380 90 -331 410 -396 -138 403 -309 101 191 -227 371 62
3238 62 -96 329 78 -389 354 -66 -27 305 -431 81 119 -103 95 -326 -231 525 -158 -17 237 -226 303
3259 303 158 -125 423 302 -52 596 152 -329 392 -243 -11 -12 -279 -95 303 -229 278 -150 -169 194 -146
3280 -146 -136 138 11 63 390 -65 299 219 -369 26 -74 -234 424 -195 -313 312 -408 0 294 -179 149
3301 149 164 -44 326 72 31 311 -189 -77 114 -134 -163 206 -456 237 118 -466 323 -333 141 104 -159
3322 -159 4 112 17 144 104 -415 303 -130 -188 378 -184 -291 215 -480 -64 -42 -310 145 60 -217 495 -329
3344 -329 -108 433 -92 184 315 -317 8 9 -236 229 38 -285 408 -242 120 209 -256 70 387 -293 186
$$ packed form
3195A51p0m62P11o6m58L61r7n13P14l91p9K29k85J78K99n41N17l91J62N57p33
3216b07m8O96l71l7Q1n39N77k5n34P87k90m21P41q06K58N41p12M10R0m18N98l09
3238F2j58M25k51m67P43m20L9L32p36N12L8k22J98m21R5P56o83J41K54m63N29
3259C03j45k83N48j21l54O48m44m81P21o35K32jk67J84L98n32N07m28j9L63l40
3280a46J0K74j27N2L27m55L64q0n88L95j00j60O58o19j18O25p20M08K94m73L28
3301A49J5k08L70k54m1K80n00J12J91k48k9L69o62O93j19n84P89o56M74l7k63
3322a59J63J08r5J27m0n19P18m33n8N66n62j07N06o95M16K2k68M55q5k77P12q24
3344c29K21N41n25K76J31o32L25Jk45M65j91l23O93o50L62Q9m65L26L17o80M79
$$ plain form
3365 186 -28 -368 410 -132 45 145 -79 182 62 -272 270 287 -212 7 -119 -305 403 -244 -76 372
3385 372 -125 171 193 -214 77 -61 -105 409 -158 -62 503 -53 316 31 -200 221 -111 -312 224 75 -231
3406 -231 316 -4 -202 107 -236 -101 224 -236 347 -262 -318 388 71 -15 361 -42 86 18 -247 26 329
3427 329 -455 194 -160 -363 371 -134 -165 446 -375 168 101 -391 145 -47 -162 185 114 -224 220 -178 210
3448 210 323 -228 -124 188 -204 55 79 -400 210 -72 -31 365 -355 40 381 -404 25 161 -289 292 -124
3469 -124 -152 331 -130 -238 266 -368 -129 129 -481 154 209 -505 204 -325 -330 701 -154 -208 194 -251 69
3490 69 262 -306 57 147 -138 382 -176 25 139 -135 -78 322 -206 172 378 -271 320 167 -182 368 -252
3511 -252 -66 226 -176 2 393 -261 56 -20 -260 261 -36 76 323 -64 -35 396 -331 108 315 -527 204
$$ packed form
3365A86k14l40P78n42J77J00k24K61j20l34N42J7m99K19j26j86P08o47J68M48
3385C72m97K96K2m07K91j38m4N14n67R6N65n56L69k85k31M21l32k01N36j49l06
3406b31N47l20j98L09l43J35L25m60N83o09n6P06l17q6L76m03J28o8k65K73L03
3427C29p84O49l54k03P34n05l1O11q21N43o7m92N36j92j15L47p1l38M44l98L88
3448B10J13n51J04L12l92K59K4m79O10k82M1L96p20L95L41p85M29J36m50N81m16
3469a24k8M83m61j08N04o34K39K58o10O35N5p14P09n29nJ031q55n4M02m45L20
3490F9J93n68L63R0k85N20n58K01J14k74N7M00n28L78K06o49N91j53l49N50o20
3511b52J86K92m02J78L91o54L17p6k40N21k97J12K47l87K9M31p27M39K07q42P31
$$ plain form
3532 204 256 -165 428 -54 -139 305 -106 113 294 -149 -33 -22 -120 314 67 -174 363 -179 117 457 -523
3553 -523 302 51 -267 246 104 -42 98 -169 -331 112 -482 147 196 -206 162 -77 37 18 -113 -84 313
3574 313 -240 158 80 -198 141 377 -184 -14 -74 -254 146 -127 -198 378 18 48 159 -337 130 130 -78 172
3596 172 135 65 217 75 -75 246 24 117 261 -51 99 257 -38 -36 54 -180 113 75 -3 282 -197 -18 400
3619 400 -483 204 73 -103 247 -41 -207 321 -364 -108 85 -332 -175 9 -60 62 -43 -130 373 -47 154
3640 154 245 -201 64 285 64 250 -88 -85 93 11 48 382 78 11 -99 -178 138 91 -259 176 11 66 53
3663 53 -130 -72 46 -308 120 337 -218 274 3 -159 -57 -144 -68 -28 -405 -14 235 -318 192 123 -65 117
3685 117 -58 -11 159 7 -231 -4 -6 -77 18 -48 51 9 -325 171 30 -67 371 102 5 261 -146 153 44
$$ packed form
3532B04N2m21N93m82q5M44m11K19J81m43J16J1r8M34k47k41N37n42K96L40r80
3553e23Q25k51l18N13j42j46J40k67j62M43n94O29M9m02L68k39J14j9j31K9L97
3574C13n53L98p8k78L39K36n61J70o0j80M00k73p1N76l60L0J11m96M67%k08K50
3596A72l7p0J52j42j50L21k22R3J44l12J50J58k95KR0k34K93l8p8K85m79J79M18
3619D00q83O87j31j76L50k88j66N28o85K56J93m17J57J84o9J22j05q7N03m20K01
3640A54R1m46K65K21k21J86l38LJ78q2L7L34l04o7j10p9L16m7l50M35j65N5j3
3663E3j83N8J18l54M28K17n55M92k71j62J02q7P6M0l77L91K49n53N10o9j88J82
3685A17j75M7J70j52k38K27kp1R5o6R9m2l34M96j41r7M38k69r7K56m07K99j09
$$ plain form
3708 44 77 283 45 -274 71 -3 -148 160 1 121 -46 -427 -11 177 -143 133 88 -159 200 -147 145
3729 145 -105 153 96 208 -364 38 -34 -208 110 97 -48 292 -215 -151 17 -201 88 -172 -88 293 226 -240
3751 -240 292 -101 -156 191 93 -51 99 -132 47 -16 -224 166 51 -83 151 -273 146 246 -11 24 -21 -285
3773 -285 -160 -141 -101 21 20 180 180 -293 95 301 -185 111 -214 -303 185 -23 -52 -17 -249 -259 33 -168 169
3796 169 -67 -261 115 96 -61 193 -97 -96 -15 -2 -301 207 -145 -105 80 -397 -190 -150 -278 60 -95 68
3818 68 198 -32 -162 304 -66 -43 23 -17 229 109 -85 124 -119 76 178 -102 179 266 -157 89 -262 -90
3840 -90 322 -151 -191 197 -58 13 148 -114 -257 12 71 500 88 -202 187 -105 6 140 66 -123 -11 -152
3862 -152 173 59 -225 -86 -38 -62 129 -164 -179 14 -56 120 161 27 186 -171 -384 210 -144 32 197 -175
$$ packed form
3708D4L3K06k38l19L45p4j45L08j59J20j67l81M16J88l20K76m5k47L59l47K92
3729A45k50K58n7J12n72M02p2j74L18j3j45L40n07O4J68k18K89k60Q4L81o7m66
3751b40N32l93n5L47r8j44J50k31J79o3k08L90j15j34K34m24M19J00k57L5m5k64
3773b85J25J9M0J22jJ60%m73L88K06m86K96l25q9M88k08k9L5k32j0K92k01L37
3796A69k36j94L76j9j57K54k90JQ1J3k99N08l52M0J85m77K07M0j28L38j55J63
3818F8J30k30j30M66l70K3O6m0K46j20j94K09k43J95J02k80K81Q7m23K46l51J72
3840i0M12m73m0L88k55P1J35k62j43K69N9M29m12k90L89k92J11J34p4j89J12j41
3862a52L25j14k84J39M8k4J91k93j5J93p0J76M1j34J59l57k13N94l54J76J65l72
$$ plain form
3884 -175 62 77 -31 -110 167 -225 128 -355 -231 247 -33 4 265 -134 83 241 -272 267 96 -109 -241
3905 -241 -89 189 65 -27 -128 326 -132 199 320 -107 168 -102 -178 -160 68 -9 410 -132 123 150 -241 98
3927 98 -75 -251 247 391 26 195 -191 284 -70 55 -212 37 -36 191 -46 -206 123 -165 -3 -45 -232
3948 -232 -86 207 -37 27 346 -240 268 -402 -171 97 -76 -99 75 12 -17 17 -25 39 76 -178 -106 -301 64
3971 64 24 -159 -26 124 -119 -40 -54 -420 140 -81 -223 103 -189 -120 95 -379 -27 -26 -222 -88 -39 -168 341
3994 341 -260 117 101 -97 99 147 164 -156 202 -191 60 59 -180 115 15 -297 247 -201 -62 -108 -271 20
4016 20 -74 -103 211 -39 -48 398 -79 100 -124 -211 -32 134 -265 88 -57 -190 237 -77 -167 222 42 12 367
4039 367 8 122 99 -223 17 -132 -154 95 -72 289 -109 156 13 -120 92 -22 24 56 -11 -356 -148 121
$$ packed form
3884a75K37J5j08p9K77l92L53m83J24M78k80L7K61l99K17J58n13N39j71k05j32
3905b41J52K78j24r2j01M54m58L31J21m27K75k70p6J8K28p7M19n42K55K7l91L39
3927I8j73j76M98J44l65J69l86M75l54J25k67K49p3K27k37j60L29k88J62m2j87
3948b32J46K93k44O4L19n86N08o70K31K68j73k3J74o3k9L4m2O4L7k54P2j95L65
3971F4m0j83J33J50k43P9j4l66N60k21j42L26k92O9K15m74L52Jj96J34M9j29N09
3994C41o01L77j6j98J96M8J7l20L58l93K51jk39K95j00l12N44m48J39m6j63K91
4016B0r4k9L14k50rM46m77J79k24q7J79J66l99L53j45j33M27l14r0L89j80l0L55
4039C67l59J14k3l22K40j49k2K49j67L61l98K65j43j33K12j14M6L2o7l45K08K69
$$ plain form
4061 121 66 -202 347 -166 160 0 -1 -17 21 0 261 -14 11 -25 -75 -91 60 13 -125 -118 -292 122 -34 -207
4085 -207 45 37 -42 76 -32 44 119 -93 399 92 -292 19 -96 8 60 -247 -288 36 -252 -263 -125 84 -92
4108 -92 -225 -35 176 85 53 -47 -396 288 111 -53 132 13 16 -101 -42 18 -78 -31 0 -17 -405 -55 195 -52
4132 -52 -107 -4 -142 194 -133 -177 26 -54 -46 -234 -323 -310 -129 -302 -5 -307 110 213 -113 -258 23 -136 57
4155 57 137 -132 -21 27 -108 151 -74 -85 -66 -84 -81 208 15 172 198 -204 129 -250 -142 95 36 -80 128
4178 128 140 -96 -45 -10 174 31 -262 228 -97 -312 4 -129 -141 313 -171 2 -179 -44 -244 -187 -110 240
4200 240 -12 32 31 -150 234 151 9 228 13 -65 211 55 -82 101 -115 -126 179 58 63 16 -285 146 38
4223 38 -205 -200 13 2 257 20 38 34 -185 -84 -76 -156 -26 151 -197 157 -120 27 109 -277 -142 149 -210 6
$$ packed form
4061A21n5k68N49n13L26j60jj6L8k1K61k75K5l6n0j6J51m7j38Pj74M14j56j73
4085b07K52qp9J18j08P6P5k12M92l07l84L11j15J04N2l07m1L24k88j1J38K09j76
4108i2j33J90K11r1l2j00l49O84j77j64J85j19Lj17N9O0r6M7L1j7l88L50K50k47
4132e2n5J03j38L36l27m4K03q0Qj88q9J3J81j73K97l02M17J03l26j45K81j59J93
4155E7Q0k69J11M8j35K59k25j1J9j8LK89j93J57K6m02L33l79J08K37n9j16K08
4178A28J2k36N1L5J84j43k93M90l25k15L16j33j2M54m84J73j81J35k00N7P7L50
4200B40k52M4jj81L84q3j42K19k15p8K76j56j37J83k16j1L05j21Nm7l01M31j08
4223C8k43NK13j1K55k37J8mk19J01Qq0J30J77l48L54k77J47Q2l86J35K91l59K16
$$ plain form
4247 6 94 -15 129 265 -506 185 -327 -92 150 15 105 -114 -175 156 -131 -228 167 23 197 30 -131 166
4269 166 -105 -84 193 107 -341 -216 39 -118 -73 -83 139 195 -25 125 -6 -242 208 127 49 322 48 -156
4291 -156 279 -138 69 262 -134 -51 9 -243 98 194 -230 44 -10 -196 186 -49 -242 39 -83 23 192
4312 192 -15 434 -90 -236 52 196 -304 121 -274 -1 43 -96 -15 64 -90 401 -13 -216 189 -41 -242
4333 -242 221 -132 -253 187 -89 62 -158 5 215 -201 -125 64 -91 -93 5 -200 -84 -76 -228 289 -45 53
4355 53 43 -116 -71 76 -86 84 359 -274 113 124 -20 -7 -141 -100 24 -179 -176 342 -122 -39 100 -108 -125
4378 -125 -25 -223 113 4 -173 111 -66 -60 111 -70 -42 52 71 56 132 -216 -35 57 159 57 -187 29 -30
4401 -30 -245 172 342 -274 -77 -133 -132 170 -116 -78 228 -120 359 66 -155 -87 -359 116 69 -179 64 -171
$$ packed form
4247FQ8j09J44J36p71O91n12K35K42j35R0k19o1L31k87r7L95j44J74j67j61K97
4269A66k71K1K77q6m48J25K55j57M5j0K22N6k20J50j31k36M50q1p8K73k74k04
4291a56M35m17K07J93l96Q3O0k52L41R6m24K74n4j86L82k35j93K81j22J06J69
4312A92k07M49n24j46K88J44n00M25l95K73M4j39Q1P9j54M91m14k03M05k30k01
4333b42M63l53j21M40k76J51k20J63K10m16P6J89j55kR8k05J16Qj52N17l34R8
4355E3j0j59M5J47j62J70K75o33L87J1j44J3j34M1J24k03LN18m64Q3J39k08j7
4378a25J00j98L36j09j77K84j77OJ71j81K8R4J9j5P6l48J81R2J02j02k44K16n9
4401c0k15M17J70o16J97n6JL02k86L8L06l48M79k93k21O8k72M75m7k48K43k35
$$ plain form
4423 -171 40 77 7 -23 95 47 90 -5 -248 -63 274 -215 -70 90 -212 144 -74 -412 -18 136 -313 147
4445 147 -211 277 123 -131 43 91 -10 -50 129 -247 107 -252 -289 -50 -361 38 45 -85 64 -193 113 206
4467 206 -61 -258 309 -82 68 254 -195 -116 185 -52 102 -33 -237 76 57 -228 127 87 -16 142 -55
4488 -55 39 -92 107 118 -171 65 247 -163 -80 6 -3 -80 -164 -171 61 -24 -164 -165 -76 -300 243 3 -22 166 -139
4513 -139 -244 57 -294 30 -57 12 411 -168 -169 275 -218 0 247 -14 297 -79 -189 262 88 -207 371
4534 371 -195 -31 168 -97 329 -71 -325 -65 224 -163 -3 -75 -48 282 -13 -128 -29 19 224 -5 -176
4555 -176 239 -35 -206 117 -100 -98 36 -149 -25 253 -225 -25 -138 -218 40 -177 -25 208 -46 69 6
4576 6 115 -188 233 -125 192 223 -209 -27 44 -106 18 -23 -134 163 -235 -118 14 -153 129 118 -200 84
$$ packed form
4423a71K11L7p0l0J18m8M3r5k43J85L37m89J45J60l02L56k18l38L94J54m49M60
4445A47l58M88j54k54J74M8j01m0J79l76L54l59l7K39l11L99Pj30J49k57L06R3
4467B06k67j97N67l91J50J86m49P9L01k37J54j35k04L13j9k85L55m0j03J58j97
4488e5R4j31J99J1k89K36J82m10Q3Q6rp7q4pK32q5j40jQ9k24N43k40k5J88l05
4513a39j05L01l51L24q7O9L99n79jM44m93K18K47k61L11l76j10M51j74k95N78
4534C71n66J64J99k65M26m00k54K60K89l87J60p2K7L30k95j15R9M8K05k29j71
4555a76M15k74j71L23k17KJ34j85J24K78m78K00j13q0K58k17J52K33k54J15o3
4576FJ09l03M21l58L17L1m32J82P1j50J24m1j11K97l98J17J32j67K82j1l18K84
$$ plain form
4598 84 25 -145 193 -21 -93 202 -223 106 185 -4 -22 55 -247 27 91 -200 87 124 -26 8 -56 193 272 -124
4622 -124 108 49 -15 -231 -197 66 -74 -73 -23 87 61 170 -62 -6 210 -268 -104 -109 -110 -40 410 111 199 201 -23
4647 -23 303 51 -184 136 -251 -159 258 133 0 105 -52 -121 23 -209 220 -131 -12 114 -144 88 -47
4668 -47 -57 221 -54 -27 187 -265 84 200 -67 39 100 -20 200 199 -371 246 -296 -100 279 -270 -46 276
4690 276 40 282 234 -112 56 260 -59 200 47 178 51 -89 60 235 -375 68 181 -95 44 -416
4710 -416 -206 254 203 -7 300 -142 -115 373 51 43 -103 -105 159 -165 -219 104 -340 35 -65 -30 117 160 -174
4733 -174 -54 240 115 271 -165 284 82 -41 -43 376 -207 163 151 -17 -16 154 -196 -73 -17 114 371 -303
4755 -303 28 288 57 367 -32 -173 93 30 -214 55 476 -92 96 2 20 -47 0 18 -53 234 228 -147 84
$$ packed form
4598H4n9j70L38k14p2K95m25L29P9j89j8P7l02K74O4k91K87L7j50L4o4K49P9l96
4622a24K32n9o4k16L4K63j40JN0J10k6J09k32N6K16m78J64njP0M50k99Q8Kk24
4647b3L26k52k35L20l87R2M17j25j33J05j57o9J44k32M29l51J19J26k58K32j35
4668d7j0K78k75K7K14m52L49J16k67J06O1j20K20jn70O17n42J96L79n49K24L22
4690B76k36K42m8l46J68K04l19K59j53J31j27j40J49J75o10M43J13k76J39m60
4710d16K10M60n1k10L07m42K7M88l22qj46kK64l24n4L23m44L75j00L5J47M3l34
4733a74J20K94j25J56m36M49k02j23kM19n83L70j2j68JJ70l50J23N6J31K57o74
4755c03L31K60k31L10l99j41K66o3k44K69M21n68J88r4J8o7M7J8p1K87ol75K31
$$ plain form
4778 84 406 -81 -71 72 10 50 31 -164 199 -37 -88 267 50 153 188 -371 -96 -23 162 -2 147 -326 111
4801 111 131 -133 57 44 -73 109 -168 -43 201 -154 75 161 -251 106 -138 68 218 -76 63 -25 -80 253
4823 253 -135 -299 201 -195 46 161 36 -253 241 -11 2 -279 -511 -67 76 -331 79 -41 -191 113
4843 113 -278 294 203 -357 313 53 -15 412 154 246 274 -154 -236 151 39 168 30 -229 75 -146 -47 253
4865 253 -234 -271 369 -279 -47 86 13 237 -130 -379 296 -5 151 168 98 -148 20 -106 -187 91 -248 190
4887 190 -191 -76 45 174 121 118 -99 80 36 -61 300 163 170 51 -132 -308 18 23 35 65 -12 246 -83 -150
4911 -150 235 238 -42 203 184 -23 139 -233 28 -159 -82 -113 301 -56 95 36 -26 110 50 -19 39 -80 0 11
4935 11 -5 221 149 146 168 162 -350 47 103 -81 142 -239 61 133 -146 163 1 -163 280 226 27 145 -123 24
$$ packed form
4778H4L22m87J0J43o2M0j9j95L63k36n1L55k17J03L5n59K75P3J85j64J49m73M37
4801A11K0k64J90j3j17J82k77J25K44l55K29Q6m12L57k44K06J50k94J39q8n5L33
4823B53l88j64N00l96K41J15j25k89M94k52J3k81k32M44J43m07M10j20j50L04
4843A13l91N72r1n60O70k60o8M27k58R2K8m28q2L87j12J29j38k59L04k21R9L00
4865B53m87l7O40o48K32J33p3K24l67k49O75l01J56J7p0k46J68j26q1K78l39M38
4887A90l81J15J21J29n3lk17J79m4r7L61j37Pj19j83j76L26NJ2L0p7K58l29o7
4911a50L85Lk80K45j9k07J62l72K61j87P7l1M14l57J51n9o2J36o0o9N8j19Q0J1
4935A1j6K26p2lK2on12L97N6j84K23l81L00P2k79L09j62j64M43n4j99J18k68J47
$$ plain form
4959 24 175 43 124 -43 -73 131 178 43 153 -127 118 319 -305 112 -169 -73 -24 -79 5 306 -80 63 5
4982 5 22 -56 187 -268 149 227 -203 -117 110 -15 -38 75 69 49 -100 49 162 13 72 157 -13 203 -24 -154
5006 -154 60 -40 -203 -20 -69 -232 133 -149 -296 21 -123 93 -49 114 -74 24 -132 385 57 -80 136
5027 136 119 225 56 -272 3 -116 -181 -1 -72 -37 55 -37 -53 41 -72 65 -96 25 -78 32 -84 227 -85
5050 -85 -99 208 -196 125 -96 167 327 20 41 85 -52 -53 39 -96 -243 -51 184 285 117 -3 10 -119 162
5073 162 91 22 49 -40 -4 6 -147 -178 -13 -177 -230 -3 -283 -16 185 -9 47 63 -99 112 293 -144 175
5096 175 62 113 75 -366 -89 137 -239 232 -16 -22 389 -132 -62 -18 4 -2 181 -194 191 -26 -221 273 7
5119 7 -272 82 -91 -100 127 -463 -191 265 -150 -53 187 -120 157 -215 -182 87 57 356 97 -37 220 218 -154
$$ packed form
4959B4J51j32Q1j67l0K04M7j35J10k80K45K01o24M17k81R6M9n5Q4L01l86J43n8
4982EJ7p8K43m55M17P8m30Q6K27j25k3J13ok0j49J49J13j49N9Q5j70K16k27j30
5006a54K14j00j63J83m9j63L65k82j47L17j44K16j42J63j88R8j56N17l28j37K16
5027A36j7J06j69l28K75j19o5J80p1L5R2r2j6R4j13J37j61J21j03J10j16L11l12
5050h5j4L07m04L21k21K63J60l07K1M4j37jR2j35j47J92K35J01j68j20J3j29K81
5073A62p1o9K7q9L6J0j53l1J65j64n3K27k80K67K01j94N6J6j62K11J81m37L19
5096A75j13N1l8m41K77K26l76M71k48oM11n21P0M4K2oJ83l75L85k17j95M94k66
5119Gk79L54j73rK27n90K72M56m15R7K40l07K77l72L3K69l0K99k59j34K57kl72
$$ plain form
5142 -154 -86 94 -177 -31 -88 56 105 -329 26 -144 -155 -190 4 147 -33 -45 98 81 -34 48 469 -340 -143
5165 -143 -5 -53 174 163 -203 347 -64 -99 167 -223 114 167 -381 -37 55 -232 68 -84 -68 238 188 -83
5187 -83 76 -189 -69 27 -278 -43 -283 -106 218 -56 26 53 47 -268 107 -442 -220 68 22 22 179 91 88 292
5211 292 -153 245 -20 11 110 -262 269 101 -239 154 -344 176 93 -289 203 131 -63 -34 157 -228 102 28
5233 28 18 -65 -198 -197 179 145 -20 104 -109 188 -75 66 152 242 21 144 7 -23 110 77 -52 106 -237
5256 -237 269 -184 163 188 -238 -482 15 -152 47 26 -187 218 56 -202 239 193 99 30 -236 -45 197 -370
5278 -370 -51 -93 -193 5 169 85 -147 -155 -184 222 -171 -59 286 -274 -238 85 -119 -165 -82 -273 334 -47 -107
5301 -107 9 -46 -66 -19 -41 13 -185 -323 184 -56 98 243 189 -135 96 -96 -311 -63 49 132 34 -143 251
$$ packed form
5142a54O8J80k71J46n7J44M9m34L55j70j1l5J94J43j80j2J43j7j15Q2M21q09J97
5165a43J38m8K27j1l66N50m11l5K66l90L37N3n48L44R2k87L00j52J6L06n0k71
5187h3J59k65J20R6l05K35k40J77L24k74Q2K7ol15L75n49K22K88m6%J57q8lK04
5211B92m45L98k65L1R9l72N31j68l40L93m98N20q3l82M92p2j94K9J91l85L30p4
5233B8j0q3j33JL76l4j65J24k13K97k63J41Q6R0k21J23j37l0J33l3j29J58l43
5256b37N06m53L47K5m26k44M97j67J99k1k13M05j62k58M41m6r4o9k66J91K42n67
5278c70L19m2j00J98J64q4k32qk9M06l93J12L45n60L6L23k04m6Q3j91O07l81o0
5301a07J16n5k0M7k2N4j98j38N07k40J54J45n4l24K31j92k15K48J12Q3r8j77L94
$$ plain form
5324 251 30 -142 168 -230 -119 116 -190 45 113 -178 6 114 122 169 -10 -58 28 -379 -130 162 -315 229
5346 229 -296 29 160 -140 -182 34 -224 201 32 -119 111 43 61 81 65 -12 249 18 -115 311 29 78
5368 78 113 90 -80 315 -130 -35 49 -65 269 87 22 478 11 58 -45 163 290 137 -268 -76 -261 -115
5390 -115 55 -259 -94 63 -102 36 59 -281 85 151 -192 41 -19 -21 92 -417 134 47 30 388 250 -72
5412 -72 145 70 115 334 -242 -66 396 -60 -63 -148 -31 261 -160 -155 178 -101 139 136 -412 316 236 -169 106 -172
5436 -172 -146 57 -7 -166 292 -158 -64 64 -111 -58 -53 92 56 -87 -192 241 -69 -112 56 146 4 21 -24 -54
$$ packed form
5324B51k21j72L10l98J11K35l06K35O8k91J84J08QM7j79m8Q6m07K49K92m77N44
5346B29n25L25J31l00m2K16k58M25j69j51K30o8J8K0j6p7K61k31j33M26k82M9
5368G8L5k3j70L95m45R5Q4j14L34j82o5M56m67M7j03K08J27j53m05J92j85J46
5390a15J70l14J65J57j65J38K3l40L66O6l43K33o0kJ13n09N51q7j7L58j38l22
5412g2K17p5M5K19n76J76M62m56lq5J17K92m21NL33k79K40ln48P28q0m05K75k78
5436a72K6K03o4j59M58m50R4J28j75N3NJ45l6j43j05M33l10m3J68R0j42J7m5l0
$$ [...]
8191A94
##END NTUPLES=NMR FID
##END=
