##TITLE=1H_101-2024
 DMSO-d6
 8 sc, 
 5.12.2024
##JCAMPDX= 6.0         $$ Bruker NMR JCAMP-DX V2.0
##DATA TYPE= NMR FID
##DATA CLASS= NTUPLES
##ORIGIN= UXNMR, Bruker Analytische Messtechnik GmbH
##OWNER= root
$$ XWIN-NMR		Version 3.5
$$ Thu Dec  5 14:08:43 2024 Russian Standard Time (UT+4h)  she@DPX200
##.OBSERVE FREQUENCY= 200.1315
##.OBSERVE NUCLEUS= ^1H
##.DELAY= (6, 6)
##.ACQUISITION MODE= SIMULTANEOUS
##.ACQUISITION SCHEME= undefined
##.AVERAGES= 8
##.DIGITISER RES= 18
##SPECTROMETER/DATA SYSTEM= spect
##.PULSE SEQUENCE= zg30
##.SOLVENT NAME= CDCl3
##.SHIFT REFERENCE= (INTERNAL, CDCl3, 0, 15.7039)
##AUDIT TRAIL= $$ (NUMBER, WHEN, WHO, WHERE, WHAT)
$$ ##TITLE= Audit trail, XWIN-NMR		Version 3.5
$$ ##JCAMPDX= 5.01
$$ ##ORIGIN= Bruker BioSpin GmbH
$$ ##OWNER= she
$$ F:/spectra/data/she/nmr/H-F/1/audita.txt
$$ ##AUDIT TRAIL=  $$ (NUMBER, WHEN, WHO, WHERE, WHAT)
(   1,<2024-12-05 14:07:34.87 +0400>,<she>,<DPX200>,
      <created by zg, POWCHK disabled, PULCHK disabled
       configuration hash MD5:
       00 E9 B6 7A A2 85 ED C7 34 08 36 98 17 FE 4E 26
       data hash MD5: 16K
       7C 92 0A 77 7D 2B 89 3B C3 89 40 F6 EA FF 47 36>)
$$ ##END=
$$ 
$$ hash MD5
$$ E8 FE D0 87 C2 B2 87 B5 C3 0B 4A 38 0F 54 D2 51
##$RELAX= 
##$RELAX= 
##$RELAX= 
##$RELAX= 
##$RELAX= 
##$RELAX= 
$$ Bruker specific parameters
$$ --------------------------
##$DU= <F:/spectra>
##$EXPNO= 1
##$NAME= <H-F>
##$PROCNO= 1
##$TYPE= <nmr>
##$USER= <she>
##$AMP= (0..31)
100 100 100 100 100 100 100 100 100 100 100 100 100 100 100 100 100 100 
100 100 100 100 100 100 100 100 100 100 100 100 100 100 
##$AQSEQ= 0
##$AQ_mod= 1
##$AUNM= <au_zg>
##$AUTOPOS= <>
##$BF1= 200.13
##$BF2= 200.13
##$BF3= 200.13
##$BF4= 200.13
##$BF5= 200.13
##$BF6= 200.13
##$BF7= 200.13
##$BF8= 200.13
##$BYTORDA= 1
##$CFDGTYP= 0
##$CFRGTYP= 5
##$CHEMSTR= <none>
##$CNST= (0..31)
1 1 145 1 1 1 1 1 1 1 1 1 1 1 1 1 1 1 1 1 1 1 1 1 1 1 1 1 1 1 1 1 
##$CPDPRG= <>
##$CPDPRG1= <>
##$CPDPRG2= <>
##$CPDPRG3= <>
##$CPDPRG4= <mlev>
##$CPDPRG5= <mlev>
##$CPDPRG6= <mlev>
##$CPDPRG7= <mlev>
##$CPDPRG8= <mlev>
##$CPDPRGB= <>
##$CPDPRGT= <>
##$D= (0..31)
0 1.2 0 0 0 0 0 0 0 0.06 0 0.03 0 0 0 0 0.0002 0 0 0 0 0 0 0 0 0 0 0 0 
0 0 0 
##$DATE= 1733393254
##$DBL= (0..7)
120 120 120 120 120 120 120 120 
##$DBP= (0..7)
150 150 150 150 150 150 150 150 
##$DBP07= 0
##$DBPNAM0= <>
##$DBPNAM1= <>
##$DBPNAM2= <>
##$DBPNAM3= <>
##$DBPNAM4= <>
##$DBPNAM5= <>
##$DBPNAM6= <>
##$DBPNAM7= <>
##$DBPOAL= (0..7)
0.5 0.5 0.5 0.5 0.5 0.5 0.5 0.5 
##$DBPOFFS= (0..7)
0 0 0 0 0 0 0 0 
##$DE= 6
##$DECBNUC= <off>
##$DECIM= 24
##$DECNUC= <off>
##$DECSTAT= 4
##$DIGMOD= 1
##$DIGTYP= 9
##$DL= (0..7)
0 120 120 120 120 120 120 120 
##$DP= (0..7)
150 150 150 150 150 150 150 150 
##$DP07= 0
##$DPNAME0= <>
##$DPNAME1= <>
##$DPNAME2= <>
##$DPNAME3= <>
##$DPNAME4= <>
##$DPNAME5= <>
##$DPNAME6= <>
##$DPNAME7= <>
##$DPOAL= (0..7)
0.5 0.5 0.5 0.5 0.5 0.5 0.5 0.5 
##$DPOFFS= (0..7)
0 0 0 0 0 0 0 0 
##$DQDMODE= 0
##$DR= 18
##$DS= 0
##$DSLIST= <SSSSSSSSSSSSSSS>
$$ [...]
##$SUBNAM2= <"">
##$SUBNAM3= <"">
##$SUBNAM4= <"">
##$SUBNAM5= <"">
##$SUBNAM6= <"">
##$SUBNAM7= <"">
##$SUBNAM8= <"">
##$SUBNAM9= <"">
##$SW= 24.0689530833862
##$SWIBOX= (0..15)
0 0 2 0 0 0 0 0 0 0 0 0 0 0 0 0 
##$SW_h= 4816.95568400771
##$TD= 16384
##$TD0= 1
##$TE= 0
##$TE2= 300
##$TE3= 300
##$TEG= 300
##$TL= (0..7)
0 120 120 120 120 120 120 120 
##$TP= (0..7)
150 150 150 150 150 150 150 150 
##$TP07= 0
##$TPNAME0= <>
##$TPNAME1= <>
##$TPNAME2= <>
##$TPNAME3= <>
##$TPNAME4= <>
##$TPNAME5= <>
##$TPNAME6= <>
##$TPNAME7= <>
##$TPOAL= (0..7)
0.5 0.5 0.5 0.5 0.5 0.5 0.5 0.5 
##$TPOFFS= (0..7)
0 0 0 0 0 0 0 0 
##$TUNHIN= 0
##$TUNHOUT= 0
##$TUNXOUT= 0
##$USERA1= <user>
##$USERA2= <user>
##$USERA3= <user>
##$USERA4= <user>
##$USERA5= <user>
##$V9= 5
##$VALIST= <valist>
##$VCLIST= <CCCCCCCCCCCCCCC>
##$VD= 0
##$VDLIST= <DDDDDDDDDDDDDDD>
##$VPLIST= <PPPPPPPPPPPPPPP>
##$VTLIST= <TTTTTTTTTTTTTTT>
##$WBST= 1024
##$WBSW= 4
##$XGAIN= (0..3)
0 0 0 0 
##$XL= 0
##$YL= 0
##$YMAX_a= 109572
##$YMIN_a= -80649
##$ZGOPTNS= <>
##$ZL1= 120
##$ZL2= 120
##$ZL3= 120
##$ZL4= 120
##$ABSF1= 10
##$ABSF2= 0
##$ABSG= 5
##$ABSL= 3
##$ALPHA= 0
##$AQORDER= 0
##$ASSFAC= 0
##$ASSFACI= 0
##$ASSFACX= 0
##$ASSWID= 0
##$AUNMP= <proc_1d>
##$AZFE= 0.1
##$AZFW= 0.1
##$BCFW= 1
##$BC_mod= 2
##$BYTORDP= 1
##$COROFFS= 0
##$CY= 11.3945322036743
##$DATMOD= 1
##$DC= 2
##$DFILT= <>
##$DTYPP= 0
##$F1P= 15.6554695791079
##$F2P= 12.8336369535428
##$FCOR= 0.5
##$FTSIZE= 0
##$FT_mod= 4
##$GAMMA= 1
##$GB= 0.15
##$INTBC= 1
##$INTSCL= 1
##$ISEN= 128
##$LB= 0.24
##$LEV0= 0
##$LPBIN= 0
##$MAXI= 10000
##$MC2= 0
##$MEAN= 0
##$ME_mod= 0
##$MI= 1.114404
##$NCOEF= 0
##$NC_proc= 0
##$NLEV= 6
##$NOISF1= 3.799351
##$NOISF2= 2.8
##$NSP= 1
##$NTH_PI= 0
##$NZP= 0
##$OFFSET= 15.70392
##$PC= 1
##$PHC0= -26705.28
##$PHC1= 8.38744
##$PH_mod= 1
##$PKNL= yes
##$PPARMOD= 0
##$PSCAL= 0
##$PSIGN= 0
##$REVERSE= no
##$SF= 200.130013532006
##$SI= 16384
##$SIGF1= 3
##$SIGF2= 2
##$SINO= 400
##$SIOLD= 16384
##$SREGLST= <1H.CDCl3>
##$SSB= 0
##$STSI= 0
##$STSR= 0
##$SW_p= 3612.71676300578
##$SYMM= 0
##$S_DEV= 0
##$TDeff= 0
##$TDoff= 0
##$TI= <>
##$TILT= no
##$TM1= 0
##$TM2= 0
##$TOPLEV= 0
##$USERP1= <user>
##$USERP2= <user>
##$USERP3= <user>
##$USERP4= <user>
##$USERP5= <user>
##$WDW= 1
##$XDIM= 8192
##$YMAX_p= 0
##$YMIN_p= 0
$$ End of Bruker specific parameters
$$ ---------------------------------
##NTUPLES= NMR FID
##VAR_NAME=  TIME,          FID/REAL,        FID/IMAG
##SYMBOL=    X,             R,               I
##VAR_TYPE=  INDEPENDENT,   DEPENDENT,       DEPENDENT
##VAR_FORM=  AFFN,          ASDF,            ASDF
##VAR_DIM=   8192,          8192,            8192
##UNITS=     SECONDS,       ARBITRARY UNITS, ARBITRARY UNITS
##FACTOR=    0.0002076,     1,               1
##FIRST=     0,             0,               0
##LAST=      1.7004516,     0,               0
##MIN=       0,             -80649,          0
##MAX=       1.7004516,     109572,          0
$$ Real data points
##PAGE= N=1
##DATA TABLE= (X++(R..R)), XYDATA
0 0 0 0 0 0 0 0 0 0 0 0 0 0 -8 8 -8 8 -8 16 -16 16 -24 24 -30 32 -38 41 -48 56 -64 71 -80 90 -102 112 -126
35 -126 142 -157 175 -192 215 -238 262 -289 321 -353 392 -439 487 -543 608 -687 781 -894 1036
54 1036 -1220 1470 -1834 2406 -3459 6033 -28933 -7769 34201 -7259 -53291 -71986 -42549 -13359
68 -13359 -8061 -33495 -50367 -46411 -26428 -16384 -19949 -35987 -51921 -60478 -46964 -14983 7611
81 7611 -12901 -58463 -80649 -55124 -10837 6947 -20777 -60621 -64275 -28967 -1005 -14323 -50448
94 -50448 -64864 -42844 -9959 427 -15814 -41181 -56335 -51258 -27672 -4208 -177 -19148 -45183
107 -45183 -53608 -31956 -218 1378 -30452 -54059 -37596 1724 17268 -10022 -49921 -57389 -23995
120 -23995 13492 18624 -8397 -36191 -37774 -18340 -1556 1748 -3319 -13638 -21519 -15806 986
133 986 10653 -789 -23486 -32496 -10729 24302 33352 2100 -36015 -38365 -1891 31793 26775
146 26775 -5034 -23687 -11853 10653 19317 7495 -9813 -12684 370 15079 20032 14056 -1185
159 -1185 -17473 -17211 6322 32532 32396 3132 -24344 -18477 13081 32702 19404 -9548 -19358
172 -19358 2458 29717 27908 -1026 -21923 -12757 11324 26668 22287 6252 -8416 -12581 -3726
185 -3726 10528 20900 16468 -878 -13491 -5979 14834 23714 5894 -19553 -18753 10087 32635
198 32635 22338 -9049 -28377 -16239 12624 26724 14337 -6590 -14548 -7250 5022 9879 5739
211 5739 -2744 -9330 -6923 4820 15427 10067 -10023 -23715 -14160 11121 26529 13356 -15629
224 -15629 -28501 -10902 14671 18868 1017 -16363 -14422 2438 12715 6386 -7244 -14680 -10641
237 -10641 1672 11412 11425 990 -13132 -20052 -9120 12056 19818 4346 -17059 -20519 -2124
250 -2124 16441 13028 -8987 -22085 -10620 11874 19510 4228 -16175 -20561 -6099 9380 12863
263 12863 5054 -6295 -12846 -10043 -48 8326 7460 -3087 -13640 -10856 5268 15850 5361 -15334
277 -15334 -22641 -6065 16885 19786 -5 -20090 -18957 -1207 13084 10445 -3584 -11801 -8331
290 -8331 804 5626 3680 -2493 -9839 -10375 -1304 9978 11712 -1531 -17916 -18840 -1050 16544
304 16544 14317 -5335 -20228 -14352 4867 14128 3522 -12759 -15503 -3378 8918 8895 -2320
317 -2320 -12694 -13338 -4888 4674 8949 4225 -7469 -15442 -11648 2042 11545 5807 -10022 -17391
331 -17391 -6450 9266 11154 -3099 -17448 -15237 1744 13987 8609 -7129 -16312 -11753 847
344 847 8380 6129 -3139 -10126 -10220 -2669 5452 6563 -2761 -12377 -11526 826 11972 8178 -8337
359 -8337 -19139 -11199 6690 15158 5225 -11676 -16521 -5744 7106 8458 -754 -8923 -9298 -2627
373 -2627 4440 5483 -9 -7761 -11149 -5548 5438 11272 3534 -10288 -16158 -6610 9425 13360
387 13360 589 -13773 -13517 618 11682 7672 -5985 -13797 -6783 5683 10327 3830 -5940 -10654
401 -10654 -6398 2130 7884 6256 -1409 -9722 -9675 359 9695 7725 -4222 -12936 -7424 6479 13038
416 13038 3843 -10374 -13601 -2844 10106 11303 745 -9525 -9568 -960 6591 7737 1564 -5576
430 -5576 -7351 -1659 5893 8696 2518 -7109 -9832 -1011 10618 11581 729 -11175 -10366 2370 13482
445 13482 10209 -2758 -10217 -5444 5771 11044 5813 -3802 -7188 -2238 5673 9573 6047 -2036
459 -2036 -7295 -4136 5365 11668 8541 -2557 -9531 -4053 7659 12892 5952 -5435 -8838 141
473 141 10892 11336 1986 -6441 -5952 2549 10180 9519 1731 -4870 -4805 984 8251 9829 3658 -4581
489 -4581 -6498 562 10113 11462 2070 -8215 -7078 4221 13192 9433 -2677 -9886 -4554 7494
503 7494 12034 5549 -4500 -7132 -1547 6314 8344 3691 -2814 -5584 -2790 4538 8546 4784 -3241
518 -3241 -8028 -3884 5526 10515 4161 -6320 -9619 -2189 8014 9609 784 -8608 -8177 593 7626
533 7626 6443 -950 -7691 -6286 658 6206 5727 -519 -7102 -7376 -331 7312 6611 -1718 -8958 -7395
549 -7395 2196 8869 5673 -4224 -9799 -5354 4163 8604 3248 -5433 -7966 -2744 4197 6922 2313
564 2313 -4777 -6936 -2764 4313 6866 2881 -4308 -7616 -3157 5252 8661 3288 -5830 -8128 -981
579 -981 7705 8425 834 -6489 -5744 1788 8928 7363 -728 -6151 -3976 2866 7967 6834 551 -4697
595 -4697 -3855 2639 8581 7706 803 -5057 -3148 4341 10023 7457 -814 -6450 -1816 7233 11142 5532
611 5532 -2699 -5302 -262 7873 9857 4673 -1965 -3583 1139 6598 8247 3919 -1078 -3494 472
626 472 6962 9379 4059 -3351 -4891 1193 8902 9991 3294 -4957 -5010 2516 9313 7678 897 -4254
642 -4254 -2369 3955 8224 5901 -315 -4825 -2670 4275 8649 5925 -922 -5222 -3152 3391 8491
657 8491 6050 -1694 -5717 -2156 4879 7487 3321 -3646 -5344 -771 5681 7101 2025 -4750 -5627
672 -5627 -799 4819 6359 2575 -3816 -6207 -1866 4983 6097 1091 -4804 -5395 -106 5675 5794 -774
688 -774 -6820 -5454 1556 6883 5100 -1897 -6138 -4482 1357 5982 4347 -1598 -5599 -3068 2452
703 2452 5046 2867 -2130 -5454 -3099 3007 6487 3771 -3142 -6374 -2976 4201 6639 3430 -3024
718 -3024 -5671 -1662 4899 6060 1327 -4130 -4168 446 5243 5680 1116 -4374 -4650 724 6064 6270
734 6270 1198 -4027 -4493 186 5842 6289 991 -4305 -3402 2660 6622 4746 -813 -4795 -2529 4060
750 4060 7593 4543 -1876 -5060 -2152 3194 6183 4051 -486 -3866 -1754 3333 6029 3015 -2229
765 -2229 -3636 -396 4799 6662 2464 -3546 -5255 -406 5463 6531 2046 -3110 -4339 -533 4312
780 4312 5194 1064 -3528 -3570 1037 5315 4336 -553 -4435 -3540 1185 6160 4772 -977 -5333 -3937
796 -3937 1617 5200 4037 -700 -4245 -2793 2108 5011 2580 -2416 -4334 -1560 3111 4860 2408
811 2408 -2595 -5269 -2418 3521 5501 2489 -2411 -4625 -1745 3037 5001 1496 -3275 -3944 191
826 191 4614 4528 180 -4467 -4589 503 5341 5332 -36 -4803 -3667 974 4432 3936 78 -3352 -2857
843 -2857 1666 4750 3232 -1380 -4111 -2089 2580 5401 3750 -1292 -4809 -2728 2787 5847 3598
858 3598 -1045 -3289 -1505 2802 5053 2517 -2496 -3750 73 4223 5255 1601 -3083 -4197 -436
873 -436 4435 5953 1956 -2853 -3890 -166 3955 4097 1338 -2518 -2629 1230 4899 3800 -733 -3665
889 -3665 -2681 1959 5517 4200 -424 -3890 -3283 1456 4994 3870 -605 -3327 -1922 1871 4072 2705
905 2705 -1808 -3738 -729 3353 4720 1774 -2317 -4283 -1682 2880 5077 2342 -2301 -3918 -1465
920 -1465 2563 3810 1246 -2356 -3226 -289 3755 3981 -106 -4194 -3754 176 4244 4190 11 -4485
936 -4485 -3822 95 3800 3384 -706 -3430 -2730 821 3171 2168 -1736 -3757 -2179 2082 3795 2150
952 2150 -1800 -4430 -2831 1354 3744 2118 -1675 -3636 -2125 1456 3481 1534 -2276 -3559 -1453
967 -1453 2791 4004 947 -3616 -4041 -672 3317 4240 724 -3200 -3931 -637 2864 3213 -13 -3054
983 -3054 -2912 563 3488 2398 -1071 -3613 -2581 1279 3947 2801 -977 -3538 -2752 711 3307 2795
999 2795 -462 -3176 -2142 1096 3002 1659 -1315 -3385 -1104 2663 4035 1587 -2316 -4118 -1376
1014 -1376 2340 3797 1602 -1973 -3416 -1199 2233 3173 832 -2106 -2585 27 2870 2913 -80 -2970
1030 -2970 -2904 385 3697 3481 -148 -3500 -2937 47 3033 2931 -117 -2608 -1919 864 2916 2056 -1073
1047 -1073 -3006 -1732 1921 3645 1937 -1649 -3576 -1813 1606 3265 2116 -1214 -2760 -1379 1287
1062 1287 2888 1461 -1422 -2556 -848 2396 3150 566 -2757 -2923 -182 3050 3663 798 -2548 -2805
1078 -2805 -438 2669 3063 330 -2662 -2050 696 3043 2017 -792 -2776 -2076 1382 3421 2580 -1118
1094 -1118 -2976 -2039 913 3429 2065 -909 -2478 -1400 1311 3059 1519 -1367 -2481 -745 1928
1109 1928 3123 1232 -1952 -2970 -1022 2208 3542 1512 -1814 -2784 -785 2271 2819 703 -2165
1124 -2165 -1987 355 2763 2406 -3 -2476 -2384 623 2935 2695 -100 -2414 -1828 376 2771 2273 -315
1141 -315 -2262 -1413 1000 2392 1747 -664 -2354 -958 1545 2826 1791 -999 -3062 -1079 1668 3196
1157 3196 1765 -996 -2469 -760 1742 2691 979 -1394 -2101 -251 2286 2836 768 -2036 -2012 2
1173 2 2853 3240 525 -1907 -2017 -42 2155 2808 562 -1773 -1358 746 2591 2226 -332 -2070 -1163
1190 -1163 1395 3075 2110 -329 -2098 -1217 1424 2976 1921 -508 -1787 -1080 1192 2622 1363 -987
1206 -987 -1818 -203 2011 2881 1413 -1390 -2145 -12 1973 2848 1319 -1296 -2059 -12 1883 2468 635
1223 635 -1434 -1862 488 2372 2206 -186 -2068 -1634 476 2660 2404 -376 -1963 -1566 884 2404
1239 2404 1816 -286 -1854 -1217 1010 2138 1337 -790 -2071 -920 979 2288 1110 -769 -2349 -1169
1255 -1169 1298 2088 945 -997 -2263 -760 1507 2092 728 -1501 -2282 -295 1996 2052 -160 -2080
1271 -2080 -1907 149 1440 1917 -301 -1934 -1994 -333 1408 1486 -174 -1965 -1676 89 1628 1393 -480
1288 -480 -2365 -1663 681 2122 1159 -666 -2500 -1790 636 2187 1394 -988 -1820 -1263 914 1869 678
1305 678 -1354 -1949 -717 1380 2047 552 -1664 -2006 -510 1469 2251 643 -1293 -1989 -177 1648
1321 1648 2005 267 -1089 -1552 383 1782 1682 -96 -1561 -1398 344 1965 1681 77 -1178 -1106 632
1338 632 2285 1935 154 -1163 -641 1105 2024 1649 -451 -1339 -517 1536 2400 1529 -647 -1308 -355 1342
1356 1342 2004 1739 -482 -1303 -144 1698 2321 978 -570 -1392 15 1896 2378 600 -1196 -1295 587
1373 587 2089 2173 255 -1002 -909 785 2236 1633 -30 -1057 -496 796 1631 1675 102 -1199 -323 919
1391 919 1913 1429 47 -1339 -718 816 1693 1280 -198 -1375 -405 1303 2099 918 -650 -1267 -259
1408 -259 1473 1983 568 -1195 -1234 69 1426 1668 390 -942 -1202 40 1288 1722 158 -1451 -738
1425 -738 334 1399 1181 287 -1263 -888 448 1661 1042 -452 -1210 -766 89 1397 946 -329 -1474
1442 -1474 -989 781 1444 1022 -452 -1499 -843 669 1773 1060 -947 -1871 -641 1108 1546 368 -994
1459 -994 -1224 -260 957 1294 261 -1124 -1700 -245 899 1091 299 -1067 -1107 7 1489 1109 -105
1476 -105 -1102 -841 -157 1154 1263 -206 -1410 -1016 424 1280 1068 -664 -1219 -1005 351 1240 800 -386
1494 -386 -1658 -582 524 974 635 -487 -1122 -523 617 1458 423 -861 -1234 -641 1027 1086 427 -865
1512 -865 -1411 -332 1070 1136 -215 -1174 -1087 -7 1037 1010 133 -1332 -1018 131 1296 917 -177 -980
1530 -980 -1029 546 1260 779 -160 -1025 -779 595 1093 664 -129 -1117 -562 391 1377 705 -676 -1099 -577
1549 -577 498 1077 725 -566 -1188 -210 878 1155 391 -1059 -1164 -122 667 1240 500 -1183 -1489 -3
1567 -3 990 1104 65 -765 -756 39 1180 1070 2 -944 -967 588 1028 894 -234 -825 -684 170 1143 1080
1587 1080 -187 -1049 -512 271 1117 729 -380 -1170 -569 629 1355 706 -609 -1002 -382 760 1095 655
1605 655 -460 -883 -314 866 1031 409 -699 -974 -309 892 897 80 -952 -795 47 1083 877 65 -1090
1624 -1090 -873 45 992 708 -94 -1258 -739 347 646 466 -309 -973 -755 208 796 386 -515 -804 -517
1643 -517 403 897 640 -317 -1047 -733 450 685 299 -712 -839 -483 455 659 102 -905 -1012 -68 521
1662 521 769 353 -903 -1095 -92 529 791 -313 -1026 -902 -89 705 401 -288 -755 -709 -318 865 271
1681 271 -325 -810 -788 210 872 470 -225 -1051 -978 123 755 528 -414 -918 -572 311 773 263 -704 -904
1701 -904 -397 806 640 -100 -710 -1052 -326 448 606 0 -789 -1013 -196 639 362 18 -897 -710 -116 784
1721 784 600 54 -967 -790 -167 647 897 -180 -1082 -813 37 529 542 -265 -740 -291 490 749 338 -419
1741 -419 -651 -463 379 870 288 -513 -834 -659 460 891 347 -632 -755 -293 607 655 -106 -537 -789 -35
1761 -35 403 598 2 -897 -827 -80 454 485 155 -857 -865 -63 707 514 -39 -560 -472 228 680 349 -321 -721
1783 -721 -294 44 666 468 -495 -674 -363 311 557 251 -477 -937 -419 249 522 164 -442 -943 -147 699
1803 699 558 112 -598 -779 -236 790 455 107 -468 -580 -33 364 365 -53 -533 -491 -26 464 634 -120 -528
1824 -528 -528 81 534 460 35 -389 -521 -98 271 325 -72 -578 -574 262 466 303 -115 -837 -386 276 734 240
1846 240 -449 -625 -282 352 249 52 -438 -588 -61 213 355 -176 -514 -525 -113 387 402 -142 -516 -569 -65
1867 -65 474 403 -23 -312 -575 -161 333 302 -10 -430 -514 189 402 185 -144 -368 -222 113 491 585 -383 -816
1889 -816 -416 98 356 -20 -575 -523 -82 131 579 83 -527 -589 -234 124 324 40 -489 -616 -71 174 343
1910 343 -16 -524 -512 -239 250 381 -33 -566 -347 9 465 419 -193 -747 -454 64 449 496 -207 -261 -169 82
1932 82 257 264 -458 -551 -390 78 481 296 -235 -437 -436 236 220 117 -298 -514 -282 335 258 -75 -397 -549 -61
1955 -61 163 606 169 -132 -454 -120 114 250 -108 -322 -351 -5 135 467 -180 -381 -123 56 227 9 -225
1976 -225 -443 -44 247 389 285 154 -412 -380 123 303 140 -167 -393 -221 95 388 99 -160 -671 -272
1996 -272 371 395 28 -167 -278 125 229 334 -8 -313 -310 279 48 374 128 -201 -156 41 201 -107 74
2017 74 -165 -430 -150 226 340 43 -106 -291 286 449 -3 110 -353 -73 92 504 67 -227 -54 -161
2037 -161 446 430 -25 -424 -553 -21 304 404 109 -138 -366 -67 249 758 7 -366 -261 -75 490 485 -269
2058 -269 -331 -199 -79 387 239 -326 -259 33 138 5 69 -23 -249 -405 8 138 271 -44 -280 -199 195 439
2080 439 64 -237 -543 -11 206 399 165 -402 -449 -154 208 230 153 -467 -197 -36 -28 223 -81 -239 -476 -83
2102 -83 350 428 -16 -464 -413 -167 51 249 -7 -279 -273 161 171 -14 -285 -400 -164 -25 187 64 229 -421
2124 -421 -267 -8 280 307 -215 -105 -37 -80 390 -70 -457 -557 -204 181 278 68 -237 -449 -43 293 378 -120
2146 -120 -148 -127 -10 284 -34 7 7 -436 32 -33 61 16 -267 -110 108 419 451 -105 -389 -308 336 456 89
2169 89 -101 -402 -274 109 394 31 -60 -209 249 40 138 35 56 -225 20 104 168 -85 -94 -187 -156 196 37
2192 37 243 -108 -105 -184 325 276 -1 -163 98 101 49 111 14 164 -164 -71 109 150 145 -289 -34 -102 32 169 157
2217 157 -109 -107 146 123 93 190 -217 -176 270 254 350 67 -119 -62 -109 -210 -141 30 113 -217 46 151 -2 -9 -485
2242 -485 -411 -102 280 -50 -208 -193 95 91 76 -339 -163 -140 31 246 101 8 -32 153 185 13 8 -66 -11 -388
2266 -388 -193 132 160 9 -268 -295 -127 -45 89 21 -158 -331 156 114 -232 -127 -285 -292 127 -177 13 -54 -159
2289 -159 -26 -63 62 -11 28 -96 -321 155 125 45 -77 109 65 -74 101 -274 -226 -89 30 -24 69 -158 -31
2312 -31 108 -47 -93 -108 5 10 55 86 116 30 76 -41 -444 -67 9 11 -218 -222 55 146 20 -39 -124 -247 142 99
2338 99 -116 -82 49 98 119 19 54 -204 67 -116 -19 126 96 227 -91 117 -350 100 1 -135 -242 -242 108
2361 108 280 407 31 -123 97 130 -40 -222 -26 75 -108 39 0 105 -37 -287 44 -171 96 -57 85
2382 85 -15 62 101 159 -30 -104 275 209 238 -10 -110 -125 172 10 25 80 -121 236 108 42 -166 80 8 144
2406 144 -158 -246 -136 26 173 22 -132 100 -56 60 7 -304 -68 310 -170 -106 -64 -87 -95 -85 -132 312 -4
2429 -4 -144 -292 63 74 6 -136 -152 13 383 135 -285 -25 -150 -29 255 141 62 -349 186 396 -2 -94
2451 -94 180 1 47 157 -282 -154 83 -1 -137 92 56 26 10 -196 -176 33 276 -20 -73 -178 84 -27 -70
2474 -70 -240 32 21 307 90 201 -13 -287 -4 88 10 200 -94 44 121 138 126 -11 -68 -151 -65 245 90
2497 90 257 -305 -27 21 101 11 -65 -183 242 -9 93 49 78 -112 110 -76 -176 -95 145 63 -126 70 109
2520 109 275 46 -160 -240 -185 61 149 -5 -3 83 174 38 -232 -378 89 -90 -32 -6 143 113 -236 -91 -250
2543 -250 35 139 19 -54 -40 -84 -94 -73 -171 -97 229 244 -61 -399 38 117 228 5 -96 39 -178 -36 -16
2566 -16 -153 225 -120 -132 -257 4 -76 58 -7 -210 -55 -154 -67 142 -117 -153 -83 -95 35 -40 131 -97 62
2589 62 26 -218 -225 138 -2 -1 -134 36 12 -30 -20 -156 205 108 -122 -36 -36 -59 137 91 36 -72 122 64 -51 -167
2615 -167 -230 -14 265 303 272 -124 -27 6 97 -52 -52 3 -196 205 295 49 349 -85 -16 50 74 223 133 -8 -364
2640 -364 -61 166 -17 -39 -81 -9 -177 28 -115 -158 87 135 2 38 -160 -4 -127 28 79 -74 223 -161
2662 -161 -124 58 -95 63 235 -64 -95 -211 130 15 88 14 -116 -23 244 -57 -44 -225 82 -128 -176 34
2684 34 87 -299 -239 -221 129 32 -87 77 -315 -48 140 46 -275 -242 35 -30 195 17 -31 -121 139 187 86 -261
2708 -261 -206 285 -84 -129 58 222 -83 -106 -158 65 171 55 -68 -20 -9 -125 99 -251 -145 136 228 264 101
2731 101 -298 -195 112 149 -222 -193 -169 -236 286 -55 166 102 225 -30 56 75 22 183 -48 -153 -46 300 52
2754 52 -170 242 -9 -31 9 148 53 -61 40 -150 -215 90 45 -37 -166 -51 302 154 23 -263 24 -88
2776 -88 91 25 -246 -19 -124 -4 185 90 -21 -187 -258 -15 121 -183 -160 -89 55 96 -68 162 -189 -88
2798 -88 -196 -14 332 -36 -182 -9 19 201 330 85 49 58 -35 64 -106 -91 -19 46 208 -30 230 190 -81 -7
2822 -7 -1 105 364 -180 -161 -105 166 108 14 10 -121 -30 -179 126 30 -41 -327 -21 -14 121 449 -153 24 -47 34 93
2848 93 93 -156 -118 -193 23 268 -20 -199 -142 -155 83 177 53 -206 -296 151 116 109 -291 -249 -51 -147 107 15 -69
2873 -69 -308 -362 45 -6 185 12 -159 -183 -24 190 254 20 -185 -307 60 94 -55 -311 -272 -10 180 51
2895 51 -130 -90 -474 18 126 18 261 -82 -268 -28 123 60 71 79 -20 69 -80 501 -111 43 -317 -191 155
2918 155 292 181 211 -205 94 232 -1 -59 94 -64 -267 374 119 244 -99 -105 164 403 -68 -190 -315
2939 -315 -116 194 149 -46 56 12 -311 109 107 -58 -4 -448 -5 -129 289 -44 55 128 219 -32 -81 -57 -27 59
2963 59 54 203 263 61 -342 -202 57 156 92 -3 -211 -9 -14 182 27 -55 -123 94 7 54 10 -108 19 -128 -171
2988 -171 134 60 83 -72 -156 253 60 218 -47 -171 -308 -70 156 -27 -481 -194 -130 256 -207 84 -298
3009 -298 27 31 -34 51 175 -9 -210 -67 -14 0 -24 -42 -143 -21 288 193 -14 -109 59 266 -135 -32 74
3032 74 -199 -91 99 155 -92 8 -63 -105 51 143 70 1 -85 -93 -189 103 158 39 -187 -245 11 112 201 -13 -263
3057 -263 160 174 -46 -43 123 57 -79 174 142 97 -194 -70 -129 169 367 52 207 -87 316 120 83 334 -81
3080 -81 -206 115 324 242 44 -94 179 49 7 176 -31 -218 142 11 -189 -49 54 -167 -146 -18 -81 178
3102 178 -142 9 86 122 147 81 -101 -122 -65 187 113 177 -342 -5 -2 159 -44 207 -327 -370 -167 -56 94 94
3126 94 -211 -35 129 -105 -70 -69 -16 -161 119 175 -5 -69 141 58 98 200 183 -280 -136 25 30 -9 40 -124 40
3151 40 -237 139 116 4 -44 -297 41 95 86 -91 -49 -73 95 164 33 -8 -305 -74 41 48 276 8 -272 -2
3175 -2 18 21 164 64 -187 -76 -27 265 23 30 -153 218 187 231 39 -167 -42 -209 159 131 244 -295 -338 19
3199 19 30 -60 -180 -17 -39 -264 191 218 -154 -19 -272 -14 145 223 -3 -352 -42 -328 265 134 -168 -36
3221 -36 -4 124 111 31 -82 -191 -345 86 193 -118 -21 -163 -290 109 36 347 -38 -238 -203 156 -46 -23 -91
3244 -91 -226 108 207 -108 34 -98 -174 402 51 129 163 -329 -198 -328 72 240 215 -219 -221 20 78 167 19
3267 19 -338 -41 -33 68 142 134 -238 -73 -69 105 146 -101 -55 -129 172 -118 125 -61 -211 -405 5 -35 -152 -58
3291 -58 -297 -49 9 1 94 74 -296 -54 193 172 183 -249 -75 -104 80 73 13 -20 -60 48 111 51 -38 -204 -318 -42
3317 -42 254 -1 40 1 -132 110 179 -28 -71 -128 54 185 341 39 -135 -206 -139 -47 62 12 -89 -153 56 -31
3341 -31 27 3 121 -51 -91 157 -10 73 119 -87 34 195 51 -100 -343 64 78 151 -73 -109 -86 -153 -123 -39
3365 -39 -32 -125 -250 46 -40 13 231 100 -150 -100 96 75 122 -24 18 -304 -13 189 260 68 -143 -289 137 221
3389 221 89 3 -247 -71 32 -116 -54 -117 -143 -89 -48 76 133 42 144 106 259 82 114 -206 -151 110 255 18
3413 18 110 107 -113 80 61 182 -172 155 -225 84 171 85 -170 -219 187 88 85 -76 88 29 -21 152 186 164 -193
3438 -193 37 71 207 200 -207 53 103 104 -159 8 78 -375 -1 -187 1 372 -156 -263 -190 -145 -149 256 -182 -138
3462 -138 65 -106 -183 43 213 -112 1 373 242 -107 -26 42 -159 50 -117 290 -37 -98 0 36 330 111
3484 111 30 -122 -108 -59 290 -45 -194 -128 -135 -32 161 -4 -243 -188 -70 -146 40 33 -228 -157 -232 227 128 -83
3508 -83 -245 -133 132 102 -50 -177 55 79 192 -120 259 -133 -127 -53 282 -47 -112 -42 -92 -249 -102 139 180
3531 180 -69 -156 -75 91 361 209 -162 -150 14 161 242 -57 -56 -98 13 48 -15 -12 -192 -143 -222 52 73 76 26 118
3557 118 120 331 399 -56 -63 -153 -41 -22 124 202 -3 203 24 -14 -10 31 33 -65 160 29 -128 -94 93 -90 276
3582 276 40 158 77 71 -163 81 121 -104 7 5 -53 49 173 -10 -35 -367 -244 -25 123 -79 -14 -107 -133 97
3606 97 134 -36 27 -146 45 24 107 3 -43 -67 47 243 164 7 -148 -32 20 261 93 9 -115 -89 135 315
3630 315 161 -17 -25 -154 144 17 229 -25 -152 -197 116 316 -61 -19 -81 -127 63 144 60 15 -8 10 82 147
3654 147 -88 -188 -154 -111 281 39 -63 83 112 237 172 391 -127 224 43 4 -251 -33 -68 -34 -144 27
3676 27 177 -39 -131 -69 -78 25 -42 -29 -151 32 -10 81 261 125 154 -173 89 -126 284 228 -6 -172 192 -45
3700 -45 -63 238 1 92 -64 53 106 43 -229 -112 -92 48 -6 -56 -86 -217 58 343 48 141 -46 83 113 175
3724 175 -74 -86 -65 -26 14 200 208 72 -99 -26 196 220 396 -57 -41 26 -283 85 -255 21 -163 117 -27
3747 -27 -94 17 -193 -55 35 2 136 -16 -205 130 -52 48 59 -47 -115 -98 66 25 104 80 -38 -8 161 -20
3771 -20 -5 -56 -117 -16 17 -124 -45 -76 -119 161 -62 108 225 65 -82 -160 -29 107 128 132 -143 -104 -38 179 -57
3796 -57 71 -134 -22 55 77 77 18 -98 -124 -131 30 29 55 -167 121 336 63 -82 -21 66 -5 -6 121 -36 -210 -24
3822 -24 58 185 -53 38 226 -174 -59 118 -19 162 -74 -205 -142 179 109 -38 -123 -117 338 66 241 -223 -12
3845 -12 194 85 89 154 -150 92 115 149 -32 99 28 -184 128 76 215 118 -52 -136 -189 -108 92 -97 -104 66 -28
3870 -28 88 -237 -81 -74 76 -49 -385 102 191 -278 -227 30 361 43 184 -133 -97 199 60 105 -181 -60
3892 -60 -35 244 183 206 -27 29 -162 103 52 89 -126 -312 -80 -57 -30 149 53 45 -159 174 91 -44 -162 -86 304
3917 304 230 -165 73 -23 -225 130 -3 26 45 -210 94 137 122 307 54 219 -152 144 -82 49 -172 -48
3939 -48 -57 65 26 128 189 -89 -76 -100 54 63 11 -160 -163 61 136 -12 282 -120 -180 64 -60 -49 -236 24 110
3964 110 41 212 -38 -116 84 219 -116 140 170 49 45 -61 68 37 163 -31 -229 -154 -65 23 12 -39 -110 -66
3988 -66 70 162 12 -153 52 -104 -77 34 117 23 -110 142 246 -138 -202 -27 -126 6 157 -78 -149 -75 -165
4011 -165 13 118 -115 -54 0 54 14 4 83 38 135 28 283 -8 69 65 -94 405 276 100 106 -119 -89 145 120
4036 120 11 108 -240 -93 47 -95 -217 168 38 -49 192 126 288 -129 -85 -148 135 -76 165 -29 9 243
4058 243 -55 206 22 -24 -106 -387 101 -5 -57 145 62 112 84 138 -302 -75 75 -149 -155 77 110 -72 46
4081 46 -1 140 337 -100 28 -202 66 219 62 37 106 55 -57 74 -32 33 -12 86 -18 -101 180 -151 47
4104 47 92 -6 219 -151 -82 -263 323 171 134 347 -233 57 -96 -72 -144 97 -46 -38 140 235 -120 -34 -160 11
4128 11 -22 86 18 -14 -329 -119 98 -44 169 -248 -163 -63 -66 135 -59 -272 -69 -67 86 -80 -260 -247 79
4151 79 64 94 201 -33 -68 48 -158 119 35 126 89 135 1 142 158 -235 95 22 -45 6 237 229 -254 -148 61
4176 61 15 0 -69 -90 153 -171 -141 92 233 -186 363 -57 -53 -134 56 135 21 -201 123 -52 -224 141 171 23
4200 23 70 -19 -85 -66 -8 195 67 -140 -64 -163 43 118 142 298 -127 -134 149 152 -66 72 -150 -279 -163 -6 -218
4225 -218 -3 -12 -189 94 -56 5 -219 55 -127 241 175 0 -85 28 -171 71 -163 -56 -361 -324 374 -37
4247 -37 -99 -108 -106 -240 -114 138 201 -155 48 6 -121 98 314 -2 34 101 -67 -268 179 -4 24 -190 11 39
4271 39 10 155 -6 202 -173 -122 -245 -104 -75 -96 -99 162 29 25 -111 -138 -3 404 5 -32 -201 136 -126 -28
4295 -28 124 93 -94 47 245 -6 -29 -254 -78 95 195 -106 159 -190 88 -189 108 -40 -110 -88 58 -149
4317 -149 156 133 -4 -42 78 -12 60 92 122 163 -178 75 37 136 -17 -76 -154 -11 -52 72 71 29 -250 -85 69
4342 69 -83 177 -57 32 -33 28 -18 -198 -60 189 218 -78 -28 -62 -31 86 10 18 14 149 227 -113 -45 -147 -2
4367 -2 -261 -22 126 66 -70 -151 -176 -1 -83 254 -135 -133 89 -80 86 145 -11 -295 22 -369 20 88 353
4390 353 -26 144 -34 77 225 62 -225 102 -144 -104 315 79 -177 39 1 97 -55 -62 -102 48 -249 -48
4412 -48 26 -30 -119 -131 50 -6 25 123 -64 -303 -213 373 -63 89 -161 -203 55 6 -317 -197 35 -42 3 60 103
4437 103 19 199 126 138 -18 23 231 115 -107 -337 -39 175 -90 -207 69 -110 -22 -52 -31 75 -299 232
4459 232 -114 -47 33 -212 -52 -123 347 212 117 -70 -81 95 135 47 -140 -15 -69 106 68 -155 -137 91 -78
4482 -78 -181 51 15 216 77 52 122 18 157 -110 -121 -17 121 -85 -36 -50 163 118 106 18 105 83 -184 85
4506 85 121 -19 -93 81 -179 172 198 -86 -37 58 16 169 -66 -125 -68 -48 -29 -255 63 142 61 -49 186 -17
4530 -17 50 -50 -127 -113 1 -242 48 77 -99 -212 171 173 -77 169 -67 320 -120 79 83 95 247 -188 47
4553 47 -144 85 40 93 -190 52 -92 110 149 -79 -248 -19 20 174 -140 196 -244 255 123 7 -47 -46 86
4576 86 54 -48 -124 40 148 -112 -80 -178 7 86 -9 -66 92 46 -71 145 -81 128 209 2 40 183 -47 -121
4600 -121 -195 -75 238 -286 213 15 -93 148 -211 -222 69 405 -2 -135 -65 -204 88 184 -125 9 -218
4621 -218 -13 -270 119 68 1 -79 -191 152 -20 129 -32 -51 -195 198 31 65 366 -9 187 -28 118 132
4643 132 5 30 93 175 142 15 -299 88 -293 33 107 180 40 -22 73 -160 241 -59 83 -324 62 -55 107
4666 107 -54 -191 -129 60 174 139 -197 285 95 -106 182 85 18 9 49 -338 258 26 -293 -249 168 -130 24
4689 24 35 13 148 -208 -260 -65 343 -154 54 -206 183 58 -108 -215 -114 14 59 175 -53 -53 -94 -113 107
4712 107 -115 -176 241 -116 -125 23 166 -30 -62 -35 -93 179 272 -60 94 -132 104 -45 291 -65 -100 -177 -230
4735 -230 200 201 248 0 -251 161 186 -121 243 -163 -36 -143 -171 25 9 239 -184 166 86 336 -128 110
4757 110 -81 -22 -2 117 116 -115 76 -169 -119 -42 -63 44 -37 -9 32 -22 -58 122 -82 108 -113 25 94 20 -1
4782 -1 82 -32 -72 255 -156 37 94 -39 -110 -138 -67 -37 21 -177 162 -110 -72 68 26 243 -40 8 124 -7
4806 -7 -89 49 85 -63 -113 -122 131 -218 135 -295 -254 193 76 -144 -93 -110 -78 52 6 114 -81 78 -167 284
4830 284 72 144 103 -153 81 29 162 94 28 166 105 -203 -54 85 -27 -17 121 216 98 64 -23 -10 0 68
4854 68 230 -15 -18 -63 -56 -2 31 -111 -177 -83 -114 48 -141 -245 229 200 -1 -190 -207 -2 14 -41 10 112 -109
4879 -109 -89 33 93 -221 -9 82 73 0 87 -132 95 3 -2 68 -125 0 -25 78 166 0 149 180 109 -45 175
4904 175 -136 188 39 71 -103 -72 -204 -157 154 -154 40 110 -88 -55 -49 -68 84 -89 -170 145 112 32 9 97
4928 97 50 -72 8 -94 -7 -185 -20 14 44 -86 22 -66 21 18 152 -45 -195 -271 81 54 -110 42 52 275
4952 275 -16 -144 115 -258 -259 130 152 -57 15 7 116 -145 172 -30 -211 -158 -133 18 -179 -156 -29 -97 78
4975 78 115 106 122 44 132 -112 -274 -200 -27 100 -165 27 -66 -69 -65 -48 67 200 -189 125 14 -2 40 107 61 -121
5001 -121 117 -241 197 157 128 27 116 -7 15 -229 134 170 168 78 87 -50 123 -54 -162 -259 69 -10 -135 -49
5025 -49 -185 -107 -206 104 -95 95 145 -189 -90 50 -166 -7 -23 -155 -5 136 199 201 56 18 -5 122 22 55
5049 55 13 -184 -93 -178 -4 -149 156 -40 -91 257 156 -83 189 -249 -111 12 106 25 30 56 91 58 58 -123 -14
5074 -14 40 48 -46 -123 50 168 262 -102 82 109 -10 13 -219 174 144 -93 97 -145 16 45 70 -243 -3 7
5098 7 -119 -129 153 76 -60 -169 -9 -40 111 76 225 -44 -17 -156 -2 132 22 190 249 -48 -121 -112 -236 -69
5122 -69 20 -128 67 103 284 87 -34 23 -63 293 82 -107 31 -179 330 -174 -46 -139 -5 264 -178 91
5144 91 -293 -145 -139 -281 -33 23 292 -191 88 -56 1 -17 25 -38 -82 0 -58 187 -320 34 35 26 5 1 -191 -13
5170 -13 -26 191 88 -95 9 -14 46 -290 -132 189 30 21 -4 64 85 -122 -174 -53 -13 80 -24 -97 5 173
5194 173 54 229 -55 -8 221 216 16 -271 -199 -9 134 -5 -20 -44 -98 -27 -298 -48 -177 35 -225 -129 103
5217 103 -287 175 -81 -160 23 91 -107 119 6 -163 62 -8 224 -47 356 30 -129 114 65 48 147 -257
5239 -257 -28 231 60 -74 14 5 -271 -71 89 179 26 -21 -46 74 233 99 173 12 -18 -4 -43 -93 -207 193
5263 193 -95 -15 186 118 4 -20 91 57 -127 128 -44 -152 222 -92 -18 286 210 143 49 109 256 -43 -455
5286 -455 -74 225 143 40 193 195 -162 178 -102 178 -39 81 25 -142 3 249 199 -159 -121 105 214 -97
5308 -97 -51 80 33 -97 103 -64 -149 87 -38 -223 150 48 5 -26 133 -146 81 -127 -55 0 -11 242 142
5331 142 -217 60 62 -68 157 -75 108 82 143 -7 127 53 154 -16 -140 -14 205 -100 37 157 -55 110
5353 110 207 -96 108 -8 -160 45 -7 61 12 66 151 54 -119 -163 -91 318 -95 115 77 138 -64 -95 44 163
5377 163 -71 4 202 -139 -106 -46 225 127 -42 149 21 50 17 -7 -11 20 40 -78 44 44 -262 -12 132 -42
5401 -42 -124 57 150 233 -138 116 -109 11 80 173 -129 -110 126 112 -106 6 -11 -145 120 -41 -90 -3 131 -129
5425 -129 6 158 -6 77 199 -146 -208 211 -205 -35 -53 19 -11 127 -137 97 -8 -326 -99 -3 -203 48
5447 48 58 37 97 -153 -206 159 92 51 -160 -18 116 -22 -106 22 -313 1 -193 124 118 9 128 -80 -100 -107
5471 -107 -120 -12 -171 -47 155 77 115 27 149 -88 46 -148 2 29 -5 2 107 -180 -131 230 -25 -44 -108 -200
5495 -200 -39 -50 -28 112 -29 -99 -63 -91 -231 -50 -17 214 41 -175 270 177 33 152 -77 -5 -4 55 7 263
5519 263 -107 -42 62 46 201 177 163 -32 -119 -128 157 -92 -114 53 -46 -61 219 12 21 -35 -96 -103 -189 137 18 -144
5545 -144 -22 -243 47 45 149 -108 57 8 108 40 180 50 -57 -4 -69 157 28 -201 -86 55 -100 54
5567 54 14 36 23 -120 -31 -110 -134 -41 30 -107 -143 -142 23 166 -104 -226 -45 159 17 -41 372 42 70 -171 -87
5592 -87 106 -19 72 3 40 -48 86 -40 -188 -229 -86 99 167 70 125 -25 240 -127 -300 16 113 167 -29 -215
5616 -215 -98 -35 -1 28 -189 -60 -78 71 26 -59 -53 47 -72 1 41 130 4 -77 149 -231 138 106 -124 -26 124
5641 124 123 -83 65 28 29 98 73 -61 220 138 171 -136 238 -256 -43 -32 -119 -143 -72 -172 -154 -170 70 -23 15 148
5667 148 -24 -66 -146 19 20 159 -8 78 171 -85 -247 -228 -44 -182 -44 38 9 -96 -125 -161 -22 -153 8 188
5691 188 -217 -154 42 -175 -231 -36 61 -14 -82 -7 31 -48 -2 51 -189 147 -49 100 -126 -22 111 -44 7 -115
5715 -115 37 -37 -53 140 35 21 178 236 -142 -41 82 -148 55 15 -31 -206 -119 127 -12 -151 33 -22 -93
5738 -93 76 64 93 143 18 125 290 115 188 -1 54 -60 138 112 166 -28 78 7 -13 -79 -14 -14 -32 233 101
5763 101 -86 -79 -145 105 86 127 120 -173 -144 91 103 73 -54 39 153 5 113 47 -197 -103 -83 -48 13 -95 -70 124
5789 124 124 -120 59 86 269 115 -17 -71 -217 -72 -34 -10 -188 -126 240 -103 -37 -69 -35 368 135 -181 -68
5812 -68 124 -6 97 140 -35 214 65 -105 -99 -112 33 -275 99 -15 -1 -105 36 56 19 -60 -115 -30 28 -36
5836 -36 -63 90 291 -8 -277 -221 54 87 -7 102 24 208 -185 -131 -32 -278 101 138 76 -221 82 -31 -98 38
5860 38 -217 -129 -4 13 -26 -56 191 81 -1 18 187 -48 -50 28 -98 98 -58 -47 -186 12 -186 -148 120 92
5884 92 151 -133 -2 -57 27 206 253 -38 17 -3 -90 68 93 92 -100 -32 45 206 59 101 -208 -323 88 20 106
5909 106 62 -94 86 223 -2 369 40 34 -111 -140 -17 374 -16 -102 62 -87 60 29 109 -106 79 171 171
5932 171 -67 4 42 -3 24 15 2 129 -27 -13 238 -166 54 8 153 71 103 258 -82 31 -277 -105 -295 18
5956 18 283 64 -138 -186 363 67 18 -17 17 -39 197 65 79 168 -64 -37 -297 -66 -207 91 77 -1 30 -153
5980 -153 13 -33 -1 -41 53 35 219 -244 406 -213 -20 8 233 66 41 49 107 53 -193 137 -151 59 -27 -95
6004 -95 -191 79 97 -70 76 -15 -32 -49 -34 -200 273 50 -106 -56 -123 93 -233 260 -151 95 44 155 -87
6027 -87 -30 91 -101 19 0 82 27 205 -54 48 68 -23 201 -14 -63 -156 250 47 -49 -57 36 120 -67 46 -130
6052 -130 -275 131 -228 116 41 10 228 63 144 54 81 52 -221 254 -38 -34 51 -159 -192 -63 223 132 -208 -100
6076 -100 -114 106 -117 -118 -9 85 5 35 2 172 90 35 96 111 192 130 -176 -221 102 100 -38 -136 91 -197 -144 76
6102 76 -29 61 -148 22 -101 -319 -45 136 47 -9 -191 -82 342 84 218 160 -39 40 50 -60 -44 -61 -58 -51
6126 -51 330 -182 142 -160 50 90 -25 108 -38 30 81 -248 -215 -207 201 -236 -24 -4 113 -100 220 170 -145
6149 -145 -76 -107 166 77 78 54 -74 -162 47 240 -159 -87 12 -59 -43 44 -164 61 -94 -166 3 158 198 -18 164
6174 164 61 -166 -18 140 132 148 -147 -112 -138 -3 138 13 -61 -105 -43 -141 -20 -16 -286 85 -115 -56 -145 124
6198 124 -83 29 -6 86 -231 374 -4 49 -63 131 26 -123 158 37 136 -143 129 119 179 7 99 33 16
6221 16 110 21 -6 -135 -20 18 -180 -221 0 -37 154 -324 -45 -4 -92 -40 26 3 -62 -99 -228 -147 -229 49 33 80
6247 80 -11 129 30 151 24 113 23 -56 144 253 -55 -383 -34 -93 17 -34 -154 141 167 47 77 30 -39 -100
6271 -100 -66 18 -10 75 10 -272 4 -100 -172 49 214 -37 -45 56 -86 -154 30 73 -50 27 32 -19 -156 137 221
6296 221 10 218 23 -110 -78 -73 215 37 -129 -56 -233 23 -113 -196 31 -136 -39 -137 -159 54 -257 -138 -2
6319 -2 61 20 -101 -179 -225 68 30 138 -123 8 -62 231 62 -140 -207 156 -299 129 24 -231 -161 -33 277
6342 277 -104 -44 -3 -76 18 -56 -12 38 -12 -58 -59 -84 75 160 -30 88 272 130 17 72 56 -39 66 -17 -49 89
6368 89 8 136 -54 232 77 5 -10 -74 69 103 315 115 3 -56 -4 4 336 39 -326 -30 52 -149 40 42
6392 42 135 145 -88 -10 241 -134 23 -62 -32 232 2 -137 -85 121 236 -66 164 185 -49 -102 42 103 27 -103
6416 -103 70 -51 77 110 -28 -3 103 244 -1 15 46 -124 -1 -4 -20 101 48 5 27 10 -4 -64 -35 -56 189
6441 189 163 -31 -14 -143 -18 78 -103 207 64 -44 -16 15 -168 -132 133 -54 -35 -150 -46 95 20 234 128
6464 128 -98 135 22 -138 47 -70 -25 163 -135 152 119 -76 57 -214 -62 -122 -131 -27 31 94 93 -75 -7
6487 -7 -212 45 -35 -140 -15 28 -114 -17 -266 61 -94 -173 181 -151 204 32 29 -63 187 76 214 61 -16
6510 -16 210 -11 370 -209 -211 83 -67 32 -348 -18 -49 15 -116 -311 -102 -13 -60 -23 -34 -235 24 -44 182 -153
6534 -153 -47 -10 -342 129 10 206 140 -115 -7 173 -144 -21 -18 -19 77 122 -44 -209 -41 -84 272 -101 -33
6557 -33 319 -159 99 298 29 -64 -73 121 -161 184 371 -268 -200 123 -212 -18 123 45 92 -48 149 223 -91
6580 -91 56 -116 -16 57 180 134 -16 -117 278 7 -16 24 -142 -138 -20 2 -46 53 120 -178 -16 265 174 130
6604 130 -50 -11 -88 439 222 -118 157 95 143 -167 89 26 147 -103 82 -17 -100 87 -149 -160 -66 -177 270
6627 270 74 58 97 130 -76 108 -181 -150 -339 -94 -123 -37 8 20 -320 -239 56 80 64 -168 19 -87 82 -213
6651 -213 -79 15 -16 -310 53 -27 115 -56 -147 -144 -184 342 -50 220 -87 -141 -178 189 19 -107 144 15 179
6674 179 -55 106 -195 30 -284 136 -6 135 17 -260 184 168 239 -137 -166 6 36 -22 89 0 -96 -79 101
6697 101 94 175 -217 -28 115 129 -52 -135 89 153 131 90 -231 -58 157 -148 49 101 -7 -17 -25 52 46 -42 -9 95
6723 95 115 323 -149 196 40 92 155 91 93 30 -157 -49 -116 -136 -11 -205 -102 -75 215 77 -89 13 151 4
6747 4 -68 -107 161 98 92 -97 19 -134 162 102 154 -235 -56 166 -198 -58 52 55 37 169 127 -11 162 48
6771 48 -22 -161 224 -98 -50 -127 2 -271 -114 -154 8 -27 159 92 155 6 18 73 202 16 -35 51 -36 -33 33
6796 33 124 50 233 79 238 74 -166 128 155 -170 125 62 8 -109 -23 -92 -34 39 -139 17 54 -301 -10 105
6820 105 122 302 -78 -139 -201 -4 -97 -33 -290 201 146 126 -9 -57 2 -84 326 44 -66 -27 60 35 23 -97 -151
6845 -151 24 6 57 249 -23 14 126 -64 57 -296 -147 -162 78 127 -184 45 115 -136 -85 75 -11 -22 -129
6868 -129 114 -256 101 56 -58 34 221 205 -45 -17 17 201 4 -151 -110 -12 80 -87 -61 8 -93 61 140 160
6892 160 249 232 165 -61 -291 -18 -91 34 -120 -158 -73 -120 -56 121 246 -243 77 143 157 14 -30 -168 71 -10
6916 -10 97 -139 -58 46 328 10 -165 -130 159 -21 -203 -115 -44 -356 -3 7 -108 -1 37 -192 148 133 -92
6939 -92 -310 -154 83 -44 -59 126 7 -178 -71 8 21 -20 58 -247 93 164 -90 -62 41 30 102 -168 86
6962 86 -168 83 162 -49 214 -160 0 135 98 232 -59 104 68 -184 -212 -9 -75 116 90 60 -203 27 -154
6985 -154 61 138 -100 22 -34 35 43 127 -148 61 26 -212 -52 86 -232 18 -104 272 -32 -58 -142 -42 165
7008 165 -233 35 284 69 81 -155 -44 -278 36 -110 177 -209 141 257 70 25 -98 -232 -9 -25 -106
7029 -106 -19 -47 139 -146 -114 -1 338 -219 -53 -36 102 -63 105 -87 -199 4 -121 129 174 -297 317 -109
7051 -109 39 -118 29 22 -27 -139 -126 91 -147 -117 14 -279 47 -216 -368 -113 184 42 99 167 -75 250
7073 250 49 -161 111 -227 -87 47 36 32 -100 7 -163 -73 -22 143 -142 200 -174 46 69 25 44 -181 -165
7096 -165 12 124 24 70 -54 -2 7 -215 -162 -225 -142 54 -394 -55 71 186 153 -77 -25 -89 5 38 96 28 156
7121 156 1 -48 -153 -210 -202 104 -51 -4 86 -89 -53 96 -230 52 41 41 85 50 38 205 -35 -66 121 62 -104
7146 -104 209 -166 36 194 -41 108 131 -217 137 63 222 22 -340 47 -9 -158 -80 -112 56 176 56 100
7168 100 -52 65 23 -44 -40 -376 161 49 -140 -12 -110 -38 -33 47 36 50 -82 79 178 -117 1 52 192 77
7192 77 152 -27 58 11 16 174 158 90 170 -13 24 57 209 18 62 34 7 -107 -18 -177 -65 184 -233 115 69
7217 69 -31 222 23 114 -269 -74 147 130 23 166 -129 -186 -82 125 36 12 -36 52 110 295 -16 206 159
7240 159 -133 -30 94 138 87 100 55 25 -182 70 -46 92 233 55 25 86 74 83 -64 207 53 -39 192 24
7264 24 253 -208 -173 46 211 95 95 26 -146 80 -35 17 -287 90 -36 0 -36 -128 -16 37 64 2 78 87 141
7289 141 109 -46 -144 81 62 65 -148 181 -20 -66 168 -284 69 -131 -132 71 -47 25 224 264 -33 -70 76 -77
7313 -77 28 5 148 -164 -26 133 131 -45 69 -173 72 -22 -201 94 247 -90 133 79 -130 48 -137 -25
7335 -25 221 -59 -17 118 -81 277 -410 58 9 -154 124 -46 276 36 -52 33 -106 60 173 101 -72 129
7357 129 304 -110 93 8 8 -35 -236 -198 122 -15 -15 -51 -114 74 -46 120 48 -139 104 40 -219 177 0 103
7381 103 -123 -233 195 -26 -48 53 29 -129 -92 37 -19 -196 6 22 78 52 20 115 148 71 -248 -162 65 95
7405 95 -63 -122 -194 -9 -89 -90 -151 53 266 67 -82 -16 -159 -244 -207 -31 274 105 44 -14 -59 -220 4 126
7429 126 370 -11 53 -307 29 51 -82 -90 85 -99 -58 -31 172 101 37 186 156 134 200 -109 85 124 4 -30
7453 -30 -176 -6 -21 -44 -16 6 3 31 43 -177 218 -53 -110 -84 -221 -30 -56 134 6 77 -67 -1 53 -123 -138
7478 -138 -32 89 53 98 55 -45 30 60 105 -14 171 -183 -92 32 -318 -180 -44 -24 -61 -1 77 21 -3 -36 274
7503 274 74 120 11 -225 -264 140 63 -94 -16 -61 -127 -71 120 8 278 -153 23 -162 -166 -54 -80 -178 -156 -100
7527 -100 -1 212 -71 -13 -43 68 39 -106 -5 -95 -179 59 186 133 120 105 55 61 54 92 -274 301 99 -35 159
7552 159 -22 -226 -136 91 -94 -194 -37 243 171 -91 207 -51 -276 -259 -260 -201 96 -53 253 63 51 242
7574 242 -297 -70 112 24 121 135 -128 -76 176 -68 -7 181 247 24 29 -33 27 -162 -114 128 -132 38 -76 -16
7598 -16 219 50 -237 82 53 -179 -87 157 61 -20 -24 -69 29 -53 12 211 189 -81 231 -73 47 -132 124 157
7622 157 -48 -143 86 235 -27 20 -65 24 -94 250 33 76 -56 84 6 -243 -7 -215 -141 -70 148 -13 -77
7645 -77 244 347 242 23 -37 -59 -22 136 -244 201 -21 -30 59 53 166 -153 81 28 -51 12 -3 -130 280 170
7669 170 2 11 110 110 144 -3 25 -239 -24 -124 -45 -232 -26 2 53 -148 -82 -68 -129 -43 -69 38 15 -126 -11
7694 -11 -39 -12 114 -47 37 -61 -236 -176 -196 141 132 -7 -52 -60 109 -202 22 -141 185 -183 -327 6 -26 93
7718 93 -309 87 136 162 -1 6 -43 161 -121 -32 5 -254 -10 -185 -110 1 -43 -1 46 -44 -98 -16 122 54 -118
7743 -118 -41 -71 114 -222 -5 176 -83 -60 167 21 295 196 -49 151 89 13 27 328 34 106 -256 -72 -218
7766 -218 48 -101 -108 2 274 -175 51 -58 -96 112 -187 124 -31 205 119 1 -74 -64 53 -356 -98 -83
7788 -83 338 -69 5 -8 -163 -1 -72 -241 -93 50 114 -4 -27 216 109 102 -78 -106 212 -73 12 -17 -54 -192
7812 -192 -191 59 85 126 -64 -30 0 86 -54 -134 -25 -30 151 83 -92 -22 -45 142 -277 -56 126 -94 85 125 -326
7837 -326 -92 -20 99 -19 -56 -113 9 -179 271 -170 51 -138 48 132 319 321 -268 157 -91 144 93 -116
7859 -116 126 -136 -81 -47 87 12 -250 220 -134 -169 13 -111 -4 207 24 32 220 118 -120 87 -68 95
7881 95 -250 32 -25 79 -18 -36 75 20 -116 -160 -51 50 -1 -198 0 7 40 151 73 2 -89 -143 -50 54 -153
7906 -153 -229 24 139 54 -62 113 -77 250 83 60 -41 42 -87 -127 69 -132 -61 51 -10 11 27 145 82
7929 82 -98 -34 -54 89 -2 48 -57 211 131 -166 -254 80 -278 -96 65 115 -66 -3 18 216 60 -124 279
7952 279 122 22 20 100 -76 -113 62 139 -211 25 -366 -130 -20 -50 -136 -143 133 -202 -174 -172 -15 -303 48 42 -9
7977 -9 100 39 -72 125 221 81 -155 -215 -18 64 -92 332 66 59 -135 49 -2 96 4 6 4 -23 -340 245 63
8002 63 87 -110 52 8 -81 -101 -50 20 61 -72 18 126 179 -32 126 71 237 35 -59 -21 -38 29 142 -77 -69 17
8028 17 -75 61 -41 99 -19 263 155 26 -110 -35 8 -79 -2 7 53 -104 -5 -74 18 230 59 129 137 34 173
8053 173 -173 165 179 -82 -13 -115 -138 -67 -45 -30 -135 22 30 -2 72 130 10 -140 212 -83 245 -324 -86 -141
8077 -141 52 30 -153 144 -10 -12 78 -22 48 229 -55 -106 32 3 -96 -58 87 28 173 -37 -318 -166 101
8100 101 -137 134 15 -119 -42 -49 33 50 -151 97 169 -57 -186 -70 -131 -147 134 101 -25 -67 30 -238 -1 -165
8124 -165 -39 14 -85 -116 -79 97 -102 111 84 100 -150 86 -5 29 -48 37 70 -21 68 2 139 335 -144 51 143
8149 143 -53 212 12 91 159 16 66 -5 17 -87 131 74 -155 279 109 -87 -96 147 -25 22 -51 89 9 240
8173 240 57 142 -98 70 167 -296 106 129 -65 7 -94 16 -157 -135 44 26 67 -162
8191a62
$$ Imaginary data points
##PAGE= N=2
##DATA TABLE= (X++(I..I)), XYDATA
0 0 0 0 0 0 0 0 0 0 0 0 8 -8 8 -8 8 -16 16 -17 24 -25 32 -40 43 -48 56 -64 74 -85 96 -109 124 -139 156
33 156 -173 193 -214 238 -265 294 -326 360 -400 442 -490 542 -601 668 -745 833 -935 1055
51 1055 -1201 1380 -1604 1900 -2310 2909 -3883 5733 -10564 50698 109572 35730 -2548 -1997
65 -1997 44323 67223 59349 25784 14929 26066 47273 48024 35053 16248 9419 13591 33043
78 33043 54237 56452 22373 -16479 -18334 22170 59166 54711 12843 -19878 -9608 30247 46370
91 46370 19790 -15710 -16836 14404 40558 33220 3421 -19695 -20383 -1908 21763 31998 19355
104 19355 -7034 -25612 -20226 6722 28513 16790 -17700 -31405 -5505 27443 25369 -12071
116 -12071 -43055 -31506 9960 35442 20053 -17265 -38151 -25227 1515 13672 6595 -6311
128 -6311 -15257 -16945 -7712 5768 7138 -8869 -25655 -22355 3435 27144 18458 -19101 -45007
141 -45007 -28063 14525 35976 14026 -22850 -31405 -8521 15016 14581 -3150 -17171 -12067 5278
154 5278 16109 11494 -1262 -13621 -18359 -6666 17007 31085 16673 -14614 -29503 -9919 23471
167 23471 32447 8879 -17876 -16008 11705 31567 18608 -11889 -22101 -498 25645 30418 14678
180 14678 -4580 -12081 -4561 10411 22103 23511 12094 -4165 -8262 5678 23798 24315 3407
193 3407 -14001 -3036 26570 38033 15476 -14827 -19670 4814 32465 34887 12196 -8939 -8114
206 -8114 7803 19958 19291 10458 2401 877 7273 17313 21247 10262 -6902 -9973 7404 29107
220 29107 31565 9202 -16322 -16178 9696 31361 24938 998 -11774 -1750 16753 21678 8925
233 8925 -4424 -5555 4736 16371 19808 11791 -1005 -9321 -6260 8771 24224 22188 1462
246 1462 -15139 -8895 12868 25209 13566 -8430 -14209 4073 23706 21502 215 -16004 -10325
259 -10325 9909 21695 16397 2439 -7406 -7299 1384 11216 14938 8617 -2581 -7812 -107 14209
273 14209 17632 2871 -13935 -11538 9497 26020 18110 -6191 -19677 -8091 13404 21740 10626
286 10626 -5047 -9398 -291 9464 10820 4814 -1627 -5020 -959 8799 14930 9740 -4784 -14212
300 -14212 -6701 12932 22906 11605 -9400 -16964 -3101 15844 18385 2317 -12101 -8069 7454
313 7454 15622 9052 -4447 -10510 -4612 6414 12526 10430 1261 -8574 -10322 -1024 11812 14776
327 14776 3376 -11117 -11752 2704 15517 10223 -6450 -15263 -5786 11276 17137 4106 -11808
340 -11808 -14396 -3045 9851 12472 3790 -6294 -9626 -4727 4087 8924 4897 -4880 -10503 -4553
354 -4553 7681 12552 3430 -12370 -15921 -1670 14283 14499 -1206 -15426 -13076 2301 12511
367 12511 7517 -4614 -10434 -5850 2740 6997 3678 -3848 -8687 -7250 731 8662 8412 -2392 -13929
382 -13929 -12368 1195 13096 9981 -5851 -16348 -8968 6176 12178 2583 -11102 -13266 -2095
395 -2095 9346 8781 -2394 -10856 -10115 -1886 5776 7168 1192 -6941 -11040 -5933 4449 9244 2500
410 2500 -9453 -12918 -3335 9084 9838 -3260 -14939 -11387 2501 11829 6267 -6607 -13645 -8334
424 -8334 2867 7434 3529 -4515 -9242 -7162 422 5769 3617 -4022 -10937 -8732 2097 9900 5123
439 5123 -7858 -14660 -8103 5903 11857 2594 -10654 -13189 -3571 7206 7914 -1396 -9964 -8931
453 -8931 -787 5931 5582 -1108 -8178 -8992 -2037 6097 7837 766 -9367 -10984 -1448 8868 8859 -1646
469 -1646 -11069 -9133 2529 10472 5962 -5246 -10273 -4801 5123 9324 3934 -4760 -8159 -3908 3638
484 3638 7971 5302 -2152 -7744 -5210 3502 10006 6633 -3841 -10324 -4112 7965 12193 4132 -7613
499 -7613 -9885 35 10910 10572 470 -7664 -5944 2585 9360 7338 187 -4873 -4303 1896 7629
514 7629 7936 1759 -5391 -5784 1337 9160 9518 951 -7885 -6591 3826 11380 8053 -2549 -8802
529 -8802 -3914 6066 10282 4785 -3772 -7305 -2339 5743 8396 3791 -3316 -6711 -3278 4428 8883
544 8883 4081 -4729 -8544 -2692 6527 9224 1816 -7669 -8785 -976 7596 7900 -979 -8245 -7072
559 -7072 846 6380 4631 -1616 -7329 -6268 73 5599 4705 -2100 -7742 -7343 -459 6555 5661 -2821
575 -2821 -9953 -8035 1215 7527 3811 -5359 -10053 -5563 2855 6682 1655 -6880 -9432 -3431 3433
590 3433 5274 990 -5931 -8901 -4201 2815 5874 1509 -5894 -8506 -3487 3846 6170 483 -7254
605 -7254 -9064 -1559 7076 6464 -2056 -8510 -7147 602 7055 5303 -1926 -7215 -5098 1394 5681
620 5681 3875 -1384 -5218 -4139 1403 6033 5241 -1428 -7208 -4644 3528 8380 5434 -2453 -7784
635 -7784 -3863 4814 8695 4045 -3597 -6031 -1013 5740 7262 2405 -3628 -4965 -305 6568 7685
650 7685 1973 -4203 -5019 -15 6338 8067 2519 -4606 -5388 1122 7021 6910 472 -4756 -3638 2642
666 2642 7342 5813 -909 -5487 -3563 3206 7070 4974 -480 -4830 -4236 1907 6987 5252 -1365
681 -1365 -5439 -2974 3503 6904 3663 -3444 -6842 -2330 4883 7633 2170 -4962 -6662 -1642 4396
696 4396 5914 1701 -4504 -5735 -1134 4079 4455 34 -4508 -4812 -745 4555 4785 -346 -6112 -6361
712 -6361 -365 5753 5090 -585 -6143 -5855 44 5238 3936 -2636 -6132 -3531 1907 4515 2264 -3377
728 -3377 -6399 -4001 2046 5532 2417 -3576 -6571 -3984 1631 5256 2707 -2997 -6016 -3021 3362
743 3362 4939 315 -4847 -5625 -1213 4589 5449 146 -5644 -5923 -592 4536 4878 429 -3897 -4765
759 -4765 -1057 3839 4588 -92 -4471 -3659 1251 5058 3795 -1334 -5739 -4301 1797 6534 4134 -1662
775 -1662 -5337 -3563 1652 5133 3542 -1307 -4520 -2336 2819 4869 1765 -3252 -4633 -1348 3837
790 3837 5846 2336 -3926 -5909 -1303 4079 5667 1835 -3078 -4610 -1050 3872 4292 313 -4108
805 -4108 -3547 914 4367 3981 -243 -4452 -4814 337 5350 4494 -774 -4780 -4399 -45 4298 4090 -1145
822 -1145 -4640 -3474 1828 4809 2270 -2962 -5377 -2728 2686 5297 2727 -3439 -6205 -2435 2937
837 2937 4203 1675 -2720 -4455 -1868 2362 3385 244 -3748 -4425 -1003 3692 4337 276 -4608 -5320
853 -5320 -1144 4180 4442 196 -4028 -4264 -536 3390 3203 -108 -4011 -3205 1006 4335 3072 -1728
869 -1728 -4786 -3116 1655 5135 3767 -1247 -4883 -3314 2002 4550 2674 -1308 -3581 -1939 2556
884 2556 4343 1642 -2829 -3938 -678 3656 5068 1720 -2915 -4596 -1455 3235 5099 2056 -2391
899 -2391 -3878 -344 3123 3840 856 -2717 -2773 1192 4536 3519 -314 -3471 -3009 872 4767 4305
915 4305 302 -3541 -3485 509 4318 3598 -161 -2577 -2066 1694 4306 2900 -1741 -3907 -1492 2852
931 2852 5163 2662 -2092 -4520 -2018 2917 4825 2099 -2038 -3408 -858 3079 3741 918 -2556
946 -2556 -3247 -48 3660 3674 80 -3369 -3579 -148 3584 4200 804 -3048 -3322 -550 3051 3190 -58
963 -58 -2944 -2863 516 3608 3056 -990 -4263 -2689 1597 4265 2937 -1308 -4385 -2875 1693 3987
979 3987 1997 -1550 -3780 -1568 2000 3479 920 -2581 -3569 -1085 2694 3982 770 -2809 -3835
994 -3835 -1347 2326 3456 990 -2498 -3238 -940 2098 2775 214 -2601 -2847 232 3242 3034 -601
1010 -601 -3968 -3374 438 3640 2948 -594 -3705 -2981 431 3196 2260 -750 -2656 -1854 926 2791
1026 2791 1647 -2109 -3390 -1581 1976 3693 1629 -2328 -4044 -1978 1809 3546 1682 -1945 -3132
1041 -3132 -1204 1988 2556 390 -2308 -3087 -230 2798 2657 -160 -3027 -3194 -142 3027 2920 225
1057 225 -2881 -2724 -283 2565 2493 -400 -2549 -2329 482 2339 1943 -1294 -3451 -2033 1082 3392
1073 3392 2149 -1401 -3818 -2599 1182 3184 1920 -1250 -3262 -1521 1537 3002 698 -2264 -2990
1088 -2990 -713 2394 3087 380 -2622 -3051 -693 2142 2838 578 -2247 -2664 -652 1722 2251 132
1104 132 -2527 -2134 568 2478 2325 -501 -2936 -2556 383 2598 2516 -478 -3016 -2708 582 2788 1833
1121 1833 -1159 -2811 -1734 1037 2798 1303 -1550 -3027 -1258 1840 3035 939 -2031 -3232 -1536
1136 -1536 1560 2692 1080 -1665 -2750 -750 1447 2056 178 -1901 -2443 -255 2268 2172 -103 -2376
1152 -2376 -2683 -263 2550 2732 -311 -2640 -2624 -114 2544 2102 -551 -2401 -1658 705 2264 1548 -1322
1169 -1322 -2859 -1492 973 2819 1861 -1330 -2775 -1609 1304 2556 1330 -1050 -2540 -1218 1395
1184 1395 2401 488 -1620 -2208 -545 2186 2418 264 -1948 -2276 -489 1830 2814 647 -1624 -2027
1200 -2027 -245 1993 2208 263 -1841 -1856 524 2270 2042 -195 -2270 -1634 697 2757 1927 -190
1216 -190 -2222 -1539 1255 2772 1591 -252 -1675 -1159 1392 2737 1445 -964 -2029 -470 1784 2903
1232 2903 1193 -1396 -1946 -408 1832 2708 1219 -1161 -1648 32 1860 2215 877 -1250 -1443 261
1248 261 2373 2332 401 -1748 -1632 250 2588 2648 319 -1839 -1655 597 2318 1928 -38 -1588 -1176
1265 -1176 905 2506 1896 -771 -2082 -879 1261 2399 1211 -764 -1843 -943 1024 2146 1147 -691
1281 -691 -2003 -703 1053 1683 584 -1246 -1997 -387 1618 1866 276 -1640 -2003 -616 1909 2257
1297 2257 363 -1646 -2097 -279 1406 1529 -294 -1724 -1699 84 1565 1495 -452 -2245 -1441 443 1788
1314 1788 1450 -709 -2442 -1662 460 1426 808 -1235 -2000 -956 651 1535 425 -1411 -2023 -1089 1009
1331 1009 1605 416 -1441 -1976 -723 743 1802 675 -1628 -2029 -582 1172 1320 159 -1622 -1746
1347 -1746 -327 1371 1411 -164 -1556 -1504 83 1426 1626 0 -1315 -1827 159 2013 1559 -473 -1515
1364 -1515 -1330 286 1855 1046 -798 -1699 -1286 974 2151 821 -923 -1620 -538 1247 1866 847
1380 847 -695 -1596 -237 1217 1373 560 -937 -1166 -20 1766 2052 543 -735 -1080 65 1582 1669
1397 1669 723 -796 -1365 71 1962 1894 101 -1227 -915 325 1789 1670 -65 -1705 -839 975 1872
1414 1872 1240 -145 -1357 -769 969 1738 1175 -495 -1468 -442 1111 1790 528 -505 -1095 -442 1397
1431 1397 1860 960 -1018 -953 -514 924 1572 899 -773 -1141 -25 1336 1461 345 -1126 -971 60
1448 60 1328 1753 466 -1021 -1067 559 1704 1137 -149 -1227 -528 438 1472 1190 -175 -1009 -733 912
1466 912 1335 767 -261 -1341 -535 712 1691 718 -601 -1435 -283 1064 1276 669 -712 -1421 -578 1263
1484 1263 1387 510 -879 -1244 110 1201 1087 264 -801 -934 -140 1467 1156 182 -911 -1172 -162
1501 -162 1216 1133 128 -921 -1036 581 1415 1329 -158 -1170 -921 364 1385 979 -613 -1324 -683 632
1519 632 1118 653 -597 -1194 -668 1033 1648 428 -956 -1268 -428 631 1169 385 -827 -934 -498 890
1537 890 1264 7 -793 -975 -126 626 1079 394 -966 -885 51 1019 1018 -23 -803 -1058 53 1160 789
1556 789 -176 -1411 -1129 264 1321 695 -537 -1163 -822 662 1235 741 -736 -1108 -531 405 1213 448
1574 448 -579 -1137 -423 637 1228 303 -722 -917 -306 700 1003 443 -694 -1224 -295 1255 975 297
1592 297 -774 -777 90 1187 1115 224 -855 -507 612 1209 962 -258 -924 -757 116 1377 809 -11 -705
1611 -705 -338 438 759 831 -154 -841 -463 633 1128 436 -381 -910 -467 859 1417 926 -427 -1155 -149
1630 -149 834 1173 285 -507 -723 57 1016 896 171 -697 -615 30 948 1041 199 -706 -672 127 994 978 98
1651 98 -810 -560 250 943 696 17 -871 -467 584 860 634 -175 -934 -280 722 1104 599 -270 -912 -436
1671 -436 211 854 567 -601 -654 59 808 997 257 -713 -686 -115 427 643 522 -558 -731 -109 776 875
1691 875 260 -621 -759 113 867 1001 5 -831 -803 6 877 598 -304 -851 -769 244 938 603 -39 -894
1711 -894 -560 387 683 654 -430 -501 -586 519 989 304 -354 -941 -518 830 795 378 -341 -727 -386 429
1731 429 811 445 -508 -532 23 341 684 113 -594 -499 0 602 916 -294 -857 -772 300 905 619 121
1751 121 -616 -297 -7 450 710 -200 -632 -539 472 799 422 -164 -604 -467 591 726 384 -171 -684 -193
1771 -193 149 580 161 -510 -537 16 438 829 275 -456 -631 -132 803 948 218 -624 -474 22 723 568
1791 568 159 -744 -625 -41 674 537 185 -521 -558 270 748 639 -145 -624 -447 151 813 320 -451 -552
1811 -552 -380 79 697 163 -513 -707 193 199 531 248 -247 -372 -298 443 511 383 -462 -636 58 338 472
1832 472 269 -221 -254 -188 756 644 74 -426 -862 130 521 600 205 -544 -337 104 488 407 -2 -401 -558
1853 -558 104 595 205 -333 -503 -368 310 519 250 -218 -483 -652 89 448 310 -233 -555 -447 79 571
1873 571 284 -259 -255 -418 383 402 26 -504 -451 -196 217 517 399 -381 -476 -76 283 526 31 -303 -757 51
1895 51 461 184 -67 -622 -520 239 216 -7 -291 -210 -557 7 499 224 -234 -303 -130 -67 319 65 -74 -318
1917 -318 -199 239 316 -116 -226 -587 -266 152 575 243 -101 -463 -234 675 404 0 -330 -636 -137 329
1937 329 42 63 -293 -477 -169 285 85 -325 -471 -635 -47 313 325 -196 -362 -449 248 341 187 -481 -628
1958 -628 -352 -162 394 127 -109 -705 -239 200 418 330 -191 -263 -240 230 216 166 -486 -345 -121 283 504 -223
1980 -223 -414 -375 -175 304 322 59 -393 -209 -114 363 258 -117 -345 -368 32 270 393 -48 -233 -428 244
2001 244 324 -44 -372 -381 -313 310 407 290 -168 -604 105 93 334 -2 1 -364 -43 -123 298 -26 -333 -226 -233 182
2025 182 366 74 -100 -569 -416 814 310 190 -577 -135 22 207 371 59 -144 -207 225 325 17 -140
2045 -140 -138 -209 -180 448 154 -271 -196 -172 142 418 -1 -86 -438 -215 218 385 115 -163 -399 -14 318 172
2067 172 129 -3 -77 -165 459 216 91 -164 -189 107 52 315 139 -351 -452 101 302 380 -11 -395 -252 191
2089 191 296 327 -83 -235 -134 27 -139 -31 -109 -192 -154 -18 331 62 -144 -291 -283 -200 207 -106 -211 -138 -97
2112 -97 274 110 -183 -106 -35 -30 278 204 125 -391 -252 -74 218 252 41 -261 -423 -240 41 210 286 -248 -324
2135 -324 -113 229 177 -71 -407 -436 106 493 277 -176 -296 -139 49 -71 -89 -220 -118 -332 16 265 136
2156 136 -356 -362 -122 -88 115 293 -342 -293 -2 138 41 -131 -229 -170 177 137 254 161 -237 -96 255 106 -58
2179 -58 -23 -192 -243 2 -88 410 -279 -133 -111 -76 169 15 -125 -361 -353 384 248 111 -181 17 132 -122 220
2202 220 135 -207 -58 -46 94 188 -113 -97 -435 -62 26 295 62 -81 -116 -170 80 196 -31 -352 -118 6
2224 6 171 273 -115 -120 -3 -65 51 163 11 -145 -341 -19 -2 17 -74 97 39 150 255 -33 -230 -171 -213 170
2248 170 290 289 -245 -272 97 380 109 82 -116 216 159 131 116 103 70 -77 -146 15 94 202 120 -129 4 93
2272 93 186 -129 -341 -316 -75 305 222 -106 -216 -233 -105 280 -51 -378 -35 -23 182 -107 -147 -231 -87 -201 146
2295 146 -83 6 -116 -216 -191 -131 98 -34 -374 -150 -249 223 121 -239 -112 1 34 69 134 28 -143 39
2317 39 -12 23 -192 38 -63 -243 59 -41 295 13 -273 -55 -173 -92 -94 -99 -201 98 503 218 -115 -103 -22
2340 -22 254 169 67 -128 -73 134 35 -63 105 90 -168 -175 153 125 81 66 -5 -70 203 74 165 -215 -277 -125 138
2365 138 62 -305 91 262 245 -37 -16 -225 95 221 1 -66 86 153 157 19 -197 142 489 42 -188 -122 68
2388 68 173 417 -80 -262 22 -36 112 -19 -15 93 -127 187 17 -164 65 -129 -23 269 -58 78 240
2409 240 36 76 2 1 89 80 -52 124 -76 383 -158 -121 -100 -49 -5 -207 -331 -214 91 2 36 -47 37 57 -157
2434 -157 -77 190 295 64 -239 -161 -17 195 201 -8 -331 96 79 377 -153 52 11 -134 376 -37 152 -197
2456 -197 -50 -164 -101 -88 213 181 38 -263 -201 30 210 -241 -109 -127 74 59 -58 138 39 23 297 -78 -121
2479 -121 105 115 122 62 -84 -157 61 -25 -70 31 77 42 93 -106 -90 171 -132 203 -20 -22 -181 310 -7 -187
2503 -187 -180 -43 177 96 38 -262 125 -96 123 128 -165 35 -87 65 -218 106 86 -36 -307 153 254 13
2525 13 -195 -286 -3 327 41 -255 -131 -342 53 175 60 -234 -252 -38 -98 392 -165 189 -32 -85 23 32
2547 32 199 75 -14 -252 116 -16 36 69 -268 -231 153 316 137 -113 -250 42 128 -217 100 -195 213 179
2569 179 109 41 53 -32 108 -50 206 83 188 39 -66 -24 71 175 -145 -10 -160 29 98 24 -41 -204 142
2592 142 332 12 -31 -48 -11 52 -62 -217 -39 42 112 -63 273 55 115 -2 -145 -49 -196 -21 326 -299 -95
2615 -95 -234 29 213 49 -3 -251 104 20 180 61 -32 -82 -180 93 206 48 137 -239 -16 171 144 -45 -165
2638 -165 -69 119 25 204 60 -162 141 19 224 -80 -224 -43 -20 9 -70 7 -153 226 -136 -177 161 124 60
2661 60 -263 110 155 65 -78 -124 -100 -184 -130 -5 -243 -194 120 93 165 14 -80 100 117 -9 163 337 366 64
2685 64 18 61 -20 15 171 -107 -10 50 121 81 73 -330 -20 -190 -90 220 202 -120 -37 124 231 -147 5 153
2709 153 -187 -60 -37 -137 -13 -17 -49 -132 100 -183 -71 -78 -178 118 291 -230 -165 -140 38 -56 -222 -150 46 317
2733 317 46 209 231 -93 -13 -147 87 128 -104 10 -4 -143 42 18 6 -342 -122 -14 42 46 -252 55 -98
2756 -98 247 101 -136 -229 -41 112 -41 85 214 206 -48 -118 288 -52 73 2 93 -23 -19 134 152 -20 -149
2779 -149 -465 147 219 247 -215 -54 55 -3 108 -203 -199 64 -72 -82 -117 -98 -20 -243 -121 183 165 67 -61 92
2803 92 116 210 244 -354 -206 -111 -1 164 61 1 -82 -15 137 209 -189 -70 -90 1 166 32 110 34 -229 -10
2827 -10 -54 107 283 23 -103 -36 -27 383 147 -50 -381 146 250 129 34 -165 -203 52 226 -2 -161 -212 28
2850 28 12 -8 -124 21 -203 10 -202 242 55 158 32 -63 -6 -148 14 69 27 -101 207 155 -115 23 134
2873 134 37 116 57 54 -14 -212 -207 149 184 125 -13 32 -117 282 155 136 -64 -147 133 191 95 -351 -196 -49 -92
2898 -92 21 110 -189 52 -267 -44 35 -167 -86 58 -252 -167 46 194 -13 -297 -132 -21 92 -48 -28 63
2920 63 -363 -90 159 -35 -63 -102 -183 201 34 156 -230 -100 -132 169 -14 121 -169 -38 -104 -101 108 44 -451
2943 -451 -14 -142 233 33 -35 -122 -88 -67 261 1 -117 100 31 91 115 -70 219 -101 -49 13 -51 258 63
2966 63 -137 -147 119 169 19 -290 9 -7 -86 255 59 -29 56 -103 286 125 101 -156 -117 -74 101 100 78 -134
2990 -134 30 190 80 140 150 -226 -229 -88 243 51 90 18 28 83 52 414 96 11 -185 155 301 -37 -192
3013 -192 -79 -1 64 172 -56 -137 -190 -232 70 97 253 1 -175 -154 191 150 72 -77 -263 90 -61 196 155
3036 155 -82 -88 103 -107 34 303 -68 -25 -107 333 -90 -37 -216 -375 68 227 -110 -113 -186 -168 124 176 243 -38
3060 -38 -17 -309 23 34 -50 -121 -309 -239 -25 38 94 -13 92 -59 236 229 135 10 -67 103 33 287 -1 -139
3084 -139 205 213 201 212 16 -114 -82 9 -147 15 184 61 -37 -173 -43 236 -5 -171 -197 63 201 157 25
3107 25 -125 -353 185 111 -66 -31 -6 9 218 136 32 -165 -295 -56 92 139 128 -160 9 4 -40 148 22 -55
3131 -55 5 -91 45 146 -227 -224 -65 39 282 572 61 -23 -116 159 55 219 74 -211 -54 20 358 34 -68
3154 -68 -145 -436 98 18 122 -36 -158 -128 3 -27 97 82 -203 92 231 161 22 63 -68 -110 129 238 192
3177 192 -98 -225 -313 138 68 -92 -42 -209 10 118 65 82 172 -79 7 -150 -116 -199 -36 95 -157 73 302
3200 302 93 -396 -212 189 139 77 212 -219 -8 88 65 82 15 -77 26 66 13 -99 -99 -161 -138 165 281 355 -48
3225 -48 159 86 125 107 -74 -269 23 -74 134 168 -94 73 -200 -34 146 -3 -75 -39 97 70 -132 149 -41
3248 -41 -278 -120 366 294 78 30 -46 -64 77 37 288 82 -4 70 114 151 8 -130 -306 -152 -6 152 88 44
3272 44 105 -12 3 344 -79 -94 -27 143 -32 145 -94 -215 -233 -112 41 159 -128 -310 -77 -122 14 285
3294 285 -157 -275 7 -17 320 175 -7 134 -36 -64 -51 -67 10 -214 -146 103 254 -181 88 -204 -165 33
3316 33 106 43 -136 3 -41 173 -37 104 -160 -26 -56 249 239 -103 53 -102 -90 -49 -21 14 -40 0 -288 234
3340 234 234 66 65 -117 -191 74 117 92 -8 -79 259 66 153 -127 20 24 177 158 81 190 -454 -68 -77 -115 49
3365 49 -173 -85 162 77 -104 -187 -52 -268 156 -50 160 154 -166 -115 91 -207 -113 250 -17 34 29 346 20 282
3389 282 -244 -13 -111 -91 127 469 -256 -15 184 202 137 187 72 -187 -86 -2 116 8 -224 -89 377 160
3411 160 169 -180 -102 133 50 7 34 102 -265 157 36 187 111 -261 -217 21 39 319 75 -189 34 133 6 -24
3435 -24 -175 -146 -127 81 74 -173 -134 -46 47 27 212 -118 133 -115 -116 301 -38 444 -281 -179 -102 -80 327 135
3459 135 -144 -74 123 16 175 -44 -192 -104 -5 203 204 -65 6 -323 137 -33 318 52 -131 -132 -73 370 351
3482 351 -33 -344 64 -109 176 -104 -172 -137 -132 225 301 -59 -21 -118 -185 -14 22 131 15 -128 -126 30 22 -14 -66
3507 -66 -81 -46 132 76 21 53 -237 74 -100 -7 141 -103 58 -62 65 144 -55 54 -4 16 258 128 53 -161
3531 -161 15 -209 305 61 -344 -30 -75 -174 -94 105 32 40 -151 214 1 -27 37 -404 -110 103 -36 -128 -90
3554 -90 -124 28 -141 -115 -125 -176 -198 -37 113 41 143 -109 -63 -44 6 -163 62 23 -229 53 194 -126 131 69
3578 69 -101 8 134 260 -75 -16 -70 106 54 15 -209 -197 -182 -77 102 289 -300 -141 -266 -38 125 196 -93
3601 -93 -163 -31 -211 -14 92 -61 -84 -246 235 -27 8 111 -247 -180 124 156 47 -104 -40 28 108 54 -33 -255
3625 -255 -104 -12 -46 123 168 -227 -13 113 14 -106 -114 -97 196 165 454 172 124 -32 -236 348 225 117 -43
3648 -43 71 14 -42 124 418 11 -39 -124 55 65 95 4 28 -165 48 -174 -158 -225 -42 -5 111 257 -39 -100
3672 -100 -94 100 300 -215 -84 -165 99 4 -195 237 -6 -199 -122 56 175 -59 -157 -59 -23 162 174 65 -279
3695 -279 -122 -31 70 170 218 16 -119 139 -99 189 214 -29 -111 -299 256 45 33 -93 -148 -37 331 44
3717 44 21 -114 161 -57 -40 246 71 28 -106 -274 130 103 108 -26 -47 -66 118 213 -78 103 2 -40 209 -107
3741 -107 160 -123 -18 -25 -25 28 21 -46 -221 24 255 -18 -143 -185 -87 -86 -94 55 -358 -47 -133 27 85 -4 148 -33
3767 -33 7 79 -62 212 225 -167 -110 80 -106 -170 -149 -120 -26 313 216 -73 -27 82 -116 -31 215 61 208 14
3791 14 179 -5 -10 -61 -14 65 -57 -6 192 -127 -98 117 180 4 75 -46 -74 -97 -103 227 114 38 -97 129 161
3816 161 2 289 42 -93 76 8 47 -32 -116 -203 -123 98 78 23 -81 -33 98 -41 381 99 -363 -135 -28
3839 -28 181 56 24 -12 -268 -61 114 50 -34 -199 -84 24 -2 127 338 -42 57 12 -161 139 5 -102 -305
3862 -305 208 28 -50 -431 -95 8 176 60 33 57 -73 -117 225 319 64 -136 55 78 -38 76 -57 -47
3884 -47 -207 -92 51 -190 200 148 33 -155 41 -133 50 -156 -53 177 156 6 124 -24 219 -103 209
3905 209 132 -122 -154 -45 -73 54 181 -115 -233 -110 -110 136 87 -57 -253 20 -41 -124 -123 18 -47 -174 -32 -108
3929 -108 230 -295 -21 98 20 173 -44 84 -66 151 79 68 -149 -49 7 40 -108 -255 7 -57 -153 119
3951 119 57 22 4 -218 206 -13 140 222 64 -280 -56 -16 47 -1 165 -116 -216 -90 -10 290 -25 -166 -157
3974 -157 97 -6 109 128 -168 66 11 -48 88 -79 -168 193 144 188 32 -40 -38 0 242 -92 132 -208 -53
3997 -53 226 32 -87 -28 -149 102 167 -19 172 40 -12 -60 142 79 -254 -80 -98 -7 78 234 257 11 6 -86
4021 -86 71 -8 90 -82 -174 -119 8 25 95 99 48 201 57 217 145 -224 -31 2 -28 -9 -126 -20 -164 -35 80
4046 80 100 26 -191 9 -6 -65 -220 -266 -245 14 -149 162 24 130 -76 -189 -152 89 156 126 63 -42 -67 265
4070 265 33 -171 -179 -177 -77 -41 -48 -114 -103 -25 63 269 123 -105 -104 -276 -122 -132 -25 -353 -83 1 224 -62 133
4095 133 -131 -344 -4 291 -39 106 -173 -266 26 242 -12 -122 125 86 73 -94 210 17 -188 -162 -102 183
4117 183 236 -56 180 -193 -93 67 -99 -59 -18 -176 -59 200 2 -269 -70 -89 200 126 75 -113 69 -74
4139 -74 -40 -45 132 220 -159 185 7 66 27 -16 45 -41 116 -11 224 -35 -70 163 77 163 -48 -344 -151 -111 149
4164 149 -62 105 75 -73 -173 138 40 72 -328 192 187 146 -211 33 166 -64 94 138 -69 -373 -134 -95 60
4187 60 394 150 -23 48 21 201 163 1 56 -89 102 180 -112 -2 -53 -69 200 183 -90 -181 -51 -70 24 -34
4211 -34 374 120 -27 -42 -10 23 85 16 274 45 10 153 165 -107 -156 -54 264 138 -72 -287 41 313 84
4234 84 -2 -68 -68 -130 141 52 157 -299 -39 -148 -145 223 23 43 -194 -296 -47 -43 -206 -50 -32 -164 18 78 -33
4259 -33 116 86 -143 151 -81 154 6 119 -19 10 -200 -120 12 9 208 28 -14 22 175 -47 -86 -282 11
4282 11 -73 -94 -23 -20 143 237 186 85 -103 145 -166 13 -29 -173 248 291 71 57 224 -109 21 -89 -150 -55
4306 -55 -14 -101 -26 161 -98 30 -333 84 224 31 24 81 17 158 95 -79 261 159 -9 39 60 55 104 173 112
4331 112 16 -234 26 180 166 -48 -55 -65 -73 104 -190 -108 -31 46 175 -117 -119 32 -229 19 161 207 -39 -106 -97
4356 -97 7 0 -138 -147 -182 -120 97 66 44 -33 -368 115 -40 39 -55 -125 -340 91 199 83 15 -67 -299 -63 182
4381 182 140 168 -43 -289 71 -18 -31 -48 235 322 -248 55 76 -117 15 -101 -206 -151 212 96 -146 147 131
4404 131 32 -208 -123 19 77 32 -49 46 -231 -151 133 -250 -84 81 -153 133 -123 32 -150 66 -23 -90 200
4427 200 -57 -209 -178 87 -25 100 -17 173 42 108 122 168 -178 43 67 -105 -42 2 33 243 96 -69 -57
4450 -57 138 -13 249 67 190 -87 -18 110 -14 104 113 -173 -105 152 86 -18 -57 -96 104 -138 126 -87 -68
4473 -68 -137 243 205 -14 -13 85 151 198 0 96 -151 -89 -125 225 208 137 -36 262 -289 -95 24 41 250 -20 124
4498 124 -24 31 -65 13 -165 136 -84 -112 -35 218 55 25 -52 -215 127 273 89 -44 96 158 -121 -218 84
4521 84 89 131 14 70 -23 97 108 -35 50 -189 -114 -115 110 48 40 150 79 -31 -229 -196 94 -63 -130 121 -25 -76
4547 -76 187 -202 -126 156 205 -83 -208 -239 -98 80 -18 -312 29 138 -63 349 -35 21 41 56 124 5 -9
4570 -9 -26 -177 -98 -231 -61 35 -31 -9 -130 -267 -112 194 -162 114 101 4 21 214 -152 -314 7 -4 47 66
4594 66 62 -173 -192 -60 -104 -43 268 36 67 100 92 -26 18 10 -24 306 -288 -71 328 -75 -77 -94 -94 111 117 31 110 72
4622 72 -165 -130 212 -76 137 179 -23 73 -4 1 -114 101 202 -49 -88 69 185 -42 134 -23 20 -289 69
4645 69 118 181 30 34 201 52 111 -61 -6 -128 -1 286 -198 -40 -167 86 155 -89 76 87 -74 286 -19
4668 -19 26 -8 117 258 -136 -2 73 83 168 -21 -44 -41 -54 -5 2 56 -63 -125 37 -348 -17 164 17 -19 -111 135
4694 135 -16 159 -15 -11 70 -61 4 184 -167 -33 52 15 -168 -237 -20 -99 135 176 186 -35 22 3 -43 122
4718 122 5 9 -37 237 77 -101 -24 153 -73 -46 54 24 -226 49 132 207 51 -59 -26 -127 -100 70 -140
4741 -140 28 8 27 -198 161 193 287 -109 -144 -136 12 -54 75 -49 25 -85 -68 3 -91 163 -135 -9 86 208
4765 208 -19 76 -139 56 47 27 -73 -110 -100 -152 115 52 179 -167 215 94 74 -205 52 -151 91 7 95 74
4789 74 55 -122 35 -11 16 -107 -55 -74 21 -110 167 -82 -154 3 -37 274 87 -81 50 96 61 55 69 21 -20
4814 -20 38 -65 -70 -15 153 -226 -23 -14 -134 -188 129 -227 -172 -39 230 -32 -137 128 43 -53 -48 -203 -73 -36 -84
4839 -84 22 72 245 -99 -289 103 -35 264 25 -102 -141 -26 179 46 97 -22 1 66 217 -76 -127 -160 -106
4862 -106 -36 139 48 -175 -250 -334 238 -118 -88 52 -211 268 61 195 103 -117 79 -18 28 -82 80 -99 -43
4885 -43 -204 19 27 -137 5 12 -271 -107 -54 -170 89 160 -101 -35 -101 -41 -185 82 -57 15 -199 -39 51 -139
4909 -139 205 -34 58 58 -83 98 -60 7 62 -175 -193 114 -281 88 103 175 -36 91 -48 102 -70 -57 108
4932 108 -74 208 -136 147 144 -68 -1 121 -127 -169 -81 -117 144 -85 91 18 152 99 -147 -120 28 -14 -68 77
4956 77 -3 -2 -48 250 20 58 -210 42 1 -31 -3 -189 -91 -265 -54 -136 -202 -55 56 -11 -91 228 -60 218 31
4981 31 -42 38 107 -131 8 -21 163 1 -38 -119 210 -66 7 133 -11 33 183 -74 174 -218 -71 -100 3
5004 3 159 2 -155 31 13 -77 48 -96 93 -47 78 185 29 136 171 58 176 -262 -12 -57 56 -67
5026 -67 -56 -190 158 61 -134 -21 116 -110 32 -107 87 -118 -21 -4 183 90 -196 -19 -304 -204 -114 -53 89
5049 89 121 -49 72 182 -24 -341 -74 -32 -85 186 -12 57 -16 -50 84 -125 5 -29 117 -511 24 -113 -128
5072 -128 -22 -89 -111 -77 -127 -87 114 -104 83 -63 48 28 -206 -90 27 -40 -10 140 121 -78 -80 -122 -11 -306
5096 -306 -254 -47 -131 -178 74 -3 -31 -121 153 108 -19 -143 -225 11 247 41 -21 -29 -176 -106 173 -81 -65 41
5120 41 117 -118 -93 -75 5 -111 -10 -119 -249 163 38 7 -285 224 -17 43 128 -148 -182 -67 -110 48 97 94
5144 94 -184 135 350 -142 123 2 -99 316 215 14 188 -208 19 60 -190 50 34 53 -44 1 153 34
5166 34 24 86 29 -178 105 -104 -239 -149 162 63 -36 34 37 -55 -292 54 -179 -59 2 -34 -68 -67 -177 81 183
5191 183 53 22 34 -181 133 43 -12 -155 34 113 -128 -25 308 79 71 -218 -115 170 188 154 -91 -185 -54
5214 -54 429 206 38 -43 -113 -66 -127 -120 169 -209 20 -161 133 69 5 182 -159 -208 131 32 -106 267 -111 -40
5238 -40 78 -97 228 173 -89 21 -115 -171 231 -326 -75 91 84 -27 42 219 -104 -75 -278 -106 0 25 109
5261 109 -20 5 57 33 77 63 -65 -181 -71 -49 -243 143 101 117 45 -44 25 68 36 168 141 88 63 27 -124 -110
5287 -110 151 -149 -209 196 -140 -197 84 10 69 -13 -285 -80 150 -259 13 111 135 139 37 89 61 -128 -106 -181
5311 -181 -46 -74 259 9 -8 -39 42 -259 122 163 -41 112 77 149 159 4 -25 26 -159 -30 70 137 146 90 223
5336 223 165 -79 198 121 -238 -151 232 24 -332 44 236 104 -14 -21 -55 116 -41 19 126 -152 -173 169 200
5359 200 -143 -111 -22 -150 -137 -157 -103 11 -23 -81 -9 225 -160 -112 37 38 -106 2 55 -170 85 15 289 -35
5383 -35 61 -92 -91 43 222 -113 93 -47 -129 98 283 -23 14 -10 33 150 -191 -5 191 -86 65 32 23 -16
5407 -16 -88 -25 -114 230 240 -28 -49 -134 125 -86 64 82 78 -2 63 118 114 7 82 -26 -102 65 343 203 231 214
5433 214 84 68 4 -73 -191 -29 -114 10 85 -150 -150 -43 158 -21 187 -181 -16 75 249 106 -15 -1 99
5456 99 -148 -23 -136 219 61 31 -245 -122 -55 25 342 -88 138 -219 160 -6 113 -5 334 106 77 59
5478 59 -138 40 -3 -107 -228 -203 -35 -125 -12 -83 63 149 281 62 -35 -4 -17 -211 -263 26 -367 -160 -41
5501 -41 156 -104 82 75 285 -211 -89 77 -226 114 144 15 184 17 -6 42 -4 246 -26 -202 109 13 -332
5524 -332 -136 -113 -114 148 82 -114 316 55 -66 -230 236 -112 -90 172 109 54 165 201 61 145 102 42 228 -173
5548 -173 130 -60 -178 -161 -76 149 -2 141 -275 216 -121 229 -46 221 307 61 -165 -110 -229 97 44 -40
5570 -40 128 -71 102 143 79 168 -10 20 68 129 103 49 -109 -82 77 59 -67 -145 191 -66 -217 128 88 65 17
5595 17 139 -29 101 102 -148 39 -162 -119 58 -54 93 -60 67 196 -14 59 -50 -194 -29 -89 -21 -219
5617 -219 -98 -93 165 72 -63 -99 -117 111 -18 -51 59 -229 -32 -67 100 -26 -188 -73 53 -79 44 300
5639 300 80 199 -15 -5 -58 -126 -52 -27 155 129 24 65 -26 -27 -41 46 -136 -112 198 -253 -142 28 -170 27
5663 27 130 11 -42 70 -22 -82 -39 -1 255 113 163 158 -244 106 47 -14 -9 245 -109 153 99 -19 186 61 8
5688 8 55 17 -2 153 -162 -85 83 45 -112 40 -29 -232 -252 -7 111 308 -50 85 115 -30 -96 105 -244 49
5712 49 9 -52 144 -41 74 -165 -64 -122 26 -74 19 -5 -85 97 137 106 67 -42 -12 254 32 -159 5 100
5736 100 -302 28 -107 -172 -90 -125 0 -92 -125 -100 -80 -148 -250 -48 -118 -13 28 180 -93 -124 145 -295 104 60
5760 60 -32 -179 186 79 -41 18 21 53 -112 13 -195 174 158 -185 -48 61 -14 -63 -385 -35 114 -37 -81
5783 -81 -50 -96 -198 61 136 35 -103 -35 -38 -26 84 -99 -61 -37 229 -202 20 13 -60 90 20 2 147 -2 -27
5808 -27 -5 -76 249 29 49 247 -76 -46 -20 10 299 -4 285 70 -71 -94 -42 27 -134 10 -394 -200 -150 -190
5832 -190 214 84 69 96 -45 -90 -46 -72 -81 -138 80 133 43 26 97 -101 95 -26 99 130 -127 -18 212 255 -166
5857 -166 -106 74 49 148 37 -40 225 39 113 -158 111 -58 92 140 -16 -119 149 -81 -185 99 -262 119
5879 119 -52 15 110 164 -48 100 -52 152 -11 -319 -126 -54 -152 -17 -112 128 42 -125 -2 -87 65 61 -45
5902 -45 12 64 -193 -45 43 163 -20 -87 65 -54 147 104 -216 -10 169 257 -18 -315 194 -53 -161 -235 114
5925 114 8 52 187 -30 -43 254 -51 147 -26 -52 -220 78 155 161 42 2 77 8 22 176 6 -207 111
5948 111 220 85 251 -147 155 16 -126 -43 -25 -84 255 -54 139 -31 -221 77 -104 -156 223 303 402 -65
5970 -65 -223 241 216 24 23 -105 170 25 145 200 18 148 -45 -66 44 86 -15 -28 -29 94 -90 56 -87
5993 -87 71 -94 -47 -180 -70 -62 93 -126 -59 144 82 -186 -71 194 -230 -256 -124 176 33 -21 184 201 29
6016 29 54 -84 -87 -78 -136 41 133 -12 4 -14 -241 -12 159 -227 -69 45 -65 -72 -141 172 -150 -104 -25 -42 -17 164
6042 164 92 -104 36 -5 101 -82 43 -47 175 -163 -194 13 -188 -445 -43 -77 -27 -89 -80 22 -20 -272 294
6065 294 -22 57 -299 -95 -103 -53 -77 -189 -44 146 133 -2 149 -127 -11 100 143 -26 -54 -74 177 -302 32
6088 32 200 -5 -190 -196 -286 229 -107 169 -201 -21 223 -97 107 -90 -136 -170 -37 -84 -51 155 -42 -29 -208
6111 -208 17 112 -115 -82 227 -146 -13 107 17 43 -3 -35 189 225 -13 -77 -137 247 112 283 22 139 -18
6134 -18 -83 66 -153 30 149 -160 65 75 64 -35 93 128 -181 -172 323 -47 -343 -157 118 -144 55 -267 -75
6157 -75 29 -10 -26 -123 -17 -142 -81 -128 101 80 -181 275 -40 61 24 30 140 -91 -161 -103 -55 -56 222 287 -4
6182 -4 331 -90 363 148 -245 89 150 -143 -74 109 127 173 -59 -164 141 -96 2 25 101 -75 -273 337 -77
6205 -77 172 55 -167 -38 -188 -216 -239 -262 128 -35 -154 70 248 -168 158 -26 -105 65 176 -36 -81 177
6227 177 -126 116 -128 48 256 -18 110 -290 9 174 17 -63 -90 -9 -24 173 59 -129 -66 20 -2 -56 0
6250 0 -137 71 -116 -11 202 -274 240 -306 30 -89 116 -34 -289 -34 155 162 -167 -69 -154 9 19 156
6272 156 -9 116 -169 23 262 7 -76 -151 59 -16 -53 -44 159 -148 10 198 -62 -220 160 207 88 16 139
6295 139 -23 -172 134 93 -12 -101 226 143 30 58 -5 156 7 154 -116 -124 207 1 115 -211 -108 -8
6317 -8 214 135 -9 67 -111 98 -82 228 -54 61 -91 -37 -150 -118 -96 116 -112 -166 45 12 -61 -254 -157 271
6341 271 -39 127 -8 -108 -22 -117 -175 -96 18 97 97 -345 58 -220 169 -51 -4 31 -48 -77 -13 -125 145 16
6365 16 94 -75 219 200 -61 -74 -34 155 149 59 -111 141 -91 311 -40 32 91 -133 -323 -167 64 -128 96
6388 96 -170 -6 -167 -28 -61 10 -11 -209 164 -238 46 6 -213 181 -17 0 -367 118 -22 127 -26 -61
6410 -61 -47 -164 138 151 28 -41 3 -46 -4 30 70 138 -180 60 206 85 162 -145 50 123 92 9 -15 59 205
6435 205 -135 -25 -54 -118 -95 -159 42 58 181 8 161 -98 -47 120 -110 -49 -288 33 104 16 40 -48 -151 -61
6459 -61 142 -122 2 72 -34 -53 -34 -158 -1 121 -135 -49 130 -298 91 70 43 73 -112 -69 186 -73 40
6482 40 56 66 -26 -20 -69 17 119 -10 27 58 -108 66 -37 -73 -87 -264 194 -133 54 -104 -48 -148 -161 -59 59
6507 59 -123 -19 84 -2 -9 57 135 40 -259 -128 12 217 59 -11 62 46 252 68 93 178 60 -108 45 149
6531 149 293 41 20 76 105 -307 -168 -131 -271 -79 71 -182 -205 59 79 83 -119 -120 -260 -1 -109 -135 -6 -105
6555 -105 127 231 14 111 13 61 -100 39 72 161 -6 -73 49 354 -368 -9 27 166 -141 -220 -21 -222 -11
6578 -11 108 183 80 124 -51 69 166 -19 50 95 68 -36 -161 334 305 14 9 -289 122 69 -126 -14 94 -115
6602 -115 -402 -203 206 -6 -2 211 38 -156 5 302 73 -76 220 -80 81 334 -12 -74 89 65 -7 109
6624 109 175 14 -26 101 -88 -47 -29 -44 -223 118 -1 245 -63 -10 78 124 38 304 90 -40 -65 -253 36
6647 36 -8 -27 -60 -25 -118 82 -110 -126 241 -13 -22 -48 156 174 -62 -45 19 237 230 11 77 -219 -134 37 112 145
6673 145 -297 204 317 82 290 140 42 -37 2 -13 -26 62 15 289 -168 164 1 -33 -21 -194 26 170 131
6696 131 149 -162 -21 158 31 -25 88 -90 95 43 -226 -108 138 43 -34 26 -177 38 -212 -80 -22 -268
6718 -268 17 -136 -60 52 94 -102 106 -89 -161 -200 -88 79 34 -163 108 -289 114 53 -116 -107 139 66 -99
6741 -99 37 -201 -218 -37 230 124 -67 -83 -97 241 58 -4 113 17 -45 73 -188 44 115 98 34 -104 -98 -49
6765 -49 -146 38 50 -14 140 66 124 -173 393 -20 75 -14 94 229 45 -22 -5 -19 213 -238 -88 -5 95 168
6789 168 109 -59 -72 153 -190 -62 -222 153 -64 -73 -13 121 -189 18 117 -7 41 68 197 32 7 128 -124
6812 -124 -134 -92 48 55 37 117 -3 -198 71 -28 -197 -84 2 -129 74 -6 87 -278 76 145 303 -26 40 -52
6836 -52 -168 1 -28 228 -231 -289 -151 156 -389 221 -239 183 33 -103 -34 81 21 -73 -56 -133 104 -286 40
6859 40 -115 -64 121 129 131 -338 7 255 259 -214 -18 72 -155 -71 13 -152 -231 237 -8 291 -64 210 -109 30
6883 30 39 -26 242 146 86 -60 101 0 -109 269 149 83 -54 -61 77 83 133 -63 -59 -55 -14 -195 43 175 81 -78
6909 -78 -129 -62 -23 -81 151 -68 -25 -97 -83 -33 5 191 -13 -44 -20 -3 -175 -10 -50 -312 -27 118 122 -263 41
6934 41 200 -209 -57 67 156 -26 63 -109 91 -66 -70 -69 -24 103 26 78 70 -59 75 -173 106 72 99 -87 28
6959 28 298 152 114 -159 -66 26 -87 307 244 129 182 -206 -205 -7 314 -37 -220 -131 37 -65 -102 54 -124
6982 -124 -221 -58 -51 -66 210 -186 237 175 147 193 -1 248 -161 -2 -84 -101 46 57 131 -40 -23 -47 82 -79
7006 -79 11 -115 123 -75 58 77 -74 -15 46 -147 -191 -69 321 231 149 -214 -230 -203 96 -221 -98 -148 20 106
7030 106 82 12 121 51 -153 143 -26 7 -167 -109 102 -92 -90 -22 169 46 -4 133 -66 0 24 170 -80 164
7054 164 106 -272 -174 -147 -224 -53 -154 -247 -210 -233 -116 -98 9 221 -69 345 -45 202 7 80 50 32 146 98
7078 98 -99 -66 -74 3 -150 -13 -373 34 -65 -97 231 113 -59 20 3 175 6 -67 232 59 151 178 -44 196
7102 196 -166 -127 13 87 85 -229 174 146 -107 110 -91 11 46 -75 184 26 98 -35 136 -122 17 -39 139
7125 139 116 -270 -71 124 -16 1 -57 -119 47 4 -5 29 103 138 53 216 -86 -124 91 5 77 -10 -63 162 352
7150 352 1 -142 84 5 168 -33 153 189 -149 68 -9 105 -105 36 -214 49 31 115 103 18 68 -123 285
7173 285 -9 -25 74 67 178 -89 -19 -20 9 61 15 -116 215 210 169 156 81 -32 238 95 4 -246 83 -62 198
7198 198 4 -350 6 -1 -165 73 184 21 65 -63 117 -176 245 -68 -113 -90 12 -45 117 136 -113 21
7220 21 -168 69 -96 36 144 -52 -115 -46 -122 22 2 -33 140 113 44 76 -31 -23 -73 13 114 48 46 -36 -74 -181
7246 -181 70 -69 -78 -95 -9 3 -100 -203 57 138 -258 205 -10 3 -280 -14 8 8 -68 79 -58 -120 -171 -306
7270 -306 45 0 66 -112 -75 228 -113 15 68 196 142 -131 196 116 -150 15 114 90 -193 207 -183 -68 253
7293 253 11 -134 -13 -70 48 -39 208 50 -189 7 13 -15 -150 64 264 -73 36 174 -58 -82 187 59
7315 59 132 -33 6 76 -9 -409 20 -90 143 145 -11 188 53 -2 -37 101 -191 135 -66 -3 123 88 97 -6
7339 -6 -61 -45 216 -92 -5 103 -28 10 -295 -135 72 154 7 281 43 -213 317 260 -190 -47 -90 25 -183
7362 -183 -93 -114 -80 54 17 -4 108 -15 84 109 -79 161 -66 -32 9 -317 30 -22 34 20 -183 -221 -20 168
7386 168 138 -52 55 -43 -10 99 30 67 -52 -8 158 7 -136 -68 98 134 -151 46 -59 -128 -238 29 -54
7409 -54 -70 127 -77 178 92 156 -128 32 -158 -8 -8 131 -106 -283 -103 111 6 101 -44 145 -74 46
7431 46 -27 0 137 -10 -6 116 21 -137 60 -27 -91 76 -27 161 -9 11 40 4 90 -60 27 47 -15 313 154
7456 154 84 -195 -167 103 19 44 -72 138 51 109 23 -7 3 -168 -195 -13 205 55 16 23 124 -29 -83 68 -106
7481 -106 23 -185 118 -50 -20 98 143 -46 184 -190 140 -96 185 86 -127 -204 5 -139 -114 -234 -102 9
7503 9 -53 32 -220 -27 -223 60 74 128 123 146 -37 -167 204 -62 30 210 -20 124 -101 20 -22 23 156 -137
7527 -137 82 -14 302 -231 2 -211 60 185 48 82 211 -50 141 -54 -32 61 -1 174 -48 202 39 172
7549 172 43 218 -294 -43 -115 123 -6 102 63 -207 -20 126 135 -122 -21 102 209 53 -122 -215 -150 87
7571 87 356 -24 175 32 67 82 35 -208 -54 -144 -115 -31 62 40 -80 34 149 34 -31 -32 12 -16 42 163 62
7596 62 -13 57 40 84 -177 -21 -155 -36 117 161 -157 308 61 -2 360 27 -100 63 109 -4 -124 64 28
7619 28 79 96 -4 19 27 -106 43 91 -73 25 189 5 171 -32 171 -163 30 -168 -148 -132 -129 115 -164 33
7643 33 -116 -97 277 361 -97 45 -130 -143 -23 58 109 -99 79 -80 -89 19 -4 -69 162 64 -320 180 54 -291
7667 -291 163 57 193 198 135 25 -159 -103 162 -130 -79 -81 125 131 -86 -205 -170 138 -74 -186 -1 -75 -5 71
7691 71 75 11 4 -56 -5 298 -146 -141 -89 97 188 -72 35 68 69 -104 -28 -111 48 229 -135 33 7 -49 102 -230
7717 -230 -143 150 219 -36 2 43 -100 -149 45 -166 46 235 90 -198 113 70 133 159 -101 27 -11 83 42 16
7741 16 -197 50 199 188 -117 -73 344 347 27 114 -74 -173 45 9 141 -196 -50 223 -109 -208 89 -79 73
7764 73 232 -159 -44 -278 96 82 -44 212 179 73 88 -70 -63 232 -308 185 -29 43 101 -27 205 -41 -32
7787 -32 -7 -113 -45 -209 64 151 -100 13 -39 3 -115 -131 53 -185 -119 28 -186 -99 -43 337 125 191 -76 -66
7811 -66 105 176 3 -216 -59 36 82 -60 -70 52 -66 101 45 16 -47 -24 -118 43 266 -137 78 -150 75
7834 75 -279 -142 -32 194 -104 69 41 148 -17 82 7 48 53 -102 -56 -2 97 83 297 -32 31 167 266 -7
7858 -7 -24 48 232 21 104 -252 219 9 55 24 73 168 -122 44 3 -79 6 216 154 -63 -98 83 -110 -39 -61
7883 -61 -95 32 50 10 80 268 79 -200 21 -157 -71 -46 75 -68 -311 -127 -47 -108 162 -234 240 75 78 19
7907 19 -2 -15 37 -122 -25 -55 -92 30 -147 -46 -120 138 145 179 -13 174 81 -5 108 81 85 -202 13 198 44
7932 44 276 -57 20 -43 -155 -39 70 40 14 -85 -111 8 107 -131 63 2 -298 -129 308 110 58 41 121 -225
7956 -225 -120 -220 -145 -148 12 -46 8 154 4 1 -55 -88 166 93 -17 29 92 243 8 -26 -123 150 224 1 -239
7981 -239 211 83 -136 -82 94 109 -28 -124 -18 111 -94 156 -60 18 -181 55 104 112 -171 -85 -31 163 -60
8004 -60 37 -45 79 148 117 32 141 -8 6 254 2 79 44 62 278 58 -78 236 -26 -90 -204 22 31 -280
8028 -280 89 -383 -293 -150 0 53 -180 -20 44 132 -43 155 158 73 -102 1 -173 157 -16 -161 -67 23 178
8051 178 39 -100 -33 150 -92 -28 -139 162 96 0 -98 39 71 10 30 152 -101 -99 171 203 -74 -41 -118 102
8075 102 -1 93 25 -167 103 -313 136 52 -29 -118 -45 76 -230 -1 -28 -126 -148 132 -52 210 -170 -214 34
8098 34 -158 310 -149 -159 62 -43 -47 -278 187 -19 1 42 -186 -5 -167 -2 286 -90 -30 -46 32 -176 81
8121 81 93 187 -134 142 -46 50 -68 -3 198 -135 12 -41 -66 -125 69 135 -94 -263 -83 178 54 39 -265
8144 -265 -375 189 -41 30 214 69 162 -91 50 92 -4 59 83 -137 92 70 86 -64 -24 -84 -71 135 91 -128
8168 -128 148 270 -160 -163 8 -1 -111 -82 154 9 -15 262 -147 -96 -60 68 16 -67 121 -29 -3 5 42
8191D2
##END NTUPLES=NMR FID
##END=
