##TITLE=1H_100-2025
 200.13MHz, CDCl3,
 8 sc
 
 11.8.2025
##JCAMPDX= 6.0         $$ Bruker NMR JCAMP-DX V2.0
##DATA TYPE= NMR FID
##DATA CLASS= NTUPLES
##ORIGIN= UXNMR, Bruker Analytische Messtechnik GmbH
##OWNER= pz
$$ XWIN-NMR		Version 3.5
$$ Mon Aug 11 13:59:03 2025 Russian Standard Time (UT+4h)  she@DPX200
##.OBSERVE FREQUENCY= 200.1313
##.OBSERVE NUCLEUS= ^1H
##.DELAY= (6, 6)
##.ACQUISITION MODE= SIMULTANEOUS
##.ACQUISITION SCHEME= undefined
##.AVERAGES= 8
##.DIGITISER RES= 18
##SPECTROMETER/DATA SYSTEM= spect
##.PULSE SEQUENCE= zg30
##.SOLVENT NAME= CDCl3
##.SHIFT REFERENCE= (INTERNAL, CDCl3, 0, 14.3821)
##AUDIT TRAIL= $$ (NUMBER, WHEN, WHO, WHERE, WHAT)
$$ ##TITLE= Audit trail, XWIN-NMR		Version 3.5
$$ ##JCAMPDX= 5.01
$$ ##ORIGIN= Bruker BioSpin GmbH
$$ ##OWNER= she
$$ F:/spectra/data/she/nmr/H-C/1/audita.txt
$$ ##AUDIT TRAIL=  $$ (NUMBER, WHEN, WHO, WHERE, WHAT)
(   1,<2025-08-11 13:57:06.42 +0400>,<she>,<DPX200>,
      <created by zg, POWCHK disabled, PULCHK disabled
       configuration hash MD5:
       00 E9 B6 7A A2 85 ED C7 34 08 36 98 17 FE 4E 26
       data hash MD5: 16K
       0B EF 10 A1 F3 AE C9 84 B8 0B 05 6B 4E CC D4 56>)
$$ ##END=
$$ 
$$ hash MD5
$$ 48 F3 DF F4 67 02 C4 DF 7A 30 6D C9 E6 22 AD 5A
##$RELAX= 
##$RELAX= 
##$RELAX= 
##$RELAX= 
##$RELAX= 
##$RELAX= 
$$ Bruker specific parameters
$$ --------------------------
##$DU= <F:/spectra>
##$EXPNO= 1
##$NAME= <H-C>
##$PROCNO= 1
##$TYPE= <nmr>
##$USER= <she>
##$AMP= (0..31)
100 100 100 100 100 100 100 100 100 100 100 100 100 100 100 100 100 100 
100 100 100 100 100 100 100 100 100 100 100 100 100 100 
##$AQSEQ= 0
##$AQ_mod= 1
##$AUNM= <au_zg>
##$AUTOPOS= <>
##$BF1= 200.13
##$BF2= 200.13
##$BF3= 200.13
##$BF4= 200.13
##$BF5= 200.13
##$BF6= 200.13
##$BF7= 200.13
##$BF8= 200.13
##$BYTORDA= 1
##$CFDGTYP= 0
##$CFRGTYP= 5
##$CHEMSTR= <none>
##$CNST= (0..31)
1 1 145 1 1 1 1 1 1 1 1 1 1 1 1 1 1 1 1 1 1 1 1 1 1 1 1 1 1 1 1 1 
##$CPDPRG= <>
##$CPDPRG1= <>
##$CPDPRG2= <>
##$CPDPRG3= <>
##$CPDPRG4= <mlev>
##$CPDPRG5= <mlev>
##$CPDPRG6= <mlev>
##$CPDPRG7= <mlev>
##$CPDPRG8= <mlev>
##$CPDPRGB= <>
##$CPDPRGT= <>
##$D= (0..31)
0 0.7 0 0 0 0 0 0 0 0 0 0.03 0 0 0 0 0 0 0 0 0 0 0 0 0 0 0 0 0 0 0 0 
##$DATE= 1754906225
##$DBL= (0..7)
120 120 120 120 120 120 120 120 
##$DBP= (0..7)
150 150 150 150 150 150 150 150 
##$DBP07= 0
##$DBPNAM0= <>
##$DBPNAM1= <>
##$DBPNAM2= <>
##$DBPNAM3= <>
##$DBPNAM4= <>
##$DBPNAM5= <>
##$DBPNAM6= <>
##$DBPNAM7= <>
##$DBPOAL= (0..7)
0.5 0.5 0.5 0.5 0.5 0.5 0.5 0.5 
##$DBPOFFS= (0..7)
0 0 0 0 0 0 0 0 
##$DE= 6
##$DECBNUC= <off>
##$DECIM= 32
##$DECNUC= <off>
##$DECSTAT= 4
##$DIGMOD= 1
##$DIGTYP= 9
##$DL= (0..7)
0 120 120 120 120 120 120 120 
##$DP= (0..7)
150 150 150 150 150 150 150 150 
##$DP07= 0
##$DPNAME0= <>
##$DPNAME1= <>
##$DPNAME2= <>
##$DPNAME3= <>
##$DPNAME4= <>
##$DPNAME5= <>
##$DPNAME6= <>
##$DPNAME7= <>
##$DPOAL= (0..7)
0.5 0.5 0.5 0.5 0.5 0.5 0.5 0.5 
##$DPOFFS= (0..7)
0 0 0 0 0 0 0 0 
##$DQDMODE= 0
##$DR= 18
##$DS= 0
##$DSLIST= <SSSSSSSSSSSSSSS>
$$ [...]
##$SUBNAM0= <"">
##$SUBNAM1= <"">
##$SUBNAM2= <"">
##$SUBNAM3= <"">
##$SUBNAM4= <"">
##$SUBNAM5= <"">
##$SUBNAM6= <"">
##$SUBNAM7= <"">
##$SUBNAM8= <"">
##$SUBNAM9= <"">
##$SW= 18.0517328524113
##$SWIBOX= (0..15)
0 0 2 0 0 0 0 0 0 0 0 0 0 0 0 0 
##$SW_h= 3612.71676300578
##$TD= 16384
##$TD0= 1
##$TE= 0
##$TE2= 300
##$TE3= 300
##$TEG= 300
##$TL= (0..7)
0 120 120 120 120 120 120 120 
##$TP= (0..7)
150 150 150 150 150 150 150 150 
##$TP07= 0
##$TPNAME0= <>
##$TPNAME1= <>
##$TPNAME2= <>
##$TPNAME3= <>
##$TPNAME4= <>
##$TPNAME5= <>
##$TPNAME6= <>
##$TPNAME7= <>
##$TPOAL= (0..7)
0.5 0.5 0.5 0.5 0.5 0.5 0.5 0.5 
##$TPOFFS= (0..7)
0 0 0 0 0 0 0 0 
##$TUNHIN= 0
##$TUNHOUT= 0
##$TUNXOUT= 0
##$USERA1= <user>
##$USERA2= <user>
##$USERA3= <user>
##$USERA4= <user>
##$USERA5= <user>
##$V9= 5
##$VALIST= <valist>
##$VCLIST= <CCCCCCCCCCCCCCC>
##$VD= 0
##$VDLIST= <DDDDDDDDDDDDDDD>
##$VPLIST= <PPPPPPPPPPPPPPP>
##$VTLIST= <TTTTTTTTTTTTTTT>
##$WBST= 1024
##$WBSW= 4
##$XGAIN= (0..3)
0 0 0 0 
##$XL= 0
##$YL= 0
##$YMAX_a= 295008
##$YMIN_a= -318869
##$ZGOPTNS= <>
##$ZL1= 120
##$ZL2= 120
##$ZL3= 120
##$ZL4= 120
##$ABSF1= 10
##$ABSF2= 0
##$ABSG= 5
##$ABSL= 3
##$ALPHA= 0
##$AQORDER= 0
##$ASSFAC= 0
##$ASSFACI= 0
##$ASSFACX= 0
##$ASSWID= 0
##$AUNMP= <proc_1d>
##$AZFE= 0.1
##$AZFW= 0.1
##$BCFW= 1
##$BC_mod= 2
##$BYTORDP= 1
##$COROFFS= 0
##$CY= -3
##$DATMOD= 1
##$DC= 2
##$DFILT= <>
##$DTYPP= 0
##$F1P= 0
##$F2P= 0
##$FCOR= 0.5
##$FTSIZE= 0
##$FT_mod= 4
##$GAMMA= 1
##$GB= 0.15
##$INTBC= 1
##$INTSCL= 1
##$ISEN= 128
##$LB= 0.25
##$LEV0= 0
##$LPBIN= 0
##$MAXI= 10000
##$MC2= 0
##$MEAN= 0
##$ME_mod= 0
##$MI= 1.114404
##$NCOEF= 0
##$NC_proc= 0
##$NLEV= 6
##$NOISF1= 3.799351
##$NOISF2= 2.8
##$NSP= 1
##$NTH_PI= 0
##$NZP= 0
##$OFFSET= 14.38212
##$PC= 1
##$PHC0= -1556.703
##$PHC1= 8.39229
##$PH_mod= 1
##$PKNL= yes
##$PPARMOD= 0
##$PSCAL= 0
##$PSIGN= 0
##$REVERSE= no
##$SF= 200.129724274929
##$SI= 16384
##$SIGF1= 3
##$SIGF2= 2
##$SINO= 400
##$SIOLD= 16384
##$SREGLST= <1H.CDCl3>
##$SSB= 0
##$STSI= 0
##$STSR= 0
##$SW_p= 3205.1282051282
##$SYMM= 0
##$S_DEV= 0
##$TDeff= 0
##$TDoff= 0
##$TI= <>
##$TILT= no
##$TM1= 0
##$TM2= 0
##$TOPLEV= 0
##$USERP1= <user>
##$USERP2= <user>
##$USERP3= <user>
##$USERP4= <user>
##$USERP5= <user>
##$WDW= 1
##$XDIM= 8192
##$YMAX_p= 0
##$YMIN_p= 0
$$ End of Bruker specific parameters
$$ ---------------------------------
##NTUPLES= NMR FID
##VAR_NAME=  TIME,          FID/REAL,        FID/IMAG
##SYMBOL=    X,             R,               I
##VAR_TYPE=  INDEPENDENT,   DEPENDENT,       DEPENDENT
##VAR_FORM=  AFFN,          ASDF,            ASDF
##VAR_DIM=   8192,          8192,            8192
##UNITS=     SECONDS,       ARBITRARY UNITS, ARBITRARY UNITS
##FACTOR=    0.0002768,     1,               1
##FIRST=     0,             0,               0
##LAST=      2.2672688,     0,               0
##MIN=       0,             -318869,         0
##MAX=       2.2672688,     295008,          0
$$ Real data points
##PAGE= N=1
##DATA TABLE= (X++(R..R)), XYDATA
$$ [...]
2047e28N39k2l12P79p75M06L84r61L33O97p88K27J21m76P19m29n2N09m62k8Q03
2068F84p90j13O97q18M78L3p04R84m64j25N60p27J27M16p71O07L23j074R08q8
2088A43p57R85l32l33P58o18L44K41o53L21M33j074O06l20p9N82n98L61M93n14
2108a1K86K92q58N69k83l73O36k10n95O94m79R9N83p67K67M65q19N49P4l20O14
2129D13l03J01mn31K90L41p97K85M89p31P39n58n1O94j55l46L75m72J45M77o31
2150b30N94j21n24M60k32j7L12n41K10L76n14N33Q2n76O14l85m14Q16j13n14M75
2171B91n74J16L64m16M58O9r09P59k85p9R52p10l04P00p76M13M03r41N26J45l17
2192a15N78o34J66N15n22k3J70m58M56K4o18N61n4m33P59m15K26K47m86J61J21
$$ y = [-528, 11, -11, -323, 456, -319, 87, 471, -490, -157, 540, -248, -21, 100, -376, 343, -86, -138, 371, -91, -119, 684, -106, -219, 478, -340, 138, 171, -533, 451, -13, -138, 422, -305, -178, 238, -533, 74, 397, -677, 231, 143, -614, 371, 39, -294, 464, -154, 190, 431, -222, 99, 532, -542, 64, -256, -335, 247, -351, 10, 503, -11, 275, 567, -291, 278, -5, -378, 258, 48, -547, 147, -332, -233, 350, -417, -150, 315, -504, 45, 119, -201, 413, 110, 211, 207, -324, -34, 307, -490, -205, 284, -447, 292, -266, -317, 377, 222, -124, 251, -221, -76, 401, -230, 364, 243, -281, 179, -53, -70, 242, -299, -89, 287, -227, 306, 388, -188, 426, 41, -373, 443, 330, -184, 291, -283, -167, 197, -219, 239, 308, -601, 158, -127, -206, 746, 36, -268, 432, -344, 69, 472, -469, 57, 202, -115, 463, -171, -5, 510, -12, -35, 135, -323, 133, 157, -461, 100, 46, -387, 372, -43, 183, 430, -56, 105, 226]
2213B26o81O17l8o88Q42n97K54M23n71R9K51m25L13K76n52O14j67p87Q45k93l05
2234c44P22o92M87O9k92L87k62o73P14k45l30Q13m28k9O93p07J36K42m80L54K15
2255C50n73O25n11j97P40p40M37L70p35M09k07j00L10J17n39O31m14l74N08k24
2275a17L78j86m60P08j20k97L02n03k05Q31m57Q5K77p89N72K49o00M58K65k68
2295A23J68m34j34O68p12L57j1n00L88L68p13P70o5n55O28p95L25N79m76k42N66
2316C03o30N80m12l62L71j7j77N86k11k77M15n88O36Pm96P90l58m00L89j53j98
2337b02M38q61O77j0m60O87K3p56O03j93k48Q28n95l51Q50q09K21J28l10N13m9
2358A24o33N28N8n43Q84p72L24O11n57o9L58q04M77Q3m09N53k48j23L52m13j6
$$ y = [226, -455, 162, 124, -564, 278, -319, -65, 358, -213, -114, 137, -288, 25, 301, -251, 363, 196, -591, 254, -39, -344, 378, -314, 173, 242, -50, 337, 75, -598, 116, -129, -459, 354, -74, -103, 590, -117, 19, 261, -219, 135, 350, -223, 402, -109, -306, 434, -306, 131, 501, -234, 175, -32, -132, 178, 295, -244, 387, -27, -401, 107, -117, 261, 75, -385, 323, 203, -94, 208, -295, -500, 331, -126, -41, 236, -553, 19, 268, -332, 126, 391, 123, 291, -143, -277, 391, -321, 36, 25, -475, -87, 281, -432, 338, 273, -282, 346, -449, -124, 455, -21, -263, 303, -327, 253, -159, -521, -150, -167, -344, 242, 31, -246, 169, -419, 217, 224, -272, 518, 160, -240, 149, -4, -202, 236, -625, 52, 42, -418, 269, 292, -464, 139, -54, -302, 526, -69, -420, 430, -379, -158, -30, -340, 173, 124, -509, 19, 77, -466, 418, -354, -30, 581, 24, -45, 313, -491, -14, 69, -340, 213, -35, -158, 194, -219, -235]
2379b35O86n52L64J66n06M34j51o81P24l23J16J52m62K88L87p86M35J29n48P26
2399C63l93n65R85n12J30K83m52L13K53q95O53j14k85O63k97r7L62p28N24m0m62
2420c11M94l25k80N12pl44L91l58k4O50m39R9K61k65L74k65m62O25m34l88R05
2441D09n86o1J035j038J27L55n39M36J1n29P32n11k51Q73r39J8P10p89O34K53
2461C50o49N11j95q7N13n09j65O85o70K44K73p05N55K28o18N56k93l53O02m59
2481a86p0O94m81r5N48p65N05K76q00O38k46j42O05p72L30L78r32N72R0o71P48
2502B24k70m19Q96l13j47K62p21K45O11q38O78j2o02P08l51l72P87n71J55N68
2522E18q77M83K93o44O97m97k26N88l78k95P84m73j65M58l84K36p0n27R94m59
$$ y = [-235, 451, -101, 263, 429, -77, 357, 206, -475, 249, -74, 42, 194, -268, 20, 407, -379, 56, 185, -363, 363, -30, -595, 390, -122, 8, 291, -161, 152, 405, -490, 163, 49, -236, 427, 130, 33, 395, -333, 191, 151, -311, 183, -142, -422, 90, 83, -261, 130, -228, -252, 398, -41, 58, 319, 54, 428, 163, -299, 326, -108, -496, 409, -177, -238, 797, -241, -114, 241, -298, 138, 149, -380, 352, -159, -410, 463, -476, -458, 252, -537, 97, 350, -299, 212, 17, -70, 443, -66, -231, 454, -216, 28, 301, -404, 151, 379, -239, 317, 24, -329, 273, -186, -256, 438, -43, -138, 410, -355, 150, 426, -374, 264, 18, -124, 481, -291, 39, 417, -515, 57, 147, -524, 224, -46, -465, 431, 118, -29, 233, -488, -243, 368, -470, 208, 196, -406, 302, -49, -421, 366, -205, -50, 518, -359, 124, 417, -227, 470, -27, -253, 335, -43, -338, 446, -27, -192, 266, -118, 118, 48, -479, 515, 56]
2542E6k04M50m52P3K30m91J72M08o14N69k85l85R86m38j34L56l39k7N00p11L12
2563C2K07m89N11k18n97O34n26J88M31o67L40M26m79J17M81p52N96K43o69O28
2583D37o20k33P91n04L3J19m55O82J51o55N16j84m38P66q89L38M59n68R7K61l48
2604b44M99j37o33J125r46k3O36m05p2N87p94O47J79q65Q10j1m73N88m83l18L48
2625A5l82R1N20n57K44J81k01N82k18j33K65o81k16R19p43J57K55o36M29Q0l04
2646c33Q72n43l98P35n79N9N35n43J72K25p94O77q6m46Q77p15N6L09k02J45R0
2667A13n08M80M71q96L95j5n55P20k04O4L65q29N77j55j96L28j9o04P67j04n22
2688c27R44p15m9L88o24K70K85o06O59j88l90P72m22k6M87m14o9L92o00L18N46
$$ y = [56, -148, 302, -150, -77, 153, -338, -166, 242, -372, 197, -88, -473, 513, 75, -59, 297, -42, -69, 431, -280, 32, 239, -250, 261, 43, -554, 80, -446, -258, 173, -494, -154, 272, -207, -90, 391, -361, 235, 478, -191, 437, -183, -416, 375, -129, -96, 23, -432, 250, 401, -254, 262, 78, -360, 406, -483, -145, 314, -254, -157, 104, -244, 255, 118, -515, 610, -336, -359, 277, -128, -200, 387, -407, 240, 419, -446, 364, 353, -120, 468, -15, -333, 15, -367, -276, 244, -313, -69, 112, -89, 493, 275, 142, 407, -274, -490, 429, -314, -157, 98, -538, -109, -29, -333, 539, -4, -402, 333, -246, -187, 348, -195, -23, 202, -592, 85, -1, -447, 430, -285, -229, 80, -122, 23, 113, -395, 85, 556, -340, 55, 40, -515, 205, 1, 65, 430, -399, 178, 23, -173, 155, 136, -468, 299, 195, -327, 617, -98, -147, 241, -383, -113, 172, -434, 225, 37, -353, 419, -3, -29, 458, 44, -25, 367, -233, 85, 631]
2709F31r19N27l33p50J175n38o8R72q26k56P56o73O44P2p11K45L4l28Q44o28l48
2730d78Q29p95M20L74o12O29k41n10R92o60l21P86m78K76J35o99L03N9q9R4M4
2751E8m87Q55q06M9O93m32r6O06j344J076m9n73O24n2m21P76n51k81O14p14L84
2772g1O0n62P82K42r33J070p12k30P22o81J2P94n51j15N02n89M56j11n93P01r2
2793A01m52Q25m42k04O97q17L83L48q17P11l34m18J033o55k12M45m91K62N27r52
2813d62Q27j65o49P31k42n18Q98n68P4L90o39L87L58p43N47L41j110J148n12m19
2833c26Q08o64K90M36r26M16K4o69Q74l67n31J015l15m04P42m83j07P74r21N51
2853B17k4n87O02Om61P39o58O6O70j009N52K06p49M17Nm64P29k15l26P15p25J91
$$ y = [631, -288, 239, -94, -844, 331, -207, -275, 697, -129, -385, 371, -302, 342, 414, -297, -52, -18, -346, 498, -130, -478, 351, -444, -24, 350, -262, 367, 126, -384, 608, -52, -373, 413, -65, 211, 346, -353, -50, 9, -80, 14, 58, -429, 426, -380, -331, 362, -70, -166, 440, -904, 172, 123, -450, 174, 122, -299, 477, -74, -355, 259, -455, -71, -11, -573, 209, 451, -482, 588, -124, -354, 368, -313, -301, 493, -58, -173, 329, -260, 196, 85, -508, 193, 101, -351, 474, 32, -172, 525, -292, 91, 439, -378, 333, -1, -419, 614, -41, -253, 192, -299, -37, 490, -462, 365, 200, -449, 282, 40, -478, 420, -148, -74, 316, -323, 64, 422, -321, 226, 567, -543, 605, 93, -326, 482, -182, 108, 544, -382, 34, 58, -611, 263, -104, -635, 380, 65, -339, 403, -80, -187, 587, -334, 217, 193, -394, 208, 214, -247, 492, -166, -100, 570, -439, 113, 319, -430, -13, -8, -472, 257, 42, -284, 431, -294, -103]
2875a03M64q24M28K05k68L34o7n71O46m18j20O25l77r8Q64j237M55J74m29Q67
2895E50l14k99M99k36k98K65l56M57K24j029Q16m87l90N56J4k99N90n07N0P80
2915E86q42J98N17o01N56l84n16Q68m27j12N31p60K93L18k69J59K52r87R39l12
2935Gn47Q41l78j34P86q72K66M78q01Q35l09l20K11L3l25N72l02l09Q62j156P79
2956B17K02o58L11j06m85J006o21OO36p08K37M12r10N72K58r82J110p28j28P83
2976D24p44j4O83p22JP51r90O87K67n34O67m03n90O30j53j62P12o88J64J25m27
2997c16K79L26q88J047k91l55N85o75J13N06o57N22l6m98M26k53J74M04n80J4
3017a53Q06r19J28O01r24L57K31n62P22l72k70R41n98n03Q24k97P6L37r86N97
$$ y = [-103, 361, -463, -35, 170, -98, 236, 169, -402, 244, -174, -294, 331, -46, -144, 720, -517, -62, 112, -317, 550, 236, -63, 436, 200, -98, 167, -189, 268, 492, -537, 279, -208, -598, -42, -28, -327, 263, -244, -194, 586, -256, -58, 459, -142, 414, 30, -486, 382, -45, -157, 374, -386, -93, 225, -44, 115, 367, -620, 319, 7, -540, 301, -77, -211, 575, -297, -31, 447, -354, 481, 172, -148, 63, 96, -229, 343, 41, -268, 594, -562, 217, 419, -239, 72, -34, -519, 487, -134, -128, 508, -200, 37, 449, -461, 111, 369, -613, 497, -231, -359, 424, -320, -334, 349, -373, -372, 379, -611, 76, 343, -191, 476, 73, -517, 113, -40, -202, 510, -178, -14, 111, -316, -37, 289, -599, 448, 157, -198, 387, -288, -175, 331, -326, 196, 160, -338, 88, -165, 9, 413, -167, -153, 653, -266, -138, 463, -461, -104, 127, -435, 287, -85, -355, 586, -12, -515, 309, 12, 88, 425, -561, 36]
3037C6K40n80P30l98m82L73%M7L33o07L79L1n63O63j68j40O57n98oK77k56O8K71
3060C07m75p1L84m46K90k6m85Q94m23O2M72o66j06Q78r51N00J24o27Q32j94l98
3081a25L66n94j09J088q87N46k6n42M20J26n77P12n16k85P37o05pP73q32O04j26
3102A41n81M93J3k22M08k29k97N26r36O24M46n10R3K54q43J059l50n32R08m70
3122ej36O65r28N77J68r09P40L47r86Q20n32k58O35n00K45N64q32L58M2l25O06
3143C56Qn96P52l07m34N20o37L15M08p25M00j6o59J079l04o68P91k61r1L33m86
3164b22J97N79r04N13%n52O66m74oM05l25o7M58k49J3J31n07N33K01r91N44m4
3186a01j21N07o20M22L20m86K13L13j002M53L57p60O56l14pM61l75K33K94q13
$$ y = [36, 276, -304, 426, 28, -454, -81, -81, -34, 299, -308, 71, 102, -461, 202, 34, -106, 551, -47, -53, 224, -32, 36, 307, -168, -239, 145, -301, -11, -37, -522, 372, -51, 11, 483, -183, -289, 589, -362, 138, 262, -365, 467, 273, -125, 241, -353, -462, 626, -261, 285, 259, -283, 137, 263, -314, 398, -118, -403, 334, -271, -278, 495, -337, 267, 141, -440, 53, 66, -156, 252, 23, -274, 252, -684, -60, 386, -124, -31, 223, -620, 439, 89, -443, 465, -5, -141, 524, -404, 173, 341, -568, 172, 519, -467, 353, -179, -437, 198, -302, -57, 507, -325, 33, 75, -250, 356, 364, -232, 520, 213, -221, 299, -338, -23, 385, -340, 60, 44, -615, 464, 160, -508, 283, 22, -69, 264, -222, -25, 554, -350, 163, 163, -389, 277, -197, -203, 202, -123, -190, 268, 19, 32, 163, -344, 189, 390, -601, -57, -101, -222, 285, -335, 87, 407, -79, 134, 447, -555, -102, 255, -505, 151, -163, -170, 291, -84, 149, 443, -370]
3206c70N76Q2m65L35k78q9M96j27l55M67n71J80P12j153Q35k9m31N37m11l96P74
3227C19m10J63M98p37J30K78n15M35K46o29O80n01k32N78l47j16L92o11M69J18
3247B08o38O37k2m49M81j70j33N31p74K54M46o50J38N45q47Q35N3p32N52l73J19
3268A1N91r07M4O98q61M74M2o37R49j88n57P58n49l92J061o94K27J38p38R55k09
3289B16n73R02q10m03J142n67J36L8j42J03J85o97N81j65k31N39ol65M91p29K28
3310a27N63q55O30k41p08J126m08j72O86p74L23L65n48O8L44p35P90k04o33N50
3330D0J62k94M20m61J76K58o43M46J78n46N52q7m23K91l59K06L66n42m7N22p16
3351e01N44K2n14P18k49j95M24j83j51L61m83J0M98o43N97R6m91N11m47k81M28
$$ y = [-370, 206, 288, -177, 158, -120, -209, 287, 160, -195, 272, -299, -119, 593, -560, 275, 246, -185, 352, -59, -455, 319, -91, 72, 570, -167, -37, 241, -274, 161, 407, -222, 458, -43, -275, 303, -44, -160, 232, -379, 90, 208, -430, 207, 185, -264, 217, 47, -86, 445, -329, -75, 371, -279, -141, 404, -443, 392, 445, -287, 265, -108, 11, 602, -305, -261, 437, -424, 50, 92, -545, 404, 216, -341, 417, -132, -524, 537, -157, 70, 208, -530, 425, 216, -357, 545, -265, -668, 474, -93, 43, 81, -61, 42, 227, -470, 111, -54, -285, 254, 248, -117, 374, -355, -127, 436, -419, 211, -30, -738, 388, -20, -192, 494, -280, 43, 408, -140, -72, 272, -463, 327, 123, -510, 40, 202, -92, 328, -133, 43, 301, -342, 104, 282, -264, 288, 201, -222, 69, -290, -84, 282, -260, -307, 215, -501, 43, 65, -449, 269, 20, -175, 249, 66, -85, 276, -207, -197, 301, -342, 255, 351, -140, 371, -76, -357, 71]
3372G1l08j72P08n92M96J23q87J078n04l22O38n26j38P38m12o6J31n47M88P9k36
3393a60L73j63l02N43m59j02Q21r79L63N06p47M29j23j21O44m58l51O78o48M32
3413A76J66q34M16J76p30P18J34o08P16m21P9L07l75J77K78r08O36J82m79L55
3433A61j74j78P18m21J5L26n40K5L53n87L77M0l68M35k00l72R03m77j5l4k73M65
3455A79q2m77M57J83n74P32m97l16N67m91J89K73n61L76K06o55M50K90n90P64
3475D23k82j85O95q45L42L88j128P35m0o08P73l04m12Q45n85K60M25q91L51M79
3495D36n81M47k01l30N81j61m16N87o90K1N44l61L24R8n62M80k61l30O52N7q41
3516e07R50p50K02N09o86L97L19q38N58j1n36O71j12l48M73l00k13K49k23L15
$$ y = [71, -237, -409, 299, -293, 203, 326, -561, 517, 13, -309, 329, -197, -335, 403, -9, -75, 56, -491, -3, 76, -160, 213, 50, -252, 291, -168, -270, 551, -428, -65, 441, -306, 123, 0, -121, 523, 65, -286, 392, -256, 176, 342, -492, -76, 100, -630, 88, 222, -386, 330, -91, -12, 295, -80, 97, 375, -533, 103, 285, -194, 161, -13, -191, 527, 106, 121, 447, -93, -68, 285, -302, 75, 115, -253, 182, -18, -390, 513, 36, 21, -13, -286, 179, 97, -380, 77, 260, -314, 418, -79, -395, 172, -319, -130, 143, -418, -42, 164, -491, -41, 249, -341, 423, 141, -44, 651, -194, 148, 536, -592, 143, 103, -505, 268, -36, -448, 397, -188, 72, 497, -394, -43, 436, -145, 302, 101, -229, 352, 191, -225, 362, -328, -307, 237, -124, 200, 298, -264, 216, -45, -375, 277, 334, -507, 443, -307, -105, 404, -282, 115, 434, -404, 154, 143, -393, 278, 166, -182, 291, -9, -222, 27, -196, 119]
3536A19J52m21J17J35m47N20l77J62J47l45M1P92p62J16Q0n08R31l45m06M76k73
3557i6k49N94l88o2K60n11M35M09n55M85m22j80Q54q74r5O18o33M75ql90M53k77
3579a57J00M43o9o85O45m92J19N88p26K16J34l42P46n94k16P47n99r0N54q05O44
3600A61j07m13O17k02m12R41l41n87N31l79J25L27m93K02J84o46Q92l81k99N07
3620B27l53l40O30l16K56L13o55N33Jo72N44j69l66P92m66J7L15n92L82K11n10
3641b18L28J98l55P58p26l54P27l26j84J93l08Q6L94n23M23rm06L24j49J52M55
3662D80q38L99L66m50L3J08m81O51k32n08O31j22k12K15LO9L20n47K02J16l68
3683a65O66m18m00P90o71m12J022p94K93K53m10N07j19m10O64r0m14N91q00K64
$$ y = [119, 271, -150, -33, 102, -345, 175, -202, -40, 107, -238, -197, 595, -167, -51, 29, -479, 452, 107, -299, 177, -96, -345, 249, -139, -201, 59, -452, -17, 392, -163, 322, -100, -280, 574, -300, -395, 223, -410, 65, 57, -333, 120, -157, -57, 386, 317, -368, 277, -215, -96, 492, -234, -18, 116, -226, 520, -74, -290, 457, -142, -232, 322, -483, 161, 54, -359, 258, 56, -356, 585, 244, -343, 188, -191, -66, 261, -232, -30, 154, -492, 400, 19, -280, 227, -126, -466, 164, -152, 104, 417, -238, 295, 296, -376, 168, -1, -367, 425, -41, -24, 291, -301, 81, 292, -218, 110, 308, -47, 711, -15, -369, 358, 32, -152, 41, -267, -181, 213, -310, 113, 104, -302, 22, -127, 25, 480, -358, 41, 407, -43, -10, 98, -383, 268, 36, -472, 159, 37, -175, 40, 43, 112, 432, -115, 87, 203, -165, 501, 83, -317, 473, -198, -610, 412, -382, -89, 164, -246, 261, 142, -268, 396, 306, -108, 483, -317, -53]
3703e3K32n25J47K61k53N18l73k97N52k77k18N22j44q6L18n03J55J55p48P66n7
3724I2m23O49k80j55K46l67K86K07k70l3K78m37L02l02j40M32k65P1L45m74J69
3745f9R4m36M86K03k97L55k87l89Q68n71o5M81q45L84L43p72O32r8k00L08L0j88
3767c3K57j74J66K07p66N66J16p55R70p15j38O76l39k41L55n94O72o8o10N97r2
3788E7l80N90r2l21K72j83l07P30o03L42J24o33M86j4l49L35l03J44N44n73o4
3809a98L47k56J47j0j12K86k78l56K89Pm6K57j77L91J4n86M59k5n00O86o29j6
3831c06O29n71M8M13l42R2K06n20K54L02n81M96k26p2O69n74o0M35m28J91j05
3852e0p6J09N6k60N60o28L27J97l47J25L04l54J0Q0l16M64nn06L39j79j39L27
$$ y = [-53, 179, -346, -199, 62, -191, 327, -46, -343, 209, -68, -286, 236, 92, 6, 324, -179, -24, 131, -617, 149, 92, -331, 318, 38, -117, 129, -238, 48, 255, -15, -48, 230, -207, 95, -207, -347, 85, -180, -109, 236, -238, -69, 25, -411, 75, 278, -19, 336, 49, -340, 528, -43, -108, 373, -472, -88, 255, -517, 115, 17, -183, 125, 155, -33, 224, 50, 216, 423, -343, 223, 339, -416, 554, -161, -299, 377, 38, -203, 152, -442, 230, 162, -448, 149, 57, -323, 267, 175, -146, 126, -57, -364, 366, -237, 105, 229, -404, 82, 68, -281, 54, -249, -105, 439, -134, -198, 149, -107, 40, 30, -82, 204, -74, -430, -141, -134, -180, 77, -100, 291, 305, -281, 178, 153, -347, 339, -290, -306, 323, -248, -200, 213, -129, -37, 169, -351, -97, 205, -376, 120, -106, -178, 491, -83, -143, 292, -136, 55, -50, -126, -17, 39, -221, 339, -289, 38, 235, -112, 13, 317, -37, -27, 53, -263, 201, 196, -310, 29, -150, -289, 38]
3874C8j15N5L74m89N15l50j79L01k6l67P13m97j11L67m35J76K17l83K17j0l28
3895c17O19l38n2J80k57J42M30o60M23J22l84L28j71k91O47o53P5K84j8l2Q9l15
3917a49J82j96k62O59l35j42N84l94j57M17m65J08L93m57L09J93m03N54n57l25
3937d43M91k66k9M42m17J14L02n27O25m6m42M43j99j57L60m26Q1L59o13K33K50
3958A35l20K32m8p7J10j33K75K17m98N2n1l7M23l86J5J88N4l14R2M1o6L13n33
3981c16M58j52l76O02j83m27N99k07r4M40l87j9K71n27N43n6m93O07j94m78O71
4002B82k67OJ24l66L88O4m08J73k1k41M13q2l91N57j71P5R4l62L07Rm68N75j80
4025A10l98M12p7j71N02m60Q5j00j40L82N9o98N89j82l15P28m05K3K86n41J8L90
$$ y = [38, -77, -22, 352, -137, 378, 28, -151, 150, 124, -243, 470, -27, -138, 229, -206, -30, 187, -196, 21, 11, -317, 302, -36, -88, 92, -165, -23, 407, -253, 170, 292, -92, 236, 65, -226, 421, -232, -157, 127, 109, 77, 166, -149, 33, -163, -425, 234, -101, -243, 341, -53, -210, 207, -258, -150, 243, -214, 95, 288, -115, 439, -118, -443, 48, -218, -247, 195, -222, -108, 194, -333, 292, 246, -196, 247, 48, -109, 251, -175, -94, 265, -348, -115, 135, -185, 47, -1, -78, 32, -101, 174, 391, -107, -55, -106, -143, 280, -106, -91, 97, 151, -163, -71, -30, -96, 217, -316, 142, -10, -386, 216, 33, -394, 205, -2, -96, 344, -43, -62, 209, -318, 225, 169, -324, 283, 89, -389, 282, 15, 21, 145, -221, 167, 231, -177, -4, -25, -266, 147, 65, -326, 231, 60, 135, 229, -133, 174, 183, -285, 290, 110, -288, 124, 47, -124, 378, -82, 3, -97, -237, 145, 204, -494, 95, -87, -402, 326, -79, -56, 230, -311, -293, 97]
4047I7k23M75l32j45M51n40M0M98m56j05M01r3j14J38n9K10k98J02K67o14q4P21
4069C37m59M1L03o20M39K2j60L45j11m10O20k37l10N10m44J9J45k3k48K1P2J65
4091A7K98k37K95m13j65O02o24K47J68l33K06j51k93P38m35j17L73j11n5R9l52
4112b43M41J26l62J3J34m06O24k14j80lk17L82l7j52J78J21k38K34l33l46O69
4133A91k99k2K48l06K02M66q69L68Jk3K82k29k52M34l05n8K85m05O01j50l17J36
4155b1Pk00K78q2j52N44m96M0L28j88p5q7j09N68k57l94O78n89L81j23o5l6l4
4178h4k4K48J88n76L06j73J54M0j07J07J16k06o6L55n55M69N2m90N96n49J23L80
4200C04l79N4m5k60J64J71k79L08k07NmK65l90N06k69J29J76m29J79Q8k55K83
$$ y = [97, -126, 349, 17, -128, 323, -217, -177, 321, -135, -240, 161, 68, -46, 92, 33, 243, -55, 47, 314, -300, -384, 337, -122, -81, 222, -398, 41, 63, -97, 248, 137, -273, 347, 110, -200, 310, -134, -115, 30, 7, -241, -220, -148, 17, 315, 78, 373, -40, -205, 397, -227, 20, 188, -145, 61, -90, -383, 355, -80, -197, 176, 65, 10, 109, -243, 198, 324, -38, -25, 109, -297, 327, 113, -67, -70, -287, 95, 58, -94, 84, 205, -33, 201, -132, -478, 191, -108, -130, 118, -188, 14, 480, -389, -21, -20, -43, 239, 10, -242, 192, -113, -171, 114, -291, 310, 160, -157, -21, -14, -214, 64, -18, -170, 374, -122, -82, 246, 58, -17, -104, -213, 355, 98, -296, 382, -207, 174, 51, -14, -50, -84, -108, 140, 328, -248, 58, -115, 39, 79, -28, 79, 195, -11, -77, 278, -277, 192, 244, -246, 350, -199, -76, 304, -75, -21, -66, -326, -162, 9, -270, 38, -169, -164, -168, 97, -293, 213, -56, 73, 249, -180, -1, 87, -168, 115]
4222A15k68MM66m85M9K32n2j56K20j93M10j79l23L80m35k3N98p37j9N02k2J50
4244B34l03k13N26j65l39L77k37JK50l98K78J54l52L06j97j49L73l44n6N72m69
4265a51L05N9m76K03K96m21L69k12k16R7J22P3K94k05k63K38k33J48n8j66K49
4286E2J53n46M35j62Q8K18k68n4K29n24J62J11j35K07j66O0K41j27L9L07l50J53
4308A23K94m58Q1R9r2L13n41J23O7J69n44M19k8n7K42l80N17l83p6K63K97q11
4330c63N88l34j58L16m24M61q5j1P2k08n2J86J54m70L71l78M46J18m56R5J40p1
4352f3J2Q6k32N08j91j22N9k68J24L15l77K97P8k18L20j76k15M25n27P2K29k28
4374i2J51o1k33M94l06k57L78j60j21J09O8J61m5m62K96K57m57M23j86o4N6j36
$$ y = [115, -153, -149, 317, -168, -119, 113, 61, -95, 125, -68, 342, 163, -160, 220, -215, -238, 360, -377, -396, 106, 84, 234, -69, -282, 244, 79, -260, 117, -120, -119, 131, -267, 11, 165, -187, 119, -78, -227, 146, -198, -254, 318, -151, 154, 213, -263, -60, 236, -185, 184, -28, -244, -147, -25, 48, 342, 137, -126, 112, -121, 27, -31, -197, 52, 205, -341, 94, -68, 20, 238, -30, -84, 145, -379, -217, -106, -241, -34, -200, -140, 101, -26, 13, 320, -30, 123, 417, -41, 40, 139, 47, 360, -181, -58, 9, 178, -366, 53, 25, -32, 210, -170, 347, -36, -112, 151, 448, -363, 225, -109, -267, 49, -375, 86, 1, -10, 62, -146, -198, -12, 142, -328, 43, -335, 111, 229, -227, -132, 8, -63, -51, 35, -197, 311, 120, -2, 57, -211, -87, 228, -149, 148, 226, 8, 328, 152, -63, 362, -165, -93, 136, -92, 59, -2, -235, 259, -47, -304, 74, -86, -207, -98, -30, 131, 86, -376, -80, 177, -280, 143, -43, -107, -51, -187]
4396a87j1J51r0M88j38m56M15k27j57J87k15k4K68l94M19n6j86L40j61j4j18K46
4418H0O0k7l16j8L08l77J19N48n84J23L31o60N68p4k85J88M0M9L44n62Q7L15m12
4441a55P6L52n56K81l6l56P17l72r4K27J9j65K52q2o1k21o1L97j71R6J12k65Q2
4464A6L4k78M05k43j74K50l03P4M47m24j65O41l23K43k06j06K90J3k50J17j05
4485d7k01M67m07M45j50k13J63K94m50J83q8j37J20j18j2L98l22k80M80j66J8
4506b3K00l83K32N6j47J58j16L30j94k44OK67l26O4J22j35L64r7m48M87m49M08
4528A32M7l43J52L13n04K35N8j9q6K8j19J72j86N0L46l60K11J2m51L65j44P1M4
4551B4O0J17J7j77oK54m19K99m4l53K64j83J78K15l66K54q9k33K71j85K37k91
$$ y = [-187, -198, -47, -137, 351, 213, -243, 172, -55, -212, -25, -240, -264, 4, -390, 29, -27, -213, 127, -34, -48, -166, 80, 140, 113, -203, -221, 87, -290, -171, 377, -207, -84, 247, -413, 155, 81, -204, -16, 24, 73, 417, -145, -58, 257, -155, -79, 273, -283, -2, -38, -394, 323, -49, -143, 84, 103, -62, 190, 108, 47, -174, -235, 162, -9, 87, 199, -66, 16, 50, -228, 177, -66, -240, 10, -293, -219, 228, -196, -361, 280, -43, 200, -6, -112, 178, 191, -59, 58, -47, -248, 219, -188, 257, 107, -106, 57, 351, -99, 84, -4, -141, -21, -139, -151, 247, -75, -355, 125, -41, -23, 177, -206, 26, 82, -65, 93, -23, 307, 113, -131, -125, 142, -184, -120, 2, -133, 231, 134, -314, 173, -276, 132, 179, -164, -12, 301, -203, 32, 90, 71, -15, 13, -106, 66, -120, -70, 276, -84, 127, 139, -312, 53, -91, -20, 24, 84, 201, 218, 41, 35, 289, -130, 169, 125, -228, 36, -147, 31, 246, -120, 134, 45, -188, 83, -102, 135, -156]
4573a56J69k76M19k90K92j35n0m1L15k22QP7k92K89j72p1L31l55j54M03l21K44
4595A2j07L54m84M7k8N7j4Q7J24j63R9J29j39j18M32n36M84j76j78o2L82m73L69
4618I8k31P2L49k48M0n1L9L2j28K79j58j13m8J66O1j58J71m30J58Q8k50J28ML9
4642i1K23j50P9K26l78J79q9k59M50k18lK18j80j42K64k49j43L27l59K78J76j44
4664A5kL8o2J15j23k75N70k53k29L79k67p8K31jl4M9M3Ll46K14r3l15L07N37n34
4689a11l6M05m68L32j00k04K13K20l66K86k56K28J89l32J2j13L5J57j63K55m2
4710A41J3J74l91R0J11j70l7k5K82k59j63K74j76J13j47%L84l24K50q8k72L15
4732I5j4j53K57k22k5K30j78M0M4l50L94j4l03L89o7j36l7o1M7N37o41L29p3m
$$ y = [-156, 13, -263, 156, -134, 158, 23, -27, -68, 247, 25, 33, 110, -182, 107, -65, -136, 195, -160, -314, 89, -232, 12, -95, 259, -225, -178, -206, -149, -163, -76, 48, -115, -16, 113, -26, -144, 288, -248, 236, 60, -118, -180, 202, -271, 98, -133, -61, 288, 40, 80, 29, 68, 100, -28, 251, 93, -20, -68, 98, 159, 1, 172, -258, -100, -12, -262, -134, -130, -91, 132, -18, 61, 287, -91, 88, -1, -260, 190, -28, -31, 187, 7, -135, 129, -120, -263, 64, -295, -17, 159, 15, 13, 51, -11, 104, -19, -294, 276, 23, -206, 173, -94, -172, 59, 58, 24, 73, 116, 119, -227, -13, -106, -421, -114, 423, -111, -147, 258, -210, 122, 22, -182, 31, 251, -115, 171, -85, 143, 332, 0, 12, -101, -66, 91, -72, 183, 141, 154, 328, -63, 27, 138, -32, -69, -94, 188, -71, -234, 40, -136, -23, -170, -170, 214, -110, 140, 52, -220, 95, 81, -72, 185, -37, -62, 168, -10, 30, 74, -276, 118, 104, -199, 190, 123, -13, -50, -111, -64, 473, -168, 161, 88, 84]
4756H4l14j1J41Kj62J34K16l98L60p8J55N4j26m86O01m2m45N81l04q5J13Q5q6
4779a1rk34L0K06k26K94j17j8K42l14J99m7m5J81q5k24M9J99L1Nk35J00m0J89
4803A20j06J08j65L42M8o07N62l65J8K50J0m12K90k42K70j17L8R7j22n1J34j47
4825d7k35N35l38K56l20J11J37K95m82p6k13M31M1l64O2K36j96O0K12l94L36j03
4847e6PQ3j43J84p8j12J67J07j10k88L83m20L42J07m28P1M67l71L13l82O5K71
4869A79k58j69M19p9K01l83K50j38p1j42J86P0p5J25k06J45pj20K65L0l32K15
4891A05l75N41m46j08L40L3l32L00p5J9K48l13r8K66j39j67K93j73L3K4j49L75
4913B02K10o74M60l24Q5K43k90p3K22k31K24Q5j60J37l31L39J22j22J30k8p02
$$ y = [84, -230, -241, -100, -98, -260, -126, 90, -308, 52, -26, 129, 183, 57, -429, 172, 130, -315, 266, -38, -123, -10, 75, -11, -20, -254, -224, -18, -244, 50, -67, -85, 157, -157, 42, -5, -50, 131, 46, -178, -129, 70, 101, 106, -129, -29, -69, 120, 14, 122, -43, 299, 347, -260, 302, -63, -45, 205, 215, -197, 93, -149, 121, 4, 42, 139, 17, -34, 100, -47, -282, 253, -85, 171, -149, -38, 99, 394, -88, -164, -377, 54, 95, -269, -207, 29, -167, -107, 105, -289, 47, -56, -49, 34, -109, 75, -3, -115, 52, 159, 49, -239, 144, -276, 66, 173, -255, -184, 283, -88, 225, -157, -92, 179, -79, -248, 171, 92, 293, -90, 160, 22, -49, -191, -5, 65, -10, 115, -91, 54, 47, -73, 192, 222, -110, 105, -270, 271, -175, -283, 57, 90, -242, 58, -17, 2, 250, -63, -161, 105, -34, -201, 92, -81, -48, -24, -173, 202, 412, -262, 198, -126, -41, 202, -88, -161, 61, -170, 54, 139, -21, 116, -215, 124, 246, 124, 254, 226, -476]
4934d76L73L5K59j41Rk05O3K79m03J42L25l10k07J37L99k82k06J96qj5j39j34
4956c09J44L76k22m4J30p5k29N05n92L94q6j45J39k30R0K80p0m1o9r4J1J77j56
4979a16L67m40K03K81n33K35Q9j17r8K31j24N7Pj28l8L7J78q5n7q0P1o6M40k1
5003B93j49%k50L9L02j97k69L67j83K8O1k48J96M0NmJ13j3M69p57L51j40Ro4K86
5028B85m85J18r2m2N47m70Q6q2R1J73J05l19M0L2Q0J19q9j32N2o3o2L00l28J25
5052a1O8j90J43j13K7K52j10j29K06k5l17L12l13J81K69l98L55q9n3J09j00k49
5074a75N36m27L40j47j79j24L72l71J16N1j07J15J4j17R0M3j42j5J44q7lN6k7
5097d4j38J23Q0r7P6m7Q6p7j04J4k0O8k21L14O0q8j1r0j34K09M7k5K32l60R8m8
$$ y = [-476, -103, -68, 191, 50, 59, -146, -83, 196, -207, -65, 260, -50, -257, -120, 279, -3, -209, -13, -21, -36, -175, -309, -165, 211, -11, -55, 75, 0, -229, 276, -316, 78, -8, -153, -14, -244, -154, 126, 56, 15, -54, -148, -137, 40, -116, 251, -189, 14, 295, -238, -3, 86, -31, -129, 102, -22, 35, 42, -86, -124, -87, 91, 6, -51, -131, -60, -126, 314, 293, 144, 144, -106, -67, 235, 38, -231, 136, -47, -19, 42, -206, -10, 30, 35, 31, 144, 131, 600, -157, 194, 54, 63, -1, 285, -200, -82, -174, -216, 331, -139, -53, -135, -44, 129, 234, -85, -45, -13, 67, 186, 97, -35, 17, -46, -108, 192, -136, -11, 57, -133, 10, -103, -76, 176, 66, -63, 143, 118, -199, 113, -200, -19, 250, -148, 207, 118, 65, 174, 74, -175, 361, -66, 274, 127, -52, -176, 196, -175, -59, -8, -115, 0, 14, -103, -13, 30, -112, -127, 17, -70, -73, -17, -44, -182, -59, 21, -76, 0, -47, 39, -38, -142, -128, -148, -80, -301, 13, 73, -15, -26, -116, -250, -41, 6, -19, 213, -147, -49, -97]
5123i7J3K31o8j91K80l27p9J92J56K7j48J40j6p6k05J62j09L9K97l36K35L2l04
5146a52R3L8P9l77J4J59N2q2J80J46l10N53m15m7K12j96j37J69%k52M56l66L1
5169a52J04P3r1J68l08L41j9j61j11R5kJ50k33L29r4l17L69k1k27J46k7q1J48
5192G9Q3j1r5J7M9K89o60K40R8r7K41j51n7N0j98NK21j97N2j0k03K56L9n6J24
5217A08j84l05N17o7k03R6k30N28j67J3K38k28l3j45N7l19L50m0r2J62r9n4J92
5240I5l6M0j28p7P7j41L59j86l1J14j79lK41J36m73K57k86J87j10NQ6M5l63M73
5264A02n1r1K14j28J25j35N8k98L27l51K02q1J69R6J22m68K15q3N0o5j51K91R8
5287A67m34L7J72j94M11j10r4m6o5K60Q4j90L6K45m52K58qj32Q9k45j20N73L4
$$ y = [-97, -84, 147, 79, -112, 168, -159, -238, -46, 110, 137, -11, 129, 113, 37, -168, -6, -115, -76, 221, -115, 120, 152, -152, -59, -21, 58, -319, -305, -146, -94, -176, 4, 150, -160, 393, -22, -69, 143, -53, -190, -21, -21, -273, 183, -183, -152, -48, 25, -66, 102, -206, 135, 116, -45, -156, -61, -63, 87, -146, 183, 89, -228, 141, 120, -107, 39, 12, -69, 79, 162, 151, 56, 73, 122, 411, -249, -9, 89, -8, 233, 82, 25, 75, -123, -118, 103, -94, -42, -52, -255, 1, 40, -16, 108, -76, -381, 136, 69, -134, -38, -268, 260, 93, 106, 344, 116, 83, -62, -5, -324, 26, -14, -106, 56, -43, -97, 95, 59, 99, -29, -106, -29, -170, 189, 3, -28, 86, -93, -96, 145, 281, -192, 65, -221, -34, -144, -139, -53, -8, -371, 102, 51, -40, 174, 46, 171, 36, 94, -204, 123, -228, -26, -107, 62, 158, 280, -188, 27, -56, -6, -71, -222, 69, 167, -267, -230, -58, -252, 159, 49, -45, -91, -156, 104, 188, -2, 34, 279, -173, 85, 77, -55, 34, -211, -331, 242, 276]
5310B76k15l8R3j80k5Nj18R2J70o5r7M9J00L9k39J49P5K5r0j10J90J7m0R3p3j52
5336f9J35j69J04R4k91j9M5K16k72K14O6p0J30k03K89l09j51K52k92K91q5l6M89
5359C59k70j46R2N0j90K74p0N6K8p2J25l12O8O7k77L16M0m39L01j41J8R2M2k66
5383b55L20m2j7k43K07Q4rK44k22J14l7J28k89M3K56m04n0K85n7q5J76k46N0r4
5407a43l0J78p4l21M02P8N8o1r1rJ13n5Q2m5j75J20N6l40L10p9k31J67KJ88O7
5432A67j32j18K38l43J88L64n90N75l79l3J95j76ML24l31L32l81j39K79K20m35
5453a71L82j93J62r4k84L57j45J46o0O7o4j13o1J77j08j60K42N3l57J56j43K52
5475D1J36k58j70L51k80J94L00m43l6L19j45k3m0j79K93J6k12K30o9m3K18k52
$$ y = [276, 61, 23, 116, -64, -89, -84, -202, -110, 60, -5, -102, -53, 47, 86, -153, -4, 71, 96, 6, -104, 86, 103, 63, 156, 83, -69, 66, -103, 1, 95, -196, -215, -170, 46, -226, -12, 54, -16, 114, -89, 200, -109, -260, -8, -300, -9, -94, -130, 359, 89, -57, 35, 85, -105, 169, 99, 155, 183, 111, 236, -76, -8, 59, -218, 98, 138, -301, 0, -141, -123, -31, 11, -255, 65, 23, 6, -237, -30, 54, 45, 289, 67, 181, 144, 272, -17, 26, 282, -122, -172, 113, 56, -29, 147, -99, -49, -143, -173, 5, -69, -390, 12, 90, 148, 87, -4, -13, 100, 45, 127, 82, -93, 27, 83, -257, 53, -26, -257, -90, -88, 100, 167, 35, -83, 155, -188, 0, 364, -226, 349, -30, -63, 132, -44, -40, 284, -47, 285, -96, -235, 44, 264, -171, 211, 18, 180, 86, -198, 159, 14, 160, 100, 167, 103, -10, -71, 106, -2, -162, 80, 133, -224, -68, -211, 41, 177, -81, -251, 100, -180, 14, 314, -129, -165, 154, 9, -14, -54, -233, 60, 76, -136, 94, 25, -18, 200, -52]
5497e2J15j66n9j5K63mp6K41l85L13l22pK85k39k4j05J51K30k23j80M80k63M3
5520AK13l40j67L43n3J54P3n05N04k13r7R6l7j07K53n6J6J87j93R2j62j1J99k14
5544b4j3K66j77l80L35l34K96J88l32J42J77j95J72m20J65n6n4q2M59k27J94Q5
5566A85m86M05M4l14J70l3q6M4j72J06J13P0j41Q6K92k47j82l1K28J34m24J54
5588h5J16n1k2j12M53j99k13P6j32q7K83n9J15J48k78j93K46J17J75k45Oj31O4
5611hr1J11k98J47L06k70J3J28l3J47n1k19P8P9j0K34k78P6j04j79M03l5j10R1
5635A27j19j93K34n4K4j60m8L34j71l6L68k10m43K33J92l6J84l22J25R5n6k96
5657b28J02j92M10l44Q3L35j33r4K01l13J74m4j2o4O4l81M93j16M2K39j18O7L
$$ y = [-52, 63, -103, -162, -177, 86, 82, 6, 247, -138, 175, -147, -154, 131, -108, -132, -237, -86, 144, -79, -259, 221, -42, 1, 214, -126, -293, 50, -3, 151, 224, -281, 223, 10, -87, 9, -28, -135, 118, 62, 78, 265, 72, 164, 2, -9, 190, -24, -37, 229, 52, -328, 7, -327, -31, 157, -175, -33, 144, -51, 121, -299, -134, -190, -244, -326, 133, -94, 100, 185, -301, 104, 148, -166, 4, -29, -115, -71, -243, -137, -24, 46, -95, -9, 283, 36, -146, -177, 51, 185, -239, -85, 31, -20, -42, -154, 299, 100, -113, -37, -169, -256, 27, -32, 83, 231, -47, -240, 6, 123, 298, 53, 59, -72, -8, -99, 12, -286, -139, 167, -103, -90, 38, 5, 152, 101, -118, -40, 39, 29, 263, -15, 61, -43, -222, 181, 146, 36, 127, 8, -185, 49, -5, 19, -141, -189, 145, -26, -62, 306, 96, -347, -114, 78, 42, 226, -96, 29, 124, 68, -228, -126, -318, 92, -252, -169, 166, 33, -61, 140, -173, 1, -43, -55, -119, -55, -436, 57, -59, -17, 222, 104, 171, 174]
5680A74m07J5M18l43K1p1J14P1J07k69l1Q6R7Q0J0l8j86J09k00L62n47N90k86
5703a24Q4J98j18J36q5l24M09j64q7K90j34m3j25K8J48j4j27k63M85m21M12l59
5725a98K02K49l72J83k51K24j45K8J01%j34M4l6J48l58M41rj29l1K1K49l7m77
5748b87K48L4k18J84L57m56K26k43J93mk90M47km59M67n4o17M54R5K25l74O2j4
5771b6J04R8k4p7J19j07l73L66O1k02k5O0j70L98J1k56K69j49j66K61k64k6L1
5794h7K84n1L37n37l8M0l9k5J80p9j98K75r0O2k66O3J2m4K50m2j96N39m62J29
5818A7L09l79m6K71l04K9J30J48j38j72J94p4j38j80L18j54J02J85m18K37L91
5839C28n48K24L12n65K21M7j03J73k9j36Q0j02L37m23K18J37j63l99N56j19q3
$$ y = [174, -233, -218, 200, -143, -122, -193, -79, -8, 99, -170, -201, -115, -18, 62, 72, 34, -152, -43, -243, 119, -428, 162, -124, -40, 158, 40, 176, 91, -233, 176, 12, -75, 215, 81, 38, -87, -59, 89, 75, -52, -315, 170, -251, 161, -198, 4, 253, -119, 64, -187, 37, -108, -80, 21, 21, -113, -69, -105, 43, -315, 126, 117, -12, -43, -22, 227, 190, -287, -39, -5, -223, -39, 318, -138, 88, -155, 38, 34, -256, 191, 189, -270, 197, 143, -474, -20, 75, 300, -74, -12, -26, 78, 176, 152, 75, 194, 87, -286, 80, 141, -61, -86, -26, -196, 202, 213, -43, 226, 77, -89, 172, -92, -118, -87, 197, 146, 483, -54, -92, -52, -91, -116, 64, -15, -213, 62, -28, 34, -232, -169, -157, -201, 49, 7, -189, 350, -112, 17, 326, -53, -99, 172, -132, -103, 27, 175, 37, -135, 59, -15, -153, -333, -15, -169, -67, 118, -300, -63, 328, -220, 4, 316, -249, -28, 19, -84, 89, 60, -76, 4, -98, 239, -184, 34, 171, 8, -391, 165, 46, -37]
5860c7n5L0P2J18j06k64M29m31M78k05k97K14J17j2k50J15LJ27j79K82q2k61M35
5883B41k12j51L11k02k46L12k74J16L49k92R7k63J59L34j05k49J4j65J69J0j60
5904b07K56P3k09J71Q6K5lj44j86K47j41n7K91k18J55q5r4J87m5m6k46J83l5J59
5928A17n5j04j8j27L17Q9l31Q6j9j63L9L61m01L97l11K79k80O4p6L2K1M1J1k08
5952b39M25j92nJ97Rl30J26O5j47J71k93L73k86L19m0o2R8k49k44r1M75q9J0q9
5976h8j7K03j41l15L91R8j17L66j11l54j30L98k31P9l2N3j71J1K38k36m6m1L41
5999A48k46K54l24K81J10l97M20j56j6n3J90j81k40N2J21K51n91M14J03j37L67
6020C70l21O9J76l84J56J72j65m3K72l26J20o7J22K6q9n2J72l46K46p0j53L01
$$ y = [-37, -92, -62, 10, 128, 22, -242, 187, -244, 234, 29, -268, -54, 63, 51, -199, -84, -81, 46, -133, 149, 67, -194, 241, 29, -122, 189, -13, -259, 53, -221, -105, 244, -48, 49, -214, -55, 279, 174, -75, -61, -226, -57, -47, -207, 49, 122, -87, 84, 170, 195, 192, 48, -138, 109, -32, -89, 202, -16, 139, 54, -40, 147, 102, 56, -190, -7, -42, 117, 62, -42, -60, -187, 130, 219, -112, -26, -45, -208, -169, 192, -209, 188, -123, 156, -124, -60, -136, -104, -83, -42, -31, -239, 186, -6, -11, 186, 195, -135, -9, 56, -91, 80, -213, 160, -126, 193, 153, 91, 189, -60, -304, -395, 80, -9, 1, -88, -105, 98, -43, -358, 33, 131, 14, 380, 269, -85, -215, 183, -48, 31, -1, 52, -119, -108, 130, -106, -152, -193, 148, -98, 156, -168, 113, 223, -174, 246, 90, 74, 21, 211, 30, -210, -158, -37, 214, -377, 37, 140, 3, 370, 49, 118, 294, -90, 66, 238, 73, 30, 302, -24, 96, 29, 151, 177, 88, 36, 208, -138, 108, 38, -115, 186]
6042A86j04k72M63l70p0M8l8J4J35k64L82m7K06k84N5qk9M1oJ29m96J98K98k08
6066d1J40j63q4J53L9L06m53M9J63k11n1J00p5o7L03n7l02M29j66Q0J9r8l30K83
6090c4o8J40o1J42Q9l71J36J07r5j02j27J24K61k16J01Ro2O7L06k04k15M9O8J28
6114A72j25k29K90J39k49Q5j16J66j78P9k73K41K2jJ1j53J96m8j84K80k38J56
6136D3K50Kl46L7j82KL45m42J61m0M3J46J54l0k97J68j34Q0PP9J3j51L15Lj77
6161D9J29m10J33J37Qj84M02n71K70N4j34J12J32k32K5O0r1L51j93j0o2j57J59
6184b3j69M8J79q6n8L71j70O7k1j62O9j73L48k68K49k96M81m18o8J36j69K90k0
6207A37q5o8Q0r2q8M2rj39p2J98J91q3M7J35m40L17J86m04J31n7L64m09L85l36
$$ y = [186, 82, -190, 273, -97, -167, -119, -157, -143, -8, -272, 110, 63, 269, -15, 40, 32, 3, 44, 38, 167, -329, -131, 167, -41, 99, -64, -148, 5, 44, 350, -103, -54, 109, -102, -153, -53, -128, -195, 108, 51, -251, 178, 12, 92, 111, 13, -317, -34, -102, 38, -23, 119, 208, -163, -27, 80, -15, -117, -244, -120, 141, -75, 26, 35, -27, 40, 346, 142, -73, -24, 44, 172, 47, -182, 108, 247, -2, 83, -33, 133, -45, 34, -239, 2, 24, 23, 34, -119, 77, 29, -155, 125, -113, 43, 293, 295, -51, -14, -196, -194, 151, -291, -130, -170, -127, 19, 173, 143, -154, 14, -120, -40, -33, 46, 59, -92, 223, 226, 49, 178, -232, -99, 38, 46, -138, 264, -307, -37, 17, -117, -5, 127, -105, -80, -20, -111, 240, 47, 37, -25, -182, -23, -192, -144, 35, -51, -109, 262, 92, 159, 138, -24, 45, -128, 220, -48, 201, -95, 386, -32, -100, 36, -133, 157, 137, 52, -16, 64, -28, -116, -74, -83, -222, -294, -96, 95, 12, 59, 194, -246, 71, 257, -147, -16, -73, 291, -118, 267, -69]
6231f9j11L11Q1Qj76r6kQJ35q2j17M7J54N3o3j17KJ88j93n3l13M00M4j18J4J49
6257H4k64KK35j20L04m5m9j94K17n06M55j64l19O43j24k1r3k14j2N9j6J99j38
6280h1K61j44j08OK05J0P4J08n50K12l6O0Q6m4k12J41qj58K12J4J6p6k53J55m0
6305a50K46L5k26J31l07m3O02l54j19o3n6K82J95k03j70L80l82Q9J74j33M4O0
6327C2k55J56J68j77J96j39k0J50J21k26N8j60J62j17k3J43n7m2J51q3q8J77j98
6350g1j06J46R9n2o5j4J73k30J23R3j1P1j37j57N4j32J47mQ0pJ17Pk2j79K67P7
6376B67l52q3K29j10L8r3J84J45j12j59J60p8Nj28K10k3j04l15K79j69K58j10
6398f1Qm9P3q9J85J58k81K43j50J10l29pM98n86J95M1O6p3n3J5m8M8R1k10L0J50
$$ y = [-69, -180, 131, 212, 220, 44, -52, -54, -46, 89, 7, -110, -63, 91, 144, 81, -36, -34, 154, -39, -92, -405, -5, 39, -79, -65, 84, -180, -178, 57, -63, 241, 196, 147, -47, 170, -336, 119, -45, -364, 279, 155, 134, 41, -173, -185, -126, -142, 57, -81, 180, 36, -72, -66, 139, 149, 223, 331, -219, -7, -43, 17, 103, 59, -153, -12, -20, -178, 34, 48, 64, -12, -265, -110, -150, 96, 131, -95, 36, -271, -314, 288, -66, -185, -248, -304, -22, 173, -30, -200, 180, -202, -113, 61, -72, -28, 32, -223, -67, 101, -76, 120, -19, -39, 111, 232, 6, 64, -96, 66, -51, -74, 69, 12, -30, 121, 38, -50, 127, -71, -177, -31, 68, 16, -49, -63, 110, -120, 3, 96, 85, 156, 19, -138, -84, -216, -69, -73, 7, 0, 117, 124, 102, -77, 190, 267, -85, -168, 61, -49, -11, -104, 80, 225, 113, -46, 114, 36, 41, -87, 123, 100, -4, -319, -40, -209, 49, -61, -53, -102, -29, -118, 67, 225, -56, 187, 37, 147, -182, -189, 309, -277, -82, -41, 25, -48, -101, -86, -134, -86, 5, -205, -175, -25]
6424b5j56K75q0m5p9J63k0p7j01J10K93l14J4J5j75L83j49l66L22o3J46J49m23
6447b03m2J43kK11k6M7k46J73j24Q3j22M6J14J68n77M78j17p4K11j07l5k54K01
6470e4j62M22j25o3r0J72m8j43J93j31k30K85J4j6R8j94o7J87j78q3J78J3K15
6493A93k21J2P1N0M5m0l92L51Jj41N4r8R1L4k9m6L2l5J88J03k36k25O8K42k85
6518b13J90J05kK20k59j10r3L9J07n0K71j70k4J4j44J93M2j28k25L78n0K3J64
6541B78j80m18P9J55N1K10l42J45j51J04L6o6J17J68l73M0K11k82N73k51M3J05
6563B52k51j54J92P4p5J7J1j74N5K45n17M22k12R2M5j98J97J7j3m1N9k51L16J7
6587A25k84N05m68K37l64J67N4o0J45j92M8K30J10l21J93J4k77p7K44K5J34n00
$$ y = [-25, -181, 94, 14, -31, -110, 53, 33, -44, -145, -35, 258, -56, -42, -27, -202, 181, 32, -334, -12, -75, 71, 220, -203, -245, -102, -104, 107, 81, 128, -118, 55, -69, 14, -108, -62, 52, 220, -357, 121, 4, -70, 141, 34, -1, -255, -54, -216, 206, 81, 18, -72, 100, 52, -91, 102, -29, -259, 26, 40, 24, 122, -72, -139, 48, -130, -213, -35, -22, 193, -28, -16, 55, 105, 150, 110, -282, 69, 70, -71, -17, -115, -24, 10, -19, -65, -33, -68, 120, 223, -13, -238, -170, 72, -213, -23, 82, 80, 300, 41, -69, -162, -123, -16, -66, 205, 35, 11, 25, -119, 74, 116, -12, -237, 141, 91, 114, 278, 98, -320, -241, -86, -35, 175, -167, -22, -173, -69, -33, -99, 18, 186, -187, -147, 64, -218, 355, 104, 147, 252, 1, -153, 39, 113, 38, 55, 66, -108, -53, 192, -325, 97, -115, -23, 22, -176, 21, 38, 25, -16, 43, -208, 108, 125, -159, 346, -122, 115, -249, -82, -28, -88, 57, -135, -87, 143, 253, -68, 125, 139, -138, -215, 29, 54, 188, -312]
6609c12J70L10j59Rj58J71J15j94RQ6j79j55M94l36j14L42k12K06l7M0j98K14
6631A12l04R9Q3j58Q8j75K00J59j72J63j90J15j57J38j45J53N2j94P2k60K97j45
6653a69J38K65l76K28o9l79M39r6K0j45J70J08j8k84J12M3m1J47j93j01M31j87
6675D3j0j0O0o9P5j52k6K24k94K3J89j42K83p5q3J83n40L08J6R3n5m4Ll26K29
6700i7j87J91l2M6mK07j39J86j98j7Q9j56J37P9j33QJ04J7L5Q2o7k42k3J85j07
6725c6J10p6o2K62l05R6o7K14q5l81N45j08j07R8k91K73j97J36Q6L2nOL8k27K79
6750B28k68m7j10L05m6n8k62K06j17L28j4k99n4K88m52K10J96m10M42m34M10P4
6772A16l34kK49l9J72j41N2k06K58l92J41K60r3J03j1k58K37j59r8K57j2j89M
$$ y = [-312, -142, 168, 9, 18, -140, 31, 146, -48, -39, 47, -132, -287, 207, -129, -243, 99, -113, 93, 56, 96, -102, 112, -192, -93, -10, -168, -80, -255, -55, 104, -68, 95, -95, 20, -137, 1, -144, 9, 61, -133, -61, -321, -24, -169, -31, 234, -142, 86, 17, -362, 77, -19, 1, -144, 26, 134, 116, -168, -56, -13, -54, 93, -100, -201, 230, 43, 33, 23, 83, 14, 89, -63, -89, 135, -159, -136, 53, -89, 194, 119, 36, 219, -321, -13, 3, 96, 41, -3, 0, -326, -97, -284, -93, -125, -79, -83, 124, -15, 171, -27, -44, 45, -111, 26, 105, -28, -20, 84, 101, 136, 218, 151, -91, -114, 71, -36, 74, -2, -64, 198, -107, -11, -78, 136, 51, -330, 215, 107, 0, 98, -193, 80, -117, 19, 105, 137, 132, 138, 176, -51, 228, -40, -87, -197, 108, 62, 4, -258, -52, -169, 159, 145, -154, -208, 80, -372, -162, 34, -376, 66, -368, 42, 116, -218, -220, 29, -10, 162, 21, 73, -133, 125, -267, -126, 134, 41, 144, 133, -125, 112, -47, -145, 112, 100, -89, -85]
6795h5L38l78K04l30L51J10k37j05R1o2J14m3Q5N2j03j4j72K42k56m5J04O0k2
6818a01J75K12m35K30j24P1n7R0k26L63k59K61j80k00K44j2MJ24k39O4J44m77
6840c28N85j40k07K24k77K11j82K03L9l12J45P7J67k75J89j48m0J91j6k96J34
6861e6q2J86J48m93K54Q5n9J8n2l4L18k31k19L78j35J20j50k93N07j05k61R3K53
6884A90l02K13J66n18L37m39J36K08k76K00J12l4J56l15J01L0r0o6L84q6r0N4
6906G1l99L39m9P3q7P7k71K46j53J20J44k19P3K42j04N4r7n14P42k04k79J76l7
6929e6L68r5k78K87k89J62j66O4k95K67k03L09k40o6J01K39k76J32j54J39j28
6950a78L35l93L95k98K60j56lp8N7n6m0K32k25K45l19J97K02r8l19M49l6l21J82
$$ y = [-85, 253, -125, 79, -251, 100, 210, -27, -132, -41, -103, 11, -32, 53, 105, 2, -12, -184, 58, -198, -243, -139, -79, -101, 74, 286, -149, 81, -43, 28, -29, 61, -165, 198, -61, 200, 20, -180, 64, 52, 56, 180, -59, 5, 149, -328, 257, 117, -90, 134, -143, 68, -114, 89, 128, -184, -39, 38, 205, -70, 119, -29, -69, 122, 106, -190, -56, -138, 48, 196, -297, -43, 42, -17, 1, -51, -85, 233, 2, -217, 161, 26, 146, -4, -297, 210, 105, -156, -63, 190, -112, 101, 267, -251, 86, -353, -217, -9, -285, -85, 27, -7, 149, -166, -65, -35, -125, -191, 193, 107, 17, 71, -328, 11, -38, 35, -52, 25, -246, 0, -153, -33, 111, -108, -35, 207, 103, 157, 60, -454, 288, 84, -195, -19, -56, 312, 217, -61, 226, -63, 99, -67, -3, -298, -31, -234, 75, -165, -231, -130, 109, -167, -35, -189, -50, -178, 157, -236, 159, -139, 121, -35, -38, -116, -59, -115, -155, 77, -148, 97, -222, -25, 177, 79, -240, 209, 173, -148, 34]
6973C4q8Q7m5k61J69R9j29l0J66j40L05k4m7j71K02l18L01l02J77p0J74o3R2j56
6997c8j29K92j15PJ20K7l11k30P20p7j12o3m07L11K4l0R6j65J5n1J34q1J53k23
7021a33K53j43m0n10P19j70k85K71J52M3k13KL45j50k40M99k50j84j80J48j97
7042b63K42j35K59k75J19J20Rj7j14q5N5K8q1M31n87M8M18k17k75N22l71K28R9
7065A58j58m4P7j76P9m8J76J08r5j74K67K08l41K74k83Q1q6k44K42j51J66Q2r8
7088B0J1R0j89l0rJ3J41J45j67j82J27k1NR6k88L57P0k99N2l6K17r9N1k40j20
7113b85K71M9J8m6k24M28K11l67Lj31O3o9L35l06j51K83k09J94J67k82Q7j63j99
7136c23L88k74%L39n4k46K60j86m5L5j19M45k03K6j5j11K8o5J11L3K17k45R8j86
$$ y = [34, -54, 33, -12, -273, -104, -5, -134, -164, 2, -138, 167, 143, 96, -75, 127, -191, 110, -192, -15, -85, 89, 26, 118, -38, -167, 125, 10, 17, 137, 164, -147, -377, 343, 266, 154, 91, -316, -5, 19, -11, 85, -80, -65, -116, 18, -63, 90, -133, 120, -23, -63, -573, 146, -24, -309, -38, 114, 157, -56, -54, 291, 141, -99, 400, 150, -34, -214, -66, -263, -21, -156, 103, -172, -53, 67, 76, 59, -55, -140, -85, -57, -138, 293, -294, -246, 172, -45, -320, 202, -169, 59, 158, 0, -44, 33, -143, -64, -112, 64, 172, 77, -97, 170, 378, 37, 311, 28, 109, 23, -221, 21, -130, 36, 118, 20, 31, 121, -68, -98, -107, -94, 47, 192, 25, -157, -30, -51, -46, 50, -238, 119, 189, -110, -58, -94, 123, 24, 75, -165, -285, -14, 35, 53, 7, -217, 211, 422, 55, 58, -73, -10, -79, 256, -50, -201, 82, -127, 67, 234, -48, 39, -124, -323, 65, -209, -209, 130, 76, -170, 90, -96, -141, -106, -225, 220, 17, 43, 28, -83, -55, -120, -9, 24, 241, -4, 94, -92]
7160i2J08j6R3N8L5m33J19J18j70R1J12l1J85j80k00N02m47m2L89k44j57Q7J08
7183gl1L6j69L38l82j02N06m3k2l0j5j14K7l42K80N2n5J54j20J4O3J40k76K69
7207A71l50J79M5l28L92l3O7j65J87m96K85L00j93j59p3K82j75j49K23O1k54r5
7229b78M24j16N8k4K6o9l11L55m0j00R8J21m2j60J54M3J64o8l81K09j45j12J53
7252d1J48j54J24l35K33M2J1k5j68J44Q5l9j5P6j88K77l05R6L1j27k2L21k15Q3
7276C7K53m38K51j80j31L93n92M21J34k52R6J75j49J21j26K04k24K69m47M24l53
7297a14L31k47n3M84n01L22o8l98L93J4Q7k86J7J98l22J49j74K05J60k39k95J03
7319b34K04J43j2j39J9l9J07J07j6k96j97K63mN3J05N9m9lJ1m98M57M3j57J65
$$ y = [-92, 16, 0, 93, 151, 186, -247, -128, -10, -180, -89, 23, -8, 177, -3, -203, 299, -148, -190, 199, -45, -202, -115, -7, -38, -2, -171, 167, -215, -317, 189, 146, 124, 94, 79, -35, -8, -350, -70, -18, -73, 81, -39, -25, 38, 178, -98, 171, -179, 0, 45, -283, 109, 76, 143, -22, 165, -331, -46, 254, 61, -98, -171, 111, -64, -213, 10, 71, -183, -278, 146, 30, 88, 64, 90, 21, -290, 65, 25, -75, 23, 144, 102, -58, 96, 139, 303, 235, -146, 63, -82, -194, -41, 107, -47, 77, -258, -25, 17, 28, 3, -165, -21, 64, 25, 10, 86, -102, 175, -130, -34, -3, -130, -152, 169, -46, 37, 290, -148, 103, -77, -208, 185, -407, 14, 148, -104, -8, 167, 18, 139, 13, 217, -7, 262, -185, 239, -114, 217, -30, -83, 401, -100, 222, 154, -244, 149, 163, 250, -36, -19, 179, -143, 6, -168, 37, 197, -42, -337, -234, -30, 113, 101, -38, -19, -58, 49, 156, 140, -156, -353, -90, -94, -41, 64, 123, 74, 71, 82, -416, 41, 84, -73, 92]
7343I2j67j19L04l42J65j14K74k30J59K24k43P2m02L70nj68o7L05k40K03j51l19
7365c99N05O5j16k4o6j09P5L0K35j24j00O1J03k12J87j7j56K08k37J31j39O3K48
7388B12j90pM3k86K06P2J7k96M2K82j06l4K01P4l85J25j11K1o2L48m26J71J75
7411H6k12J63qj15J14j54J04K66k11j29J50J7N6J20o40N70j53j19l0l4L38N5k30
7434Dp2j24J03O0K39j86q1p6n4J55j42J30J54j63N5J17n1j25J37J03k72J62k56
7457a83K69j0j28OJ09R1j66q0j76M85j54ql38L84k2Q9mqk05o6K23j67J12j06L0
7482b3K01k78M3K29k93p0K26j4N8J56o7O3j50q9Q6qJ35m1l40K58R4l38K44k31
7506a49J35J65q5k1J69l02K05j33K5Q%J08Pk57M4q2o4L1K37J4J5j08K20L2K5j47
$$ y = [92, -75, -194, 110, -232, -67, -181, 93, -137, 22, 246, 3, 75, -327, 43, 38, -130, -197, 108, -132, 71, -80, -399, 106, 171, 55, 31, -35, -144, -69, -39, 196, 72, -28, 33, 136, -76, 111, 94, -62, 146, -91, 40, -99, -36, 212, 22, 15, 58, -228, -22, 50, 67, -229, -187, 95, -11, -45, 156, 230, -155, -30, -141, -120, -182, 166, -260, -89, 86, -126, 37, 29, -86, 28, -126, -22, 244, 33, -96, 54, 71, 127, 247, -393, 177, 24, -95, -125, -159, 179, 234, 4, -68, -192, -89, -29, 210, 24, -57, -133, -187, -32, -174, -44, 110, -53, 2, 119, 68, -57, 80, 183, -89, 73, -183, 86, 76, -52, -46, 63, 154, -12, -92, -268, 217, 63, 55, -283, 101, 79, 168, 164, 156, -49, -115, 108, -59, 53, -53, -23, 178, -100, -57, 172, -121, -191, 35, 21, 79, 235, 168, 231, 81, -8, 78, 70, 205, 164, -176, 82, 176, -162, 82, -149, -14, 151, 66, 45, 214, -88, 117, -16, 9, 17, 17, 125, 132, -125, -81, -163, -227, -196, 41, 55, 70, -38, 182, 214, 239, 92]
7532I2O8M4j77J77k41K23J01l45K48k13k3K23l20j11K93q4J20J05k31j3j2l7J71
7555E8n6q1J1J66k99O81n77L9K08pm03L61k08P8K57k72K37j96K5J40j93J93j59
7578Cj7O5P3r8L9j07j57J45l13J62O9M5J22j50L4R1N8J21j74k15K20K09j5l82
7602a72K48K09l33J54k82M44l34J67K0j42k4K42l69l0L71j84J54l25J90k2K9j09
7624i8M41l77J4M7K0j32K05j42K41k16RJ31l33O7J50K8Qj17k2O5l8j40L05j76
7648f0nj6J32M3l33K0O6L59j61r2K36j85J26M9k68J51n4j42L01k51N1K00j70K3
7672B0j43J43J59j2k15K96q8l54J28j55K95j67k31L80J28rl3j58k8m7K52r8j0
7695E3k15P60m46k15J55l09NP6K23j96L26j52J48j57j83L02J08l06N9Q7j40J55
$$ y = [92, 160, 204, 27, 204, -37, 186, 287, -58, 190, -23, -46, 177, -143, -254, 39, -45, 75, 180, -51, -64, -76, -113, 58, 2, -79, -68, 98, -201, 480, -97, -58, 150, 143, -260, 101, -107, -29, 228, -44, 193, -3, 22, 162, -31, 162, 3, -14, 51, 124, 26, 65, -42, -199, -54, -367, -205, -136, -91, 31, -119, -85, 6, 64, 185, 11, -204, 16, 225, 210, -172, 76, 285, -48, 106, -176, 268, -66, 101, 121, -21, -45, 197, -172, -202, 169, -15, 139, -186, 4, -18, 11, -98, 343, -34, -20, 27, 47, -85, 120, -22, 219, 3, 12, 143, -190, -123, 27, 55, 63, -54, -76, -11, -49, -189, 116, -60, -65, -81, 51, 94, -239, -219, -153, 206, 45, -47, 189, 4, 130, 179, -89, 62, 8, -134, 167, -84, -33, 167, -3, 20, -123, 20, 179, 167, -48, 248, 160, -194, -66, -221, 74, -93, -324, 56, 184, 175, 142, -16, -44, -91, 161, 63, 53, -162, 598, 152, -63, 92, -217, -212, -136, 87, -109, 217, 65, 213, 56, -127, 175, 283, -23, 36, 123, -17, 138]
7717A38K26o43M95j41J0j15j27L77n8J6l9j70o5L03l29J42K50j18p9m7m21L71
7739b4K6O1P2k94LJ05l3J11R9j46j85K12o8K05k7k17L72n20L04K3J1j1K22l35
7763c4J55n5k11J63o1k57L88r6J03o4k38L53j3P5j74J9l45M96j84r0O7j91R2K8
7787g4r6L23J09k52P5j55J07L8QM4j08j91m5n5J59O8j37J5M87k10m21O22j56L9
7811A94n81J3N35m16J38K63j70k76J85J34K9m0n5k0M60l66j00R9N8p6J05m81K68
7834a00K55o7k53Q5K31k77R7nL22l65L59l97J27q9J51r4J26j83K09k56K86m18
7856b56J93k63N75k49k42r1k4J12M91j42J41nn92L58K0P6j16k7K08j72J14M2j99
7879d8k48K78J08j70K79k28K05p6k45K06K49k25j02J7J0Qk9j93M25l19J73Qk36
$$ y = [138, 364, -279, 216, 75, 85, -30, -157, 220, 162, 178, 139, -31, -96, 207, -122, 20, 270, 152, 73, 26, -395, -24, 2, 63, 135, -159, -156, -51, -84, 27, 126, -20, -205, 7, -61, 144, 117, -100, 272, -248, 56, 79, 90, 79, 301, -34, 121, 66, -145, 18, -43, -300, 88, -8, 95, 31, -207, 146, 133, 208, 34, 53, -292, 204, 20, -70, -3, -194, -102, -74, -170, 153, 262, 10, 85, -70, 37, 75, 83, 127, 19, -172, -217, -272, -113, -45, -182, -167, 320, 110, -311, 311, 155, 194, -387, -374, 161, -255, -117, 146, -24, -300, -115, 19, 48, 8, -47, -67, 393, 27, -73, 26, 84, 8, 113, -368, -100, 155, 88, -165, -80, 151, -126, -29, -34, 288, -77, 282, -115, 12, -77, 74, -20, 106, -77, 132, -124, 162, -256, -63, -326, 249, 0, -242, -333, -357, -245, 246, 104, 245, 240, -352, 6, 26, 102, -14, -41, 167, -5, 109, 151, -48, -296, -18, 90, -80, 199, -29, 176, 100, -145, 61, 310, 85, -17, 0, 10, 18, -11, -204, 221, -98, 75, 83, -153]
7902a53rj02L77k78M36l82L76l43K89l38L14k68L22l05K5Qr4l6r3L71J0rk88M5
7926a25k7K20nK4j33M4j00M2K60j50q2Q5j86L15j74q0Q3j54J27l5j1j21K69o4
7950B2J59k5l20K94J61n45K85q9K38k92%j7J25J56K4l48J85L2j55K88L3j68l7
7973FK71k05j38K31l04J66qN3j3m5p3R7P1Q2k44l24O23j94J2j74J54K32l54o9
7997a47J70M4l99K14K83k10L07j00%k12R9j11J10j16J93q4j62J48j44p0K99j74
8019f2j08K40j64K18K84m18J87J4l78K84pl41K61J27p1Q9n71M06J93k07Rp1k19
8042c05M18Pk3j14N7k2J92k56P6J03o0qp9K17N8m19K10P0J1k86K02mM3k1j90K14
8068I1k82K03J4o0K33J08l96J33L51k20k8o6j63L19k12J31R2m0k52K92l50Opo4
$$ y = [-153, -162, -264, 113, -165, 271, -111, 265, -78, 211, -127, 187, -81, 241, -64, -39, -31, -125, -161, -254, 117, 127, 118, -170, -125, -152, 68, 63, 87, -46, -2, -102, -60, 200, 50, -32, 53, -133, 182, 8, -72, 11, -143, -16, -51, -62, -183, 86, 22, 181, 156, -164, 130, 291, -254, 31, -58, 180, -112, -112, -129, -4, 152, 176, -172, 13, 45, -110, 178, 211, 43, 6, 277, 72, -66, 165, -139, 27, 19, 72, 59, 14, -59, 38, 109, 191, -53, -377, 246, 52, 64, -110, 44, 276, -78, -147, 23, 67, -332, -118, 165, -45, 262, 162, 162, -50, 49, -62, 48, -68, 125, 41, -121, 27, -117, -187, 112, -62, -170, 70, -94, 124, 408, -10, 177, 191, -187, 97, 90, -251, 10, 137, 66, 155, -416, -10, 183, -24, -15, -86, -305, 113, 120, 97, -17, 40, 18, 210, -46, 30, 133, 73, 65, -14, 203, 261, -158, 52, 122, 133, -153, 49, 45, 88, 67, -123, 91, -191, 12, 26, -34, 199, 307, -89, 44, 395, 175, 147, 81, -82, 237, 25, 156, 248, 208, -44, 248, -102, -96, -103, -167]
8092a67N05m46J77Q4j75K7NK47l26j30M77l77l1M0K44J8o0j9j48j60M14l33J79
8115D5r4q1M50j93l07L33r1m38N03j83r7J41r3N9M42l59j25J15k21K41j39L4L1
8138b7jl7J55Lm8K17k30J13k36j62N26N8m89L83k48k16M80k16j56K54m45K15K69
8161A62j38J28r6j71L02k8m69K56k96L80j2O9r2M3j21J27l9n2p5M5J04L50n19
8184a42L26j16l2J57o0M5m32
$$ y = [-167, 338, -108, 69, 153, -22, 5, 10, 257, -69, -199, 278, -99, -130, -90, 154, 172, 112, 93, -55, -215, 199, -134, 45, -49, -130, 320, 127, -180, 153, 62, -376, 127, -56, -153, -12, -105, -46, 396, 37, -88, 27, -194, 47, -92, -58, -27, -28, -65, 90, 93, 45, 262, 32, 145, -91, -253, 273, 331, -158, 225, -23, -239, 241, 25, -131, 123, -322, -107, 162, 24, 152, 56, -115, 187, 159, -310, -54, -350, 30, 18, 87, -5, 38, -83, 44, 5, -47, -122, -77, 27, 377, -142, 184, 68, 36, 193, 133, 178, -254]
8191b54
$$ Imaginary data points
##PAGE= N=2
##DATA TABLE= (X++(I..I)), XYDATA
0@%%%%%%%%%%Qj6J6j6K4l2M0m9N7p2Q8j04J21j45J74j99K31k71L11l58M10m67
32b49N33o03O80p69Q67r72J087j216J356j506J671j854K053k268K505k765L046
49A596l356L698m075M491m951N465o045O703p452Q317r332J0540j2005J3826j6162
64h742J9288k3711L0505m2407O9441k48928r3996J34508j32227J49855Q6553J55755
76I5894J32872J3719L347K989j8506L0048k33449j42366J07751j18078j53987
87b79766R3329j93K9747Q4177P308P4793P5303L1662M1636j01775K9231J31135
99B16587j60647j05226J01010m7553l0577k384q9265K7234M4722j8294q505o5606
111a38504Q4743J32359j05247J3171J38784l4425K7538L4251q7988J2302j0034
$$ y = [0, 0, 0, 0, 0, 0, 0, 0, 0, 0, 0, 8, -8, 8, -8, 16, -16, 24, -25, 32, -40, 48, -56, 65, -80, 94, -105, 126, -145, 166, -192, 218, -249, 284, -319, 361, -408, 459, -513, 574, -642, 714, -792, 879, -975, 1078, -1190, 1315, -1450, 1596, -1760, 1938, -2137, 2354, -2597, 2868, -3177, 3526, -3926, 4391, -4941, 5599, -6406, 7420, -8742, 10546, -13165, 17340, -25067, 44374, -204554, -298550, -164042, -296269, -146414, -59861, 95894, 228766, 242485, 245832, 248821, 230315, 260363, 26914, -115452, -7701, -125779, -279766, -186437, -186630, -156883, -72706, -65398, 9395, 84698, 116360, 157996, 56221, 85452, 216587, 55940, -49286, 51724, 4171, -26406, -28790, -118055, -90821, -46099, -64393, -72898, -138504, -53761, 78598, -26649, -13478, 125306, 90881, 118419, 152670, 64682, 76984, 66950]
122F6950q1697l9929p7703J3909K9005j07798O6654J23467m1603P2099P9692j7421
134H5625P8973o18p5126j526n2865k5969l7165j26009L7153M8394p5573N9637
146h5069N0203o740J03725J2964k7011N8657k3013j1708p925q4506K6079j778
158C878q9321M3575P600l6670O3661k0404r158P2364l3858o42L1997m0733M2579
171C4868L742o2148N5871K38l7890L9651m3146p900M6381o8012j510L3299m8565
184e5121L7033Q575l8749O8591N734k2137M6957k6885J1500K9031p7295J4946
196B180K2586p0124K3948k928m2185N9263o374k2389N0232j0321K2248K0926n5774
209h712M3418J5804p0161L2480p443m4377M7778k5222k9593M5693j3620J0788
$$ y = [66950, -14747, -54676, -132379, -118470, -89465, -197263, -130609, -7142, -48745, 23354, 103046, 85625, 164598, 163980, 88854, 87328, 34463, 8494, -28671, -154680, -117527, -69133, -144706, -85069, -34866, -41606, 62119, 75083, 48072, 106729, 83716, 72008, 64083, -20423, 5656, 3878, -85443, -41868, -34268, -70938, -7277, -27681, -36839, 35525, 1667, 1025, 33022, -7711, 34868, 38610, -23538, 32333, 32571, -5319, 34332, -8814, -16714, 29667, -38345, -39855, -6556, -55121, -18088, -9513, -48262, 20329, 26063, 3926, 50883, 23998, 35498, 64529, -12766, 2180, 24766, -45358, -21410, -24338, -66523, -7260, -13634, -36023, 14209, 3888, 26136, 47062, -8712, 34706, 50510, -19651, 12829, 5386, -38991, 8787, -16435, -46028, -335, -13955, -3167]
221c167J0656l4163N6399M498n6886N1213o818l6838M7416l5326k7158M4593k5413
234a0994m978N598k3021M9402j1540m1031O3683j0742k6039N1537l7566j3135
246h826M6245l9564j0413Q958k1706L1999k4073k7689O2179k0977j6508N2387
258C2012l5233M734M5371m6786L05J7978k4783J7895k6772j7626M9869l3530j2268
271b8834M4901l4589J5049L4903m7815J8264K3960k7933J5621j7592p634L9739
283B8040l9886p477L7310l5544J5463J8844m6681L0742J7556l4428K0550q773
295d284j479L3948l9290J418L5898l4256J3825P400m0434L7565J828l8758K7684
308A065q111j990K8094l7125J0954L5624l3678J3935M386k8892L7167j1595l5771
$$ y = [-3167, 7489, -26674, 29725, 34223, -22663, 28550, 21732, -15106, 32310, -3016, -30174, 14419, -10994, -15972, -10374, -33395, 16007, 4467, -36564, 27119, 16377, -9662, 41875, 4309, -8826, 37419, -2145, -12558, -3600, -25306, 6693, -17380, -45069, 17110, -3867, -20375, 32012, -3221, 1513, 46884, 98, 403, 18381, -6402, 11493, -15279, -32905, 16964, -16566, -28834, 16067, -18522, -3473, 31430, -16385, 1879, 25839, -2094, 13527, -4065, -11699, 28040, -11846, -19323, 17987, -17557, -2094, 16750, -29931, 811, 18367, -16061, 4489, -4284, -5763, 28185, -11105, -9687, 26211, -8045, 5780, 13180, -27254, 10311, 12139, -26619, 1065, -7046, -9036, 19058, -18067, -7113, 28511, -5167, 8768, 13154, -15738, 21429, 9834, -25937]
321b5937L1566j2782n400K2038l6519J7405L1003l3788J6852P329j8342L5296
333B8721j8023k5389L4377j9106p184J5096l6853J9119K0369l8340J9147R248
345A182j3666L2704j7067j0872L7483k1283k728J4149l4801K0253P560m2161K1371
358g876L079j7067K6900j6940j958L6258k2278M882J7554k8019K2485N58l7279
371a9701K5536n211k1136K4276j8937j57L0396k5198R624J7827k4352K2181j908
384A3240k8589K8008j0973j8203K4515k0575K241K4479k7293J3121J6293k5369
396i105J9701k594k0869K5574j5717j2162K4635k0888N844J9405k7246J8262J3079
409A7919k7740J9018k124j8818K0707j7566o397K1736k1746J0773J6015k4967
$$ y = [-25937, 5629, -7153, -12553, 9485, -27034, -9629, 21374, -12414, 4438, 11767, -6575, 28721, 10698, -14691, 19686, 580, -6604, 8492, -28361, -9242, 11127, -27213, -8066, 1182, -12484, 20220, 3153, -7719, 29764, 8481, 5753, 19902, -14899, 5354, 12914, -29247, -7876, -4797, -21864, 5036, -11904, -13862, 22396, 118, 5000, 22554, -5465, 17020, 17578, -19701, 5835, 624, -20512, 3764, -15173, -15330, 15066, -10132, -508, 17319, -7033, 15148, 13240, -15349, 12659, 1686, -16517, 7998, -12577, -10336, 14143, -13150, -29, 16264, -9105, 10596, 8002, -12867, 12707, -3010, -15172, 9463, -11425, -5581, 13824, -13422, 4840, 17919, -9821, 9197, 7073, -11745, 8962, -8604, -15001, 6735, -15011, -4238, 11777, -13190]
421a3190K5311Q467k9538K4080k183k0816J6094j7990l885J5540k2423J2701J0062
434B230k0320L1322J081k6317L2943l449k1735J7517j5018m055J0417k1161J1140
447e405K611j6076K9989r148k0179L8426r974k1374K3568j1995m388R580j6083
460a0448J0584P5r323K5248j7890j1026L8549k2452j8413K7772j6403o785J1268
473G56j4871Q995K565l293J9947j7934K434L4822l1728r335L0170k5384p148J1574
487A570j8841O483L459l951J3647j4188J3715K7188l3937N534K9962l1176o12
500a147J2356k3913N733K931r525P034r781J5289J5985l0797J9161K4572l2573
513d675J0011J3369k4537R754J876j4891N403o310R112K565k5455K4845J3698
$$ y = [-13190, 12121, 20588, -8950, 15130, 12947, -7869, 8225, -9765, -13650, 1890, -20533, -7832, 2230, -18090, 13232, 14313, -12004, 20939, 17490, -4245, 13272, -1746, -5801, 4616, -16545, -5405, -2794, -18870, 11119, 1971, -18208, 20218, 10244, -11130, 12438, 443, -3945, 5635, -10448, 136, 211, -9112, 16136, -1754, -12780, 25769, 3317, -15096, 12676, -3727, -10512, 756, -14115, -5120, -2555, -5848, 14099, -3835, -1401, 33421, 1693, -7642, 22528, -2856, -10004, 1570, -17271, -10788, -7329, -11280, 2367, -11821, 1894, 29082, -4855, 679, 30641, -535, -1147, 11209, -12704, -6971, -4040, -13565, -6531, -16312, -1023, 14962, -15835, 3326, 27898, -4675, 5336, 18705, -5832, 3922, 5798, -9093, -3690, -10000, -888, 1677, -23778, 1067, 14765]
526A4765l1898J9752J0393k1613J8511J383j5760J0514k472K644k456j9319K1678
539F122J58k8860K3170J691k0915K3072l000j1585J8569l056J10K064j0620J8892
553A5812p401k3409K3771o502j8563K1234j1656q761K1355r065j159O962o508
566c890J5753o855j4600K3471r934j1900J9467j5331m116J8594j6336j63R411
579C571r522J0465o463r181K1094j0790q256J8137j3510K901J4225j9076O149
592b56R625j3016R101o004q507J7658j1634o760J5066j2634N592R491j7626J2719
606B815O120j4882J2856m978p908J6658j3244n150J4620j1548L555M078j3922
619a0930J6327p00j4445J5726o199n565J7253j4904l115J6275j0970J520K706
$$ y = [14765, -17133, 2619, 13012, -8601, 9910, 11293, -4467, 6047, 3575, 6219, 3763, -15556, 6122, 6280, -22580, 590, 2281, -18634, 4438, 1438, -10147, 8422, 5366, 5476, 7540, -3080, 15812, 8411, -14998, 8773, 2271, -16292, 4942, -6714, -15475, 5880, -3185, -4344, 2618, -3890, 11863, 5008, -9592, 13879, 3945, -7955, 11512, -3819, -7935, 10659, -5677, -5840, 3571, -5951, 4514, -1949, -11130, 9964, -826, -9082, 9055, -4455, -1554, 12671, -6405, -256, 9369, -3647, 5454, -550, -9057, 8601, -3033, -9793, 5273, -7361, -1769, 7722, -9904, 2815, 8935, -5947, 6909, 1931, -5977, 10681, -2563, -7713, 6907, -4641, -1086, 2992, -10930, 5397, 4697, -9748, 5978, -221, -5786, 11467, -3437, -6552, 9723, -1247, 273, 2979]
632B979r723J3587o266j0573J6299j0532l898J6973j6206Q42J7770j3103J835
645a6N540n571R505q605o396J4488j3947k016J2828j8501N422J6096j7403M216
659d360R923n042P463o989j178J2628j4605J336R264k0392R102J0957k1487P618
673e762J0048q554N877l634J599J0426j3154M742P142j7357J3112M374k2380J3326
687a95P250j3182O150k192R61P131j1473O061M302j3373J4892j036j8780J8443
701D959K294j4633R360j440j349O293r986N354K294j0327J3746n290j3412K0194
715H057l771j3311J3224l364k635O524r058M712K090q231J1433o662q371J9335
729I972q864r747J5776p198j815P636r705N048J382p573R475p297m567J6505j1930
$$ y = [2979, -6744, 6843, 577, -9996, 6303, -4229, -8127, 8846, -7360, -6518, 11252, -1851, -16, 5524, -47, 9458, 853, -5543, 8945, -5002, -7018, 5810, -12691, -7269, 8827, -8576, -4360, 5563, 521, 7984, 995, -183, 12445, -2160, -824, 8440, -11952, -2850, 8107, -13380, -5762, 4286, -4268, 1609, -2025, -426, 10000, -3154, 1588, 8730, -8627, 4485, 8859, -13521, -195, 7055, -6127, 23, -2169, -1208, 5923, -5550, 511, 4813, -8560, 6332, 5296, -13484, 4959, 7253, -7380, 1980, 540, -809, 5484, -4502, 852, 3146, -7181, 6565, 1275, -12137, 8057, 4286, -9025, 4199, 835, -1800, 4724, -4334, 378, 2468, -5763, 5670, -992, -9363, 9972, 1108, -8639, 7137, -61, -1876, 5760, -3945, 1103, 2485, -5088, 4387, -2910, -7477, 9028, -2902]
744b902m532J5295r980M05P791j0176N815K085p630Q594o780k619J2710j2539
758d463q09J2657j1739K842P183j1041O794J691p662Q761n788k136J0544j1074
772d240J547R616j2263N808M791j1449Q841Pp252R405o572j597J0027j0882K361
787a852O945j1328P319K537j0681R885r77o547R707o794q47R685j0427K877N328
802D830j0236Q616l68j0059J0857l369n457R400q187J293R073j1053L988N104
816D432r046Q785j982q282J1460m129m354P945q351K483P139j1905M949L717p993
831e132P837k982o069J1517n205l693Q698p891L937N532j1645O358K609q087P754
846C538n234m303J1296p591j987Q097q047N023L927j0309Q082J581p814P961n409
$$ y = [-2902, -7434, 7861, -2119, -1714, 6077, -4099, 1716, 3801, -3829, 4765, -2015, -4634, 8076, -4463, -5272, 7385, -4354, -1512, 5671, -5370, 1424, 3115, -4547, 4214, -1574, -3710, 6834, -4240, -2693, 6923, -5340, 468, 5259, -6190, 2651, 2658, -4594, 4811, -1761, -3358, 6669, -4213, -1852, 5093, -6235, 1084, 3621, -7060, 2825, 1848, -4699, 5008, -1786, -2633, 7052, -3375, -498, 4830, -5406, 3210, 2842, -7217, 3640, 271, -5186, 4214, -3973, -2680, 6393, -4660, -672, 4432, -4614, 4171, 2189, -6093, 5367, 1238, -3116, 4829, -3522, -1039, 6100, -5805, -856, 2861, -5132, 2705, -277, -6346, 5171, -34, -3727, 4971, -2920, 1017, 6549, -5096, 1262, 3871, -4216, 3538, -1696, -5999, 5297, -2294, -4281, 3816, -4231, 792, 4719, -5590, 2492, 4073, -3741, 4220, -1189]
861a189k851J0564r326j069Q237q156M710K348r139Q603L30o512P370n745o29
876b454R249j0911J091P760q827M873J890q594R016q14n819P266n378J115P025
891F488j1076L548O842j0227N600Q91q002R122j999n710O760m233J696M702j0094
906e692O750M626j0431P194N33p445R182l306n798P417m772J349K557q580P993
921A577J548j0058R520p10o858J0073m567l697Q109n018P43J783o878P502j067
936B002r357J0291k765n647R798o091k341R053n828O70K723m721O758l036o218
951d709R530n489m255R410p549j098Q551p019J307L777m599N848l142l705R202
966F060o990k685Q424q949J015P557r369K964M099m552N061k481k146Q285o904
$$ y = [-1189, -4040, 6524, -2802, -3871, 4366, -3790, 920, 3268, -5871, 2732, 3062, -3450, 3920, -1825, -2454, 6795, -4116, -3025, 4735, -4092, 781, 2671, -5923, 3093, 2279, -3540, 3726, -1652, -537, 6488, -4588, -1040, 5802, -4425, 1175, 2066, -5936, 3186, 1187, -4523, 2237, -1996, -300, 4402, -5692, 1058, 5684, -4747, 2447, 2980, -4465, 4717, 1411, -4387, 3030, -1742, -393, 2164, -6416, 1577, 3125, -6933, 2587, 1877, -4981, 5092, 525, -3172, 4937, -81, 662, 2445, -4433, 3069, 2002, -7355, 2936, 171, -5476, 4322, -1769, -4110, 4943, -885, -215, 2508, -2213, 4545, 1509, -4709, 4821, -668, -4923, 4487, -3062, -4160, 4391, -2628, -1321, 2456, -2143, 3705, 563, -3142, 6060, -930, -3615, 4809, -4140, -3125, 4432, -4937, -1973, 2126, -2426, 2635, 154, -1992, 6293, -611]
981f11l54O720r093K431N286r891M171K842n926N336k099j337O947o283J411O416
997E966q774M377L446r003N597Q08o772N809k815k090N858o143K087N336p857
1012d170N081K568p320P284j146n137O994l957k163N292o039J878L568p360M802
1027A75J191n789O886k169l576Q179n125j194O261o887K527K950p837N288N63
1042A443n924O059k931j713P378o302P02O067o627L517K467p941N693K72n966
1057c806M850l527m39N607o716K544M812o359N230J771p224O964l21o050N032
1072B368k723j049L246o253L259K944p027N973O05o166Q633j509n626O906k349
1087A232q81K216n661M459J126o474N311j580n072R207l663n330P460k105j139
$$ y = [-611, -965, 5755, -3338, -907, 4379, -5512, -1341, 1501, -4425, 911, -1188, -2525, 4422, -1861, -450, 5966, -2808, 1569, 5015, -3988, 1609, 2417, -4355, 1454, -1361, -3451, 2407, -3736, -1649, 3687, -4170, 911, 3479, -3841, 3443, 2297, -2840, 4154, 197, -1966, 3326, -2713, -835, 2733, -4627, 175, 1366, -4423, 2463, 294, -3282, 4897, -228, -1422, 4839, -2048, 479, 3429, -4408, 880, 1443, -4481, 1578, -1353, -3066, 4312, -1990, -1288, 4779, -1848, 1669, 4136, -3805, 1888, 2160, -3806, 1044, -2483, -2922, 2685, -4031, -1487, 3325, -3034, 2196, 3967, -3257, 3707, 3386, -2664, 2368, -355, -1404, 1842, -4411, -1152, 1792, -5235, 738, 1343, -4823, 3810, 2301, -3325, 3581, 1232, 351, 2567, -3094, 1365, 2491, -3983, 1328, -252, -5324, 3883, 220, -5110, 2350, 245, -894]
1102h94K953m372M237P4m466N909l381l321Q572n934m042Q033m194j598L583l494
1118b335L284m60l631N823l076j669P169p199n14Q517o714j121M010l849K888
1133A123n79l785M713k834P0N482p565J655P703p519K29M381m945K879J4l370
1149b348L712k927M77L961o888L554M966q066L099L835n724L840l65l028M264
1164B362l245R9K570n593M269K929p935M547K587n492M514p65l141M989k875J5
1180a65K318m818M411J180p189N858K51n608N384j617k809M937l436L31K709m298
1196b561M007M33n304O191q70m931N531k375k206N034m145N6K859m077L352q02
1212A92l979N864j595l506N939l611n20M602m675J485K372m463L341o29l654N156
$$ y = [-894, 2059, -2313, 1924, 1998, -2468, 3441, 60, -3261, 5311, -623, -4665, 3368, -826, -2424, 1159, -2335, 949, 489, -3142, 2681, -395, -2064, 5105, -2094, -2608, 5909, -805, -1926, 2084, -1765, 1123, 544, -3241, 1472, -1362, -1292, 4190, -3375, -1720, 5983, -1536, -1307, 3074, -1871, 1008, 1022, -2348, 1364, -1563, -1086, 2875, -4013, -459, 4507, -3559, -460, 3375, -2349, 1491, 1126, -1902, 2362, -883, -784, 1786, -3807, 462, 3391, -4544, 3, 2590, -2902, 1612, 847, -2294, 2695, -180, -165, 2153, -2665, 1746, 2926, -4263, 1595, 1846, -3762, 1622, 5, -2804, 2133, -1303, -972, 1737, -2561, 1446, 1879, -3425, 2766, 1896, -3035, 2496, 121, -2085, 2949, -1196, -1140, 1719, -2358, 994, 192, -3787, 2077, 482, -3024, 2915, -696, -1216, 3386, -1289, 196, 2568, -1895, 1446, 817, -2837, 2319]
1228B319l261k187N367l976J59M101m760K612K165m487L915r70k922M901l229
1243b53j641M705m242O72K732m636L054J336m326L984n77k995M812l238j119M099
1259B367m005J291K127m357L365P81m206M713j449k446M756l798l55L417m229
1274b028J624J741l764L752q88k805M945k914j544M403l330k13L451m514K035
1289d9J475l890L984j280k187M783l440j038M143m233J102K823m959L153O22l374
1305b365M053j741j272M024l211l09L845m373J553J665m163L059K00l983M122
1320A104j793j073M055l565O75L351l938J800J318l575L140p33l245L577j983
1335h85p87L724l591J293K875l964K079O97k986L196j052k965M102k680n41L007
$$ y = [2319, -942, -3129, 2238, -1738, -1579, 2522, -2238, 374, 2539, -1948, 1967, 997, -1925, 2976, -253, -1894, 2811, -1431, -759, 1973, -2663, 391, 1727, -2599, 1385, 808, -2187, 2625, -613, -1732, 2367, -1638, -347, 1780, -2577, 788, 1569, -2637, 2076, 627, -1819, 2937, -861, -1216, 2201, -2028, -404, 1337, -2427, 1325, 437, -2368, 2577, -337, -1881, 2522, -808, -1021, 2430, -2084, -49, 1426, -2464, 1520, 240, -1947, 2836, -604, -1642, 2501, -1732, -630, 2193, -2766, 387, 1009, -2365, 1688, -53, -1325, 2699, -512, -821, 3024, -1349, 204, 1869, -2294, 765, 965, -3018, 1104, -689, -1762, 2293, -1272, -597, 2754, -1184, 616, 1934, -1641, 1499, 766, -2479, 1098, -885, -1672, 2052, -1539, -246, 2629, -1335, 744, 1441, -1545, 1651, 599, -2366, 1736, -944, -1485, 1522]
1351A522l699J896K377m145L097M07k760L628k058j863L828l290l9K445l518K018
1367a54J691l956L129M37k733L209j651j259L514l337q8K902l614K746P42l683
1383b105L449m00k578L189j726o67K700l509O38K471l656K689K54k893L660m04
1399A112k585L297j889l25K453l641J233J494l347K845l90k668M073j482j980
1414a800L604k203J56K259l300J615J072l028K729n31k680L983k003j390L377
1429A860k694L63J817l098J809R09k861K639n15j428L027k299k54K901k629O70
1445B17J607l252J987Q5k802K957j069j568L400k874M99K700l060J479J275k672
1461a091K207j09k769K715j080j251K660k453L89K743l517J719Q84k550K970j024
$$ y = [1522, -2177, -281, 2096, -2049, 1048, 1455, -1305, 2323, 265, -1598, 2230, -1060, -1099, 1346, -2172, -154, 1537, -2419, 710, 1147, -1586, 1623, -28, -1287, 2227, -1110, -1198, 1704, -1910, 836, 1578, -2105, 1344, 944, -1634, 1555, -171, -838, 1862, -1647, -1009, 1462, -2194, 495, 749, -2144, 1516, 1112, -1473, 1824, -65, -390, 2063, -1578, -345, 1149, -2198, 647, 257, -2411, 1662, 180, -1800, 1804, -399, -243, 2016, -1284, 331, 1403, -1625, 1104, 573, -2107, 1876, -127, -1517, 1860, -834, -471, 1346, -1752, 57, 966, -1895, 744, 229, -1199, 1828, -471, -725, 2176, -453, 217, 1824, -1428, 559, 644, -2158, 799, -270, -1838, 1562, -1312, -813, 1887, -1173, 306, 1581, -1091, 1116, 1007, -1762, 953, -127, -1378, 1282, -1171, -782, 1961, -1556, 163, 1047, -1503, 1467, 443]
1477D43k080L491k027j136K550k440P40J655k974J829O41k100K713j312j470L761
1493B284k421q63K605k486Q88J279k835J787mk222K639j390n00K997k904K68L044
1510B166k957J424R49k750K348n08j630K094k191L25K328l251O47K747k956J276
1526F1R60k367K341m69j114J693j522J13J707k908J391J837l258J733P52k601
1542a651K252n24j323J869j255K60J285k649K258J119l033K266O83k134J972r17
1558D78j525J724j507K88J185k264J838M22k369K877m20j795K461j201j100J847
1574I39j712O81N40j615K014o35j918K974j039j513K835j406p89J960k104N11
1590b77J033k096K105r41j411L218j625j210K433j609l21K055k161Q34L70j381
$$ y = [443, -1637, 1854, -173, -1309, 1241, -1199, -459, 1196, -1778, 51, 692, -1408, 1305, -7, -1477, 2284, -137, -1000, 1605, -881, 7, 1286, -1549, 238, 234, -1988, 651, -739, -1239, 1758, -1146, -878, 2166, -791, 633, 1582, -1168, 1180, 672, -958, 1136, -1055, -730, 1598, -1653, -1006, 1741, -1215, 61, 1021, -1346, 995, 526, -588, 1105, -417, -304, 1403, -1505, -114, 1723, -1535, 198, 950, -1651, 601, 77, -1246, 623, -632, -372, 913, -1736, 522, 1641, -1392, 874, 1557, -577, 1395, 478, -1047, 677, -830, -542, 643, -1621, 217, 639, -1730, 1147, 727, -1068, 1393, 192, -908, 939, -773, -92, 448, -1167, 847, 212, -1706, 1268, 229, -1284, 1551, 145, -644, 1316, -788, -277, 756, -1340, 765, -176, -1587, 1631, 6, -1204, 1229, -380, -701, 1354, -807, 27, 397, -984]
1606i84J550m22j108K529j776o15K632k546o8J788k437J093P38j743J560j24p39
1623f72K082j686j2K712k900K80J443k299J020N48j839J271l63n26J565k035J052
1640c59J859k042J111J014k252J777k87j881K045j500n96J586j679N74J438k201
1656a393J382P32j594J851k36j206J690r95o09J414j754N06Q58k096J111O44j419
1673a114J831n58j232K185j212k14J736j799P38O09k007J140L27j555J312p05
1689e18l43K070j850L78J315j632R29N55k083J854jj674J579j162r7J547k037
1706a170O66J251j726J113N37j583J693Pj662J865o50p11J443k007P33J048j934
1723a087J042Q8j546K063q08q63J807n13q2J171j724J258K14k043J379m3j662
$$ y = [-984, 566, 144, -964, 1565, -211, -826, 1806, -740, -808, 980, -1457, -364, 374, -1369, 191, 67, -672, 1410, -276, -288, 2424, -476, -196, 1247, -1052, -32, 516, -1323, -52, -415, -941, 624, -1411, -359, 1500, -542, 569, 1583, -669, 1108, 821, -1060, 985, -515, -1111, 475, -1204, -630, 808, -1393, -11, 721, -873, 978, 742, -464, 1226, 231, -378, 1036, -718, -212, 646, -1450, -339, 305, -1114, 717, 159, -1073, 1112, -100, -314, 1422, -377, 361, 970, -1037, 103, 430, -1125, 187, -518, -861, 1209, -641, -263, 1052, -580, 349, 904, -1179, 675, 674, -1000, 579, -583, -680, 867, -1170, -504, 747, -979, 134, 671, -912, 781, 788, -874, 991, 341, -370, 1073, -934, -201, 847, -1087, -45, 43, -1503, 560, -248, -1111, 696, 183, 101, 1272, -452, 806, 1020, -1023, 356, 313, -1349]
1740a349J787r89r16K053j273L15Q73j093J256J38j187J373o04r99J399j430n49
1757a195J910j196N5R59j354J218L0j215J473m90o31J575j675O9J634j850K83
1774d00O40j256J204J58j338J806r88m37J352j441K21J628k054Q67P04j122J037
1791E81m16r31J595j426k82J566j394M5J468j854J291K72j144J390n89n74J508
1808A106j002j19P15r48J52M34j639J363k9r87J368m05p04J437q28j8Q85j230
1826d49P84J86j453J409k52j331J504r76j80J284j295M11J082j450J036L85j130
1843d35J071k30o29J155q18j03N87j478O29L62j202Q35J61r32J525l34o21J516
1861A059j031K25P09j655Q62M84j651Q72M9j225J701q70l14J653r89K3J077j188
$$ y = [-1349, 438, -551, -1467, 586, -687, -372, 501, -592, 664, 802, -385, 988, 384, -615, 784, -646, -1195, 715, -481, -426, 533, -821, 397, 427, -788, 685, 195, -436, 1139, -536, -467, 1167, -683, -400, 240, -1016, 188, 346, -992, 814, -174, -611, 741, -700, -479, 1149, -905, -38, 666, -456, 581, 165, -766, 829, -597, -879, 687, -707, -662, 806, -1048, 243, 515, -629, 761, 172, -402, 1106, 104, -15, 700, -248, -96, 338, -1301, 62, 33, -954, 414, 9, -695, 742, -86, -104, 781, -449, 335, 521, -932, 477, 225, -1106, 398, -578, -758, 526, -769, -358, 724, -726, 310, 695, -435, 636, 406, -223, 932, 114, 11, 598, -880, -251, 111, -1091, -256, -95, -1027, 498, 164, -457, 1059, 28, 253, 962, -693, 169, 653, -998, -126, -77, -1302, 399, -471, -785, 868, -121, -98, 979, -209]
1879b09N60R1j040J074o33o10J086q27O2J115j259O12P52j225P32J67r70J117
1897E95m15l30Q43r07j03R97j286M21L78p61Q31j1j076J275n43j47Q52o10J12
1916A15P77j443P65K47r52O43m15p28J130n07j77J121j055O11L75q47N73N15r62
1935b14R42p13p09J339r23k45P46q25N54K45o23J075m06n83J101p36m42R16q59
1954c60K67L69p02M66M41r97R57j82o51J062r15l3P42r13J53Q92r44J70N08o66
1974c36P97j78p56J137p83m4Q54j020J27P13j171Q91j28o69Q01l3o20J194p55
1993B1l12Q04j033N73K51r36P76O8n13P97m15j77P96q08j78Q71j071N28L45j121
2013g34R25l97m26P07j95J29L21m47J66L14o23P67n6q77J053l56o88O67n50K40
$$ y = [-209, 351, 442, -598, 476, -157, -767, 319, -508, -446, 669, -590, 22, 774, -451, 281, 448, -522, 595, 180, -150, 693, -214, -317, 680, -606, -185, 193, -568, 263, 252, -824, 451, -92, -239, 613, 3, 115, 892, -551, 214, 461, -491, 152, -263, -991, 139, -368, -545, 576, -479, 132, 507, -340, 233, 748, -214, 728, 15, -694, 645, -278, -523, 223, -602, -48, 197, -426, 649, 243, -340, 761, 25, -417, 499, -360, -93, 276, -426, 40, 481, -516, 441, 259, -392, 670, -245, -278, 464, -449, -296, 596, -348, -178, 330, -336, 461, 283, -473, 664, -119, -163, 691, -329, -202, 511, -660, 231, 103, -566, 235, 202, -418, 776, 21, -291, 513, -520, 53, 304, -632, 144, 212, -301, 496, 81, -96, 700, -108, -286, 585, -486, 42, 387, -734, 191, -206, -632, 75, -120, 9, 330, -117, 49, 363, -260, 507, 451, -426, 627, 271, -417, 250, -300, -60]
2033f0L36n34J49j88n11J013m44l42R18j75k61O75p39o1N58o57L50K19r51Q94
2053A89k28m75R19o58l87J206q28N58K01r00N86P1n82O98o00k24P81n06j16M74
2073A79l70j5M66j040J000l67k11Q28n70j8M49p19J95N82r30L85M57q36P93l34
2093g6k91O83l94k57O90m97L59L15n76J79r6l01N92m04j38N41o30J25K27k81J88
2114d2N02p64N86j84l65K87k99K6M88o75R7M24l18J22J98l58N48k51j27N20o39
2135b24L57M70o27J01J49k89K91j57k54M47n62j13R41q57L67M33n36L17j50k31
2155a27O91o65j50O59o26L4K83l01K24R2l98M46J9n96Q58j99o00Q58o38J60N10
2176E34q75M51L59r59O98j6n51N36k03L5L57m49j63Q10q11J79k8k26P69o62k16
$$ y = [-60, 276, -258, -109, -297, -808, 205, -239, -581, 337, 162, -99, 576, -163, -224, 334, -323, 27, 246, -705, 189, -39, -514, 405, -253, -640, 566, -262, 296, 497, -403, 183, 254, -328, 370, -230, -454, 327, -179, -295, 179, -191, -206, 260, -780, 220, -147, -358, 470, -100, -118, 331, -388, -193, 389, -541, -156, 301, -535, 258, -76, -367, 316, -78, -335, 355, -142, 217, 532, -44, 135, 39, -262, 330, -74, -212, 329, -301, -176, 51, -230, -42, 460, -304, 282, 98, -267, 20, -279, -253, 235, -440, -343, 81, -237, -115, 83, -275, 273, 22, -105, 415, -224, 133, 603, -24, 77, 226, -63, 228, 71, -183, 264, -298, -411, 530, -327, 40, 473, -63, 254, 104, -127, 564, -101, -251, 408, -218, -184, 99, -202, 22, 114, -284, 162, 181, -415, 443, 244, -356, 502, -136, 24, 534, -341, 110, 469, -490, 208, 192, -359, 177, -26, 9, 366, -83, -246, 564, -247, -68, -96, -322, 447, -215, -431]
2197d31O71m27p5N56p13M88K58n27R8L05r5J31l58k60R08o66K41L70p85L26K44
2218B59o23L28j3k12M57l17J67N29o32n4M09p92R34k87l09L58j37j88J84m58J07
2239b90M67n61O02K18n82N42k34m30N48m74j01N98o58K42L85o97N25J71n63M28
2259A36J75p23P36m28l03Q25o02J63J45o47N92J76m38O10l01k99K38l20K05M95
2279D35o46N77J27o32M67m12l43R96p82M8N44n03qL74m87N12j99k87N77k86k10
2300a38M27l11r7L69k90R1K90o75J23K47n99R00k42j05L62m74J75K73k20k04M69
2321C71p47N44m84j99Q49m38m15Q39l50j68N39o75M66K36p09O09j22l09M51m42
2341a54l83Q08p16K67N63n65M93n0m51M25l4n47Q60p26J5L63m48J85L26o37Q99
$$ y = [-431, 240, -187, -262, 294, -419, 69, 327, -200, -102, 203, 108, 239, -119, -379, 529, -137, 104, 474, -311, 15, 259, -364, -36, -49, -261, 196, -121, 46, 575, -57, -111, 298, -494, 440, 153, -156, 202, 65, -123, 61, -397, -290, 177, -384, 218, 436, -146, 396, 162, -268, 280, -194, -295, 303, -355, -113, 272, -425, 100, 271, -292, 136, 311, -412, 324, -104, -407, 418, -184, -21, 124, -523, 69, 245, -193, 417, 116, -183, 55, -265, -60, 435, -211, 366, 493, -139, 328, -84, -427, 569, -213, -165, 379, -124, -132, 242, -245, 267, 68, -219, 358, 72, -138, 289, -22, -119, 250, -40, 51, 341, -334, -211, 36, -563, 337, 95, -10, 352, -122, 53, 326, 106, -98, 371, -376, 168, -316, -515, 334, -104, -519, 320, -30, -198, 341, -334, 132, 368, -341, 268, 146, -163, 288, -154, -537, 271, -445, -178, 385, -180, 313, 263, -188, 237, 203, -344, 516, -210, -195, 168, -280, -95, 231, -406, 493]
2362D93l64l11P65p10m7O16o01L18O0n22P18k36l44L92k90j50R18q75p2M18k59
2383h3K58N9p51O55j10m92M14J68k52N10m63J2O23p01M45k9k61K25O3n22L43j33
2405b2p8M20q71O30J41m25J71L55n75N98k08n13Q54m96R1L72r61M73K9m39O16
2426A62k04o17Q90j64k28M08n29J16O00o05L18k7n31O69l00n8K24l83p6M49n01
2447c87O11J9n77L71M41q00Q16m89k69P74q50R1M42j88j68L85n78O59q5n86J047
2468F79o46l49Q80p19J63M99r46O37K60n34J80o8m79O16k40k06N54m58M1J80m11
2489c67O51j81m88N93p9m74Q11n59J70K85p17M19K50o93L29K39l65M48j5n65N81
2510B73k96k59P35j156R36K3p33O54k30k72O55l69r6N17k03oO9l19M22l25n88
$$ y = [493, 129, -182, 583, -127, -174, 442, -159, 159, 219, -303, 415, 179, -165, 227, -63, -213, 705, -170, -242, 176, -83, 175, 234, -517, 138, 28, -464, -50, 118, -134, 376, -87, -75, 548, -153, 292, 263, 2, 227, 290, -232, 111, -22, -100, 320, -551, 79, 220, -205, -34, 321, -254, 344, 136, -377, 477, -19, 72, 444, -517, -44, -15, -454, 162, -42, -659, 231, 67, -161, 247, -282, -166, 434, -171, 147, 120, -411, 258, -42, -100, 124, -259, -335, 114, -387, 224, 243, -334, 37, 478, -322, 494, 5, -264, 510, -340, -249, 193, 5, -163, 222, -356, 303, 218, -368, 679, 33, -316, 564, -155, 8, 507, -439, 198, 458, -76, 104, 36, -443, 173, -67, -273, 281, -177, -136, 44, -367, 284, 103, -385, 208, 129, -345, 466, -93, 77, 362, -355, 64, 314, -379, -50, 189, -176, 272, 257, -308, 273, -23, -282, 453, -703, 233, 256, -477, 177, -53, -325, 330, -39, -135, 382, 179, 173, 242, -77, 345, 20, -568]
2531e68O68j57l86P70n05R4L49n45M42K77r93O83J25n34P30l20m28O69m97m1O54
2552D87p31J13O37j017P15Oo70N66j63k84Q15o03J08O15n89L51k28l91O39l22
2572E4n34P38m33K1L70q72R62j68m69N88k35k60P40n89k88J007q18j84Q41j013
2592e42N92L26r59P94j40m56P12l07p26R82l53J42K26n47L19J91n07M56j26n79
2612e02R94o63j0M92m80L68J64o82N70K31o95O23k78l80P00p79QL29l56J75J91
2633B0n81P96l26n39R55k33k17P82q80O1N37r01O53k40n50O97k77o3O39n58K58
2654C3M76n71K36K69j041M44Ll0K15j85j52P21o05J54N50p76K98J42m72Q04k79
2675B34l86N78k49l45M25m01K61K55o51L19j01m25M53K38o99P77j87l20O61n12
$$ y = [-568, 100, -57, -443, 327, -178, -84, 265, -280, 162, 439, -554, 129, 254, -280, 450, 130, -298, 371, -126, -167, 487, -244, -131, 506, -511, 204, 210, -460, 106, -57, -341, 474, -129, -21, 594, 5, 356, 128, -263, 376, 54, -480, 258, -175, -154, 216, -656, 306, 138, -331, 257, 22, -238, 502, -87, -375, 632, -186, -370, 471, -542, 50, 376, -583, 211, 71, -385, 327, 20, -706, 276, -77, 65, 291, -256, 63, 254, -253, 203, 77, -502, 492, -171, -181, 311, -169, 199, 363, -319, 251, 482, -213, 410, 132, -248, 452, -327, -319, 10, -346, -171, 20, -561, 235, -91, -630, 325, 92, -125, 657, -223, -162, 375, -526, 127, -113, -663, 34, -243, -306, 333, -225, 33, 509, -62, 174, 443, -598, -154, -151, -181, 34, -151, -303, 418, -187, -33, 517, -259, 39, 181, -291, 513, 234, -152, 426, 177, -168, 257, -144, 117, 372, -279, 40, -61, -486, -33, 205, -494, 283, 96, -224, 437, -75]
2695g5mL73l56J90p0p53Q32j83j13N66n24r1O25k66l25N91p69M38k4o99J134o51
2717a54l44R34o25J0Q48r51M41L36p57Q03k35m48N67n24QL67n88O4O15q75R12
2738D04j12n00M47l40k33R33q09k4N13o92L66L03n30K77K4l95M31M0m42N47k97
2759h9j38N87o05J18L22l92K26J10m91O32j61l10N86m35kM48q97O71k7n19P02
2780C36l39n96Q76l49l18P99o90L72K58j132P53J78p22P51j73m79P49m39L1N43
2800D09o04K20N01q76P11j17o87O74k95m3M36n79J77L87p81P13J98n76K25k3m48
2821c78O92k20k11J66j42r0N43o93M60%o30Q22k40l16N32j34k72K15l40L31J84
2842B79m29j48M39o83P10N2o34Q80o50j16O55n83LL74m27L25o3j44L52l49j92
$$ y = [-75, -79, 294, -62, 128, 58, -695, 137, -46, -159, 407, -117, -208, 417, 151, -174, 417, -352, 86, 62, -637, 497, -154, -498, 436, -189, -179, 669, -282, 159, 495, -262, 541, 306, -142, 425, -99, -91, 276, -312, -248, 367, -508, 404, 292, -208, 239, -101, -334, 599, -210, -234, 279, -413, -47, 256, -274, 3, 27, -368, 63, 103, -339, 208, -89, -227, 360, -245, -127, 195, -197, 29, 139, -352, 280, 119, -191, 395, -40, -42, 406, -491, 180, 153, -366, 336, -3, -599, 277, -72, -390, 409, -281, 91, 349, -783, -30, 148, -574, 177, 4, -475, 274, -165, -134, 409, -195, 25, 526, -350, 361, 244, -443, 231, -64, -107, 329, -250, -73, 314, -467, 246, 444, -132, 93, 70, -378, 314, 94, -117, 49, -93, -183, 360, -333, 127, 127, -503, 319, 79, -237, 295, 161, -111, 104, -236, 95, 279, -150, -298, 141, -542, 168, 220, -414, 466, -184, -300, 355, -228, -225, 149, -278, 47, -16, -160, 192, -157, -349]
2863c49J224r08L3J98p24Q01P0o35N12k54n56Q75n41PN81n29J14N28p76M02L9
2884A12m82O82p5m48N53l81j46M96o92K35N07p84O56j48k38K90k8j91M45m75K42
2905A30M53r15K76K15l87N00l83k22P18o70K93J6k10m6N97q36N26K26p41L19M33
2926B92p54Q17n22r5O32o20L52J22m64M69k33l80O73l43l78R23o19P9L32o24L80
2947C9M15o72P71k49l04J69k63m21P65n02M8L55n42L87M17p05M61J17o45P69m31
2968b1J28K61o16K19M34n29L13k71l38P12j04n82P46m67k83P54q23M63J29l80
2988b55M70k4n26O84m22j54K94l10j18Q31r86O61N4n56O51j69l35O06l81j32M20
3009C03p26N24K15o50L64J31o67R25j92o80P80n29J23M82o02M79k52j69N31j26
$$ y = [-349, 875, -33, 0, 198, -526, 275, 345, -290, 222, -32, -588, 287, -254, -247, 334, -195, -81, 447, -329, 73, 112, -370, 312, 237, -211, 342, -39, -185, 311, -381, -146, 361, -423, 233, 85, -153, 137, 109, -82, 363, -112, 130, 583, -332, -56, 159, -228, 272, -111, -333, 385, -285, 8, 24, -186, -232, 365, -471, 55, 281, -460, -141, 292, -462, 355, -167, -262, 370, -250, 102, 224, -240, 229, -4, -384, 289, -54, -432, 491, -128, -49, 283, -341, 39, 454, -218, 553, 304, 0, 169, -94, -515, 250, -252, -204, 151, -391, -4, 413, -292, 169, 286, -359, 410, -21, 107, 368, -248, -29, 405, -124, 189, -82, -420, 292, 188, -394, 352, -115, -398, 356, -467, -4, 125, -255, 215, 191, -335, 349, -73, -227, 67, -243, -361, 470, -516, 145, 199, -357, 294, 125, -210, 396, 15, -117, 303, -423, 101, 316, -334, 30, 161, -506, 419, 227, -453, 327, -202, -79, 403, -199, 280, 28, -141, 390, 264]
3029B64p13P63n91JN39m05P9M44p39N78j2p02P36k81l29P44l89k69N81q49O16
3050F6M01o75M94j92n14O28p2n51J105q84j48J034p34L04K99j103P44l29n5M33
3070B51k16k66P58o70J03N27p68L47R2p90O33L2l42O90n81j11P26l93j62Q02j145
3091d83N13J38p78P44o9k74M93k70M7M48r70L03N65p59L47K79p02R07m66k01O17
3112D29o00L0P13j074M25O02r99P65m34k43P63o77J86L72n39L96J61o88N60J10
3132B58q72Q77l54l87R70m59o4M26n87L37K09q63P63k28l14Q19n90k94P22n94
3152b25O9N90m79J11J45m23L60o8n0J43l88j62P74n95J06L16n57L01M30r98Q91
3173B91j73n61P83l09k44O01q01M77M87r32L99K55n74N74j96m37Q32p49j49R76
$$ y = [264, -449, 314, -277, -276, 263, -142, -63, 381, -358, 220, 208, -494, 242, -39, -368, 376, -13, -282, 299, -550, 66, 467, -208, 286, 94, -420, 208, 136, -415, 690, -194, -342, 692, -42, 262, 561, -542, 202, -127, -182, 251, 35, -231, 527, -143, -40, 487, -281, 66, 158, -632, 1, 33, -309, 381, -200, -311, 415, 22, -140, 662, -483, 30, 168, -610, 134, 65, -209, 284, 14, 61, 509, -461, -158, 407, -352, -5, 274, -428, 479, 13, -188, 429, -171, -141, 572, -502, -77, 525, -474, 291, -143, -386, 377, -300, -114, 258, -281, 115, 276, -412, 148, 258, -614, 263, -91, -478, 492, 33, -31, 395, -192, 145, 354, -509, 254, 26, -288, 531, -59, -353, 369, -225, -156, 434, -45, 66, 211, -212, 148, 80, 30, 173, -215, -377, 397, -198, -92, 224, -333, -32, 398, -600, 291, 118, -443, 340, 31, -213, 388, -413, 64, 551, -381, 18, 273, -301, 273, 77, -360, 472, -277, -426, 550]
3193E50p82M91K67r42O87k45R8K35o52j2N86l98j23N13n22J00J22n12P07k09k02
3214b43Q19n57m20R19p99K87N01q60L12K07m13K21J06m03L98j63j54P34j093N33
3234f8M12o67N67j2m92L15j75q6M70m83j27Q21p15P0O05p89M67J45m60M10j4n89
3256c95N92l23K13N48r62P30j27n55N05k01j10M67j54o22O75m98J24M80p56O43
3276B74j61p89Q64j37j71O99q09Q4M68p43N24P6l05M72o3q19P49m4n34O01m42
3297b06K00L08p76N25J75m79L26q5k93Q14n28k82P75m08l7M24p16L93Q0o68M97
3318C9j80k87R27n29n2L59m40R1N77p96M44J02n97O17k63n43Q20m41j59O70m87
3339a28J51K29q52Q74r3q41O79J57l29M16k17M9Q4k42L14P6n73N81k80o08M38
$$ y = [550, -232, 259, 526, -416, 271, 26, 124, 359, -293, -305, 281, -117, -240, 273, -249, -149, -27, -539, 168, -41, -243, 576, 19, -401, 518, -281, 6, 507, -353, -41, 166, -247, -26, 80, -323, 75, -88, -242, 492, -601, -68, 344, -323, 244, 232, -260, 55, -120, -206, 264, -219, -346, 475, -240, -170, 435, -354, 113, 258, -202, 208, 194, -395, 197, -126, 87, 635, -327, 403, 276, -279, 226, 25, -85, 382, 228, -394, 281, -217, -93, 387, -369, 274, 113, -676, 188, 51, -120, 579, -230, -146, 322, -421, 103, 179, -126, 346, 283, -536, 213, 169, -365, 236, -206, -6, 302, -474, 51, 226, -253, 73, -12, -305, 509, -19, -301, 474, 66, 29, 453, -263, 130, 210, -458, 39, -141, -428, 499, -30, -82, 277, -163, -72, 505, -291, 153, 255, -342, 275, 12, -531, 289, -152, -311, 359, -128, 23, 252, -600, 274, 181, -660, 19, 176, -153, 263, 46, 95, 179, -63, 251, 327, -246, 335, 55, -553, -115]
3360a15o1j69Q78r32L27M23p29M09L10o90O14k23m47R09o71k2M92n70J92L80p38
3381d33N36J67o17O10l07o2N72m93o9M06l57L23M5o27N95m79l49P76N3k67L95
3402D18n88J1N66q16N40J19o59N52j91k21P96q28j68O09l21L38J03p06M78K2m88
3423d34P30j05l58N12n70k91J057r54M56L2k60L07R0n08N44M9n42N98l53P1Q1
3444A52l85K43J87l81J87J94p27Q49n31j49P76q20K70P48p14K49J74o36O00k83
3464Ck24N15m30o8O14n75qN89p55K41J06l01N22l84l7O62o20N1L06o75M57M41
3486D30p26L49L41p17N70l78n8M51n43L04L94o40J66K50n76N39j67j76M32l98
3506a53k27O57o16J03M15m81O14j70l69L75k21j46O73q01K93N71p51K92J55m59
$$ y = [-115, -176, -345, 533, -399, -72, 351, -378, 31, 341, -349, 265, 42, -405, 504, -167, -189, 303, -267, -75, 305, -433, 103, 270, -347, 263, -44, -106, 466, -27, -96, 310, -47, 276, 321, -306, 289, -190, -539, 237, 290, 23, 418, -170, -159, 407, -409, 131, 250, -409, 143, -48, -269, 527, -301, -469, 140, -181, 157, 260, -446, 32, 54, -434, 296, 191, -167, 345, -225, -516, 541, -413, 43, 75, -185, 122, 212, -296, 248, 297, -245, 353, 0, 71, 152, -233, 10, 197, -184, 3, 197, -530, 319, -212, -361, 415, -405, -135, 613, -101, 148, 322, -314, 286, 3, -221, 294, -136, -204, 410, -165, -173, 416, -339, -98, 8, -293, 229, -155, -192, 470, -150, -99, 207, -468, -11, 430, -296, 53, 394, -323, 247, -131, -189, 262, -281, 23, 417, -223, -57, 193, -383, 156, -11, -187, 245, -153, -380, 277, -339, -236, 179, -302, 312, 142, -227, 148, -73, -219, 454, -347, -54, 517, -234, 58, 213, -246]
3526b46N10k1m49N35l24k03N10o76L88L64n83L64L67p57K94Np77P69j96J2K69
3547A55k98J64M01m49K97j97l0J95q9l16N96o36N0N62q55M80L38p10J65K04l83
3568c56N16N6l87M14k33O1M38m78J80K8n16L14R8n83M76j47j93O02n72L00L47
3589C65n68L17J55l45M04q4n60M92k70k60P52n79J21N40o18o4J63k97N29l4k80
3610a21O40n37RK69m13L49j50k26K97k15j84O04n06j02O17n36J91K80n14J29L14
3631A95n26O77J41p06N16n52N4M60m80m4O57p37M83m5m74N61j96k28M75kp10P74
3653B93j31r4k9o12R72k88k71O20m00j74M47l47J50R9n81L76K04m82L76l04j72
3674c48O86l78l31M88l08K05J17l84N35j48k06L77Nm46M27l08k30O17n12k19N58
$$ y = [-246, 264, 243, -206, 329, 5, -198, 312, -364, 24, 388, -195, 169, 536, -221, 73, 78, -699, 70, -126, -114, 155, -143, 21, 422, -27, 270, 73, 43, 238, 149, -167, 429, -207, -157, 405, -450, 30, 368, -342, -177, 27, -356, 160, 216, -171, 243, 10, 71, 509, 31, 211, 239, -277, 37, 135, -448, 28, -119, -312, 290, -282, 18, 365, -203, 114, 269, -76, 328, 244, -316, 176, -94, -354, 398, -181, -60, 480, -138, -202, -39, -336, 193, 159, -121, 519, -18, -9, 260, -153, 196, 46, -180, 117, -98, -282, 322, -184, -286, 331, -205, -14, 266, -248, -119, 195, -331, 346, 487, -219, 297, -255, -201, 259, -221, -265, 392, -345, 138, 93, -381, 180, -16, -244, 231, 229, -481, 293, 162, 68, 39, -573, 399, 111, -160, 460, 60, -114, 333, -14, 136, 235, -346, 30, 234, -248, 128, -176, -348, 338, -40, -371, 117, -191, 14, 131, -253, 282, 134, -72, 305, 310, -136, 291, -17, -247, 370, -142, -361, 197]
3695A97m43L78k02k90O00l84m5N23m63P9K22n97N65N8m30N15k71k10K51l4m03
3716c84O69p51K07O84n81J09L65o17M31k26k09N84m96j09N03n81J00Q39j048N34
3736B3L44n79L12p0l06N91n52r0O65q17K91K65n46M52K24m68M39n8j57J43j43
3757c7R3R9m18J86L71o43M56p1k77L34o5l80M30m96L34L08l46J55L47o56L25K18
3779B67n30N73l83l00N76n03K44J03l65L48J37k47J77j79j58M89l52n5L70l97
3799a85q8L36l24K00K38n77P45o31k02Q48n33K97L60o75J64L52n93N63r8n33L36
3820@j99R8L02m71J10M97n80M40J02m57O7L65k67O30q48j8N57o15N7O55p15J34
3842a56M20n00M32n9j77O9j59J09O01o27R0J82m49m2M79n85M22j02l00Q00o70
$$ y = [197, -246, 132, -70, -360, 240, -144, -189, 334, -129, -50, 172, -425, 140, 198, -232, 283, 12, -198, 53, 19, -384, 285, -466, -259, 425, -156, -47, 318, -299, 132, -94, -303, 281, -215, -324, 179, -402, -302, 537, -511, 23, 367, -212, 100, 30, -276, 315, -237, -327, 338, -479, -188, 77, -469, -17, 207, -261, 178, 120, -37, 106, -37, 56, 155, -263, -77, 294, -349, 107, 36, -241, 93, 28, -352, 78, -418, -84, 224, -122, 33, 380, -276, 49, 267, -263, 310, -73, -373, 203, -300, -56, 47, -318, 30, 167, -80, 97, -82, -240, 249, -103, -158, 212, -185, -273, 63, -261, -61, 177, -400, 345, -286, -488, 360, -173, 124, 484, -191, -27, 325, -268, 295, 197, -336, 0, -199, -101, 201, -270, -160, 337, -243, 197, 299, -158, -91, 274, 7, 637, -211, -229, 328, -287, -230, 425, -290, -156, 264, -236, 196, 137, -40, 29, -130, -21, 580, -47, 43, 225, -224, -266, 213, -372, 50, -52, -352, 448, -222]
3863b22L62J0j75K38m9l85J38J70j69L90m39j62N49n14K07j22j54M35J7m02M95
3884B18k09j80K35m8m3Ql79M39R7k50M15k79m48Q99m13n2M15l08JK73j53j15J30
3907B53o98N67J48o14N11r1l86O84n31o9M61m18J16L58o25L79j44J4J99j52P4
3928C6L8k97J29K02l95M60o8l01O00j81m56O19m28k68L61j45j8J47k76M26J03
3949B88p72M80n6k31N46m18L25k19P0K71l4n46L68l98j13O73k13k94P66k87j84
3970B2P0k66K93P9k11K36l98j0L36l47K00J14l08J49K08m36J29N21p64O74j50
3991A41k14M64l35q8J86k86L1K04m11M13P7m31M78o02K83K10q8J88Jm06J14N25
4013D54q31L36J15l21M27l24J9M62m03R3K95p25P45k57j1K00k06k23K40r7j51
$$ y = [-222, 140, 150, -25, 213, 164, -221, -83, 87, -82, 308, -131, -293, 256, -258, -51, -173, -327, 108, 125, -277, 218, 9, -171, 64, 16, -27, -19, -398, 41, 138, -112, 303, 24, -424, 475, 62, 10, 425, 117, 118, 391, 238, 123, 253, -445, 122, 270, -344, 167, 76, -310, 374, -157, -226, 235, -183, -67, 291, -334, 45, -99, -85, 114, -38, 36, 74, -223, -94, 108, -287, 173, 105, -196, 404, 223, -233, 386, -42, -310, 51, -94, -112, 35, -241, 185, 288, -484, -4, -60, -291, 255, -163, 162, -57, 13, 284, 250, -296, 72, -326, -439, 234, 21, -273, 493, 206, 22, 92, -174, 119, 198, -13, 223, -175, -185, 151, -196, 4, 118, -190, -41, 167, -269, -140, 381, -383, 291, 141, -73, 391, 56, -32, 154, -132, -101, 103, -308, 105, 182, -249, 229, -373, -90, 120, 32, 220, 221, -185, -71, 454, -377, -41, 74, -247, 180, -144, -125, 337, -66, 27, 322, -403, 342, 85, 74, 274, 68, -155, 85, -12, -163]
4034a63K98l25R3N2J6r2p8L45L07n20j13K25l82J68L96m86K54L15m48K13N3p3
4056E5j70J56l14N16j92k56L66l67M83p6m97N11k42j40M50l95J4K81k88L8J53
4077H6n78O18j69j76M40j4n10M91l26Q3K14l90K67J16o51P51pp30Q27m60K66O9
4099B17N5q7J9l91K8N30q24M03oj25L02m18J49M08l96K97J69l63r2L07o03M66
4121D5k34j00K24m7L5%R0j10J32j36K10J0j63L82m77mM85m97J65L23k87n2L10
4144C04n60N38j80k81L49l04J34j77j79K34L50l49K30k04n3M37k88k04K97j47
4164e3J36j97R2L7K92m37K47k4l00L65k99j68L79j93J26Q4j78K98r9j32j1J13
4186G8j46M78l40l30M49m34J72K48l94K87J29l31L89j85k81L68k97K31M2j07J1
$$ y = [-163, 135, -190, -97, -45, -29, -121, -199, 146, 453, -67, -180, 45, -337, -169, 227, -259, -5, 310, -138, 75, 128, 55, -115, 41, -273, 243, 51, -205, 161, -206, 277, 201, -296, 215, -27, -167, 283, -112, -98, 183, -105, -67, 86, -492, 126, -43, -219, 221, 207, -303, 188, -138, -55, 159, -231, 36, 152, -499, 252, 245, -485, 342, -118, 148, 217, 272, 185, 204, -187, -159, 371, -453, -50, -56, -181, 121, -297, -148, 260, -136, 161, 330, -33, -125, 182, -421, 45, -189, -289, -65, -112, -77, -77, 13, -97, 35, -101, 109, 119, -44, 338, -139, -143, 342, -155, 10, 333, 46, -6, 304, -256, 282, 102, -179, 170, -134, 0, -177, -356, -122, 228, -121, 109, -95, -148, 289, 1, -203, 94, -53, 83, -114, -22, 15, 307, -130, 117, 93, -207, 158, -141, -309, 70, -123, 3, 87, -91, 207, 108, -24, -35, 78, -68, 410, 70, -260, 189, -245, -73, 175, -219, 68, 197, -134, 255, 70, -211, 157, -140, 91, 133, 26, 37]
4207C7L09n71o4L26m19M81k63J17K43k92L04q2l77L20l8n34O94j01j01K94k69
4228A4j20L64m00K20K01o29M50k12N5J3M4o7M56l94J0J12m22K86J97k74P6J81
4250A61k99L32l80J91L63l06qJ56o67N46R4m50M23J04k26K7j96P3K32j31o5J43
4272A17m08N06k66j81K64m4J0n9o4L18j28k25J94K77j82O5j85lK22n19J7L81k41
4295a34r9J19R4J15j15K2L53j44o64O60j94r8J55j58K08K54l89k3M07o51M62R7
4317B77n38N01l96J01J29l51J14R2j49L73j25j76K99J00m12J57q0j70N26n03L61
4338A30J45n75N37o5l35J35J66l15J74R1J3k5k34P9L82m74kK03k77N97n88L21
4360H3P2p4N2J61n14J01K34l45K93Rk8K23k81j44J20p6l0J03k23L42L5l35M12
$$ y = [37, 346, -225, -289, 37, -382, 99, -164, -47, 196, -96, 208, 126, -251, 69, 31, -503, 191, 90, -11, 283, 14, -106, 258, -142, 78, 279, -350, 100, -112, -57, -44, 0, -67, 389, -5, 5, 117, -305, -19, 178, -96, -20, 161, -138, 194, -186, 5, 368, 62, 54, 210, -457, 89, 183, -267, 156, 260, 34, 61, -135, -62, 170, 39, -26, 117, -291, 215, -51, -232, 32, -12, -2, -61, -125, 193, 65, -160, 34, 311, 129, 194, 9, 6, 228, -291, -274, 107, -134, -233, -114, -20, 95, -20, 2, 355, 211, -453, 207, 13, -85, 70, -88, 120, 374, -15, -38, 369, -282, 180, 277, -261, 240, -156, -55, 74, -277, -163, -71, -220, 153, 28, -148, 151, 251, -161, -4, -84, -254, 272, -231, 130, 275, -300, 237, 172, -163, -28, 138, -177, -3, 88, 101, 76, -158, -79, 303, -171, -173, 30, -247, 350, -238, 83, 155, 81, 133, 294, -220, -119, 115, -230, 63, 72, 44, 267, -14, -158, -38, -114, -144, -41, -264, 78, 113, -222, 190]
4383A90k87r0R3P1P3O8l54J30P9J96j60j18m1rl3K75Ok37k1M77m02m3M41l21q2
4408i9J76j92L41l39j2L07j7j48R2k74N76l35k68M13k21j8K46k35j01L33k59J20
4430H6j61N8J54Rm52L12j71O6L49k05r1K53ol5P8l22K97k14l21L63j53m3K14l99
4454c34M61K61o35M9L32l44L97j49M5j63L2j7K56m95M4L79l02Q0Q3k03J45J39
4476F1n3K93l09n1J35k96K95K1m87O37r3m25M66k31j80M10l14Q1L47o55M24j35
4498e9p3N11n89L77m0j48r9L27k56o9M40l88NJ95k10Mk5k13O74m97K2N39m68j31
4522a71J02j07K49J4j23J4Q7k63J88j32p2L81k05R4J59n43M35j65L3J82l49k6
4544b18M00n92L04L39l70L09l20O2L86r5m96N30r3l13K02L2l01L00Ln0K91m15
$$ y = [190, -97, -187, -94, -23, 50, 118, -236, -106, -27, 169, 9, -109, -150, -159, -192, 83, 89, -148, -169, 308, -94, -137, 304, -17, -99, 77, -115, 226, -113, -125, 182, 165, 17, 109, -165, 411, 76, -192, 221, 0, -18, 228, -7, -108, 225, -34, 86, -75, -17, 137, 146, -306, 6, -165, -99, 250, 45, -46, 207, 201, 166, 244, -78, 219, 5, -316, 47, -106, -149, 65, -334, 127, 388, -247, -198, 134, -210, 187, 38, 83, -80, -48, -65, 191, -304, -260, 119, -183, -103, -20, -223, -78, 61, 8, 301, -8, -59, 76, -220, 75, 96, -391, 246, 153, -272, 194, -37, -217, 193, -121, -40, 307, -348, 76, -59, -132, 379, -210, 167, 127, -21, -120, 207, -49, -118, 322, -66, -61, 134, -76, -72, -97, -310, 364, -133, -111, 428, -40, -171, -69, -176, 73, 87, -36, -22, 65, -198, -10, -142, -214, 167, -38, 56, 215, -328, 107, -58, -25, 157, -192, -218, 182, -410, -106, 233, -137, 172, -148, -86, 300, 205, -291, 239, 146, -167, 35, 67, -234, 66, 69, 19, 310, -105]
4566a05J94Ok41N08m18Q2J85k53K1K21k86J96Nq2j58O0j0L30o53M47j70J95j42
4589f8n8j44L54k87KK45L4KK2l48K82J25m36M24km03L97k16P5L44o52J77K11l56
4613b76K78K49l79L13O0j75J55Ml17J97p2j60K34j08J7J27n7K59n78N5L63l66
4635a77K71j84j06K32k16OK99N7l33M37k04k20K29j81J2J77l22J61K9k00M66k60
4657b7j17J08K2l07N46q8k48K21j15m0j70L79O0k17m58L50L58l42L81m44R9K62
4679B13k76J46l11j8K99j91L32k94Q2j87J16J42K96k08j64N3q7M9n9o1L97k61
4701Hk1R9P9k38R4J37p2j35p3r6K82nj43M02l86J79p7k00N16k64k28K58j02j46
4725a32K36m2L8N1m54K20K36k76N44j24l07L09m5k13P2k96K65k33Q2J06M5k96
$$ y = [-105, 89, 95, -146, 362, -56, 26, 211, -42, -21, 200, -86, 110, 115, 33, -125, -65, -75, 255, -398, 49, -121, 74, -68, -126, -270, 84, -203, -201, 44, 78, 80, 102, -246, 36, 161, -275, 149, 147, -256, 141, -75, 0, 344, -308, -131, 80, -276, 2, 251, -128, 185, 245, 70, 225, 229, -88, 109, 37, -123, 111, 3, 20, 147, 90, 349, -229, -174, 189, -177, 94, -90, -196, 36, -180, -174, 125, 182, -151, 286, 82, -138, 91, -90, -78, 99, -223, -62, -33, -233, 233, -27, -144, -36, -14, -321, 225, 137, -111, 110, -5, -45, -215, 164, 224, 7, -451, -101, 257, -85, 296, -148, -49, 213, -63, 83, -228, -246, 53, -138, 194, -100, -18, -205, -89, 53, 349, 141, -23, 30, -57, -8, -67, -128, 269, 8, -13, 86, 165, -73, 21, 158, 86, -49, -122, -218, 64, 59, -84, 318, -68, 111, 34, -166, 350, 86, -142, 116, 14, -132, 104, 62, 100, 151, -303, -83, 153, -123, 421, 297, -10, 299, 254, 41, 113, -183, 82, -151, -69, 37, 82, -214]
4747b14M34l34M2J82k36J33l14J90P7RR1N3k32J18J93k64J29j15j97o1L47j04
4769g3J36q8j34L30j65k19N04r6k91P3j46j53N62m39K91P6k34L51l87J6N35n91
4791a42N5J79k49Q8J51o53N92jl39M36j46p1K71k04j17L31k33M01p4o80O27l90
4813a68J05J19k53k21M78m97L69M0k95P12l96o0J40K7j91N04n99L69J9j82j19
4834i9M54l46n7o2q0J89L25n40N29m04J91k4j29K46k03K01j48k63j34K10J22N9
4856C7K56l09N8K7r5N4L2k16K54n6l42M08k56J24J20j21j43K36j09L8J6j88J86
4879A1j56L16K3k49O8o6nJ35M8n27M48K90l3J5j68k35K68J58n04L90n74M67Q4
4902B04m67R9J79K2J32j95K41J89m44K85k67k16O09j51l66M05p8j53M4Lj18O9
$$ y = [-214, 220, -114, -72, 110, -126, 7, -307, -117, -40, -31, 60, 113, -119, -1, 192, -72, 57, -58, -255, -316, 31, -73, 63, -25, -159, 171, 6, -213, 291, 195, -96, -23, -169, -322, 240, -199, 92, 168, -66, 285, -102, -86, 449, -142, -87, 92, -157, -69, 82, -571, 21, 20, -319, 117, -29, -100, 171, -33, -150, 181, -52, 349, 275, -405, 222, -168, -63, 56, -197, -418, 60, -437, -68, -28, -323, 389, -7, -67, 73, 100, -91, 413, -186, 183, 202, 20, -99, 355, 9, -48, -110, -190, -1, 324, -216, 313, -91, 100, 76, -53, 193, -10, 191, 43, -220, -354, -144, -22, 37, 293, -16, 42, 69, -26, 28, 60, -156, 98, 42, -300, 108, -148, -24, 96, -25, -168, 68, -41, -3, 13, -175, 11, -145, 171, 194, -55, 13, -53, -58, 77, 125, -402, 46, 336, 303, 318, 150, -85, 183, 341, -163, 227, -347, 120, 204, -263, -164, 15, 37, 169, -26, 215, 404, -40, 245, -22, -238, 371, 220, -146, 259, 181, 28, 72, 75, -43, 26]
4924B6k52K78R2k18kP4kP8r4K7K33n77O23j76k64K16k4l0J61n1k59L95k05K10
4948B59k00k57j38K41J50j34K08n99P36k48Q7l3p2N0k00L4M6j28R7J88r5j63R0
4971h1J65m33K09J9K41K49l75j1%o1J67k00OK46k86K84n8k88J40K51k45N1o5K10
4995A35J61l31j22J6L8o2J99j41P3j51L62k31K92k64J49j61m7L30n06L04Qk87
5017b36J17J10J20k60NK10q4r6j6K22k78P6J02j6K50j54j74L73q5k27K13k10k68
5040c06O89n88j08L00O6R3l3j11J21o2o4O1m11M76j8j51J4j64K97L5j49k45J90
5063f8L37p64P25k77Q4n7K20k92m5n8J54n8Q6J23O3k45J22JJ76j22j58J97j01
5086D3j92J25K0j37N1J45o9J43j8j78O6j77L31l40O7K68j21n0L0k2r5J70L4J56
$$ y = [26, -226, 52, 144, -74, -76, -2, -4, 74, -20, 7, 240, -337, 286, 110, -154, 62, 38, 8, 169, 118, -141, 254, 49, 259, 59, -198, -336, -95, 55, -79, 129, -470, 266, 18, 105, 72, 0, 50, -150, -116, -70, -198, -101, 87, -8, -171, -81, 84, -349, -140, -121, 120, 369, -6, -17, -17, -78, 89, -111, -105, 141, -145, 139, 81, -207, -67, 184, -61, -10, -75, 135, 296, -35, -157, -141, -103, -165, 34, -107, -34, -185, 177, -54, 238, -26, 123, -38, -85, 245, -261, 43, 51, -236, -119, -9, 111, -149, -144, 66, -18, -114, -130, 92, -186, -110, -8, -24, 226, 72, -102, 271, 186, -41, 172, -38, -306, 383, -205, -313, -13, 53, 146, 113, 2, 123, 61, -3, 58, -353, 123, 105, -46, -32, -196, 101, 136, -13, -258, -68, 269, -495, 230, -47, 37, -20, 200, -92, -137, -195, -41, -99, -13, 110, 173, -72, 50, 51, 227, 105, -53, 144, 43, -149, -24, -4, -141, -90, 55, -14, 129, 111, -67, -1, -178, 153, -187, -120, 148, 27, -23, 7, -15, -110, 60, 94, 250]
5110B50l61Q8q0K99j85J25k44mJ43N5m16N37n58L83l8l43L72j80k8K89K4k46J61
5133D3l23K18J41Qj84r4P7K37l0j19R8L0k99K79k07k8J28j19M4p1MN09j15m52
5157b25J30J83j02J69l19j17L06l70N05j71l18N70l28mK76p3K6k63Q5n9K00j66
5179f5rn7n1J12L3L57j20l99L80j3j52O9k2j55M32l89k5J68J40k75J04l83K09
5202a11K21j91R8N3l58N34k40j45K93m27J16L76k94j13L07j84L96m07q0K32k03
5223a27L06n0j28K0j54J19P3J46l45L31j63j25N06o62N30l50k17J01L91l53K68
5244A17O2l76K43j67j0R8K70l58J28j34M4m5J13L2j24j41L88j88J71R0l26K07
5266I4k6o4J94J9k75K53k61j23M64l22O4r2j35K09J56l04j22J65n1O8N1J84k27
$$ y = [250, -111, -23, -103, 196, 11, 136, -108, -112, 31, 86, -330, 207, -351, 32, -6, -349, 23, -157, -185, 104, 128, -118, 43, -280, -62, 79, 87, -97, -191, -114, 123, 93, -26, 72, 102, -197, 82, -125, -153, -25, -144, -100, -171, -167, 342, 227, -225, -95, 88, -14, 155, -164, -281, 25, -345, 160, -11, -329, 241, -87, -91, 185, 112, 138, -125, -40, -99, 101, -65, -74, -131, -182, -70, -37, 320, 200, -199, 181, 168, 16, 85, 63, -92, 340, -49, -74, 94, 234, -41, 63, -320, -111, 110, -81, 17, 70, -288, 246, 6, -139, 154, -273, -157, 219, -75, -188, 119, -65, 331, -76, -156, 76, -127, 179, 129, 1, 21, -133, -14, 59, 205, -140, 191, 28, -97, 409, -253, 277, -73, -290, -189, 202, -151, 117, 179, -197, 46, -121, -131, -33, 237, -121, 7, -127, -83, -128, -15, 17, -107, -248, 140, -48, 123, 213, -113, 94, 68, 4, 198, 217, -58, 195, -66, -189, 275, -47, 17, -75, -210, -1, 155, -149, -271, -106, -157, -89, -38, 146, -81]
5289h1J11k19P7J66K68n81N2L36Lk94M05r2Kj36J00j64K54k91K5Q2k38O21n65
5312a59K9J16Q8j18M4RN1N2l97L03p0J6K9M9k50O3J32j92L04l29J38K48l17J8
5336a43K75q2J01k03qM9K4j30K23O7k17L14q2P4l50n4P5K02j25l9l53M30J74k13
5360Inl0q9K54N4k23J93m75K44J13r0L51j4k51k5m5n8K51l13K31N6k20p8J21m2
5385h1J56j83o1K70j02J03J19l50L6K18q6O5J29l38K68r8j65L09j18l35J00l0
$$ y = [-81, 30, -189, -112, 54, 322, -259, -207, 129, 132, -162, 243, 151, 153, 17, 117, -47, 207, -84, -59, 23, -215, 406, -159, -130, -14, 74, -44, 0, 9, 60, 112, -285, 18, -52, -36, -7, 42, -208, -145, -13, -205, 99, -230, -92, 156, -161, -143, 132, 50, 151, -52, -60, -11, 13, -117, 106, 173, -44, 270, 188, 262, -88, -142, -67, 135, 10, -29, -382, 48, 222, 9, 4, -26, -115, 139, 193, -30, 163, -312, -68, 45, -45, 306, 292, 41, 16, -29, -87, 164, -149, 82, 138, -82, -160, -39, -81, 75, -108, -169, 101, -1, 102, 221, -129, -93, 125, 39, 104, 233, -105, 163, 65, -100, 209, 91, -244, -144, -174]
$$ [...]
8191a99
##END NTUPLES=NMR FID
##END=
