##TITLE=1H_100-2024
 DMSO-d6
 8 sc, 
 5.12.2024
##JCAMPDX= 6.0         $$ Bruker NMR JCAMP-DX V2.0
##DATA TYPE= NMR FID
##DATA CLASS= NTUPLES
##ORIGIN= UXNMR, Bruker Analytische Messtechnik GmbH
##OWNER= root
$$ XWIN-NMR		Version 3.5
$$ Thu Dec  5 13:55:57 2024 Russian Standard Time (UT+4h)  she@DPX200
##.OBSERVE FREQUENCY= 200.1315
##.OBSERVE NUCLEUS= ^1H
##.DELAY= (6, 6)
##.ACQUISITION MODE= SIMULTANEOUS
##.ACQUISITION SCHEME= undefined
##.AVERAGES= 8
##.DIGITISER RES= 18
##SPECTROMETER/DATA SYSTEM= spect
##.PULSE SEQUENCE= zg30
##.SOLVENT NAME= CDCl3
##.SHIFT REFERENCE= (INTERNAL, CDCl3, 0, 15.7039)
##AUDIT TRAIL= $$ (NUMBER, WHEN, WHO, WHERE, WHAT)
$$ ##TITLE= Audit trail, XWIN-NMR		Version 3.5
$$ ##JCAMPDX= 5.01
$$ ##ORIGIN= Bruker BioSpin GmbH
$$ ##OWNER= she
$$ F:/spectra/data/she/nmr/H-F/1/audita.txt
$$ ##AUDIT TRAIL=  $$ (NUMBER, WHEN, WHO, WHERE, WHAT)
(   1,<2024-12-05 13:54:48.56 +0400>,<she>,<DPX200>,
      <created by zg, POWCHK disabled, PULCHK disabled
       configuration hash MD5:
       00 E9 B6 7A A2 85 ED C7 34 08 36 98 17 FE 4E 26
       data hash MD5: 16K
       14 11 F9 5A DC 41 DC 8F E0 64 F8 3F A3 A2 DB 33>)
$$ ##END=
$$ 
$$ hash MD5
$$ 4E 4D 5B C0 FD DD 9A 67 2C 7A 0F A4 B1 E8 02 96
##$RELAX= 
##$RELAX= 
##$RELAX= 
##$RELAX= 
##$RELAX= 
##$RELAX= 
$$ Bruker specific parameters
$$ --------------------------
##$DU= <F:/spectra>
##$EXPNO= 1
##$NAME= <H-F>
##$PROCNO= 1
##$TYPE= <nmr>
##$USER= <she>
##$AMP= (0..31)
100 100 100 100 100 100 100 100 100 100 100 100 100 100 100 100 100 100 
100 100 100 100 100 100 100 100 100 100 100 100 100 100 
##$AQSEQ= 0
##$AQ_mod= 1
##$AUNM= <au_zg>
##$AUTOPOS= <>
##$BF1= 200.13
##$BF2= 200.13
##$BF3= 200.13
##$BF4= 200.13
##$BF5= 200.13
##$BF6= 200.13
##$BF7= 200.13
##$BF8= 200.13
##$BYTORDA= 1
##$CFDGTYP= 0
##$CFRGTYP= 5
##$CHEMSTR= <none>
##$CNST= (0..31)
1 1 145 1 1 1 1 1 1 1 1 1 1 1 1 1 1 1 1 1 1 1 1 1 1 1 1 1 1 1 1 1 
##$CPDPRG= <>
##$CPDPRG1= <>
##$CPDPRG2= <>
##$CPDPRG3= <>
##$CPDPRG4= <mlev>
##$CPDPRG5= <mlev>
##$CPDPRG6= <mlev>
##$CPDPRG7= <mlev>
##$CPDPRG8= <mlev>
##$CPDPRGB= <>
##$CPDPRGT= <>
##$D= (0..31)
0 1.2 0 0 0 0 0 0 0 0.06 0 0.03 0 0 0 0 0.0002 0 0 0 0 0 0 0 0 0 0 0 0 
0 0 0 
##$DATE= 1733392488
##$DBL= (0..7)
120 120 120 120 120 120 120 120 
##$DBP= (0..7)
150 150 150 150 150 150 150 150 
##$DBP07= 0
##$DBPNAM0= <>
##$DBPNAM1= <>
##$DBPNAM2= <>
##$DBPNAM3= <>
##$DBPNAM4= <>
##$DBPNAM5= <>
##$DBPNAM6= <>
##$DBPNAM7= <>
##$DBPOAL= (0..7)
0.5 0.5 0.5 0.5 0.5 0.5 0.5 0.5 
##$DBPOFFS= (0..7)
0 0 0 0 0 0 0 0 
##$DE= 6
##$DECBNUC= <off>
##$DECIM= 24
##$DECNUC= <off>
##$DECSTAT= 4
##$DIGMOD= 1
##$DIGTYP= 9
##$DL= (0..7)
0 120 120 120 120 120 120 120 
##$DP= (0..7)
150 150 150 150 150 150 150 150 
##$DP07= 0
##$DPNAME0= <>
##$DPNAME1= <>
##$DPNAME2= <>
##$DPNAME3= <>
##$DPNAME4= <>
##$DPNAME5= <>
##$DPNAME6= <>
##$DPNAME7= <>
##$DPOAL= (0..7)
0.5 0.5 0.5 0.5 0.5 0.5 0.5 0.5 
##$DPOFFS= (0..7)
0 0 0 0 0 0 0 0 
##$DQDMODE= 0
##$DR= 18
##$DS= 0
##$DSLIST= <SSSSSSSSSSSSSSS>
$$ [...]
##$SUBNAM2= <"">
##$SUBNAM3= <"">
##$SUBNAM4= <"">
##$SUBNAM5= <"">
##$SUBNAM6= <"">
##$SUBNAM7= <"">
##$SUBNAM8= <"">
##$SUBNAM9= <"">
##$SW= 24.0689530833862
##$SWIBOX= (0..15)
0 0 2 0 0 0 0 0 0 0 0 0 0 0 0 0 
##$SW_h= 4816.95568400771
##$TD= 16384
##$TD0= 1
##$TE= 0
##$TE2= 300
##$TE3= 300
##$TEG= 300
##$TL= (0..7)
0 120 120 120 120 120 120 120 
##$TP= (0..7)
150 150 150 150 150 150 150 150 
##$TP07= 0
##$TPNAME0= <>
##$TPNAME1= <>
##$TPNAME2= <>
##$TPNAME3= <>
##$TPNAME4= <>
##$TPNAME5= <>
##$TPNAME6= <>
##$TPNAME7= <>
##$TPOAL= (0..7)
0.5 0.5 0.5 0.5 0.5 0.5 0.5 0.5 
##$TPOFFS= (0..7)
0 0 0 0 0 0 0 0 
##$TUNHIN= 0
##$TUNHOUT= 0
##$TUNXOUT= 0
##$USERA1= <user>
##$USERA2= <user>
##$USERA3= <user>
##$USERA4= <user>
##$USERA5= <user>
##$V9= 5
##$VALIST= <valist>
##$VCLIST= <CCCCCCCCCCCCCCC>
##$VD= 0
##$VDLIST= <DDDDDDDDDDDDDDD>
##$VPLIST= <PPPPPPPPPPPPPPP>
##$VTLIST= <TTTTTTTTTTTTTTT>
##$WBST= 1024
##$WBSW= 4
##$XGAIN= (0..3)
0 0 0 0 
##$XL= 0
##$YL= 0
##$YMAX_a= 100350
##$YMIN_a= -76880
##$ZGOPTNS= <>
##$ZL1= 120
##$ZL2= 120
##$ZL3= 120
##$ZL4= 120
##$ABSF1= 10
##$ABSF2= 0
##$ABSG= 5
##$ABSL= 3
##$ALPHA= 0
##$AQORDER= 0
##$ASSFAC= 0
##$ASSFACI= 0
##$ASSFACX= 0
##$ASSWID= 0
##$AUNMP= <proc_1d>
##$AZFE= 0.1
##$AZFW= 0.1
##$BCFW= 1
##$BC_mod= 2
##$BYTORDP= 1
##$COROFFS= 0
##$CY= 11.3945322036743
##$DATMOD= 1
##$DC= 2
##$DFILT= <>
##$DTYPP= 0
##$F1P= 15.6554695791079
##$F2P= 12.8336369535428
##$FCOR= 0.5
##$FTSIZE= 0
##$FT_mod= 4
##$GAMMA= 1
##$GB= 0.15
##$INTBC= 1
##$INTSCL= 1
##$ISEN= 128
##$LB= 0.24
##$LEV0= 0
##$LPBIN= 0
##$MAXI= 10000
##$MC2= 0
##$MEAN= 0
##$ME_mod= 0
##$MI= 1.114404
##$NCOEF= 0
##$NC_proc= 0
##$NLEV= 6
##$NOISF1= 3.799351
##$NOISF2= 2.8
##$NSP= 1
##$NTH_PI= 0
##$NZP= 0
##$OFFSET= 15.70392
##$PC= 1
##$PHC0= -26705.41
##$PHC1= 8.58744
##$PH_mod= 1
##$PKNL= yes
##$PPARMOD= 0
##$PSCAL= 0
##$PSIGN= 0
##$REVERSE= no
##$SF= 200.130013532006
##$SI= 16384
##$SIGF1= 3
##$SIGF2= 2
##$SINO= 400
##$SIOLD= 16384
##$SREGLST= <1H.CDCl3>
##$SSB= 0
##$STSI= 0
##$STSR= 0
##$SW_p= 3612.71676300578
##$SYMM= 0
##$S_DEV= 0
##$TDeff= 0
##$TDoff= 0
##$TI= <>
##$TILT= no
##$TM1= 0
##$TM2= 0
##$TOPLEV= 0
##$USERP1= <user>
##$USERP2= <user>
##$USERP3= <user>
##$USERP4= <user>
##$USERP5= <user>
##$WDW= 1
##$XDIM= 8192
##$YMAX_p= 0
##$YMIN_p= 0
$$ End of Bruker specific parameters
$$ ---------------------------------
##NTUPLES= NMR FID
##VAR_NAME=  TIME,          FID/REAL,        FID/IMAG
##SYMBOL=    X,             R,               I
##VAR_TYPE=  INDEPENDENT,   DEPENDENT,       DEPENDENT
##VAR_FORM=  AFFN,          ASDF,            ASDF
##VAR_DIM=   8192,          8192,            8192
##UNITS=     SECONDS,       ARBITRARY UNITS, ARBITRARY UNITS
##FACTOR=    0.0002076,     1,               1
##FIRST=     0,             0,               0
##LAST=      1.7004516,     0,               0
##MIN=       0,             -76880,          0
##MAX=       1.7004516,     100350,          0
$$ Real data points
##PAGE= N=1
##DATA TABLE= (X++(R..R)), XYDATA
0@%%%%%%%%%%%%qJ6j6J6j6J9k7L2l5M3m8N5o4P3q5R7j12J27j43J60j77K00k25
35a18K49k76L06l41L80m19M62n13N70o32P00p77Q64r63J077j211J369j561J801
54I67k104K509l082L957n476Q895l3855J4300L6078l2443l7411j7236K2594K2686
68a9621L176j9537j0388M463J4454N518l050j3801j3410o162J3316K7597J7910
81D65j8663l9545j9137K3124L8552J3900k5129l1904M02L0781J8798j5770k9340
94e3466p558K2980K8333M975j8309k2007q645P100J9022J8413L076j4767k0701
107d1554o249J7519K3824P6k3931j5444J5410L1501R675k6121l3641j636L2684
120a7887L1761Q66k6133k2439J686J8260J2816J16n373n264k644N341J0507L211
$$ y = [0, 0, 0, 0, 0, 0, 0, 0, 0, 0, 0, 0, 0, -8, 8, -8, 8, -8, 11, -16, 16, -19, 24, -24, 31, -33, 40, -45, 52, -60, 67, -76, 84, -93, 107, -118, 131, -145, 161, -180, 200, -219, 243, -270, 300, -332, 368, -409, 455, -508, 569, -642, 727, -834, 967, -1137, 1372, -1710, 2247, -3229, 5666, -28189, -13889, 22189, -10254, -47665, -64901, -42307, -19621, -16445, -35982, -46370, -41907, -27453, -21935, -24985, -38786, -52196, -58358, -45042, -17445, 465, -18198, -57743, -76880, -53756, -15204, -1304, -26433, -58337, -57935, -27154, -8356, -24126, -53466, -61024, -38044, -9711, -4736, -23045, -45052, -53697, -46597, -27575, -9162, -6086, -20853, -41554, -47803, -30284, -6460, -6384, -30315, -45759, -30349, 1152, 10827, -15294, -48935, -50571, -17887, 13874, 14740, -11393, -33832, -32146, -13886, -1070, -954, -6327, -11591, -14235, -8894, 1613, 4824]
134D824j0294j5565k592K1127K7373J834k9294k9985L326L2577K6332p443k8181
147e961j3248J3493J9740K698j4536j3205L273J5540J1408r29j0153j3778q394
160a4052O097J9611J6965m143k3437j9764O891K5329J3668j4600k2441k932K1050
173H242J9799p781k7344j4512J2827K3649J0750q831j7320j0716J269R774J0357
186A0163M981o022j3342n866Q616J3627J297j6615j6418O858K5784J4195j5188
199A2070k8169j2020J6361K5801P014j5638j7605j935J0201Q803p92o751n432
212h092N37N300P752L643q236j5859o756J2550K1104Q299j5437k4127o002J8499
226f825J9841q20j7752j2449P004J6652N850j1640j4417k209J0079J2923M979
$$ y = [4824, -5470, -21035, -23627, -2500, 24873, 26707, -2587, -32572, -29246, 3331, 29663, 22220, -5961, -19209, -5716, 14024, 16722, 2186, -11019, -7746, 7794, 19202, 18273, 8120, -5658, -14052, -7955, 11656, 28621, 24478, 1041, -18723, -11832, 13497, 27165, 12565, -9876, -12808, 8242, 28041, 20260, -7084, -21596, -8769, 14880, 25630, 16799, -521, -11237, -9968, -194, 10163, 15144, 9122, -4220, -10086, -1470, 12157, 13454, -3161, -19579, -12721, 13063, 27258, 12070, -16099, -28119, -11758, 14043, 21057, 5419, -12186, -14121, -3920, 4883, 4091, -2660, -8092, -7555, -2255, 5497, 9140, 904, -14955, -21711, -9161, 11943, 20242, 4805, -19322, -25324, -6825, 13016, 12196, -5556, -18005, -11001, 5651, 11501, -139, -14556, -16765, -6686, 6237, 11216]
239A1216o484j1769q528O43J1120J3576J778j3359j3916J451J4927J1352o969
252E038j8448n923J4943J8701R57j8270j7521J712J7901J3515k311j1969q773
265a0448n91O272P037J975l899p270k900N970J0725K277j2388j4362K32J7854
279D84J6579l743k0469j4597O705J8177R372p950j4400l300Q722Q908m99p163
293c174o799q43N813Q676L998m814j1600q771M672J6132J0222p507j6859p854
307a8708J0099J5694K534j3723j2025L933J4530Q189o375j3818o947O218J1216
320H17O519k119p944q298j134O809R379K553p864j0411m82J1954R663m530j4592
335i680q258Q698J7042O223j1686j5798l163J0972J1883J960q016q405o48N304
$$ y = [11216, 4732, -7037, -15565, -14922, -3802, 9774, 11552, -1807, -15723, -14272, 655, 12007, 5038, -13410, -19333, -4390, 14311, 15268, -3002, -20523, -18811, -910, 12605, 10294, -1675, -10448, -11039, -4767, 2270, 4245, 346, -6924, -9824, -3854, 6871, 9148, -3240, -17602, -17370, 484, 17063, 13320, -7149, -21746, -15041, 3136, 12508, 4558, -9842, -13142, -4420, 4488, 3989, -3174, -9973, -10816, -5003, 3673, 7671, 2857, -8743, -17514, -12842, 3290, 13512, 6005, -10854, -18708, -8609, 7085, 9619, -4104, -16129, -12196, 2334, 10523, 4148, -9670, -16617, -10399, 817, 7336, 5217, -2727, -11025, -12159, -5350, 4029, 6582, -1282, -11693, -12175, -221, 9442, 4912, -9680, -17938, -9240, 7802, 14025, 2339, -13459, -16622, -5650, 6233, 8193, 177, -8228, -8876, -3572]
349c572N933J695m279o861k479N896R480L254p940j3088l413J1693J4676J070
363A2065j2747j2759R39J3379R571m623j1804m844O266R634L346o485q724k733
377i519M811P853N113j794r187p947J670J0466Q893k551j2193p734O181J3088
391G150M244r548j2172p75J1914J0725j874j1329q211J825Q847P431r79o394n808
406d954j217M720P150K258o227q577o88Q556R860q61j1877r981M176J3538Q162
421A4038n755j2790n681O786J0355K856n991p403j631N024O199J951m193o750
435b985l028L819Q958N065n684j0591m814O929J1601L946r374j0750m45R713Q797
450A1157j737r891p215L677R571M751l380p800n153K076P271N527q88o832o934
$$ y = [-3572, 2361, 4056, -223, -7084, -9563, -3667, 5813, 9067, 1127, -11961, -15374, -3681, 10995, 12065, -682, -13441, -12502, 877, 10448, 5825, -5979, -10823, -4557, 5077, 8423, 1938, -6786, -9519, -4708, 3145, 8258, 6464, -2723, -10670, -9000, 1466, 10359, 7808, -4385, -12119, -5938, 7150, 11394, 1846, -10326, -11101, 813, 11538, 9664, -1665, -9876, -8051, 796, 8227, 7248, 854, -4954, -6171, -1451, 5699, 7957, 1730, -6847, -7535, 1021, 10881, 10020, -1857, -11838, -7662, 5876, 14038, 8283, -4507, -10188, -3402, 6953, 9809, 3818, -3585, -5216, -192, 6007, 7958, 3765, -2985, -6013, -2194, 6764, 11829, 6145, -4446, -9260, -2331, 9270, 13216, 3842, -6908, -7353, 2360, 11157, 9420, -471, -7686, -4009, 5562, 10313, 6933, -867, -6020, -3944, 3327, 8854, 7966, 1134, -5800]
465e800N2Q412P204k018q959p099L446J0628N914o310j1180l630P311J0138K380
480A0489q109r040r15P175O652O56n640o284j109M844O115J529m789p936k123
495h485O642Q767J010q089r190j81R656Q628k415j0108o605L814R016M785m484
510B761q097l321L977O572L354l015o941l626K685P173M194k109q622n267M228
525f054R791M077n774r705k775P406R385P86q011p488M63P746O280j020o769m996
541f658R11N853N577R5n988n916J48O464O992K9p971o842J818Q866O167k461r255
558b171m999M603R059L198m787p314k397M953P178K300m835o365k084M169O971
573G479K699m150p026k483M607P427K647o093p542o67O780P327Np803o866J388
$$ y = [-5800, -5748, 2664, 9868, 7850, -1109, -8208, -4762, 5866, 11780, 5470, -5710, -9340, -2029, 8109, 10489, 2380, -6660, -7575, -400, 6252, 6908, 1268, -5016, -6125, -1281, 4834, 6363, 1574, -6362, -8485, -1843, 6924, 7934, -155, -9345, -9526, 130, 8758, 6343, -3765, -10370, -6556, 2460, 7245, 2761, -5336, -8657, -4680, 1892, 5246, 2231, -4710, -8336, -5651, 1522, 5716, 3607, -5015, -10282, -6054, 3737, 7814, 2040, -7665, -10440, -3034, 6351, 7137, -874, -8362, -7899, -153, 6127, 5107, -1662, -6658, -5747, 106, 5683, 5778, -210, -6126, -5978, 486, 7478, 7507, -464, -7306, -5488, 3378, 9545, 7084, -2171, -7170, -2567, 6492, 9690, 4903, -2411, -4808, 145, 7323, 9623, 4788, -1577, -3661, 508, 7479, 10178, 6028, -998, -3481, 1126, 8553, 11200, 5107, -2435, -3102, 3678, 11005, 11010, 3207, -3659, -2271]
589b271P946N721j680p132n125J843O865L994k003n688m156J575O174L871k339
604G595o768l934K373P699M963m354q378l781M187Q156K882n433p290j831N405
619A491O365J41n152n785j42N570M636R2m941n894q74N446O252O94o251o220o80
636e252O251O314j037o957n408K359P084M044l391p277l515L944O334L312l446
651C359o496l234L099N586K906k182n753l482L153O621K069m377o567j881N800
666a379O526J253o151o721o07N882O424J26n820m860L13M527M793n73m880m638
682e785J678N159M185j419o278m235J605O768M651j890o597m800K855O263L464
697E624k936n603k442L309O171J417m384n549j147M487N751J443m487n617j732
$$ y = [-2271, 5675, 11396, 9716, 2584, -2541, -698, 6167, 10161, 8158, 2470, -1686, -111, 6063, 9934, 7595, 827, -3107, -734, 6965, 11928, 7574, -804, -4585, -398, 7758, 10640, 5207, -2083, -3914, 1491, 7856, 7997, 2845, -2940, -3082, 2488, 7124, 7216, 2275, -3619, -4493, 953, 7205, 7899, 1648, -4572, -5252, 999, 7313, 6276, -681, -6089, -3730, 3354, 7398, 4007, -3270, -6785, -2841, 3493, 6805, 3359, -3137, -6371, -3272, 2314, 5220, 3038, -2715, -6197, -3044, 3577, 5646, 1269, -5298, -7179, -1379, 5147, 6400, 249, -6472, -7079, -1197, 5227, 5353, -467, -5327, -5014, -487, 4306, 3733, -1147, -5785, -4107, 1052, 5237, 3818, -2460, -6695, -5090, 1678, 6329, 4439, -2158, -6958, -4103, 2160, 5624, 2688, -2915, -5357, -2048, 4123, 5540, 1156, -4393, -5540, -1053, 4698, 6141, 1654, -3963, -5695]
712e695L913O102J347l955n629q19M350M849L56n224m754R12O171M300j713n924
728a413m555J364O498M280j661n446m144J571N230L191k035m450k664J958N347
743C071K480l317n695k379L864O009K546l787o549k384M156N898J721m086m799
758c251j000M202L954J36l956m387L79M659M872n34n071m896JN240N122r6n258
775A16m352Q53M880L798j838m947k557K461N264K302k709n743k399L381N796K299
791F605k498n745k866K936N255K237k688m781j197L358M444M72m327m217j61M721
807A548N104J30n239m520j49M485M529M60m458m279Q79L948L120j012m345l273
823c072K179N033K591j997n359l500K518N653K973k249m770l440K067M882K416
$$ y = [-5695, -1782, 4320, 5667, 1712, -3917, -4736, -386, 4463, 4819, -405, -5159, -4247, 1924, 6224, 4511, -1413, -5968, -4604, 1894, 6174, 4513, -933, -5077, -3506, 1724, 4915, 2880, -1570, -4234, -2276, 3071, 5551, 2234, -3461, -5840, -1976, 4033, 6579, 2792, -3757, -6141, -1985, 3913, 5634, 1548, -3251, -4251, -49, 3905, 4041, 85, -4302, -3923, 736, 5608, 5074, 3, -4893, -4892, 348, 5470, 5374, 116, -4236, -3383, 1497, 5295, 3457, -1490, -4047, -1586, 3678, 5980, 3271, -2472, -4871, -1490, 4306, 6605, 4107, -1638, -4504, -1568, 3687, 5924, 3236, -1545, -2742, 616, 5060, 5532, 1205, -3012, -3173, 1548, 6652, 6782, 1543, -2977, -3126, 1359, 5888, 6348, 1890, -2389, -1510, 2438, 5558, 4546, 201, -3072, -893, 4140, 6731, 4734, -625, -4125, -1607, 4046, 7019, 4770, 0, -3440, -1373, 3509, 5925]
838E925l065m158j381L429L725R99l918m577m32L800M777J099m238n222o92L353
854e76M344J050l697m032k39M036L327r91m313l366J323M949L327j721n278l520
870e377J368M967L336j594m170k892R97L976K323j816m301j572K824M230J268
885C567l367m783j576L641N081J379l284m881j345L097M115Q50k906l397l94L382
901h21L239l71m180l275N78M979L383n19m746m095J094M279L508n09m029k806
917d291J013L542K166j357m175j732K495M382J804k541m914k078K727N105K107
932D253k755m307j650K091M232J456k958l199l29K827L707l74l564l456L00L951
948B25L628L26m171l905K3L709L940n89l399k973Q96L499K150j374l672k130K052
$$ y = [5925, 2860, -1298, -2679, 750, 4475, 5474, 1556, -3021, -3453, 347, 5124, 6223, 1985, -3237, -3929, -576, 3768, 4818, 1121, -2911, -3150, 886, 4213, 3222, -1091, -4457, -3134, 1815, 5142, 3421, -1857, -5377, -4009, 958, 4294, 2700, -1470, -4362, -3365, 611, 2934, 1118, -3183, -4755, -1931, 2299, 3567, 200, -4583, -6159, -2518, 2563, 3942, 658, -4223, -5568, -2471, 1644, 2494, -412, -3809, -4203, -821, 2418, 2047, -2133, -5408, -4830, 149, 3532, 3013, -1733, -5828, -4734, -455, 3053, 2544, -1485, -4291, -3278, 264, 2430, 1073, -3102, -4834, -2339, 2043, 3847, 1306, -3608, -5686, -2959, 2146, 4253, 1498, -2809, -4459, -2368, 1864, 3320, 362, -2837, -3166, -339, 3368, 2994, -570, -4026, -3726, 225, 3853, 4179, 8, -3897, -3874, -165, 3775, 3186, -213, -3186, -2290, 1209, 3359, 1985, -1687, -3817, -1765]
965a765M290J925k027m491k076J819M388K333j971l818k020J991L788J087k574
980H79l264m36L230L004M88l448l833l40L565M020M51l555l696o83L619L243k90
997B954k617k695K38L307K417j162l859k125J487L980K840j996m010k766J483
1012b524L764K960j172m075k131J707L587J337k202l512p75K745L545N64k820
1027I98l983q69L446L513J034l143l071j195K898L368L0k927k536J47L190K923
1043C823j364l484k456J195L569K931j051m140k577R21L478K533o35l302k267
1058b826J594K869J609j565l627j360K558L639J075k577l565j414K671L342J287
1073C710k499k975q56J994K792Q43k865k694j8L399K574l97l489l060R46L384
$$ y = [-1765, 2525, 4450, 2423, -2068, -4144, -2325, 2063, 4396, 2425, -1393, -3413, -1422, 2366, 3453, 879, -2385, -2821, 409, 3413, 3901, 453, -3380, -3720, -155, 3865, 4316, 761, -2935, -3618, 1, 3244, 2954, 337, -2358, -2120, 1187, 3604, 2442, -1417, -3542, -2055, 1925, 4765, 2769, -1241, -4007, -2524, 1240, 4200, 3028, -1047, -3178, -1471, 2116, 3453, 1251, -2261, -3036, -291, 3254, 3818, 998, -2985, -3854, -408, 3105, 4139, 996, -2075, -3270, -372, 2996, 3026, 99, -2437, -2290, 900, 3823, 2459, -1025, -3481, -2286, 1283, 4214, 3163, -977, -3554, -2633, 845, 3378, 2743, -559, -2826, -1232, 1637, 3246, 1681, -1946, -3306, -748, 2891, 3966, 1389, -2176, -3590, -919, 2423, 3710, 1211, -1764, -2620, -626, 2166, 3009, 144, -2550, -2568, 831, 3405, 3008, -481, -3541, -2595, 789]
1089G89K694m04l204l178P74L418K103q26k932j608P96L092J804k262k987j274
1105c205J805L573J562k110l659j360J897L481J226j775k945j169K356K400M22
1120B499j925k681m79L007K727J2l034l198q7L570K940m20k559l033K06K848K553
1137B946q84k705j907J110K850J705j071l580j602J764L029J988j417l391j671
1152b836J397K881J478j456l036j019K036K181J006k063k904k93K632K883J18
1167C005k822k889k42K436L000L88k426k678k70K202K613k59k796k050R45K761
1183I18J831r44l196j645R80L204K052j364k904j942J164L114J301j284k721j180
1199b616J442K760Q07j990k623r27K362K945L92k066k961o09K422K492R18k354
$$ y = [789, 3483, 3079, -125, -3303, -2529, 889, 2992, 2166, -766, -2374, -1578, 1514, 3318, 1056, -1931, -3205, -1400, 2173, 3735, 1625, -2034, -3394, -1497, 1984, 3210, 1435, -1510, -2679, -323, 2077, 2499, 574, -2107, -2586, 421, 3148, 3160, 126, -3072, -3159, 411, 3351, 2931, 372, -2661, -2455, 393, 2946, 2062, -643, -2550, -1440, 1410, 3115, 2044, -1536, -3138, -1374, 1655, 3643, 2226, -1165, -2836, -1439, 1442, 2920, 1464, -1572, -2591, -555, 1626, 2632, 569, -2335, -2628, 4, 2887, 3005, 183, -2706, -2948, -512, 2488, 2876, 450, -2228, -2498, -296, 2317, 2058, -738, -2788, -1843, 918, 2749, 1805, -1391, -3036, -2056, 1148, 3200, 1836, -1068, -3010, -1846, 1268, 2569, 1285, -1436, -2616, -1174, 1586, 2393, 403, -2220, -3147, -785, 2160, 2552, 486, -2475, -3084, -662, 1830, 2748, 394]
1215C94k851N7K053K351J05k590k197Q72K419J840q62k155k375N22L188J957j028
1232A700k503j803Q04K603J672j242k485j193J139K953J210k162k632o90J835
1247g94K906P66j881k933n95J970K617M51j786k106m35J996K187J19k406k131
1263b055R4L075J725l79k576k053J17K480K592q35k553j516P18J929J950r56k253
1280d96j455J206K292J379j250k806r42J463K531J034j524k326j367J794K406
1295A939M97j381k408m64J842K147K45k166k197P9K228K171j85k356k112M52J900
1312B31K126j88k290j849N47J885J521l90k249j649P91K647J065o96k604j581
1328b683J400K495J146j241k460j232J506K458P85j657j984n42J388K090O79j866
$$ y = [394, -2457, -2400, -347, 2004, 2109, -481, -2678, -1806, 613, 2453, 1591, -564, -2939, -2417, 771, 2728, 1700, -803, -2606, -1802, 801, 2473, 1231, -1254, -2447, -1308, 1645, 2855, 693, -1939, -2629, -794, 2112, 2878, 997, -1936, -2531, -561, 2056, 2507, 721, -1385, -1820, 176, 2363, 2482, 76, -2055, -1961, 1114, 2839, 2460, -116, -2169, -2052, 428, 3020, 2185, -368, -1884, -1166, 763, 2713, 1757, -496, -1951, -745, 1547, 2926, 1676, -1130, -2072, -609, 1922, 2956, 1432, -894, -2261, -467, 1939, 2436, 1055, -1353, -1817, 25, 2172, 2417, 251, -1946, -1867, 361, 2532, 2347, -9, -2121, -1669, 231, 2357, 2169, -121, -1970, -1423, 462, 1983, 1593, -656, -2305, -1514, 1133, 2198, 1502, -1102, -2683, -1283, 1212, 2358, 1117, -1343, -2575, -1069, 1389, 2174, 517, -1467, -2009, -621, 1469, 2148, 282]
1344B82k373J12J577K086L65j949k140k29J972K064R1j898k224K79K340J246k85
1361A316k144j639O49K459J574p24k379j561O57K379J251o22k336j158R39K267
1377I28J348j485k319n58J147K286Q36j657k403m41J641K485J06j752j958l10
1393b106J885J952K24k155j651K60J548J875j10j949j629N7K051J831o22k193
1409g32j292P98J743J506o64k041j483R00K056J198j078j968r92J287J846P51
1425A835j127j954p69J307J781P92j570j544q31J274K382J86j464k224J24J491
1441c11K022J82j999j772P6J859J746m46j976j393M72J621J627k41k064j681P91
1458a487J817J615o67k059j144O84J890J062j005j935j053J299K075P05j400j589
$$ y = [282, -2091, -1979, -402, 1684, 2049, 100, -2040, -2269, -297, 1767, 1858, -40, -2264, -1985, 355, 1601, 1316, -828, -2467, -1818, 641, 2215, 1491, -888, -2449, -1792, 587, 1838, 1216, -1120, -2278, -1339, 928, 2276, 791, -1528, -2086, -939, 1347, 2183, 526, -1877, -2318, -677, 1808, 1914, 162, -1796, -2106, -221, 1731, 1955, -200, -1851, -1591, -43, 1832, 1722, -227, -1856, -1799, 252, 2083, 1461, -732, -2024, -1226, 517, 2023, 1359, -682, -2165, -1265, 791, 1989, 911, -1057, -2049, -762, 1084, 1835, 708, -1246, -2015, -708, 1073, 1865, 295, -1249, -2080, -806, 1576, 1762, 298, -1926, -1802, -311, 1711, 1893, -106, -1878, -1802, 57, 1803, 1357, -619, -2012, -1540, 81, 1708, 1467, -597, -2278, -1487, 330, 1945, 1278, -781, -1925, -1241, 649, 1711, 706, -1229, -2282, -983, 1092, 1797, 397, -1192]
1474a192p31J255J768N53j205k153j79J401J734N37j613j744j89J700J656K95
1490A893k195j501J82J935J348k17j752j352J70J988J298p86j653j132L27K227
1506G80J006o95k055q94Q61J834Q37r29j962n57J287J717P40j401j823l01J142
1523d13J463P40j233k052k00J331K158O8j746j541j81J871J432l58j393j421J42
1540a333J531J441l60j557j101J89J466J392m84j744r88O09J871R77j088j767
1556i46p70Q09J850P37q72j800q19J112J683N70j182j533o22J089J826L59j589
1573i8j310r5J417J444K39j585j612L09J327J220l13j230j235K32J549Q13j20
1590I52j536j071M22J415J172m89j692j252J069J778P57j074j504r24R42J601
$$ y = [-1192, -1923, -668, 1100, 1653, 448, -1705, -1884, -483, 1251, 1788, 175, -1569, -1758, -58, 1598, 1893, -302, -1803, -1621, 314, 1662, 1445, -307, -1659, -1489, 499, 1797, 1011, -642, -1774, -1447, 780, 1786, 1091, -964, -1858, -997, 837, 1674, 745, -1217, -1774, -487, 1230, 1970, 569, -1254, -1555, -413, 1050, 1790, 557, -1495, -1695, -364, 1794, 1862, 116, -1425, -1606, 265, 1697, 1339, -54, -1475, -1333, 198, 1639, 1279, -278, -1379, -1190, 276, 1668, 1184, -560, -1548, -939, 932, 1909, 821, -946, -1716, -907, 943, 1680, 808, -992, -1811, -699, 984, 1554, 372, -1161, -1783, -694, 1132, 1491, -98, -1408, -1503, -86, 1358, 1597, 12, -1600, -1291, 36, 1256, 943, -287, -1522, -1290, 259, 1072, 952, -584, -1655, -1233, 182, 1354, 865, -827, -2079, -1010, 768, 1525, 451, -1053, -1977, -1035, 566]
1606E66Q02j201j361k66O24J614M92j216j735j89R02J968K60j364j507k30J311
1623e30J304M33j599r68K2J345J140j36j468j231L48J774P89l30j535j008K04
1640a446J727J096n71j551p82N99J370O73o25j495o65Q35J491O35q85j413p81
1657a788J594J105O02j203j452m93J256J527J97j331j077l86J228J444j70j220
1673a67j332M10J290J080o3j409j257L65J515Q69kj508j060M30J177J268q40j463
1691f97n88R72J241O94r14j445o25Q66J390N40p48j735j86J064J263M68j225j074
1709g39k15J092J025M37j587j227M38J039J083J18j493j125n5J424J325k82j117
1726A41j431M67J385Q37j95j819n99O20J478R29r70j479p01P43J580L43l64j433
$$ y = [566, 1368, 167, -1194, -1460, -836, 778, 1270, 54, -1681, -1870, -968, 1000, 1260, -104, -1611, -1841, -530, 774, 1207, -392, -1360, -1338, 7, 1147, 1011, -457, -1688, -1340, 434, 1223, 893, -642, -1650, -1446, 281, 1377, 806, -745, -1527, -928, 442, 1115, 490, -1005, -1670, -835, 656, 1291, 406, -1007, -1788, -194, 911, 1513, 310, -1142, -1635, -379, 1148, 1345, 14, -1063, -1449, -221, 1223, 1053, -167, -1499, -1089, 201, 1281, 1218, -191, -1448, -1083, 432, 1301, 1299, -209, -1269, -839, 338, 1606, 766, -697, -1285, -313, 928, 1622, 708, -737, -1362, -496, 894, 1434, 686, -1049, -1235, -171, 1092, 1560, 335, -739, -954, 138, 1163, 1600, 13, -1214, -776, 263, 1346, 1464, -29, -1154, -1209, 215, 1540, 1258, 141, -1290, -823, 562, 1399, 1204, -615, -1214, -594, 884, 1813, 843, -636, -1337, -594, 986, 1329, 965, -468]
1744d68n36P87J032N77r20j019n55J078J165L16r60j592J1J236J191k29o60j276
1762h22k41Q66J237j29r02q48k5J242P97l70j222p91L29J375Q66n96j327q65O64
1781g62R99J111o23j581k90Q37Q64N12l53j696l68Q25J388J83r03j207l06Q74
1799d96J435Nq70r80m32R99J139J66j245q24m3J208Q28m23j006o71P1J073J051
1818I85j44j345q71M35J177P64n14r69r02M81J277M46m61j072o42Q01J501J66
1836A113j046j181j92O73J205N22j209q30j18N14J279K12q77j050K11M94J242
1853I62Q6j125j030J29J306O80j55r59r96M3J240O68M4j085p27N84P17O62m43
1872F01r99n31N83R74N84p69j138l16Q13J005N83q26r44o67R84Q47N95r02j001
$$ y = [-468, -1004, -217, 815, 1392, 472, -547, -1102, -24, 1141, 1457, 497, -1095, -1084, 152, 1343, 1114, 454, -822, -1063, -197, 1040, 911, 9, -839, -864, 378, 1175, 805, -417, -1208, -879, 496, 1362, 766, -561, -1426, -762, 237, 1348, 725, -856, -1146, -309, 555, 1067, 714, -982, -1350, -525, 863, 1046, 143, -1064, -1370, -496, 939, 944, 74, -906, -1338, -339, 800, 966, -279, -1103, -1146, 62, 890, 467, -539, -1210, -1139, -66, 985, 841, -504, -1375, -940, 237, 1001, 487, -482, -1384, -903, 374, 820, 359, -713, -1355, -554, 947, 1113, 67, -1114, -1306, -633, 572, 1094, -115, -945, -1063, -549, 730, 942, 65, -985, -774, -280, 962, 1048, -77, -1107, -978, 328, 1008, 853, -106, -1102, -1059, 181, 849, 893, -192, -919, -335, 382, 1044, 601, -398, -929, -346, 628, 1212, 443, -695, -1011, -198, 807, 1390, 564, -380, -1047, -63, 784, 1379, 477, -524]
1891e24k72R22Q73j2r43n93l98J178J048j3r61j060J11R07J059l39p43q16L15
1910b61R59N45n34r33m69L91Q99P03o58r45n70O63R00P45p48r82m63O12R26N37
1930A317j002p81j91O64J094n0m91j223j26O77R33J98p10r41J03M64Q57J76q98
1949G0p28J20Q88O17o9j166o68L50J087P42n92p94q20L85J045J93k19o71m74L79
1969c25Q18N46n96r79m28Q50Q40K82o42r10j91M4J396L98j037q63l79J082P38
1988F44K21q74r14J78O60R32J7j300n42L10P28P86l55o36o95K97N10O13l6j283
2008g39j91J23R99O49n20q57m18P60O30O07p12j191j20P32P76J91o29p74k10O84
2028b10Q88J70p97n85l96P02R09L56q92r55k5Q66Q24J27r76o50J50Q33N58l41
$$ y = [-524, -796, 126, 999, 987, 44, -549, -947, 231, 1279, 1266, 305, -755, -644, 263, 1322, 983, 240, -576, -261, 698, 1243, 709, -224, -693, -302, 597, 1300, 642, -303, -873, -210, 690, 1435, 687, -295, -758, -146, 780, 1317, 315, -466, -657, 7, 1101, 1051, 560, -663, -789, -112, 821, 1019, 309, -632, -529, -65, 792, 968, 70, -658, -538, 350, 967, 898, -268, -936, -586, 501, 1243, 651, -143, -963, -578, 467, 660, 441, -230, -704, -325, 493, 1039, 443, -536, -964, -114, 726, 1008, 366, -544, -735, -691, 705, 1103, 66, -797, -1176, -94, 644, 865, -9, -923, -745, -85, 847, 864, -436, -978, -668, 60, 846, 491, -145, -840, -543, -33, 580, 544, -739, -930, -807, 192, 841, 321, -536, -954, -194, 436, 1043, 331, -860, -980, -248, 528, 719, 90, -684, -894, -210, 678, 848, 51, -534, -930, -228, 681, 1037, 145, -810, -835, 31, 855, 982, 6, -644, -494, 339, 897, 556]
2048E56r17o63N86P81M36k28j093l38O83O98M26k59j001p09Q35O69O31n97q67
2067c71k54N77R13K2m68o60l21N50R96k45m59o79m06O81R10K50p90o40k02P93
2087A97P15j76p25n60L01O72N88n09m83o74J83Q99L95l43p33k90K75R45L55q79
2107A53l15m28L76Q12K6m50n64k51O90N06M50p71p42k00N66R18p3l23r75K44O31
2128B80K13J68m51j009M37P26M13j65o42n70k8J115K51k31n36n71L88P46J17k40
2148D11n67k62J41O80M70m57r37l29O66R99J87p67p11q6N92O37J75m03o64k49
2168d74M84M74J45o78k38l40R28N54Q3r02o64k0O03Q05M0q26m16J32R65J51l24
2189D82r34o7K27P08N24n12q24N4n8R89K04l90l02p57M20Q47j5k77q27m0L89Q86
$$ y = [556, -361, -1024, -438, 343, 779, 551, -542, -880, -197, 501, 927, 668, -333, -1042, -207, 462, 1093, 496, -371, -625, -48, 865, 887, 419, -241, -562, -12, 984, 739, 280, -399, -805, -124, 786, 1036, 246, -394, -596, 197, 912, 736, 11, -549, -248, 424, 1012, 503, 20, -654, -471, 428, 823, 480, -253, -543, -268, 677, 1032, 153, -162, -590, -214, 598, 624, 174, -390, -641, 49, 555, 1005, 234, -508, -708, -142, 776, 703, 380, -595, -351, 280, 493, 661, 210, -799, -362, 364, 777, 612, -30, -600, -628, 487, 738, 507, -29, -600, -212, 534, 651, 411, -156, -418, -277, 403, 873, 416, -521, -850, -184, 815, 1002, 235, -476, -562, 30, 667, 842, 439, -225, -474, 10, 484, 629, -49, -287, -627, 301, 855, 938, 36, -628, -648, -45, 760, 800, -26, -442, -310, 655, 806, 482, -452, -519, -292, 416, 940, 428, -396, -342, -400, 589, 793, 403, 101, -656, -236, 611, 596, 319, -508, -548, -159, 727]
2211G27K6p87o35M6J276J68l59m25n45J79L55M86J29o77m54j32P98N08l28k33
2231A23q61O9J121j16K95q68l19N5R23J48m68p21P4L37K99L78l90m27o3K00M89
2252B78J30m63m27l01Q87p3O14m52p98l9N11M28k79k9o94Q1J032J1kq95k72M22
2274c30O19m4j3m30m28J7Q33K34j17o89k60J8P72N62m18n60n00M95K79N14k63
2295B91q05j02M54Q82J75q61o41K01K55N85K23o81l73QL65M23J29k14n72j51M24
2316A5O23J08o56l17M7O05J90k11m84r1l3M85L53m36l00k44N28K64k2j00n22j36
2338c34L64N38k05J27l90n38L28O91M32p20o50K2M43N64j17n49l81J42M66J42
2358C75J04l36n63K06K2M98K28l33o54K59J41R46m49p2o53R4M42N02j77j002k64
$$ y = [727, 753, -34, -669, -623, 653, 821, 462, 37, -508, -329, 26, 512, 641, -36, -490, -622, 176, 684, 356, 123, -738, -669, 452, 336, 631, -237, -556, -501, 422, 570, 102, -619, -545, -208, 91, 469, 79, -348, -411, -211, 278, 408, -55, -482, -783, 104, 31, 645, 193, -605, -644, -133, 295, 16, -13, -707, -626, 406, 417, 415, -480, -752, -330, 289, 245, 232, -198, -626, -609, 224, 458, 341, -348, -608, -590, 182, 744, 326, -234, -734, -239, 40, 554, 291, -514, -616, -162, 720, 895, 34, -607, -406, -151, 434, 657, -24, -397, -389, -24, 399, 528, 314, -258, -409, 15, 638, 746, 90, -227, -180, 425, 615, 404, -80, -171, -204, 281, 634, 198, -102, -346, 182, 446, 424, 324, -198, -334, 30, 568, 363, 490, 100, -438, -110, 581, 1013, 293, -357, -335, 108, 672, 555, 6, -375, -233, 233, 375, 479, 143, -420, -214, -192, 306, 534, 201, -453, -194, -53, 893, 444, 372, -281, -187, 255, 757, 580, -422, -686]
2379f86M60N94K65n35n77Q4J73M65n0K2m08j51p7O17K26m33k52k73M06L64P4m18
2401a10k51j65K46R66l82m01m56P9N31L50K0o81j70J59L95J97q2j49p00J54L81
2422f9J68K19l36n36K74N88J07l80j63m16K67N44J76k59q00n1M54M67j42n0j23
2443f1R2p4J94N21n06m26l87L90O02j9n40l69K32L46M83l32l21r4K9N24J39j30
2465B93l73l69M81l6M05j64m08j29jM11J04l3k47l95K09M55L58j45o19j95M35
2486C7M71J97m56m94j66M99K68Q7l22m00O3J33L22J46j97l44PJ15K93J82k49l02
2508a10l38N06M88j85l63o25L32M78L23m70k03j39L53M14m22j37q7o6p4M64J25
2529B64j00j70m55J13M10K73l07l71j83M61K77J40k53k44k87O35K98l89k5k09
$$ y = [-686, -226, 368, 633, 98, -479, -395, -222, 243, 193, 215, -193, -344, -421, 196, 422, -11, -263, -536, -130, 234, 308, -110, -361, -526, -280, 686, 304, -97, -553, -474, 57, 407, 427, -254, -424, -265, 130, 327, 245, 96, -604, -450, -69, 99, 318, -18, -554, -280, 308, 415, 35, -128, -544, -277, 267, 443, 184, -616, -667, -213, 254, 112, 62, -61, 31, -43, 151, 672, 166, -260, -647, -257, 345, 326, -214, -583, -351, -5, 478, 146, -175, -269, -240, 284, 423, 293, -80, -449, 32, -4, 401, 237, -171, -300, -301, 110, 214, 181, -66, -461, -252, 203, 561, 416, -203, -398, 37, 508, 705, 249, -245, -411, 88, 356, 443, 121, -279, -216, -83, 239, 385, 188, -156, -149, -34, 259, 441, 192, -110, -448, 58, 546, 361, -2, -627, -295, 183, 506, 36, -167, -306, 47, 461, 39, -98, -185, -251, -325, 139, 264, 164, -6, -461, -348, 62, 335, 28, -343, -526, -65, 212, 352, 99, -145, -432, 203, 501, 112, 87, -122]
2549a22k83P71j58J03m06J21l65J77L79K51l52o85L10J41M50R3n43n24L97O3M28
2570B46M6n50m3K34K79k6J3n30l3Q0M58O5l33o4Q5N0J44L31m71j89j12J19O32
2593D31p4n74j72M8M03M16k29m46n5j04N94J31o4k99j56j00K52J22P0m17K0j41
2615c44K67N13j45m42k93K70J91Q8q0k41j16K65N87k25k77p4l71N28K55k51P6
2636A81m71J02J19l6K36J65o82JL13K37M21m53n41k1L43P44m87k78j37rM06J41
2658B94l43k87L1K40J87O1J4l7m28n8O03L1r2m08j20J70K46K45k02l70K7j7O43
2681D30K2l91k96J0K51K55n7l74q4j41L83O5L97m25k93J72J07L79J0n00j15M1
2703a54J48L57r6j01l31P3J92M92l37l64j22K1J48O2K17l18R3K45k51M60k08m93
$$ y = [-122, -405, 366, 208, 311, -95, 26, -339, -162, 217, 468, 116, -569, -259, -118, 332, 425, -118, -642, -245, -182, 246, 292, -258, -301, -67, 212, 186, 199, -331, -364, -284, 174, 239, -94, -158, -73, -23, 121, 452, -19, -208, -320, -201, 431, 357, -217, -389, -341, 62, 478, 249, -197, -252, -356, 238, 369, 305, 6, -150, -250, 2, 124, 194, -223, -203, -344, -77, 436, 291, -151, -444, -174, 17, 105, 25, -216, -332, -67, 520, 295, 18, -56, -427, 101, 356, 105, 181, -290, -188, -69, -105, 131, 296, -386, -385, -72, 165, 586, 133, -408, -429, -86, 658, 171, -107, -244, -253, 153, 294, -49, -336, -305, -65, 122, 183, 197, 160, -268, -326, 277, 308, 216, -192, -312, -142, 104, 349, 147, -223, -196, -213, 430, 452, 61, -235, -225, 26, 281, 224, -150, -234, -375, 8, 73, 470, 45, -248, -76, 31, 410, 420, -80, -195, -154, -6, 351, 255, 154, -177, -104, 88, 580, 243, -121, -243, -222, -74, -12, 205, -113, -20, 225, -26, 434, 226, -267]
2725b67l2J38M94K19k61n56l19O78K14M8l08k02j58N31P7l9l52O9j81K46K25j25
2747A39k53J58n4j13N72m0l25o39M18L1M77k77k96k92L68L33M9q7k41k37M21J07
2769B19q0J02n84L64mL6J09q7j31l02K39L39J47l62k52n0J22L91L18p30M7j86
2791c35M03J87j77j10k82J07L19J70k84J15l30q6M15j9L7k98j06l0M75N3k03l6
2813a5l73Q4N94N0l53j46p2M62k51K11j89l64J07K07M23k3m45j22j20L44J88M1
2835B38n03j83K4L45K27O7k74n10L23L69K35k02l22j71J77K49J3r2j31m11M66
2856f6L67j86j16j53j72J76J77J75m7l63r2L20K3RK3l37M4L14L69k09m03k79M08
2879a8R5J78r2P2k18o8J37L02m88R4k75K16L38j70J42j70j89k95L97L63k9m68
$$ y = [-267, -299, -161, 333, 552, 291, -265, -584, 94, 308, 356, 48, -154, -312, 219, 296, 257, -95, -26, -207, 39, 264, 139, -114, 44, -10, -123, 449, 409, 84, -555, -137, -106, 371, 94, -202, -494, -126, 207, 256, 169, -72, -309, 112, 219, 139, 241, -343, 21, 17, 53, 162, 75, -56, -358, -119, 220, 367, 5, -247, -297, -175, 216, 534, -196, -149, -335, 68, 255, 78, -32, -314, -207, 112, 282, -2, 113, -217, -303, 112, 93, 130, -168, -274, -304, 171, 224, 21, -15, -388, -304, 290, 340, -13, -159, -231, 231, -20, 191, 2, -362, -255, -48, 375, 352, -93, -215, -335, 9, 197, 238, -265, -448, -424, -79, 148, 215, -59, -569, -246, 123, 358, 156, -166, -337, -160, 89, 102, 10, -121, -532, -66, 301, 115, -1, -154, -326, -150, 27, 202, 155, -208, -300, 20, 43, 52, 75, -262, -218, 96, 465, 256, -147, -426, -18, 77, 255, 163, 235, 17, -51, 86, 388, -100, -6, -281, -65, 273, 103, 245, 75, -114, -409, -12, 351, 322, -146]
2901a46P7J24M15j84k00r1j92O4L61k47J04l6m07K00K67J54m58N0J3K1L58K98
2923E45n82j96k7L47L75q5n30j41L63n9K11O9l31jJ45pJ60L3m08K5j09Q0N18j5
2947C80l72n86M10L70L59l32l97j94K77M14j0l77j21j5m4L57j49J3m23M3K73M80
2969C56k29j94j82j11M22m0J01l46j97M03K12p2Q4k28l13J86K3M78l62k42P4J04
2991g3J46K64k01m82k5L87L63j56o8k25k43K65L43J28j76l11j16K71J35N0o1m30
3013b15rK64J48P9k67l11P3M03J86j2l61k13j72N75L5m9j42l37K69M8L95j46k56
3036a5k57P3K80J43j84n1j88k5K18J33k06j93J63K12R6l8P8k73k10J12L26k4J08
3059B78m30M0p9K65j02q7k53K76J15K19l08J13l85j16K43N9K06k48J32k20J47
$$ y = [-146, -69, 55, 470, 286, 86, -5, -197, -133, 228, -19, 85, 49, -358, -158, 109, 263, -195, -145, -132, -111, 247, 545, -37, -233, -260, 87, 462, 377, -153, -294, 69, 10, 221, 290, -41, -42, 103, 96, 256, 289, -119, -94, -203, -123, 395, 380, 8, -578, -168, 202, 561, 229, -168, -362, -85, 329, 319, -58, -179, -194, -238, 119, -30, -17, -440, -397, -124, 356, 127, -67, -249, -360, 62, 22, 123, -223, -420, -17, 195, 123, 207, -21, -334, -148, -125, 353, -9, -251, -177, -73, 73, 337, 136, -346, -371, 16, 379, 223, 155, -70, -313, -48, 295, 423, 247, -64, -180, 91, 226, 276, 215, -215, -224, 40, 188, 267, 0, -311, -238, 165, 351, 339, -22, -235, -407, 168, 203, 154, 12, -325, -56, -8, 387, 241, -15, -272, -199, 81, 224, 40, -11, -199, -224, -6, 127, -79, -272, -109, 103, 199, 161, 239, -34, -244, -132, 194, 170, 278, -152, -112, -191, 74, -28, -115, -368, -92, 23, 242, -66, 47, -338, -454, -211, -152, 54, -194, -62, -282, -135]
3080a35J61J86j79k68J95l8L14l91k68J2J30K41K4J1k31r1J29R9J67o7k31r8J3
3103c15L96J35j51m52K32J79q6O3k56q4J22OK89nj31q5j52K10M65j82m98j49M14
3126c5J23K00j99n3j1j43K52j2o1j02J8q6J84K4K34l16j93N9M50n9k92k25J70
3149g3K4M02j93j6l32JL5L00J50k62j97kN0K28K05j75k53m3j1J70K61j95j10j34
3173a70L35j54K56k19l29K04m1K65L5j74j46Q2R0L87k91K01o77K08J39K03j21
3194H3j86j74K64L68j05k82j66o3L12K28j14j89j83j3K14L97k03nl25P9m3N3K70
3217B17j87j04j11L65N4j68n5nk23J55J98j52j42J21j61J59LJ85j53k35K10K74
3239B45l4k88r2L06j93J24J79j55j98q8J74P5J35Ok47l85K58K89k4O8n61K32J57
$$ y = [-135, 26, 212, 33, -235, -40, -78, 236, -155, -423, -411, -281, -40, -16, -5, -236, -327, -198, -99, 68, 1, -230, -328, -315, 81, 216, 65, -387, -155, 24, -62, 1, -255, -339, -217, -211, 78, 73, -58, -143, -295, -85, 380, 198, -300, -449, -35, 88, 288, 89, 36, 25, -118, 134, 122, 61, -41, -23, -109, 75, 99, 333, 17, -176, -117, 333, 274, -18, -243, -73, -49, 353, 160, 144, -188, -187, -152, 148, 298, 36, -161, -163, -113, 115, 320, 145, -108, -151, -162, 8, 269, 74, -36, -170, 165, 11, 267, 48, -281, -77, -118, 147, 182, 8, -138, -56, 34, 421, 130, 331, -346, -138, 1, 204, 83, -103, -277, -13, 355, 250, -32, -198, -261, 51, 279, 165, -24, -207, -220, -6, 391, 188, 183, -142, -63, -106, -53, 217, 30, -74, -185, 180, 234, 66, 11, 6, -217, -62, 136, -16, -158, -37, -198, -39, -36, 149, -4, -239, -29, 245, 211, -77, -169, 137, -56, 68, 247, 92, -106, -194, -20, 55, 190, 196, -51, -436, -178, 111, 87, 155, -406, -174, -17]
3262a7J87k87pP1o7J02K89l66K64n3j14N1OK8p9k87J71K16j36Q3m26J71J61L01
3286B62rl62j45K18j14L85k9j39k59j30J53K96L70m36n4j29K7L04j86qj81N1J88
3309G3M2m7K36m40n4Q8L76n9l69O3K32o3M5k14j53J92j37K07q0R1k1l71L88J40
3333A65q2r6k19j51M81J76k06K20m15Q2l9L22O8n30j25K92p3M09%j90k20j56M96
3356B09J4nk30R6k05K18M5M5m92JK8K21J83N4m01K03j67Q0M16l79J6l66M46J74
3380B04j16k8L0l31K03L96j1j75l81m58N66K00p8k48J44K3r6K45j67k1M7l33L91
3403FL5L00k07j70j45L75L1j70O6l05K90l11J45J92j32j91L2L44Km3k54j31K02
3426c9J39K18k69l36L9J40M50k92J02k95J0J18Q0p3J32l24k26O28Q2P6j96k69
$$ y = [-17, 170, -117, -124, -53, -120, -18, 271, -95, 169, 116, 2, 53, 59, 87, 8, -279, -108, 108, -28, 55, -371, -200, -39, 262, 253, -109, -254, -36, -150, 235, 206, 67, -192, -322, -169, 127, 497, 61, 7, -122, -95, 209, 23, 15, -166, -115, 73, 115, 68, 304, -136, -190, -102, 274, 215, -154, -91, 141, 78, 123, -91, -244, -52, -189, 18, -62, 29, 8, -363, 25, 165, 83, -13, -232, -383, 98, 274, 68, 288, -127, -45, -84, 238, 306, -224, -349, -57, -130, 279, 279, 89, -131, -287, 209, 223, 218, -12, 84, -121, 97, 142, 187, -305, -304, -276, -55, 128, 182, -219, -16, -183, -103, 313, -66, -50, -416, 30, 204, 88, 60, 90, -241, -38, 358, 347, 172, -209, -667, -101, 99, 21, -227, -83, -60, -156, 89, -78, -99, -52, -385, 6, 41, 341, 134, -36, -181, 194, 225, 55, 121, -184, 106, -205, -60, 132, 0, -191, -159, 185, 187, 144, -110, -241, -39, 100, 318, 49, -287, -248, -108, 342, 50, 152, -143, -133, -15, 65, -8, 124, -200, -426, 202, 284, 360, 164, -105]
3448a05k13K38M26j96k43l71L70L76P1j46j59p0P2J76J55j17j42l42o9O35j19
3469B27Ml11J3J21K03O8p9l49m39N12K08n9O0j76k1J49J57j02j5j43j01K20o3
3492H4L36j84k38k27L25J71k28K1Q7k23j3L37k99Q8l89K7K46J55j99L39k00j36
3514a20K98r2jo2m67M26J89J14o5l30k45K85N3NJ19j31J26pR3K84o06j37J99N3
3538a9J80J19k89p9k52M59k62K40j90k30L37j89L90n8l38r0o3J85K24j78K7k04
3560b80o4N59L1k93j66K36J28M9J2k42q0j63L44m2M20l38j17j18K08K7K7J09k02
3583D5J7r5M64k23p2n60L03J68L17L3m39nj64J29K35k21j08l3k5L18K47m6o75
3606c90M49j18K55J29k66j25j60K34J54j01J36q4l51J6L55R6n1k53LR9R2P8k20
$$ y = [-105, -318, -80, 346, 150, -93, -464, -94, 282, 353, 207, 48, -22, 50, 226, 381, 264, 122, -220, -289, 346, 227, 231, -80, -67, 54, 257, 325, 246, -103, -542, -30, 178, 119, 179, 3, -18, 131, 288, 186, 171, 28, -73, 147, 84, 420, 236, -2, -229, 96, 267, 39, 60, 147, -76, -89, 248, -51, 37, -352, -325, -79, 76, -123, 216, 16, -120, 178, 86, 85, 23, -444, -18, 171, 285, 220, -110, -355, -70, -17, -12, 107, -24, 102, 95, 188, 472, -134, -271, -72, -19, 161, 280, -9, -88, -340, 119, -143, 97, -93, -323, 14, -175, 215, 157, -181, -271, -334, -149, 75, -103, -76, -280, -344, 215, 246, -47, -213, 23, 151, 200, 212, -30, -110, -273, 71, 29, 449, 111, -6, -124, 84, 111, 138, 247, 45, 62, -33, 431, 208, 136, -424, -121, 47, 364, 397, -42, -47, -211, -82, 153, -68, -176, -209, -234, 84, 331, 285, -390, 59, -59, 196, 325, 59, -66, -226, 8, 162, 61, 197, 113, -238, -222, 133, 229, 178, -75, -72, 27, 119, 197, -23]
3629b3j57M5J95o7j41L71m64K9L92J09J2k56j22QL81k77K49j27l10R4K40J66k42
3652A05k53m9M47o3J11j58k91j86J06N49m70Q1k35J16k3L55J31o0l54k84O03P2
3674B50o3k21k22j38N63j72J14k44j34K97j46K73r7J6n39K74L50r3L9o0k38J71
3696b0M3P8J19l76j84M30J39k9Km03j7o1L25K71j74n5j86q3L27M6j26l51Q4k3
3720b24L42Qk35%P3K43M8K2j94l32j43O82K5p2k38j32j23M15P7j60j63l7J78R9
3744A59k31J00n6k43K17J59K12j85l68J10%M53l43K62n89O2L72K14k76J2k23J6
3766a66J05N10j29k21j54l15M74n2K33k91m40K01J76K02O8k21k28J28J24K22l65
3787a39J04p4L7Q4K03j49m17K29N0L89j77j32k7j83K36K03o4k71O9k09N5L91k03
$$ y = [-23, -180, -135, 60, -7, -148, 223, -241, -212, 180, 289, 301, 45, -77, -69, 312, 35, 284, 157, -153, -59, 181, 347, 105, -148, -197, 250, 187, 298, 140, -151, -337, -231, 318, -152, -71, -306, -190, -213, 142, 273, 213, -141, -425, 178, 250, 187, -34, -256, -394, 169, -3, 111, -133, -267, 30, -116, 157, 60, 76, -463, -189, 161, 68, 107, 47, -191, -20, 23, 101, 220, -156, -340, 90, 229, 200, 202, -201, -218, -279, 46, 317, 143, 88, -98, -181, 146, 192, 66, -285, -201, -224, 118, 126, -109, -109, -36, 207, 255, 277, 83, -249, -392, 290, 315, 243, 5, -127, -250, 165, 242, 82, -81, -118, 60, 159, -72, 28, -28, -271, -54, 105, 317, 132, -236, -126, -126, 327, -16, 246, -343, -281, 91, 305, 29, 41, -182, -166, -61, 449, 320, 99, -55, -370, 104, 52, 285, -6, -446, -245, -69, 133, 201, -20, -248, -120, 4, 226, -139, -35, -109, -72, 12, 215, 66, -351, -122, -72, 317, 140, 8, -19, -202, 34, 237, 173, -98, -29, -238, -183, 208, 5]
3810Ek7k15K3p1K47J86l1m56j23L19J43J41p1m39J0L46J44M6k09j05L4J01J75
3833A73J12o07K06J55J7K16m02m7R0M8O1p0l5j5j51J80J78J38l65J06j78J71K19
3856B00l45M08k35p2J6L2J84j05j71k53M13J55r7k78K48j50q4J58o0p5M1j24L30
3879A36k4N0k91nn9J64Q2J37k71k54J06L86L7l05k02J77K77j42Q8J8l22J34K11
3902A28j11L18m04mn6J75J37k2m28n9K67j79M04%l02L69l67L42J03k60rN9l50
3925b49L36J46Oj10k69J59R7j68L18o22J37K43N9O6N6k74Jn8J96j55r6l3P6J41
3949CJ41j92J34l27J79M0K17j29m8ql01J18L08J72k48o0m9J99Q6k01P5n7J07l7
3973A22P0r4k88j25M27l7L22m55j00J24M5L3L1M3j77o5J87J3N0k9r6j24N5K89
$$ y = [5, -22, -237, -214, -285, -38, 148, 117, -339, -462, -143, 0, 141, 70, -369, -359, -13, 131, 177, -32, -137, -103, -2, 173, 285, -322, -116, 39, 56, 272, -130, -177, -87, -39, 22, -48, -83, -98, -249, -69, 109, 247, -118, -12, -190, -19, 200, -145, 263, 28, -44, -28, 4, 188, 83, -88, -341, 72, 227, 130, -148, 100, -50, -134, 24, -36, -111, -70, -194, 136, 112, 162, -129, -134, -193, -29, 53, 190, -81, -335, -229, 157, 194, -111, -313, -136, 141, -1, 87, 105, -217, -83, 128, 17, 335, -69, -73, -129, 46, 183, 161, -267, -326, -59, -238, 166, 166, -136, 233, -134, 208, 311, 51, 42, 101, -249, 87, 233, 239, 129, -140, 19, 116, -52, 266, -356, -219, 24, 83, 149, 205, -69, -68, -126, 70, -85, -181, -214, -138, 3, 144, -48, 86, -241, -62, -22, 195, 66, 18, 10, -291, -173, 135, 307, 59, -1, -50, 149, 235, 34, 109, 52, 159, 122, 192, 98, -190, -315, 112, 75, 397, -58, -158, -34, 11, 44, 75, 118, -59, -124, 63, 76, 126, 97, 1, -123, -68, 221]
3997B21M5k25j49n6J47Q2k29P9p8K02j00J52N5l51M4j50M48K4j45N7j50P9K15
4020B17j13R0l98J93q2K07J33l7j64j11J78J33k17j37m8R4J50p8K01k44j33k8
4042a94l5L37L9k20l54M20K01m1J33l49k15K59K03k76N2j05j26J75K55l7Ok58
4064a30O3j1J77j14j63q4J27J55l1K01k81J04R5l41M41q5Rl83J68Q9rJ99k90n3
4088a47K2L46p3M6k13k44N7J98L50o6l59J10J08l8R4k68Jk55K56N9J32n7o8j31
4112a40M2L31r1l88K00j29j61N18L4m32J53j36K68N2J93k82j44K60J76k87J69
4133B06l98J55j28J54L47k76R8k40l3PQ1K76k76j9K4L3Q7j3k52N3K08k51K69k92
4157a80%J04K75j17Ml9j11k26J63J98M7J32k40k14J34M4J46j05k12J4J81M5n0
$$ y = [221, 266, 41, -108, -164, -17, 65, -164, -85, -163, 39, -61, 91, 146, -205, -161, -311, 137, 161, 16, 73, -77, 2, 217, 104, 194, -204, -11, -93, 114, 247, 210, 46, -65, 113, 246, 29, -108, -156, -62, 88, 10, 211, -33, -166, -194, -229, 108, 147, -73, -427, -7, 194, 153, 286, -63, -278, -19, 184, -92, -40, -145, -271, -96, 159, 122, 128, -130, -67, -78, 99, -15, -178, -262, -135, 20, -11, 190, -91, 13, 108, -233, 208, 123, 132, -251, -83, 6, -3, 196, -94, -147, -125, 221, 148, 194, -19, -263, -206, -8, 342, 276, -83, 27, 135, 97, 191, -77, -76, -331, -75, -16, 116, 59, -9, -140, -98, 233, 142, -246, -46, -175, -336, 182, 216, -216, -63, -199, 69, 121, 314, 32, -112, 148, 324, 37, 206, -192, -37, -165, -11, 336, 60, 158, -82, -115, -108, -27, 249, -27, -46, -22, 11, 98, 85, -167, -114, 94, -157, 112, -180, -180, -76, 199, 82, 86, 47, -64, -290, -127, 71, 118, 250, 10, -204, -70, -26, 120, 15, -197, -183, -2, 43, -7]
4180gn5r6Q6R3J71p4k24j08J67R2J84j75k36N0J27j10K80k21j66K07j99J50N5
4203iJ76j99k3j01J86M9m6j63j2kO7K11j84k2jR0Mo6l6r0l1J77M3Q0j42j49M9
4230a44L20J00j40r9m7k02L12M6j6l08k3J74m1j40M64k03j16L05J81l45J11j82
4252Gj30K74j20J18l50L16J07l86M79J5l62j16L4L2J31K45k90j34q3Q7J5J10J61
4275A60k07j07J4K12R8j09j65K4K92Rl20K4k74L09j62K75j29M0l40K59J52m10
4297c55L68k04N7K74L5j42J73l47L0J25R7k22jm8Nn0K64ro9j33J59J02K8k56J03
4322a6J5l22K48J3M3Jj13K00n0R3j28Rk9NK12j46j11j1K8K38N7j17m1k89j81K83
4348a09R0J95k25j49K23Jk20L17J13l17k57O22j44j70K30m38L15l4k4n5L67m63
$$ y = [-7, -62, -158, -72, 21, 192, 118, -106, -214, -47, 45, 229, 54, -182, -132, -5, -115, 165, -56, -222, -15, -214, -64, -9, 167, -32, -55, -156, 30, 79, 33, -130, -142, -144, -77, 134, -50, -72, -73, 17, 21, -45, -81, -171, -202, -25, 18, 98, -44, -193, -144, 176, 276, 136, 37, -10, -212, 100, 146, 130, -178, -201, -27, -68, -208, 256, 53, -63, 242, 423, 78, 189, 7, -123, 151, 31, 149, -201, 115, 222, -164, 315, 330, -32, -148, -114, -82, 49, 294, 4, -130, -213, -126, -111, -1, 160, -47, -154, -140, 72, 170, 61, -104, -80, 212, 221, -99, -75, -349, -40, -202, 73, -56, -16, -356, -97, 55, -355, 13, -191, -134, 140, 175, 33, 206, -141, -111, 14, 111, -111, -112, -160, -155, -205, 59, 50, -19, -152, 7, 109, 137, -119, -16, -1, -323, -75, -62, -19, -18, -131, 69, 19, 112, -16, -7, -36, -31, 181, 35, -76, -87, -59, 179, 236, 119, 78, -211, -392, -109, -19, 176, -49, -198, 25, 26, -194, 123, 236, -81, -338, 284, 140, -30, 200, -238, 77, 43, 19, -36, 331, -132]
4370a32LJJ77O6j37p1j3J2K87j49k66J05J87r8J82j22l08J90J50m4r7J10l36K26
4394g7k7L90n57L31k05n4NL97l9k87K18j60J35J94m45L05qj13L24n4k10q3j5j75
4418b10K17Q9j83k21K39oN8L19k05j85k13J02M98j63k04Pj16J71M2L3O0j45o4
4441h0J60r5j95J55j49K38J09k4J06j33r9k15R6J63R3N4m38m2N17l95M96l70k00
4464b48K00k14M26L73n88j14J1M28m91M49l97J21J61j33J63k83j00P8K94n7K45
4485C24m98J11j81K6K39J87k27j8m8J65nl9J26l92J32J0N1J15l57LJ41P2M31k54
4509A14l66L7QK09K21m74J05Q7N9j43J91Q2K0l76J84k32O61n28Q2p6L9K53o9k73
4533a85%k3L37J81r1j70j97K09O8pj24r0n2K12r0M41m99p0r9J15L58O8j87j42
$$ y = [-132, -129, -128, 49, 115, -22, -93, -106, -94, 193, 44, -222, -117, 70, -28, 154, 32, -276, -86, 64, 20, -77, 33, -303, -77, -104, 286, -271, 60, -145, -199, -194, 203, 164, -123, 95, -65, 70, 264, -181, 124, 116, 3, 327, 273, 63, -20, -35, -210, 7, 96, -87, -308, -69, -75, -17, 302, 97, -88, -301, -199, 299, 136, -68, -61, -177, -6, 36, 69, 129, -16, -80, 80, -15, -210, -55, -204, 34, 143, 119, 225, 92, -7, -222, -126, 37, 130, 184, -254, -296, 221, -174, 322, -48, -248, -48, -262, 164, 537, -51, -165, -154, 274, -217, 232, -165, -44, 117, -16, 147, -136, -236, -158, 136, 79, 324, -174, -63, -244, -218, 21, 208, -19, -37, -85, 80, 75, 36, 162, -230, -98, -88, -37, 78, -279, -276, -135, -63, 368, 114, -252, -215, -207, 2, 223, -251, -146, -59, 0, -143, 48, 130, 150, -226, -42, -274, 387, -141, -59, -135, -96, 157, 88, -185, -185, -208, 129, 310, 219, 49, -148, 61, 129, 122, -2, -92, -144, 68, -22, 419, -80, -150, -249, -134, 224, 292, 105, -37]
4557c7K25k47LM44l13k46j02K96L9M8n7k23P4j09N48l13J87k47k8J3R2J0oj02
4581e1J19J65n0J6L4n24K63J14N6j52j30R0p0K00n9J50l91K32j27K52K64k22m5
4604A34j06j64K56o8j86N6J65n3j1r5K44l34L2M44k24q1J64n22J97K31J09k84
4626i6j02lM3J66J07j22o5J13q0j23L47n9k08n7R1J86J07k16K02k35n1K19m1k41
4650a18q4j4J46j0K22j90K20k18j91L29o8J50k05q2j53J61Q7j70K82L44m23j15
4672a00K87r3k51N3j48K65J37l49J36MK34m2N6k34o8o5J30J91l3k83K6K7L06j77
4696IP%n4K2J75j5j60j84J94K7K11k69J44k16K25k06K57r7l69N9K07p0J80k10
4720a33Q2rQ3n1J74M6l97L34k55J22K61o8j65k73J91j76M98j1l77j2n4J19Q8R3
$$ y = [-37, 188, -59, -56, 388, 75, -171, -273, 23, 62, 110, 53, -170, -96, -205, 343, 30, 217, -30, -58, -45, 47, 57, 51, -51, 68, 233, 183, 199, 233, -291, -28, 86, 142, -10, -140, -50, -120, 80, 21, 171, -220, 12, -115, 137, 401, 179, 134, 28, -136, 120, 52, -134, -78, 87, 34, 23, -72, 172, -162, -130, 314, 90, 9, 173, -349, -152, 79, 188, -96, -198, -201, -158, 8, 115, -7, -72, 41, -39, -162, 185, 126, -82, -139, -48, 138, 245, 29, 231, -4, -55, 164, 123, -118, -202, -216, -70, -80, 142, -48, 172, -46, -237, 92, 24, 174, -31, -113, -266, -105, -18, -188, 94, 438, 15, -100, 187, 94, -157, -104, -252, 13, 150, -199, -63, -59, 175, 133, 189, -45, -113, -178, -48, 143, 110, -173, -147, -120, 186, 9, 16, 16, -38, -16, 159, 144, -16, -200, -6, 21, 232, -37, 107, -109, 116, -90, 167, 70, -299, -240, -33, -103, 77, -133, -51, -60, 23, -28, 146, 192, -205, 129, -126, -4, 257, 189, 24, -249, -58, -234, 264, 253, -124, -136, -190, -71, 17, 110]
4744A10j19j04j39L64Pk9m37K23K5K45k5R1m50j3K37J46q7M3j17o5J03M2j7j24
4768i0K50k62J99k1p7k4M7J46K7j58LL6j72R4J08l55J3J03j40J63L22k58k51L89
4792I2o6j5j66L50m2p6j15P6J4k6N1j22M5l3R6N0k51M1M3j0J05J4J06l16L10q7
4818F8J8j21k10O7j24K93j7j03J0l07K38M48j25j91j67K94r9M6o1J07k95Q4J76
4841B9k6J56m98J41n4J39K48n7r4L1J3j22J88J27l40J4j32L51n0R4k39Q9k57L08
4865E9K9Q2j79j28J5J25o0K06j39j58lN5l8M72m54J48o9J04R3l69J70J14l2p1
4889b8J66k66r5J33R6K1k41L81k96J47Q7R1j30j02K14k55K99j48K9k59j77K11
4911a22J96j37J25p1J12j06J88M9l42o5K85J3q2j30K8%q3J70N6k0K52j33m04K3
$$ y = [110, -9, -113, -252, 112, 119, 90, -347, -124, -99, 146, 121, 212, -238, -251, -14, 132, 45, 88, -29, -94, 9, 51, 34, -90, 160, -102, 97, 76, -1, -25, 22, 168, 195, 37, 40, 76, -96, -2, 106, -249, -236, -133, -273, -110, 212, -46, -297, 92, 26, 11, -155, 195, 153, 77, -38, 38, 52, 26, 77, -45, 0, -33, 63, 113, -138, -97, -54, -64, 41, 55, 161, -155, 155, 68, 86, -35, -245, -178, -302, -9, -26, -129, -119, -426, -188, 260, 135, -56, -223, 71, -28, 18, -43, 64, -231, -147, 29, 3, 159, -339, -198, -252, -113, 135, 78, -16, 15, 28, -94, 94, 221, -119, -105, -237, 114, 64, 158, -81, 8, -249, 59, 88, 170, -9, -137, -122, 3, -57, 149, 10, -148, -151, -96, -134, 338, -116, 32, -37, 67, 160, -209, -39, 75, 43, -28, 138, -128, -223, -90, 6, 27, -214, 167, -129, 18, 105, 196, 66, -36, 178, -77, 222, 74, 103, -156, -333, -122, 74, -63, 62, -9, 103, -3, 185, 234, -108, -173, 112, 125, 43, -87, -59, -59, -142, 28, 84, 64, 316, 183, -221, -198]
4935a98L40L2j65LK7m4j40O3Q0r3%J57j12J11k88R4K77k01J86j91ol31K73M15
4959B89l60J96l08L69l40J98N5J86l11k1j51M19l04j8K7K61k14K4N4P9r9J40l36
4982a65L53j06j13K18k09j04L6L07l81K25l28L64J85j25l18K40j30O5j2j02J22
5003B2p2N0P3n5P2j17j42K24J77k41R1k11p3M27k55J03j98K09l6O9l97K57k8j07
5027a58J63n2K5j9J07k18K20r2J22k0p7k8M7J2J39J3L8j74j19K52O4l67m5J07
5051f0K3L0P6k57J98j50L22j05j91J79q9N1J16r8j38MK06j39J60j28m1J43k23
5074a11J55J38j56j5j55O5O9J51l46R3L17l04K65j86Lj8j12P8j47K96j03L1R6
5097A04m8j42J11j49O8M1K50k38k02M39j05l5j70p1J02J14k39J5K42r6J17N7j02
$$ y = [-198, 142, 174, 9, 12, 39, -5, -145, -82, -2, -95, -95, 62, -50, 61, -227, -133, 144, -57, 129, -62, -68, -399, -126, 289, -71, 125, -183, 186, -154, 44, 99, 285, -26, -47, -198, 221, -83, -101, -74, 187, -27, -3, 51, 130, 31, 171, -165, 188, 82, -31, 187, -22, -126, -90, 217, -164, 61, -267, 97, 282, 157, -161, 79, -51, 14, 2, -100, 22, -50, 0, 73, 18, 90, -27, -169, 55, 232, -9, 82, -129, -202, 225, -30, 73, -125, 84, 48, 117, -280, -23, -51, -158, 5, -47, -22, -41, 66, -152, 68, -24, 98, 78, 1, -27, 20, 32, 171, 184, 222, 48, -71, 181, 245, -122, -167, -60, -37, -7, 69, -188, 10, -140, 182, 77, -114, 65, -24, 27, 143, 45, -93, -89, 117, -22, 138, 10, -31, 112, -111, 44, 182, 26, 11, -144, -79, -10, 141, -205, -112, 205, -99, 166, -20, -17, -35, -147, -69, -216, 80, -23, 8, 104, 56, -86, 25, -124, -56, -15, 235, -3, -205, 234, 129, 94, -76, -147, -45, 69, -170, -155, 87, -9, 108, 165, 63]
5120F3j17J6N0o7P3l0J94j71M6k01J04l0K2k7M8roj0j25p2M50ml85K33n80Q53
5146C18p2j46j41k41J43L6j0O5J46k22N8J15k61J33o6J68q0K3O2N0Q9l25J67J98
5170B07J46l02P7k02J53J60k40Q3j87L13j48p0Q2q8r5jK80j23K3o7J90J07k48
5193E0k3j21O9J77l26M51l11P4M3L5j20K65l08K51j53J8o5J46j16n0K89l24L8
5216a1j74K26j08M9j6K68k96M13l69K29l99m6L40q3l25J53L7J64M1j26K4k07K05
5239a1k9K22j14j41K03k03L0J99j37j7n6j50M01p6k24J23j98O4Q9J79l9o9nj92
5263a51L4J26p2m0q8Q7L45k80K20l26L81m37K80qLj10J37j3o2J32j58j59K85j82
5287e6P9L1k62J92m1k3m2M25n9k15q5j02L53K1k62Q8k07PP6J44o0o0o6K12J58
$$ y = [63, -54, -38, 12, -55, 18, -12, 182, 11, 57, -144, -40, -70, -48, -75, -27, -36, -42, -52, -177, -249, 201, 197, -188, 45, -535, 318, 246, 100, -41, -282, -139, -103, -113, -48, 98, -124, -66, 49, -212, -79, -145, 23, -57, -34, 28, 78, 167, -158, 9, 207, 353, 51, 128, -74, 79, 239, -1, 82, -105, 208, 60, -10, 72, -16, -111, -112, 168, 45, 68, 1, 191, 298, 50, 27, -94, -25, 152, -174, 277, -34, 40, 83, 118, -2, 263, -45, 206, 53, 71, 6, 152, 36, -14, 275, -49, -11, -185, 41, -67, -18, -34, 234, -62, 351, -18, 211, -188, -234, 106, 23, -302, -149, -112, 52, 93, -33, -9, -216, -11, -40, 182, 68, -73, 130, -73, -43, 156, 19, 2, -54, -204, 197, 121, -103, 20, -178, -114, -25, 154, 115, 46, 41, -151, -117, 9, -63, -103, -191, -104, 241, -39, 181, -145, 236, -201, 79, 71, 74, -36, 101, 88, 26, 158, 0, -159, 126, -56, 23, 54, -208, -16, -57, -80, -122, 303, 244, 29, -56, -158, 195, 216, -46, 42, -165, -158, -82, 62, 2, -58, -124, 88, 246]
5312B46l19q3Q3j53J57K2m9j6k7R2J52o7j61P2P6P9O1k54K0l4RJ0J48M5k47k0
5338a58q9L79j45L9j89m6P5J98o0n7J39r0p6j8K01j12P1Nj70L53k38n7n5P7r9
5363a22J49k73K0M78k02R4l8j39j20N6J40J44l6k22j09O2L8P5M3j52j43L28n9
5386A2J81j65r3q9J23K21j91L30l52M1j11J05M5q0o4m7J63R0j20l4j65L59m48
5409b89K04M9O0J2j97M2K68J9l17o0K26q9M7L78m15L05k81l9R3R1O6r1j12k9k9
5434h8L39j6l86K93Q5j84J01L8j54j33J78k8k35N41l69l0l23N26j45M5n2R5mm8
5458D6o3k46J68kJ03k49M09l98Q9O5K53MM9k68p8Q2J57M2j26j57j67O88l69o4
5482c2m5K14j48Kj40L7QJ91n3k44Q8R4L3j0q8J11J19k58j3K76j69k01k2J24J24
$$ y = [246, -73, -156, -73, -226, -69, -47, -96, -112, -139, -47, 105, 38, -123, -51, 25, 104, 165, -89, -69, -103, -94, -84, 64, 109, -138, -158, -247, 132, -13, 26, -163, -209, -134, 64, 4, -53, 86, -4, -80, -98, 103, -9, 62, 67, -103, 250, 12, -45, -100, -23, -122, 27, -246, -226, 252, 50, 144, 106, -33, -153, -97, 43, 187, 151, -71, -180, -118, -80, -5, 38, -114, -257, 71, 12, 193, 28, -65, -154, -31, 190, -1, 329, -23, 18, -93, 12, 57, -23, -87, -134, 29, 119, -1, -35, -200, 159, -289, -85, -36, 24, 36, -161, -119, 149, 168, -149, -209, 17, -72, -25, 353, -62, 243, -38, -77, 16, 107, 173, 82, -30, -59, -88, 251, 235, -151, 142, 227, 43, 144, 182, 28, -105, 73, 45, -190, 351, -18, -48, -371, 155, 10, 55, 3, 98, 94, 46, -17, -263, -95, -97, 6, -243, 166, -232, -143, -78, 175, 179, 228, -40, -118, -36, 121, 163, 37, -120, -287, 401, 32, -32, -77, 137, -11, -9, -149, -112, -104, 87, 34, -210, -122, -28, 5, -5, -93, 18, 137, -121, -134, 142, -27, -228, -250, -126, -2]
5507bl5K17m7k67L87k61j93K36N8M4R1l03K84l4j26N8m9k03j5K53R0k97j8J39
5531Gj7j22J06R8J67m75Q5K28M2P5k50J92j20mr5j4j90M22j86M3M6k6N7j01K75
5556B43j38Q9j12k26M25k41j34J39k51J83k00J82K69l32K51o3%lp6J05j19J28
5578A19Kj82J15q3j59M6K72j83J27J42j25j20q1J13r5o3j5L41k59K27j62k4l9
5601h6j89O46l34J30k05J73k57M7j23K66n5J7l9J11j36J81n7o2j31K93R5k37P2
5624A20p4P3j33K59k42j8N0K04l78K93k19J89j79K71J00l33N9p0O9J45k47K29
5646A68N6k52J00j11K61k18j15Q3O5j28o9j57K41p7J07K47l59k9N19k47m5P7k2
5669I5j73O4p6P1j78J48j0K40j78j7O6j62J23n3lr7J59j78P5J1J04MP8n7R9r2
$$ y = [-2, -37, 180, 133, -134, 253, -8, -201, 35, 93, 137, 228, -75, 209, 175, 49, 107, 58, -145, -160, 93, 183, -114, -132, 7, -10, -132, -26, 72, 239, -236, -151, 77, 119, 194, -56, 136, 16, 12, -83, -97, -287, 135, -51, -8, 38, 12, 69, -32, 243, 105, 194, 82, -144, 281, 40, -94, 45, -206, -23, -223, -41, 228, -104, 147, 84, 84, 81, 5, 110, -9, 119, 121, -61, 54, -29, -188, -142, 130, -53, 74, 216, 91, -29, -110, 3, -92, -155, -170, 171, -88, 139, -23, -47, -86, -275, 371, 37, 167, -38, 135, -122, -75, -198, 68, 13, 30, -9, 102, -34, 147, 90, 28, -103, 190, 285, 48, 120, 46, 119, -14, 245, 3, -15, 35, 239, -139, 154, -65, 124, -55, 216, 316, -17, 42, -28, 41, 186, -61, 168, 224, -28, 72, -39, 222, 4, -111, -28, 37, -91, -160, -317, -76, -153, -46, 201, -158, -187, 332, 85, 40, 117, 95, -78, -14, -90, -19, -197, -49, -59, 181, 3, -14, 52, -110, 13, -40, -43, -140, 19, -159, -84, -73, 31, 35, 113, 56, 155, 63]
5695F3Pj78j0J03J46j84J75J9o4j97J55j7P3j43j36M14k97k10L36N9l39K47q7
5718f5j95K55L70m16k6O0k15K94r6O8k72L87k25J17J05j53l7J38j07j1m2J00n0
5741a6k22J40K9J75n8p5K5J37Mk51K8L04j70j24o4M83k98N6j04J88k10L8P7j31
5765c9n8J41L0n2J78j92q6Q4J23j14J47k92J13J00k6M6k55L1J04J47l70K53mk04
5789a95K72J1p9o7M0J03N2j52N2J68j71J49j70J5pj13r2J15n3K32J37k61j34%
5813a48k82O00j94j4J4p2R7P1k51J92K42l93J41K3j19L4j87K69P3o5J92k54r1
5836a22J90J66j78j20l4K92j69j75R8J68k98J51K18j71j41J7J44n5J86qR5k29
5858B5k94K87l9L7o9J85j41J3MK07l98J22j17K35q2q1J82j86K3n2L85k70P8J0
$$ y = [63, 70, -108, -118, -15, 131, -53, 122, 141, 77, -120, 35, 18, 91, -52, -188, 226, -71, -281, 55, 114, -225, 22, -65, -260, -5, 365, -51, -77, -17, -232, 62, -34, 34, -238, 149, -76, 41, 146, -7, -44, 94, -13, -24, -66, 34, -16, -238, -98, -69, 106, 48, -27, -2, 135, 139, -112, -84, 220, 50, -74, -138, 345, 47, 103, -1, 187, -23, 15, 92, -39, -97, 44, 74, 22, 200, 8, -78, 6, 129, 15, 162, -130, -17, 83, 57, 103, -152, -121, -17, 130, -240, 13, 9, -195, 77, 88, 9, -58, -18, 85, 137, -15, 37, 205, 34, 183, 13, 28, 21, -92, -184, -69, -122, 110, 247, -14, -148, -148, -430, 170, -24, -38, -24, -96, 1, 72, -179, 13, 255, -138, 3, 26, -93, -59, -246, 23, 96, 31, 223, -31, -122, 68, 234, 56, -64, -98, 194, 25, -150, -52, 116, -182, -31, 187, 16, -125, -108, 36, -19, 167, 159, 254, 25, -269, 18, -21, 16, -53, 132, -9, 4, 8, 215, -183, -61, -178, 57, -25, -106, 76, -110, -87, -139, 246, -24, 54, 64]
5882F4J0j62K66Jj98j7r5J13K70j34j85o7pM73k13q5P0k17m1j04L88K06j98k05
5906f7L1p4K18o3j96L6J00J95QJ32l79Pj34N6K34q6k12K69k13J57O5m5p3Mj18
5931a48k1J12K6M0o7n2J84m1J15q3R3J10k00J10j14j99J67k3J65l28o6L92j25
5954D7o0P2J82l18J32j74Q9L4J62p0j21Q7NJ08j06l30M24l39J97j10j07K12j79
5977a63J39N7j95K11k58N9K60KK7m64K23K05J4k24N3J6J4Q9J26j3k04J31N3k49
6001i1n9K71J99l27k74L53O5j07Q4l3N9j21J64j96j7J84j50j9J81L5j2r7j15j30
6025a53M53k67j12J69q5J54P0p6k58j08K62m4j29lJ29J40J44l98J54Q6j77j91
6047b40J91J93j00j86J2K02R3j5j64j84L47j32nL56j44l16J3P1o9K8J24j00J38
$$ y = [64, 74, -88, 178, 179, -19, -36, -131, -18, 252, 118, -67, -134, -141, 332, 119, 34, 104, -113, -154, -258, 130, 336, 138, -67, -36, -110, 108, 45, -151, -115, -15, 180, 188, 320, -59, -52, -186, -130, 104, 18, -194, 75, -138, 19, 84, 39, -34, -30, -148, -169, -57, -31, 9, -58, -110, 74, 33, 148, 65, 158, 268, 68, 178, 64, -135, 32, 9, 174, -154, -220, 172, 47, -13, 59, 241, -77, 55, -119, -30, 4, 166, 96, -25, 62, 67, 175, 69, -261, 163, -176, 21, -89, -196, 16, -163, -24, 33, -162, 49, -209, -150, 110, 112, 139, -325, -102, 103, 117, -107, -54, -38, -24, 65, 191, 178, -26, 105, 158, -91, -150, 121, 320, -7, -281, 72, 137, 30, 114, 81, 140, 19, 183, -13, -30, 154, 4, -15, 166, 201, 189, 92, -23, -153, 300, 33, -79, 90, 5, 159, 229, 153, -105, -213, 49, 5, -124, -127, 2, 142, 286, -112, 42, 128, -49, -240, -49, 144, 44, -142, -130, 72, 165, 150, -14, -198, 149, 17, 12, 368, 224, -92, -79, -8, -77, -49, 75, -25, 113]
6070A13j02J55j98k6K6p0J03J30K4r3Ll65k4M25J24rl9l50K23P1j31Q4J19L2p0
6095A55J3r3n1N0J6k11J61L2m5j44m6J18J9L26k92n5K8J62j16J4j05O5J3L1M7
6120I2K14l65J2k1j0J18J71l39Q5J17jJ5k47J75m6j48L22L8k01k88O3K48r1o0
6144a47O0K15k63J03L3j67K24n6j16K43K3k00J14k67L9K90J90l20n2K10k27q0
6166a51K92k77N8j30M17k26l8j2o7N6J43j19P1R7K60l13k79L62k18K96q5k84J73
6189B6R2K5l10J90J88k96M4P3l1l4J4J0R6k6m5L5m5j90L16L3k26l73N68j18M7
6214F3j12J23k99J46L30P0m28K25p3Q8p0rk46KQ6J02J32j64j22K14j43J20o4q9
6238a18M2j12j05L28M0k8jn1j69L08K3j53M8L6l40L35Qk25J10nO9R1Q0j27j30
$$ y = [113, 11, 166, -32, -58, -32, -102, 1, 131, 155, 62, 65, -300, -324, 101, 225, 216, 177, -173, 50, 121, -10, 74, 193, 225, 155, 168, 75, 24, 74, 90, -121, 40, 72, 27, -117, -163, -45, -26, 300, 8, -47, -19, 143, 27, 41, -64, 1, 14, 45, 92, 306, -59, -47, -68, -78, 40, 211, -128, -43, 74, 73, 88, -159, 16, -30, -178, 144, 182, -19, -307, -244, 4, -87, -147, -87, 128, -135, -32, 1, -166, 58, 2, -114, 129, 152, -48, 66, -201, -162, 128, 318, -2, -54, 156, -71, -151, 141, -136, -78, -208, 209, -17, -55, -67, -134, -78, 65, -54, 17, 114, 374, 61, -218, 144, -74, 222, 137, -147, 26, 118, 143, -167, 23, 211, -85, -41, 32, 1, -33, -19, -9, 87, 61, 16, 51, 6, -184, 132, 165, -61, -434, 134, 16, 63, -49, 74, -225, -79, 251, 321, -107, 118, 45, 133, 63, 54, -192, -190, -104, -2, 130, -34, -156, 58, -85, 35, -29, -118, -76, -188, -293, 35, 75, 47, 46, -5, -174, 134, 157, 4, 52, 88, -252, 83, 91, -134, -24, -29, 40, 131, 211, 84, -46]
6263d6Q0J15j69J15k05J7K16j76J47j17R8%n0J00o1J04k14O5o1n2QJ38L5q7k9
6288b9J17j45r7L17k18j40K52MJ47j79k56K17K2J69j40n8J37j53R5K50m10J40
6310D2J46l68K48l7P8m28K07K78k70L57k57j64J84K48n0j35j74J65O4p1J1n4J24
6333A44j89K13k58J07k60K72m31M81r5O5K4o6j54J71Q9q1j75J87j82J78K8m7j3
6356H%lkJ44k65N1K74j89o2K67l49K95j59J05j44J25n1J06j63j53J20N9L9J0J0
6381G3o2o1J91J53j91l16K37P4J07k56r7K7J06P7m3p2jK5l9J73j11j90K63o1J07
6406A13r4j7k5o8L1J66p7J8m1N0l8J71l40L28j03l43K26K47l37j9o4o2J51N4N1
6431b2o0K42l56K11r5K84l94J09K67j19p1R3l29J22J13P7j3r7L8o4J61l77L14
$$ y = [-46, 34, 149, -20, 95, -110, -93, 123, -53, 94, -23, 75, 75, 25, 125, 64, 168, -46, 19, -42, -94, -86, 52, 87, 0, -29, 88, -57, -154, 163, -55, -195, 57, 61, 208, 29, -227, -10, 12, 181, 41, -17, 120, -33, 62, 312, -98, 42, 188, -180, 68, 31, 109, -319, -112, 166, -104, 253, -4, -168, 16, 264, 214, 79, -95, 70, 134, 63, 74, 20, 144, -45, 168, -90, 17, -243, 29, -402, 79, -16, 49, 73, 7, -147, 24, 113, 32, -143, 44, -138, 40, 68, 21, 8, 8, 5, 3, 147, -118, -67, 207, 18, -44, 223, -126, 169, 10, 115, -29, 96, 45, 151, -12, -165, -45, 14, 53, 63, 73, 11, -50, 141, 294, 103, -213, 24, 98, 205, -51, -148, -121, -15, 62, 19, -53, -54, -29, -68, 105, -6, -196, 67, 6, 113, 19, 2, -23, -91, -60, 106, 29, 47, 6, 56, 18, 189, -151, 177, 74, -269, -43, 204, -133, -152, -216, -278, -127, -73, -22, -82, 160, -196, 15, -80, 204, -190, -81, 186, 67, -4, 89, -240, -118, -5, 72, 59, -38, 0, -64, 97, -280, 34]
6454C4j28J00l57q4M30J38k42K15Q0j28O9o7J99n6j77Qj61L78q6j73m34M95j35
6477h2L68m03k2O9JM1l7J20l04K97k21R0L36l00l00K56J42p0j2k20K00k4J67m35
6501c43K42K4oJ39jJ01l0K4k63J72K25m09j32M42l17P6k5J13k23Q4M0R8O4j36
6525d1J5k35L37k15k7M3j0R8L2J17j79O5J3l0m1J85M9l03K10k42L5J45J94r7l04
6550a86m9J85P6P4lk93J49Q4J96j48k56P3J42M1j49K50l43J13J5k37M28j42k70
6573b50O3L1O6M0O4J80j95k14K00Q0q7l4m9OK58j91m9K01j79kj32K92j28K57m67
6598b39L92J7K7k14j28J86R0n9J15k22J15j01k09J99J57k45K5O5N9J13k77K10
6620G6n9R8r3l0J39J83j57k69k37M97J66k91j86J70k9J57Rl43L6L67j17j18rj24
$$ y = [34, -94, 6, -351, -435, -5, 133, -109, 106, 186, 58, 127, 60, 259, 203, 26, 34, -127, 251, 165, -8, -442, 53, -82, 286, -117, -139, -70, -69, -28, -65, 55, -249, 48, -173, -83, 253, -47, -347, -91, 51, -19, -31, -251, -51, -75, 92, -343, -101, -77, -83, 56, 55, 156, 126, 150, -113, 59, 284, -125, -257, 185, -132, -56, -81, 32, -191, -107, -67, 31, 95, -41, -26, -261, 76, -139, -166, -123, -133, -35, -3, 114, -65, 0, 13, -17, -58, 127, 176, -127, 83, -159, -124, 21, 215, 118, -186, -235, -50, 26, 100, 97, -196, -47, 37, 233, 85, -171, -98, 44, 85, -64, 186, -157, -44, -29, -266, 162, 20, -250, -187, -156, -90, -50, 14, 194, -1, -215, -15, 65, -22, -56, -105, -99, 159, -32, -81, 120, -59, -61, -193, 99, -29, 228, -239, 153, 170, 197, -17, -145, 41, 131, 72, 187, -35, 80, -21, -230, -31, 126, -119, -94, -29, 30, 143, -134, 76, 17, 115, 22, -8, 131, 314, 157, -112, -349, 148, 314, 23, -163, 7, -22, 135, 144, -199, -163, 204, 87, -31, -40, -164]
6644a64O8p6R7J69j18l13L64oJ12j18J34j17j65R8o2K67k54j25L80j72R9L7q0
6667E5k2j13j49L75l9pj8l08L44o2kj15k5j64J44J38j16K23m21J77J82J07j91
6690gj04j29R1J27J74l48K14k7M20n07J08K06k90Ok1L20Rl30K39j86l1J27J29
6713A90q0l21K85j25J82q4J00j71K34k65j25K72k92L20j01k50K53N8j12Q1J1N3
6735A13l1R7j79j23KJ7K23j09l9J28J7j05N5J77k87r5J01J51j83j32K19J31o4
6758H4j35J49P3k99J35r8J66Qk9j23J15j8k5k65K71K37k57J79j29rn5J74k10J56
6782I5k00P9k30J19N7K35P2j39j56p8P9r0J26n5K3j40L32n4j7N8o8j50J13L02
6806C13j67k07L72k90j21M13k84l1k21L05r0Q8j02l14L05O4R3k09J54jJ22k95
$$ y = [-164, -96, -172, -75, 94, -24, -337, 27, 21, 133, 15, 149, 32, -133, -35, -97, 170, -84, -209, 171, -1, 98, 135, 55, 33, -80, -229, 146, 107, 100, 82, -226, 118, 56, 54, -61, -86, -250, -106, 32, -84, 139, -282, -105, 77, 184, -7, -111, -240, -149, -22, 152, -196, 18, -9, 411, -96, 12, 218, -72, -66, -87, 233, 242, -88, 151, -35, -66, 61, 190, 110, -211, 74, -51, 131, 47, 147, -24, 210, -55, -180, 92, -200, 120, 19, -231, 22, 80, -32, 49, 60, 113, 82, 179, 0, -123, -121, -104, 119, 10, -29, 99, 116, 11, 66, 243, -44, -139, -38, 113, -70, -202, 17, 148, 84, -51, 98, 171, -128, 7, -91, 75, 83, 54, -69, 46, 28, 3, -262, 9, 246, -11, 168, 39, 30, -25, 149, -61, 95, -105, -26, -256, -137, -80, 155, 227, 88, -68, -146, -67, -157, -31, -86, -63, -203, 129, 75, 58, 116, 48, -102, 11, 313, 146, -61, 311, 21, -100, 313, 29, -2, -223, 82, -8, 80, -22, -336, -31, 33, 126, -83, 71, 70, 192, -103]
6828a03J80r0J73r6q1n8K10j8q4j55P4k62L06J8Pq3Oj19N1K57k39K02j83l5J64
6853D2P3mk33KJ92n5l4J79l11K84k63J73O9k18J11j10l2n8J76J30N6o3r3r6o3
6878a46L1P6j79M36k29J4N1j6j26J55k3O3j43N9N9R2p8r9N6M4K66l95N2k36m9
6903b65J46L71m30l4J47q8K31J10k25p3J76j6n9O7j33k13M05r0k3J61k4k47k28
6926c34J85L46j26n3K51k53r4J01J78m19N9L06k07J03L5p1j06q9k9K84j22J92
6948A37j07o7j4kn5K4o4J27N3k5J20k78J1J18J26n3k88L24Kk8J82j16r2j82J75
6973B8K5K2R8p7K35l40kPkK65l27k0J1J57J38p1j21j05P3P0j53J46J09j52k13
6998a99K09j33Q3q3K1P8k0J05m5PO2P9q7j55J16m7k82L50o8L7r1Q5P8q6L5m2o1
$$ y = [-103, 77, -13, 160, 64, -17, -75, 135, 117, 33, -122, -48, -310, -4, 14, 21, -62, -56, -175, -124, 133, -106, 96, -87, -122, 42, 115, 111, -122, -120, 72, 17, -17, 162, -149, 135, -128, 45, 114, -104, 7, -103, -135, -193, -17, 113, 169, 106, 13, -83, -146, -115, -39, -218, 218, -11, 3, 54, 38, -88, 67, 44, 107, -36, 23, 82, 174, 96, -3, 53, 97, 363, -32, 20, -216, -265, -119, 252, -178, -212, -65, -153, 78, 188, -37, -110, 66, 50, -9, 58, -75, -288, 117, 27, 4, 165, 141, -106, -334, -149, 197, 71, 18, 269, 16, -78, 23, 201, -218, -159, 147, -60, 43, 78, 7, -99, -188, -217, 67, -55, 137, 30, -37, -51, -53, -108, -84, -148, -21, 32, 7, 127, -151, -140, -22, 104, 51, -237, 87, 89, 61, 243, 127, 35, -147, 28, 53, 75, 173, 96, 331, -9, -11, -4, -6, 259, -68, -88, -77, 80, 218, 147, 26, -79, -6, 64, -89, 57, 166, 14, -199, 10, -123, -40, -123, -102, -24, -44, 61, 16, 23, 85, 164, 77, -78, 38, -9, -291, 59, -9, 28, -63, 22, 100, 14, 49, 7, -54]
7025e4Qn5m9K62Q5l82k10L89q1K91j91j51j4J38k6P7J68m19L35J24j52L4m33M60
7049A54j88J09j80K28l3j76nM3N3K61l83P8J39K96m22N7r8j09K71l27L85j69K28
7072B12k54N5k32L61k10R0r0M4J08J39j54j84K67k25M8n5j4p0L56o7J06k42kj50
7096a63J22J00k21J78K0J34j99Q9R8j48P2L8j49K46j87P1j32L7j7r9Q3Np9j01
7120b02J82L6MJ31j86k33M60j62k99L22J09n43L87J79j81O1j68K90k15J56jn1
7142G6j64Q3O6k13M35r5p3l02J70K06j22k11K9J9l1pL59k41%j96NL43l63J64J10
7167D7M9j50J57R1j75P9k2j86L81j69l5Pj61L00l64M47j82k22K2Q8L20m37K83
7190A68j69jj16L3k3L7Q8j20J39R5k31q2K67j21j58J65L67o07J91R4J35M0l32
$$ y = [-54, -46, -101, -150, 112, 197, -185, -395, -6, -87, 204, 13, -138, -152, -14, -40, 37, 205, -214, 121, 245, 93, 127, -306, 154, -34, 75, -105, 123, 90, -86, -91, -48, 5, 266, -117, -39, 100, 396, -26, 31, -67, -176, 95, -232, 153, -16, 212, -42, 13, -219, 142, -68, 22, -68, -24, 84, 223, 69, -115, 152, -73, -25, -80, -94, -164, 192, 125, 231, -11, -13, -163, -41, 59, -162, 16, 36, 170, -29, 60, 158, 10, 82, 120, -29, 217, 30, 101, -31, 6, -11, -110, -27, -22, -101, -202, -20, 16, 20, 151, -35, -268, 192, 30, -269, 53, 162, -381, 6, 185, 4, 65, -103, 187, -28, 128, 127, 76, -88, -5, 61, -152, 283, 188, 115, -187, -17, 189, 67, -144, -115, -96, -127, -134, 225, -16, -16, -212, -207, 136, -227, -63, 47, 96, -54, 103, 194, 19, 98, 76, -110, 271, 102, 67, 74, -87, 213, -151, 296, 114, -108, -86, 2, 322, -115, 168, -1, -2, -118, -85, -108, -71, 17, -103, 36, 131, -100, -182, 85, -36, -194, -29, 338, -269, -78, 16, 151, 191, -141]
7213a41n1J01K08o7K39k73O6k04J71J06j95J99j43k5o9J43o3l6L0r2Ok2L05r0
7237A03k32J35N3R9k20Q3L2R0o7j6lO2O3j42K8N4j38k2j43J63Q9j1N0J58m02J60
7263B6k9O1m7O7M1k38J54J63j91K1mP0J6N8l92K90N5p7J6k59J29J34Q9p4m1K5
7289F3K5k85L51k69J25p9j22J42L0j01R7kn6N7j39K03J70m89K91o0k33J28J43
7312a0k04J05K85m50M91J5j99J61j75j85L93l06J16Q0m7R3j1K58l76m2j41K52
7334A03j11n9QO3j48K39j33K7p6j58J97j53J56L2mm7n3O3J74m9k78J66j51L40
7358A48Q3l01J39k78J27lK38l39J62K44n02L70j03k06J90j5L9J57O4k94R9O1j84
7381a04L27k48J1k19K90k32L3K58r6j73K61k0J18k05j29K33o6j50P9o8O2J3M3
$$ y = [-141, -192, -91, 117, 50, 289, 16, 82, -122, 49, 155, -40, 159, 16, -9, -78, 65, 2, -34, -4, -96, -90, -112, 193, 103, -129, 6, 59, 158, -62, 21, 53, 143, 76, 60, 57, 119, 182, 40, 68, 122, -16, -38, -181, -18, 71, 60, 110, 268, -134, 26, -3, 58, 11, 78, 119, -119, 35, 198, 7, 28, 24, 94, 110, 168, -224, 66, 121, 44, 60, -199, -70, 64, 153, 79, 38, 63, 88, -197, 154, -115, 10, -69, -191, -49, -19, -120, -23, -25, -81, -24, -163, 40, 210, -279, 12, -48, -281, -153, -10, -214, -109, 176, -274, 217, 232, 33, 194, 19, -166, 227, -79, 37, 117, 70, 163, 152, 410, 34, -8, -149, 103, -8, -67, -59, 4, -144, 95, -38, -11, -87, -245, -48, -201, -45, -13, -17, -64, -117, -54, 120, 71, -207, -41, -192, 148, 231, -70, 69, -209, -82, -85, 153, -186, -24, 220, -282, 88, -15, -221, -31, -46, -7, 150, 214, -80, 19, 80, -104, 223, -25, -14, -233, 57, -175, -142, 116, 20, -153, 108, 88, 206, 1, -128, 105, 39, -111, -32, -100, -38, -25, 18]
7404A8N2k45L21k42j54L39j86J32o2K41N4k60n4K29k55J57j00J42j70J57j46j27
7426a59J43R2Q7q9k31OM20k56j71L5J15Q4o3J00j98J02k1J45k62J99j83j33J3
7449b25P4N42l63j86J26J57p7j58J09R2q1R4n6j32M4m2L8P5k10J56L1k8J63j83
7473d0k58N13k4n60N63l82P2J15J95l37k13K47L04o0j00k5K8L4j87K41r9Q5k06
7496i4N6N2K33j69k01j9K91j03J66Mk90J31j4o2m0J84j33J96k77J2K38j52k9K4
7520Dp1J86k03J75l1l5Lj37M1J0j18M08k45q1J7J38Ok27J50J63rP2l50Q3R6n5
7546a0N6P4PM6j54j08J48O4o4m2k29K2J89Q5k62N9K55M5p6j99K82J11l11K09k27
7571c0J44k14J77k81M08q6J06n41L16K22m8k92rP3J17l33K44j30K2LJ24K7J50
$$ y = [18, 70, -175, 146, -96, -250, 89, -97, 35, -27, 214, 268, 8, -46, 183, -72, 85, -15, 127, -43, 114, -32, -159, -16, 76, 163, 74, -157, -151, 269, 13, -158, -123, -8, 76, 13, 113, -85, 17, -4, 141, -121, 78, -105, -238, -225, -151, 391, 28, -158, -32, 125, 48, -110, -1, 91, 10, 104, 48, -84, -40, -82, -44, 31, -179, -23, 8, -20, 143, -40, -298, 215, 191, -369, 194, -188, -116, -1, 194, -143, -356, -109, 195, 135, 35, 10, 38, 72, -115, 126, 27, 112, -94, -38, 14, 247, 78, -123, -142, 149, 46, 212, 216, -74, 57, 43, -19, -59, 125, -8, 188, -89, -77, 161, 9, -20, 4, -67, 119, -84, 91, 60, 25, 28, -109, -68, -58, -176, 232, -13, -94, -77, 61, 67, -160, -10, 153, 144, 216, -134, -51, 45, -10, 46, 120, 127, 173, 19, -89, 59, 123, 59, 17, -212, -190, -1, 84, -178, -119, 136, 181, 105, -94, 188, 299, -12, 197, -30, 114, -100, 77, -204, 204, 118, 224, -317, -1, 221, 173, -119, -128, -55, 62, -271, -27, -157, -135, -132, -8, 19, 169]
7594A69l1J0j22q7J22K4l92L37l9n6J32L8j43J94l91K69n6L36m39j65L82R7j96
7617gN3j30j60J08K63j0p4r6J09k45N51m37L8j33J64K81k50P0k14J50K23j94j92
7640a32K89m78K82j22J54J67j63L9K9m2K55l98m8R2O6R1n3p1nl8j27L42j74J10
7664F5k83K17k1j10j86M49j99p1K34k44J27J19q0J33m61J65J80M8j62l43M59j30
7686i4K12j91M5q3K29p1k39L27j44M3o7j9J26j38J17r4J96j47N4k91K03J23j80
7709h3L7K3rQ6j70J81q0n6J74j76j70K96Q3j52j05K10q2QJ40j89K64k73j25O7
7733a01J98O0n26K84l6J22K36l11Q8k16J45n2K3Q7R9j13K7o3J92N5l50Q4m4L93
7757B81m51L02K8k21p7J63j26J68j63q2j4L1J91k32J47m7J58m4J5N7J00l97L68
$$ y = [169, 138, 148, 26, -61, 61, 85, -307, 30, -9, -65, 67, 105, -38, 156, -235, 34, -22, 314, -125, -290, 92, 189, -7, 46, -84, -244, -136, 127, 117, 43, -53, 56, -189, 362, -75, -37, -170, -6, 275, 25, 95, -119, 31, 254, 60, -132, 157, -321, -39, -161, -7, 160, -3, 36, 65, 23, 278, -120, -168, -76, -10, 81, 28, -43, -48, -86, -213, 129, -45, 65, -218, -1, -22, -132, -318, 131, -68, -139, 95, -149, -22, 97, 17, 150, -311, -146, 34, 82, -80, -423, 36, -94, 118, -73, -28, -111, 118, 47, -192, 135, -9, 34, -33, -52, 74, -64, 53, -41, 155, 8, 62, -229, -26, 97, -83, -46, -23, -32, 54, -116, 65, -15, -71, 103, -73, -243, 53, 136, -16, -121, 89, 7, 15, 155, -34, 230, -43, -168, -101, 97, 157, -369, -85, -121, 1, 237, -74, 14, -202, -57, -109, -86, 1, 100, -13, 14, -49, 143, 198, -152, -68, -112, 281, -170, 132, 160, -61, -138, 25, -101, 67, -96, -178, -192, -161, 30, -202, -55, -102, 56, 12, 27, 84, 184, -213, 155]
7780A55o1k64K3l8Q3R7j59J14J17k25K13o1K24l75K95M2k92L24k55L19k50J04
7802A30Oj71k35L63r0m2K55l88N07k90j59J56N0k7N5j74J78o9kj1l1j40J05q0
7826a04J55o7j54J47K65j86k6j13M9m2J08k2J46m6j03m6j5l7R2J0j99L89k18p
7850b4r7oj2Q5J47p4o0J57l93J71l9K70K4k72P3m3Q2r2K56l50P9J11oJ55j40L1
7876C3j04pK12q4j03o2Q1Q7l7J60j54o2j19J69k54L08q6r0J47p2n2K43j09j88
7900a43J67j45O8J56j99Q2m2j5N7O3j11L10m16P2L52m74L23j73KK5J02j4j19N5
7924a7%j38K13k19K19m7j15L1n0n2K17l1j37L51l00J81j05L4Jj24%J48k58J70
7948b8q8K27k70L64l53O7J58K01j78M1m09K36j54L72k08J95k43J98R3l03M4M9
$$ y = [155, 94, -170, -147, -185, -102, -5, -164, -50, 67, -158, 55, -6, 218, -157, 138, 180, -112, 212, -43, 276, 26, 130, 136, -35, -270, 93, 3, -39, 216, -172, 335, 45, -114, 42, 92, 65, 120, -54, 124, 55, 53, 42, 11, -129, -24, -104, 51, -16, -170, -23, 242, 56, 30, -83, -34, -76, 32, 10, 156, 110, 7, -39, -54, -91, 1, 11, -188, 201, -17, -24, -121, -127, -139, -54, 93, 19, -41, 116, -277, -106, -145, 125, 149, -123, -50, -93, -11, -103, 153, -197, -118, -7, -13, 142, 2, 33, -71, -78, 134, 50, -53, -115, -34, 53, 16, 176, 22, -40, -159, 10, -244, 64, -22, -112, 35, -37, -89, 154, 45, -143, 24, -121, -53, 103, -96, -14, -56, -71, -14, 49, -62, 248, -168, -96, 256, -218, 105, -68, -66, -41, 61, 47, -72, -17, -17, -155, 58, -161, 58, 11, -104, -73, -123, -175, 42, 11, -126, 225, -75, 106, 1, 35, 36, -88, -88, 60, -198, -28, -116, 111, -159, 205, -148, -81, 77, 278, 100, 141, -268, -32, -186, 186, -22, 173, -70, 128, 221, -82, -38, 11]
7970A1l5K8R5jk1k21N5o6J22J4J71k41J86j04L4j76M4j3J60n9K07j08Q2j10N8
7995A12k25K61k85J60J05k55O8q8K74J31k30j18J76p9N0o0k5R7R9j8j4J12k17
8018C1P7k71P8o4L14j16l22L92l2j79K46j51j57K18qJ48j62n2LJ80j82N6Q5j83
8042e1p4J00j98l2J33J47J08P4k24J3J45j95J37J83j50k5l14M4J52N3K5K58m46
8065a37J70J38p1j74L15l07J99k0k48K54k84J18L0J8J26o1j86K01j53K14k64J75
8087E3j49j4P7J0J75j05j82o8J23RL36m04J09P4l58M13O1k36jJ01J30j56k5O5
8111C8j32J51o3P3r9K42j69k60N4M0L01k42R4j22R9j76J54j7j17J22J51j37r5
8134a10J61l31K17K56j55j78L2M5MJ22k64K72j67Op6P8R2o6K34l31L6K49l09J99
$$ y = [11, -24, 4, 99, 98, 77, -144, -89, -155, -33, -19, 152, -89, 97, -7, 27, -149, -105, -118, 42, -17, 190, 82, 164, 54, 112, -113, 148, -137, 23, 128, -127, -59, -147, 127, 258, 28, -90, 86, 7, 57, -3, -28, 69, 168, 150, 136, 248, 31, 108, -163, -85, -149, 165, 49, -273, 119, 87, -92, 154, 3, -154, 64, 56, 204, 42, -10, -7, 173, -9, 47, 132, -51, -125, -25, -223, -255, -122, 25, 133, 207, -17, -4, 141, -54, 83, 266, 116, 91, -223, -179, -27, 26, 51, 309, -137, 33, 171, 100, -74, 241, -66, 133, 113, -135, 119, -165, -47, -17, 1, 127, 66, -120, 81, -72, 142, -122, 53, -96, -110, -33, -23, 152, 47, -135, -203, -80, -71, 265, -139, -30, 44, -314, 99, 160, -76, -77, 24, 154, -2, -27, 38, -94, 57, -6, 67, -32, 210, 41, -219, -165, -125, 176, -66, 28, -94, 5, -171, -17, -34, -151, -29, 122, -15, -110, 51, -280, -63, 193, 38, -140, -108, -63, -59, 63, -201, 71, -96, -90, -166, -88, 4, -62, 172, -159, -123, 126, -183, 16]
8158A6n6K04k24K72J87l29m7L4j67K4Q5P0j18J09k29J49R6k7R6l17J84J31j99
8181e6L6j89M57l99R5q5k4K30n19N60
$$ y = [16, -40, 164, -60, 212, 399, 70, 23, 57, -110, -86, -1, 69, -49, 60, -169, -20, 76, 49, 145, -172, 12, 143, -56, -20, -209, 248, -151, -56, -141, -165, 65, -454, 106]
8191A06
$$ Imaginary data points
##PAGE= N=2
##DATA TABLE= (X++(I..I)), XYDATA
0@%%%%%%%%%%Qj6J6j6J6k3L1l2M0m8N6o4P2q7R8j10J26j44J65j86K10k37K64k95
34a56L31l70M12m58N09n63O23o91P64q47R40j041J156j287J434j606J809k052
52a093K348k714L187l826M737o157Q712j4746N4894N5008o1518l0797k833L7101
66D2303J8797n717k6108o489R135J3777k211j0164j4510n511M425J7561J6609
79E1897K5l0142l3390j081L5184L1895n170l6758k6596J1276L1959Q503k4781
92A2821k7054M446K7881J9398j0854k8577j8228M015J7165J7634O372j0779k1400
105g160j5140M419K1020J6316r344k6256q338K1074K3734m809l2392k3957J4579
118b6254L7909J9191j8128l3538j4921J4083K3329Q403q147j0453m300J266O119
$$ y = [0, 0, 0, 0, 0, 0, 0, 0, 0, 0, 0, 8, -8, 8, -8, 8, -15, 16, -16, 24, -24, 32, -32, 40, -47, 51, -59, 67, -77, 88, -98, 112, -125, 139, -156, 175, -195, 217, -241, 268, -295, 328, -363, 401, -446, 494, -547, 609, -678, 756, -850, 959, -1093, 1255, -1459, 1728, -2098, 2639, -3518, 5194, -9552, 45342, 100350, 38832, 8035, 5202, 42303, 61100, 55383, 29275, 22786, 31921, 45698, 43487, 33323, 18813, 13302, 17727, 35288, 51897, 51922, 21780, -11610, -12691, 22493, 54388, 49218, 12460, -14136, -2860, 29099, 37602, 12821, -14233, -9787, 18094, 37492, 26638, -1939, -20167, -16152, 1013, 18647, 25019, 14240, -7160, -22300, -17881, 3139, 19455, 10111, -16145, -24483, -3409, 20325, 15516, -16876, -40833, -26254, 11655, 30846, 12718, -20820, -35741, -21658, 1671, 10074, 1927, -8526, -12826, -11560, -5441]
131e441O503j600j1118r216O346K1545J5881j2238l2455j7206J9349L5620J4954
144C0924k1448l0265m466K2359J8371m854j7275q047R997J7008N375r903j3278
157e502p334K318J3519J7423N803j4311k3319q497J7616K5834M271k0539j9242
170a1960N942K3583J2007j5646k5566l028K3048K2417m39j8658j7440k113J0769
183B916J3279O345k021r737j1044N3J1989J0556m086j6441q448J3563K2756L165
197C2845k3606k4173K179K5586K1207m101k3191j4998O203J4876O601m899q797
210E732l051M108O162L615k341r471j0828K123J6660J5357l127k1517j8456M673
224a0361K4076J4626j0121k0279p082J2643J5504p09j5844j0965N159J4378Q944
$$ y = [-5441, 1062, -538, -11656, -20872, -14526, 7019, 22900, 10662, -21793, -38999, -19650, 15970, 30924, 9476, -20789, -25255, -2896, 15475, 10621, -6654, -14701, -4704, 12304, 17679, 7776, -5502, -12836, -10518, 3001, 20424, 26227, 11916, -11403, -19900, -2284, 23550, 27821, 7282, -11960, -6018, 17565, 29572, 13926, -11640, -14668, 8380, 30797, 30358, 11700, -5740, -7853, 2916, 16195, 22540, 20519, 10782, -262, -209, 11780, 22336, 18250, 1809, -6639, 6924, 29680, 32845, 9239, -14934, -12755, 12831, 34038, 29937, 6746, -8252, -2049, 12827, 19428, 14529, 5732, 2681, 6789, 12951, 16566, 14225, 4754, -6074, -3951, 12709, 28066, 24939, 3422, -15034, -10361, 13715, 28341, 18220, -2059, -9141, 3502, 19006, 18297, 2453, -8512, -3353, 11025, 19969]
237A9969l507j1925j0547j278P792J2071P612o070j5931q702P854J5862N199j1907
251F492j5455O94J7922J3601q481k0926j0342J0959K0641P387j0990j4927m724
264h149N538Q898N079k102o293n061J18P433P222k688j2799q823P820J8213Q225
279B2631j1910k1066o802J5260J8830J985j4289j2872J452J2060P119m990r208
292a800l274L959P425N119j693q448r085j685R640J4425K709j3512j5435l10J4775
307B810J2562l748j5817q251R551J4725K059j1666j3153r1J1152J0912O67q368
321C344q962l985L985R089O348l140r532p251L932J2212N125r373j3071j699J3086
336A08J3917j564j6258j2796M590J5064Q834m780j0994o470L931P510L851j898
$$ y = [19969, 16462, 4537, -6010, -7288, 504, 12575, 20187, 14117, -1814, -10516, -2662, 13200, 18399, 6492, -8963, -8269, 9653, 23254, 14773, -6153, -16495, -5536, 15105, 22492, 11502, -3425, -8149, -2611, 6287, 11366, 9264, 2971, -2090, -1972, 5461, 12683, 9995, -2804, -11627, -3807, 14406, 22631, 10721, -10345, -17147, -1887, 16943, 18928, 4639, -8233, -6781, 5279, 12398, 7408, -1800, -5074, -1115, 6310, 11429, 9736, 1288, -7797, -9482, 158, 14583, 17292, 3780, -11655, -11965, 2810, 15372, 11624, -4193, -12444, -2893, 11832, 13891, 2225, -10928, -11019, 133, 11045, 11712, 3344, -5618, -9603, -5618, 3471, 9819, 6679, -2853, -10104, -6172, 6040, 11165, 1792, -11279, -12978, 108, 14025, 12461, -3797, -16593, -12003, 3061, 11895, 7115, -3879, -10349, -6418, 1092, 4943, 3045]
350C045n974m672J290P410O353k243r946r215L363J4067R806n849j5214q439P434
365h784J4608N200r560j1666m20R525Q093j441r157o930K457P371O547N39o298
380H4q761l088O653J0504L679p118j1858k706J0267J1055j261j1952q938M910
394h530J3147O411p617j2585l952P517J0048L689n630q064l318K732O262N004
408E114j394p766n626K970R785N554n451j2294m687R195J3276K411j0979j2005
422a1897j6J1004R312j880r348n935K125P145M914j447o734m497P76O341P018
437F881J51q361q729Q13J0066R439j477j1863q184M649J1479N409n917j0636k923
452i203P649R198Q87p031p431r07N879P216K315m873p350l042M440Q260L908n523
$$ y = [3045, -2929, -7601, -6311, 1099, 7452, 5209, -4737, -13952, -10589, 3478, 13284, 7435, -7779, -16218, -8784, 5824, 11024, 1464, -10202, -10622, -1097, 6996, 5555, -3602, -10532, -8075, -704, 5843, 6382, 84, -8677, -11765, -5112, 5392, 9071, 1953, -9905, -12611, -2344, 8711, 7450, -4502, -13440, -8530, 4617, 11028, 3411, -9174, -13126, -5609, 4439, 8128, 2498, -5566, -8884, -6152, 110, 5114, 3720, -4046, -9672, -6702, 3083, 8637, 3186, -9108, -13795, -4600, 8676, 11087, 108, -11897, -11913, -909, 8403, 6523, -2825, -8760, -6635, 510, 5424, 3977, -2757, -7254, -6478, -137, 6881, 7032, -1329, -10058, -9245, 821, 10260, 8783, -3080, -11264, -6615, 4864, 10273, 4356, -6280, -9203, -1554, 7644, 8531, 1500, -5931, -6838, -959, 6257, 8572, 3699, -3651, -6693, -2253, 6007, 9915, 4392]
468D392r259k585P414R487J667r753r206J535R986Q177k450j0635o423L974Q929
483E250M885l452p216m119K415O547M240k202o484n175J750Q215O117l483r683
498b395n571M563J0430M770o701j0587k560P564Q764R29p860p579P85O857N550
513F959n73n982n740o20N615O338N56n832p325j463P165Q392m52q552q178J517
529h175R703O716l909r803m442M664Q070L720m853p799k671M223O203K975l497
544A125o683l545L498P268L652m056q237l981N711Q708K599o386q690j217P461
559b773Q069p26p609o409J528P233N554j621p017m660J880O001N044p62o099n519
575g886J159O447N891j163p732n521L396Q486M367m004q148m042N354Q668K560
$$ y = [4392, -4867, -7452, -38, 9449, 11116, 1363, -7843, -6308, 3678, 11855, 9405, -1230, -7653, -3679, 5250, 10135, 6683, -533, -4652, -2237, 4310, 8550, 6348, -136, -5311, -3561, 4654, 10771, 7288, -2395, -7966, -3403, 7027, 11797, 5096, -5491, -8051, -487, 8277, 9206, 1346, -6233, -5448, 1409, 6959, 6386, 404, -5336, -5956, -341, 5997, 6553, 721, -6604, -8067, -902, 7490, 7038, -1514, -9692, -8175, 1528, 8244, 4335, -5468, -9910, -5246, 2824, 6544, 1691, -6108, -8779, -4556, 1647, 4622, 1125, -5558, -9103, -5605, 1663, 5315, 1259, -6978, -10959, -5248, 3460, 6059, -327, -9017, -10234, -2773, 5296, 4570, -3039, -9448, -7920, -687, 4867, 3246, -3771, -8431, -6551, -550, 4494, 3732, -2367, -7886, -6727, -280, 5611, 4448, -3284, -8805, -5409, 3077, 7444, 3440, -4708, -8750, -3396, 5272, 7832]
590G832n451p046j755N093O786J518m354n876j350M671N793J349m641n894r69
605d294N158P191J078o644p418M30P304O917p89p510n707J607P516M539k671o759
621e2l372L230O296L302l250n959l398K306O650M327k970o829m182L095P185L613
637I992l778p698k309N100O830J109o188o409MO486N408k19n745n781r8N591N039
654G334q8m631n064o47M715N460l46o326m951J707O596M889k688p758l863K643
670c018P342L719l314p069l043L444N493K427l060n542k167L756N353J571m087
685A805o013j715M682O429J605m826o802j311N013O250R68n852m764J8M751M766
701E004p69n759m266K126N760L620j364o234m007J609N698M286j228n485m605
$$ y = [7832, 2381, -4665, -6420, -1327, 5459, 6977, 2623, -3253, -4603, 68, 5861, 7210, 2569, -3325, -4294, 864, 8055, 9133, 2489, -4929, -4499, 2805, 9722, 8933, 1423, -4284, -2677, 4839, 9378, 6707, -52, -3424, -194, 6102, 9404, 6154, 195, -3203, -897, 5753, 10080, 7110, 281, -3901, -806, 6379, 9992, 6214, -1484, -3793, 1307, 8137, 9246, 3058, -3351, -3347, 3139, 8547, 8328, 2583, -3198, -3296, 2295, 7334, 7246, 2615, -2449, -3096, 1619, 7079, 6733, 407, -4544, -2837, 3759, 8648, 5960, -1798, -5661, -3018, 4324, 8043, 4729, -2340, -5383, -1939, 3554, 5981, 2921, -2621, -4788, -1032, 4321, 5892, 1805, -4208, -5923, -1241, 5188, 6793, 1967, -4835, -6146, -1133, 5117, 6085, 233, -4531, -4513, 238, 5004, 4235, -1524, -5790, -3664, 2096, 5716, 4352, -1882, -5889, -4280, 1418, 5704, 4476, -1009, -5614]
716e614K102N129L633k264n297l107L326O211K039m852n645j879M502O159J727
731F170m395n926j285L896N042J376l922m558k47L652M292K23m983m788O67N666
747H80M966j013n900n439J212N986M375j054n475l818J569N100K506j941m800
762b846k247K653M645K979l436n970k195K924N870K903l116n937k513L345N301
777B360J334l166m945n21M324M072l93m544m390L23N299M606m08m676m691l55
793e771M792M808L4m681l823O48M455L231j296m971k636K004N621L339l167n805
809c218k730K948N323K725j890n347k461K664M774J627k885m111r31L355M536
824D379P80m202m594o88M518N110P12m267m747p41L963M668K59m091l625J022
$$ y = [-5614, -3512, 1617, 5250, 2986, -2311, -5418, -2092, 4119, 6158, 1306, -4339, -6218, -1716, 4443, 6170, 1775, -4151, -5436, -1540, 3502, 4878, 956, -3602, -3849, -197, 4095, 4318, -665, -5453, -4786, 880, 5846, 4833, -1067, -6506, -5294, 692, 5067, 4013, -1462, -5280, -3711, 1389, 3895, 1954, -2846, -5093, -2440, 2205, 5184, 1748, -4222, -6417, -3493, 2377, 5280, 2164, -3773, -6286, -2941, 2360, 3694, 528, -4417, -4938, -614, 3458, 3065, -1479, -5869, -5546, -247, 4359, 3951, -725, -5416, -5771, -979, 3829, 3863, -818, -4641, -3993, 462, 3693, 2397, -2574, -5210, -3206, 2415, 5754, 2587, -3218, -5948, -3000, 2323, 5048, 3158, -2189, -4650, -1986, 2788, 4415, 1530, -2581, -3512, -157, 4379, 5159, 957, -3637, -4325, 193, 5303, 6015, 1748, -2999, -3740, 223, 4891, 5150, 1059, -2566, -1544]
840a544L905L144j116m724l047K082N045K996j953m991l559J718N356L117j531
855D898m378k861J806M421K085k968m138j374L429M664R61l901n036j167L970
870D11N006J190l536m940p58L348L776N65l385l649J17M118K894q79m329l650
886c701J216N000L528j542m520l803J005M560L195j281l797k752J381L538K481
901D508k316m440j264K602M208J821l206n049j798L047M822J728k773m604j083
916c797K500L914O43l006l617K6L383L353k51m273l489L20M298M003k16m459l771
933d439M49L790L280q20l578k421J153L748J885j739m458j859K700M516J868k429
949A646m490k447K319M539J982k154m084j205J938L817J000l155l032j60L001
$$ y = [-1544, 2361, 5505, 4389, -335, -3382, -1300, 3745, 6741, 4788, -203, -3762, -2044, 3312, 6429, 4898, 520, -2341, -535, 3886, 5971, 3003, -1135, -2509, 920, 5584, 6545, 2644, -2392, -3559, 411, 5417, 6607, 3071, -1869, -2627, 721, 4497, 5062, 1677, -1972, -1855, 2263, 5157, 4278, -51, -3701, -2485, 2515, 6043, 4501, -19, -3822, -2817, 1743, 4938, 3657, -140, -2892, -1511, 2027, 4508, 2192, -2248, -3512, -910, 3298, 5119, 1913, -3136, -4934, -1887, 2935, 4663, 1890, -2714, -3797, -1297, 2617, 3260, 254, -3363, -3337, 46, 3399, 3148, -1125, -4614, -4294, 4, 4007, 3791, -668, -4439, -3990, -200, 3080, 2260, -1318, -3739, -2586, 1162, 3047, 1308, -3150, -5009, -2309, 2207, 4075, 1646, -2844, -5291, -2972, 1567, 3549, 1395, -2689, -3894, -1956, 1861, 2861, -294, -3326, -3486, -485]
964d85L911k75l694l763Q8L683M016N06l673m056J99L418L078l81l470k615J203
981b310L800J974j475l793k431J898M364K177j644m185k701J633M166K456j806
996B123l589j719J743L578J058k658l164o54K852L739P34l505l870o91L479L601
1012C057O71k871l656k36K535L436m64k669k950Q67L633K467j485l588k666J269
1028b650L884K812j368l494k335O69L542K402j399l149j718J668L143J287k374
1043I20l726o28K793L870Q75k945l749j080K822L586P75k396l217p20K412L166
1059B758k55k689k648L78L225K959p97l607k882J112L333K885o49l365k531N36
1075b237L100K174p25l204j864J866K739J569k291l389j007K336L659J269k375
$$ y = [-485, 3426, 3151, -543, -4306, -4218, -535, 3481, 3987, 314, -3742, -3543, -125, 2953, 2572, -898, -3513, -2310, 1490, 3464, 1989, -1804, -4235, -2337, 2027, 4204, 2560, -1625, -4326, -2693, 1473, 3929, 2123, -1466, -3185, -1442, 2136, 3194, 536, -2628, -3282, -430, 3309, 4043, 538, -3332, -4023, -544, 3057, 3728, 857, -2799, -3035, -500, 2936, 2472, -197, -3147, -2280, 1353, 3820, 2335, -1253, -3919, -2650, 1234, 4046, 2678, -816, -3151, -2482, 1060, 3462, 2063, -1086, -2804, -1136, 2007, 3294, 920, -2806, -3434, -641, 3229, 4104, 1159, -2590, -3670, -848, 2738, 3513, 1117, -2100, -2820, -408, 2758, 2503, -186, -2834, -2456, 769, 3728, 2931, -676, -3558, -2446, 887, 3772, 3123, -242, -2773, -2237, 863, 3037, 2312, -892, -2756, -890, 1849, 3418, 1127, -2262, -3269, -933, 2726, 3995, 1620]
1090A620l605j375K290L484O61j725k842j048K187K710K21k416k687k8L179K876
1106C502l51l359l133N29L149K879k2k944k990O95K635K077r98k542j635J208
1122a300L319J052j421l502j635J952L588J787j854l447j810J928L198J416k086
1137A185k773n62J712L117L2k282k858Q8K682L002k02k653l267r3K951K755j34
1154B700k363k422Q2K762K296p66k745j950J123K933J906j631l017j779J203L111
1170A443K343j544k911j868J441L152J177j834k625j038J989K663N40j999k870
1185a941n97K379L138K22k325l055o51K750K938p9k082k853L07K326K421p17k635
1202d54k124J044K657J736q40l110j550P27L075J962j329k602j914J061L143J209
$$ y = [1620, -1985, -3360, -1070, 2414, 3075, 1350, -1492, -2540, -353, 2357, 2578, 162, -2525, -2553, 626, 3502, 3151, -208, -3341, -2812, 337, 3216, 3194, 250, -2740, -2045, 590, 2667, 1669, -873, -2508, -1300, 2019, 3071, 1650, -1852, -3487, -1535, 2053, 3840, 1986, -1461, -3271, -1343, 1855, 3271, 1185, -1588, -2150, -438, 2679, 2711, 429, -2429, -2341, 341, 3343, 3141, 488, -2779, -2872, 79, 2834, 2700, 337, -2085, -2003, 759, 3055, 2289, -456, -2406, -1283, 1650, 3556, 1925, -1092, -2871, -1668, 1443, 3786, 2242, -669, -2537, -1096, 2056, 3233, 1399, -1226, -2264, -275, 2388, 2928, 929, -1941, -2538, -159, 2979, 3201, 876, -2179, -2830, -80, 2858, 2779, 697, -2156, -1849, 477, 2898, 2181, -454, -2578, -1534, 1123, 2859, 2019, -1091, -2641, -1914, 1161, 3123, 1794, -808, -2722, -1661, 1482, 2691]
1218B691j117l017j142J762K664Q33k093k775o49K197K769O98k098k543p07J795
1234g32K252N68j993k083m51K146K360j3k753k121N23K538K228n87k628k302Q33
1251b215K867J729o67k704j340N14K771J089q21k631r05J127K560J293j948k281
1267a562j165J541L031J181j978k573p61J827K410M47j994k184P9J822K230J22
1283B473k157k195K0K470K194n49j923k344J03K835J665n11k009j723N12K252
1299A113J443p57k512j225J216K270J712j568k550j204J371K632R62j244k722
1314a063q31J476K210Q09j506k100n67J649K310L16j700k323l04J888K250J29
1330B643k051k291n0K163K045k02k107j475K78K155J220l67k057j946J069K464
$$ y = [2691, 1574, -1443, -2585, -823, 1841, 2674, 581, -2194, -2843, -646, 2123, 2821, 723, -1820, -2527, -732, 1520, 2088, 95, -1988, -2439, -293, 2067, 2054, -699, -2820, -2297, 241, 2469, 1882, -746, -3048, -2215, 652, 2381, 1714, -990, -2330, -1816, 955, 2044, 1223, -1408, -2313, -1186, 1374, 2667, 719, -1562, -2727, -1186, 1845, 3026, 1048, -1525, -2286, -459, 1951, 2398, 404, -1780, -1701, 121, 2351, 2473, 316, -1879, -1859, 611, 2805, 2256, 333, -2011, -1908, 927, 2592, 2081, 72, -1651, -1139, 1113, 2556, 1799, -713, -1938, -722, 1548, 3260, 1692, -858, -2062, -691, 1941, 2903, 1659, -1063, -1894, -418, 1792, 2601, 1095, -1005, -1572, 77, 2387, 2703, 1003, -1320, -1624, 264, 2514, 2643, 592, -1699, -1749, 414, 2459, 2257, 150, -1325, -1047, 1108, 2328, 1961, -96, -2042, -973, 1491]
1346A491J118q16k370j491R37K543J080j094k193j323J607J961Q75j762j694n26
1362a657J231K287K75j673k060m02J849K096K15j721j873k33J601K055K83k463
1378a90j839O27J948J576k14k397j465N03K287J683r80k214j527Q95K143J281
1394B117p24k119j217P93K469R53j428j933q47J337K026R68j558k283n12J653
1410c05J895O02j536k168l67K047J522M16j883j829J38J606J742j7j904j715K04
1427a552K067J481l01j973j438M37J630J891p35k055j413R71J976J176j072k115
1443a025r16J092K079Q29j064k232n95J440J759O06j333j835o93J563J617M96
1459A788j374j668n12J505J771L13j757j822Q5J622J831k43j989j440N61J662
$$ y = [1491, 2609, 1793, -577, -2068, -1131, 1412, 2492, 1398, -795, -2118, -511, 1450, 2325, 563, -1131, -1657, -426, 1861, 2136, 463, -1597, -1999, -150, 1946, 2161, 440, -1433, -1666, -65, 1990, 2273, -190, -2029, -1402, 546, 2122, 1908, -489, -1954, -1451, 836, 2519, 1539, -675, -2202, -1307, 836, 2117, 1393, -726, -1943, -1150, 1319, 2272, 844, -1089, -1936, -599, 1427, 2395, 837, -1446, -1958, -305, 1590, 2192, 656, -1512, -1879, 168, 1690, 2106, 223, -1606, -1468, 138, 1880, 1863, -41, -1756, -1552, 515, 1996, 1695, -278, -1716, -1279, 351, 2242, 1507, -548, -1961, -990, 986, 2162, 1090, -1025, -1941, -849, 1230, 2059, 995, -1237, -1832, -392, 1367, 1973, 640, -1195, -1888, -325, 1292, 1788, 414, -1254, -1766, -261, 1510, 1823, 66, -1756, -1671, -49, 1782, 1539, -450, -1890, -1329, 333]
1475C33J293j77j943j387O91J768J377j040j735r22M23J990J218p84k077j286
1491b258J124K316Q20j214k045n01J112K002N39j439j852l88J378J724N00j614
1507B04j739l18J655J707M9j621j809L93J485J794n18j562j623M82J982J345m57
1524A449j854j282M20J982J290j116j790q79P47K159P26j035j642p93Q90J685
1540I57J075j377j530p64J338J437N29j030j819l20J442J712q2j351j556l27J857
1557A91J263K51j596j504j02J860J291l28j569j059J61J600J341n65j560j264
1573a589N62J994R35q49j605j132R79J711N91r68j405q13J011J703K10q18j491
1590i74l20J049J709K23j347j427l26J255J515L21j434j527l73J426J622Qj668
$$ y = [333, 1626, 1449, -494, -1881, -1190, 578, 1955, 915, -820, -1742, -1319, 671, 1889, 1105, -972, -2258, -1134, 1182, 2002, 788, -1257, -1758, -646, 1356, 1895, 456, -1396, -1784, -406, 1318, 1818, 204, -1535, -1853, -198, 1509, 1558, -63, -1872, -1479, 6, 1800, 1282, -280, -1903, -1421, 561, 1906, 1449, -405, -1687, -1267, 715, 2005, 889, -901, -1780, -1033, 1126, 1852, 817, -825, -1618, -728, 957, 2032, 655, -875, -1639, -301, 1136, 1665, 635, -1184, -1504, -62, 1650, 1568, 217, -1339, -1666, 191, 1454, 1705, 109, -1395, -1497, 363, 1654, 1326, -243, -1302, -1141, 459, 1800, 1235, -325, -1589, -1027, 967, 1902, 1053, -552, -1684, -705, 1006, 1597, 629, -776, -1589, -578, 1125, 1335, 517, -974, -1294, -245, 1464, 1687, 340, -1087, -1413, -158, 1357, 1678, 244, -1283, -1656, -230, 1392, 1400, -268]
1607b68j275L88J314J264j33j821j152O83J381J009l87j538j057L40J593J188
1623A529o28j474q63O11J766N06r72j819j32J075J203P53j247j489m02R76J607
1640A000M90j422j254m46J228J552k16j060j212p4J605Q29J41j555j226J45J822
1657C47O92o8j419j249M65J355J084m54j550r90P26J414N23n03j412o66P74J504
1675E73Q95q60j761p88J121J291Q01j007j343o56R57J506K83j034j314o0J097
1692b99R83p0r91j353P7J364J250L1j478o96J4J297J333o68j464q16N79J033J047
1711A173k79j589q60O24J486P33q37j277n99P09J150O81p42j138q42Q67J470N35
1729A265r93j292j29P37J620J17j340j245Q2J103R94M12j580q80L5J340Q50k7
$$ y = [-268, -1543, -1155, 159, 1423, 1290, -531, -1683, -1000, 381, 1390, 1003, -535, -1592, -1252, 341, 1529, 901, -573, -1436, -825, 941, 1447, 475, -1344, -1476, -401, 802, 1555, 308, -1181, -1583, -607, 1000, 1490, 68, -1186, -1632, -404, 1148, 932, -128, -1340, -1414, 191, 1020, 1161, -394, -1620, -1475, 347, 1039, 971, -448, -1697, -1232, 123, 1207, 753, -797, -1787, -1061, 353, 876, 373, -1039, -1705, -931, 573, 1468, 608, -1153, -1941, -820, 471, 1272, 265, -1078, -1734, -777, 729, 1012, -22, -1336, -1396, -299, 684, 614, -377, -1730, -1653, -289, 961, 992, -486, -1182, -1168, 129, 1462, 794, -670, -1486, -907, 126, 1173, 894, -695, -1555, -931, 555, 1288, 451, -826, -1425, -716, 434, 1115, 373, -765, -1607, -740, 730, 1265, 272, -1020, -1149, -412, 1208, 1325, -15, -1260, -1178, -75, 919, 1331, -249, -1129, -1094, 246, 1096, 1069]
1747A069j240j074M12J265Q12l70j367j070J035J183P55m01j421p58N59J485M55
1764A329n66j275n80P21J298N75j248j150k32J029J329L21j128j524j66J378J091
1781A202K38j149j093q3P75J190K1j425o45J78J201Q07l14r64r96L18J358N35
1799A154l41j404l72M32Q29P73l91j298l97O80R05P20j046j159l83P92J023P44
1817A261r44j204l37R60Q49L92r43j022n3O92J286m16p25q40K1Q44J239k39j249
1836d28r98J55J124R81j57j085j064N25J002N44Q2j480n17O15R93N20n20j173
1854h81p14P98J276K49n26j297n99R38J018M45q06r15j98Q72J012j40o62j123
1872a253kQ44R58O4j141p96j69J199Q50J63j299n49m4J096P25k40r90o06M98R00
$$ y = [1069, -171, -1245, -833, 432, 1244, 874, -493, -1563, -528, 655, 1410, 1009, -412, -1170, -611, 874, 1329, 763, -512, -1092, -371, 927, 1502, 254, -896, -1128, -99, 1230, 1551, 423, -1101, -1267, 111, 1202, 1440, 291, -802, -885, -110, 1080, 1101, -324, -969, -791, 410, 1217, 903, -61, -1057, -739, 619, 1154, 813, -591, -963, -531, 298, 1071, 680, -618, -1015, -335, 570, 1290, 244, -915, -1298, -506, 517, 1261, 317, -887, -1224, -264, 585, 977, 34, -988, -1041, -349, 937, 521, -204, -1044, -1023, -179, 1060, 821, -428, -1426, -1271, -147, 834, 677, -408, -1472, -947, 55, 599, 681, -799, -1316, -701, 292, 812, 292, -881, -1595, -797, 479, 728, 202, -1095, -1694, -756, 262, 707, -99, -1014, -1212, -340, 672, 532, -130, -1253, -1255, -411, 547, 611, -530, -1326, -1495, -296, 554, 717, -582, -1131, -1175, -79, 646, 406, -584, -1190, -692, 208]
1892B08O65k74j465l38M49J056R36q48r34o79O17R38O44l91j324k42M39J151M31
1911A039j002j033j33Q80J034R7q08j111K93Q42J054lp93j348J59J025P34m25
1929E01q30m80L24P45J041o74j042l14K99P03J086p18o68p49K51J191L60l69j240
1948e83j48P82P85Pl86j174k52J257P35L18q39r70k78P15R53P5o99o46j77Q77
1968C52O83j28r77n48K73M79J197m72j083p34L06J434K95k95q07o38J43O54P27
1987H61k56p64q04N65J075K65o56o93n11M92J295K37p64j019j98N70Q20M07p24
2006A98r07q0P49O82R9o20j023j5J013O54K21r46q52P2R00R58o08p62n24j0R00
2027I9M45j55j112J09J55Q73J12k07q29o93N72J083O81j078n39p19O80Q88K81
$$ y = [208, 873, 599, -866, -1204, -755, 301, 1237, 389, -545, -1224, -607, 331, 975, 584, -740, -982, -543, 608, 1039, 37, -996, -1129, -249, 785, 882, 74, -1037, -744, 98, 1152, 1149, 356, -992, -833, 192, 926, 501, -329, -809, -485, 260, 1301, 627, -415, -729, -430, 273, 1359, 641, -27, -776, -525, 666, 1026, 657, -583, -731, 51, 836, 843, 457, -717, -969, 288, 1023, 1341, 502, -468, -746, -31, 922, 997, 298, -348, -525, 352, 1035, 907, -70, -618, -345, 134, 1331, 859, -224, -958, -652, 782, 1077, 782, -25, -663, -520, 134, 861, 605, -159, -963, -398, 677, 942, 286, -407, -918, -426, 869, 1106, 342, -677, -875, -305, 515, 922, 198, -709, -789, -40, 642, 741, 121, -902, -917, 96, 750, 971, 25, -827, -755, 145, 1103, 495, -267, -791, -801, 99, 544, 389, -723, -614, -459, 414, 526, 319, -510, -1203, -631, 452, 1133, 55, -484, -1203, -523, 365, 646]
2046F46m91o57k44P04P75j17r56k11k50Q66N16K44r89m71l82Q31P30l03l40q81
2066i80K54P73O38k54p82l63k09J311M97o05q70l57N86Q31L88n70r01o3L47O55
2086C26N65o87n76k12K16R22J32n13j024K39M45O81N27q56r12R0O22Q62j20j018
2106b91l82J43Q53L50l35n38o38J87Q35L80J03j075k96J82Q25M54k14q45n61N36
2126c27P21K59k03r01l18O21R00lm40q99j43O65N36J23n00o99J1N51M58M82q11
2147H3o54k99R25L64K13r07m89P9Q44M42j51m94p79J46Q33O02o12m40k22J18O38
2168B40K73p0r11j09L19P10L48m85p21k69K89P03L72n33q08lN80Q10r8o48n89
2189f00o1Q42K75l8n39m51J45N33L05l8k68n83p7Q80M39no99m10j29M84Q04k01
$$ y = [646, 155, -502, -746, -42, 733, 616, -340, -551, -801, 65, 581, 825, -164, -635, -1017, -186, 544, 241, -99, -980, -726, 47, 685, 431, -351, -714, -923, 388, 885, 280, -590, -947, -361, 470, 858, 288, -613, -676, -329, 326, 891, 204, -372, -584, -368, 554, 686, 173, -851, -612, -167, 514, 1041, 185, -727, -637, -15, 847, 727, -291, -673, -530, 323, 673, 338, -200, -838, -651, 184, 564, 667, -408, -704, -522, 303, 757, 543, -302, -863, -327, 394, 653, 450, -451, -769, -148, 752, 749, 309, -590, -733, -68, 468, 591, 91, -608, -597, -46, 412, 894, 83, -571, -870, 55, 419, 632, -275, -764, -685, 159, 601, 450, -44, -823, -677, 156, 758, 146, -294, -516, -398, 240, 513, 443, -468, -577, -258, 452, 800, 315, -406, -675, -386, 317, 689, 156, -652, -655, -75, 735, 637, -11, -600, -661, 181, 456, 418, -121, -572, -427, 106, 411, 373, 105, -478, -555, 325, 764, 759, 60, -350, -479, 5, 809, 608]
2211F08q05m02L83O11J66k33q48k1M82L90L48l47p26k47K84P26K61l81m91j64
2231d06M17N11l6k35p97Q6K89P35K47q23n03J26N42M90j5n46n41J36N07K03q9
2252B98j63p63L08L81N71j80o21l48J37N25J12L91r40k95K43O91L35o31o00L8
2272e11K99N14J32n18p27K34L40L55J50j03q19L8J71R07o8l92o08r2M19O23K63
2293F07q87n50L60K67N90j82m14n00k0P89K24j26n44o4J71K8L89K6n21l39L07
2314c89K52N74k55n46m66N89L56K73k89n67j46N48N90l87j40o40r2O33L90j1l45
2335f8l43j57O73J37J09j01r88R8N29O73j45n54l98J52P42L40m81n64j77L71K96
2356A44L22k94p71L43K3O10K88n56p9o21L28M46L99k92p69Q3L18O60o0l79m88
$$ y = [608, -197, -599, -216, 395, 561, 328, -520, -541, -59, 331, 679, 332, -394, -641, -357, 369, 630, 249, -242, -406, 11, 522, 486, 251, -546, -460, -171, 564, 811, -12, -515, -389, 153, 643, 628, 82, -459, -323, 184, 387, 298, 135, -628, -320, 61, 632, 452, -169, -517, -380, 145, 257, 648, -292, -587, -344, 347, 682, 51, -549, -511, -212, 302, 434, -84, -811, -577, -237, 118, 268, 165, -654, -616, -445, 462, 394, 2, -606, -698, -279, 344, 607, -280, -830, -470, -203, 387, 205, -209, -709, -729, 60, 284, 158, -386, -450, -279, -251, 138, 164, -357, -696, -389, -137, 437, 182, -364, -830, -241, 115, 388, 99, -468, -614, -66, 524, 137, -3, -643, -735, -102, 288, 277, -68, -411, -568, 105, 242, 351, 250, -738, -640, -111, 562, 417, -137, -535, -383, 359, 699, 218, -346, -523, -152, 144, 466, 172, -599, -256, -233, 377, 665, 109, 30, -591, -263, 183, 582, 290, -479, -396, -78, 582, 522, 143, -345]
2377c45j61M25P05q4k17q94K72N33j01P9l64q4j77M46N19j62m61n25L35L21K91
2398C51J01n97l33R3O11L36m58m06j74L33L59L22m38l10j96K01N34o4j15l99j34
2419c83l9O32J21l95m85j49L65M67L44m40m60k06N77M40L0o77m66M35M80K61l56
2440I6k82M8k46l9M80K0m27j51n5N70K67J1p35m2K40K84L42m25l35j03L57N70
2462D45j78m47k28j47K29L23J64k71m36M72P6K10k9Ql77k77K65O53P4p38k27q
2484d44L30M33J56r43j30K53M38M44m69j65m73N56J40M55n51j22k48L22PK58m9
2505A98l82j23R5M58P3j4o63j41K36P95k54k36o13K47M33K69k24j10m17M6J85
2526a42L32ok88k11j12K12L30M71o74k39N5K70M54l18m03k48m1N29K45M1m37k60
$$ y = [-345, -506, -81, 624, 540, 323, -571, -299, 234, 133, 212, -152, -236, -413, 33, 552, 390, -71, -596, -261, 60, 351, 452, -145, -478, -385, 226, 562, 104, -302, -476, -143, 216, 538, 100, -210, -406, -205, 329, 265, 150, -249, -383, -422, 210, 331, -64, -549, -698, -333, 134, 478, 38, -422, -628, -51, 389, 419, -258, -724, -289, 191, 452, 96, -186, -138, -384, -423, 57, 77, -350, -501, -556, 14, 281, 292, -443, -485, -245, 39, 381, -44, -379, -482, -125, 445, 267, -180, -408, -555, -326, -3, 161, -110, -546, -74, 2, 212, 183, 191, -186, -463, -198, 455, 529, -209, -436, -444, -114, 319, 475, -468, -598, -345, 93, 537, 68, -97, -570, -14, 126, 581, 30, -92, -340, -18, -11, 247, 198, -184, -307, -212, 246, 319, 305, -358, -499, -263, 532, 278, 42, -571, -324, 109, 378, 154, 44, -373, -327, -142, 190, 184, -104, -315, -427, -215, 115, 586, -88, -327, -272, -2, 452, 134, -269, -517, -558, -29, 216, 257, -180, -440]
2548d40L67J25M53m23l67j63M17N3K01p1m67N4k1K24N42k51m66l84M55L95K4m93
2570b36k51j4N85L10O0n44l79RN01m9J83k86j67j78O18j36L93n40l25K24M05J91
2592C74o1m00m83N01L70j13j26m54J70K93O1K76l18j49k90K87J94K68n01r1P2
2613a20RN24O1j66o47l07M47N15P7m14l14K5L62M31m24K1k0r4M26J21k84n54J57
2636a68r6J99L41p9m02nj50L60J25k4l42lJ24K44M63m62k71l14N18K8Mj29k53
2659b92J84J08J29k46M30l18k32J07N64l33n6l13n5K30L15j22j75l38L2O62o6
2680B15j05k47j6j53P86k18k82j37j20K71J79Q8j48q7m27M4M75L41m85k96j56
2701d78L61L68J10l39k20l6J82M41Q7l91l27N3J15M18o7q8j28l79M31J86r1k64
$$ y = [-440, -73, 52, 505, 82, -285, -448, -31, 22, 223, 152, -315, -261, -282, -58, 484, 233, -233, -617, -162, 233, 257, -236, -487, -501, 84, 394, 454, -90, -469, -460, 41, -8, 175, -111, -278, -456, 162, 26, 419, -121, -446, -222, 183, 374, 313, -87, -570, -69, 301, 188, 62, -392, -222, 71, 132, 408, 90, -59, -349, -62, 132, 400, -101, -192, -120, -111, 413, 474, 308, -339, -646, -199, 316, 393, -21, -335, -310, 52, 483, 59, 80, 60, -34, 392, 513, 229, -325, -168, -264, -65, 276, 197, -205, -210, -360, 0, 125, 101, -241, -244, -120, 124, 587, 125, -146, -460, 58, 86, 90, -39, -292, -108, 0, 129, -117, 313, -5, -237, -130, 434, 101, 45, -268, -323, -93, 222, 100, -75, -413, -381, 281, 215, 110, -137, -153, -306, 480, 262, -20, -157, -277, -6, 173, 261, 113, 26, -401, -357, 118, 459, -26, -322, -478, -117, 251, 361, 22, -198, -234, -52, 389, 476, 85, -242, -189, -74, 344, 277, 189, 61, -318, 113, 299, 208, -56]
2723e6Ok34J63K40N9l02k66j03N48N48m62n15l9K72L60J75l63p5q1J61J04J46
2745B86j95J05k89K65k4J68q2m29j09M45K90j51J29o36lK92M69j99k28l00q7K71
2767a2L78k62k51K40k08R6k5J77n3l24J43LO03k66k8q30K63N10K02k20m21J22
2789a63k5L52n0rj96%K82K54j48l61l6k38JO71m9l55n8J1J00K41J82k48l43k81
2813d66M77N25m72j93j79J47M48Mj05m59k15M50L61k89K18k69j98J19j52M68q1
2834A39l10j37O5M52o4k98q7k03J78M11J39l64r9k22J90M76O1m67q2j07J01K61
2856C3j22q3N3m8K01q3K78m82o5M8J88L62k26l34j70J95K93J39J18p64j53L43
2878b79K23J69L4k47R9j73L37R6l78n4k1P7J9J75j05L2o01L97N64p0j98m11J66
$$ y = [-56, -50, -284, -121, 119, 178, -124, -390, -493, 55, 603, 141, -374, -413, -141, 219, 394, 31, -44, -125, 36, 140, 286, 91, 196, -93, 172, 148, 316, 234, -195, -304, 141, 431, 280, 409, -227, -230, 62, 531, 332, 104, -196, -283, -12, 366, 104, -147, 93, -115, -19, -44, 133, 80, -244, -101, -98, 505, 239, 211, -619, -356, 154, 356, 136, -285, -163, -188, 164, 114, 105, -91, -91, 191, 445, 297, -64, -100, -338, -337, 334, 285, -70, -128, -117, -17, 224, 406, 158, -185, -466, 11, 536, 64, -129, -308, -161, 287, 291, 186, -273, -488, -38, 323, 34, 252, -17, -215, -96, -248, 220, 139, -171, -308, -243, 209, 145, -153, -240, -443, -265, 146, 285, -79, -178, -400, -210, 266, 327, -140, -222, -329, -228, 33, -89, -172, -119, -167, 34, -49, 229, -253, -318, -270, -82, 280, 54, -280, -450, -255, 38, 177, 295, -469, -622, -279, -56, 113, 147, -100, -1, -174, 163, 259, -119, -173, -194, -117, -98, 77, -28, 4, -597, -200, 364, 294, 96, -315, -149]
2901a49JM88l19p9j62j42L64J31K10k40m01Q9J42L43q0k48k33J18M43p9J92m57
2923f8k76J7N66O0O5n47j92K87K88K22k28k49j23L2J66M9Q4q4k39J2K67K22m03
2946g2R4n10N04K26m8k66k56R8N1O89n44k12J37J62J47k3qk70l54J14L26L52k28
2969A09j5l63J21pJ84J43n10J93P7L01o7k7j27m29K41L55J02l32k21m3J23L25
$$ y = [-149, -148, 340, 21, -58, -220, -362, 2, 133, 343, 103, -298, -209, -67, 276, 196, -52, -285, -167, 276, 197, 389, -68, -344, -327, 239, 299, 364, -183, -375, -88, 200, 422, 194, -55, -178, -146, 20, 69, 153, 69, -170, -158, 109, 331, -72, 22, -488, 16, 242, 194, -72, -328, -230, -179, 510, -34, -246, -109, 53, 200, 177, 169, -101, -455, -341, -15, 337, 109, 94, -269, -148, -155, 29, 172, -338, -145, -68, 233, 166, 139, 12, -417, -176, 179, 281, -51, -272, -315, -192, 133]
$$ [...]
8191C6
##END NTUPLES=NMR FID
##END=
