##TITLE=1H_10-2025
 200.13MHz, CDCl3,
 8 sc
 
 17.1.2025
##JCAMPDX= 6.0         $$ Bruker NMR JCAMP-DX V2.0
##DATA TYPE= NMR FID
##DATA CLASS= NTUPLES
##ORIGIN= UXNMR, Bruker Analytische Messtechnik GmbH
##OWNER= pz
$$ XWIN-NMR		Version 3.5
$$ Fri Jan 17 14:45:40 2025 Russian Standard Time (UT+4h)  she@DPX200
##.OBSERVE FREQUENCY= 200.1313
##.OBSERVE NUCLEUS= ^1H
##.DELAY= (6, 6)
##.ACQUISITION MODE= SIMULTANEOUS
##.ACQUISITION SCHEME= undefined
##.AVERAGES= 8
##.DIGITISER RES= 18
##SPECTROMETER/DATA SYSTEM= spect
##.PULSE SEQUENCE= zg30
##.SOLVENT NAME= DMSO
##.SHIFT REFERENCE= (INTERNAL, DMSO, 0, 14.3821)
##AUDIT TRAIL= $$ (NUMBER, WHEN, WHO, WHERE, WHAT)
$$ ##TITLE= Audit trail, XWIN-NMR		Version 3.5
$$ ##JCAMPDX= 5.01
$$ ##ORIGIN= Bruker BioSpin GmbH
$$ ##OWNER= she
$$ F:/spectra/data/she/nmr/H-C/1/audita.txt
$$ ##AUDIT TRAIL=  $$ (NUMBER, WHEN, WHO, WHERE, WHAT)
(   1,<2025-01-17 14:44:39.53 +0400>,<she>,<DPX200>,
      <created by zg, POWCHK disabled, PULCHK disabled
       configuration hash MD5:
       00 E9 B6 7A A2 85 ED C7 34 08 36 98 17 FE 4E 26
       data hash MD5: 16K
       D1 D7 32 54 40 81 AD C9 A4 A4 91 DC BE EF FB 15>)
$$ ##END=
$$ 
$$ hash MD5
$$ 0F 6A 23 D2 1D 1C 32 FA 85 59 F6 D7 F3 56 E0 87
##$RELAX= 
##$RELAX= 
##$RELAX= 
##$RELAX= 
##$RELAX= 
##$RELAX= 
$$ Bruker specific parameters
$$ --------------------------
##$DU= <F:/spectra>
##$EXPNO= 1
##$NAME= <H-C>
##$PROCNO= 1
##$TYPE= <nmr>
##$USER= <she>
##$AMP= (0..31)
100 100 100 100 100 100 100 100 100 100 100 100 100 100 100 100 100 100 
100 100 100 100 100 100 100 100 100 100 100 100 100 100 
##$AQSEQ= 0
##$AQ_mod= 1
##$AUNM= <au_zg>
##$AUTOPOS= <>
##$BF1= 200.13
##$BF2= 200.13
##$BF3= 200.13
##$BF4= 200.13
##$BF5= 200.13
##$BF6= 200.13
##$BF7= 200.13
##$BF8= 200.13
##$BYTORDA= 1
##$CFDGTYP= 0
##$CFRGTYP= 5
##$CHEMSTR= <none>
##$CNST= (0..31)
1 1 145 1 1 1 1 1 1 1 1 1 1 1 1 1 1 1 1 1 1 1 1 1 1 1 1 1 1 1 1 1 
##$CPDPRG= <>
##$CPDPRG1= <>
##$CPDPRG2= <>
##$CPDPRG3= <>
##$CPDPRG4= <mlev>
##$CPDPRG5= <mlev>
##$CPDPRG6= <mlev>
##$CPDPRG7= <mlev>
##$CPDPRG8= <mlev>
##$CPDPRGB= <>
##$CPDPRGT= <>
##$D= (0..31)
0 0.7 0 0 0 0 0 0 0 0 0 0.03 0 0 0 0 0 0 0 0 0 0 0 0 0 0 0 0 0 0 0 0 
##$DATE= 1737110678
##$DBL= (0..7)
120 120 120 120 120 120 120 120 
##$DBP= (0..7)
150 150 150 150 150 150 150 150 
##$DBP07= 0
##$DBPNAM0= <>
##$DBPNAM1= <>
##$DBPNAM2= <>
##$DBPNAM3= <>
##$DBPNAM4= <>
##$DBPNAM5= <>
##$DBPNAM6= <>
##$DBPNAM7= <>
##$DBPOAL= (0..7)
0.5 0.5 0.5 0.5 0.5 0.5 0.5 0.5 
##$DBPOFFS= (0..7)
0 0 0 0 0 0 0 0 
##$DE= 6
##$DECBNUC= <off>
##$DECIM= 32
##$DECNUC= <off>
##$DECSTAT= 4
##$DIGMOD= 1
##$DIGTYP= 9
##$DL= (0..7)
0 120 120 120 120 120 120 120 
##$DP= (0..7)
150 150 150 150 150 150 150 150 
##$DP07= 0
##$DPNAME0= <>
##$DPNAME1= <>
##$DPNAME2= <>
##$DPNAME3= <>
##$DPNAME4= <>
##$DPNAME5= <>
##$DPNAME6= <>
##$DPNAME7= <>
##$DPOAL= (0..7)
0.5 0.5 0.5 0.5 0.5 0.5 0.5 0.5 
##$DPOFFS= (0..7)
0 0 0 0 0 0 0 0 
##$DQDMODE= 0
##$DR= 18
##$DS= 0
##$DSLIST= <SSSSSSSSSSSSSSS>
$$ [...]
##$SUBNAM0= <"">
##$SUBNAM1= <"">
##$SUBNAM2= <"">
##$SUBNAM3= <"">
##$SUBNAM4= <"">
##$SUBNAM5= <"">
##$SUBNAM6= <"">
##$SUBNAM7= <"">
##$SUBNAM8= <"">
##$SUBNAM9= <"">
##$SW= 18.0517328524113
##$SWIBOX= (0..15)
0 0 2 0 0 0 0 0 0 0 0 0 0 0 0 0 
##$SW_h= 3612.71676300578
##$TD= 16384
##$TD0= 1
##$TE= 0
##$TE2= 300
##$TE3= 300
##$TEG= 300
##$TL= (0..7)
0 120 120 120 120 120 120 120 
##$TP= (0..7)
150 150 150 150 150 150 150 150 
##$TP07= 0
##$TPNAME0= <>
##$TPNAME1= <>
##$TPNAME2= <>
##$TPNAME3= <>
##$TPNAME4= <>
##$TPNAME5= <>
##$TPNAME6= <>
##$TPNAME7= <>
##$TPOAL= (0..7)
0.5 0.5 0.5 0.5 0.5 0.5 0.5 0.5 
##$TPOFFS= (0..7)
0 0 0 0 0 0 0 0 
##$TUNHIN= 0
##$TUNHOUT= 0
##$TUNXOUT= 0
##$USERA1= <user>
##$USERA2= <user>
##$USERA3= <user>
##$USERA4= <user>
##$USERA5= <user>
##$V9= 5
##$VALIST= <valist>
##$VCLIST= <CCCCCCCCCCCCCCC>
##$VD= 0
##$VDLIST= <DDDDDDDDDDDDDDD>
##$VPLIST= <PPPPPPPPPPPPPPP>
##$VTLIST= <TTTTTTTTTTTTTTT>
##$WBST= 1024
##$WBSW= 4
##$XGAIN= (0..3)
0 0 0 0 
##$XL= 0
##$YL= 0
##$YMAX_a= 576374
##$YMIN_a= -622829
##$ZGOPTNS= <>
##$ZL1= 120
##$ZL2= 120
##$ZL3= 120
##$ZL4= 120
##$ABSF1= 10
##$ABSF2= 0
##$ABSG= 5
##$ABSL= 3
##$ALPHA= 0
##$AQORDER= 0
##$ASSFAC= 0
##$ASSFACI= 0
##$ASSFACX= 0
##$ASSWID= 0
##$AUNMP= <proc_1d>
##$AZFE= 0.1
##$AZFW= 0.1
##$BCFW= 1
##$BC_mod= 2
##$BYTORDP= 1
##$COROFFS= 0
##$CY= -3
##$DATMOD= 1
##$DC= 2
##$DFILT= <>
##$DTYPP= 0
##$F1P= 0
##$F2P= 0
##$FCOR= 0.5
##$FTSIZE= 0
##$FT_mod= 4
##$GAMMA= 1
##$GB= 0.15
##$INTBC= 1
##$INTSCL= 1
##$ISEN= 128
##$LB= 0.25
##$LEV0= 0
##$LPBIN= 0
##$MAXI= 10000
##$MC2= 0
##$MEAN= 0
##$ME_mod= 0
##$MI= 1.114404
##$NCOEF= 0
##$NC_proc= 0
##$NLEV= 6
##$NOISF1= 3.799351
##$NOISF2= 2.8
##$NSP= 1
##$NTH_PI= 0
##$NZP= 0
##$OFFSET= 14.38212
##$PC= 1
##$PHC0= 253.3151
##$PHC1= 9.992201
##$PH_mod= 1
##$PKNL= yes
##$PPARMOD= 0
##$PSCAL= 0
##$PSIGN= 0
##$REVERSE= no
##$SF= 200.129724274929
##$SI= 16384
##$SIGF1= 3
##$SIGF2= 2
##$SINO= 400
##$SIOLD= 16384
##$SREGLST= <1H.CDCl3>
##$SSB= 0
##$STSI= 0
##$STSR= 0
##$SW_p= 3205.1282051282
##$SYMM= 0
##$S_DEV= 0
##$TDeff= 0
##$TDoff= 0
##$TI= <>
##$TILT= no
##$TM1= 0
##$TM2= 0
##$TOPLEV= 0
##$USERP1= <user>
##$USERP2= <user>
##$USERP3= <user>
##$USERP4= <user>
##$USERP5= <user>
##$WDW= 1
##$XDIM= 8192
##$YMAX_p= 0
##$YMIN_p= 0
$$ End of Bruker specific parameters
$$ ---------------------------------
##NTUPLES= NMR FID
##VAR_NAME=  TIME,          FID/REAL,        FID/IMAG
##SYMBOL=    X,             R,               I
##VAR_TYPE=  INDEPENDENT,   DEPENDENT,       DEPENDENT
##VAR_FORM=  AFFN,          ASDF,            ASDF
##VAR_DIM=   8192,          8192,            8192
##UNITS=     SECONDS,       ARBITRARY UNITS, ARBITRARY UNITS
##FACTOR=    0.0002768,     1,               1
##FIRST=     0,             0,               0
##LAST=      2.2672688,     0,               0
##MIN=       0,             -622829,         0
##MAX=       2.2672688,     576374,          0
$$ Real data points
##PAGE= N=1
##DATA TABLE= (X++(R..R)), XYDATA
$$ [...]
2130a081J350p38N12R53k006J172J142k182K008L44l157K269N92k718K140l77
$$ -1081 269 -469 43 996 -1010 162 1304 -878 1130 1474 -1683 586 1178 -1540 600 223
2146B23k089J725j56m66J110j057Q36L8q92K388j341q97K946k325n87L244k874
$$ 223 -1866 -141 -297 -763 347 -710 126 164 -728 1660 319 -578 2368 43 -544 2700 -174
2163a74o74K156k313J01R45j717O79q2j49J094j053J168P30j919K037J010k361
$$ -174 -848 1308 -1005 -904 41 -1676 -997 -1079 -1228 -134 -1187 -19 711 -1208 829 1839 -522
2180e22K057M55k726K419j3k455J721n88j231J110p51j87M17r62J015m71o15K608
$$ -522 1535 1990 -736 1683 1670 -785 936 348 -883 227 -524 -711 -294 -1256 -241 -712 -1327 1281
2198A281j866p10L000k237N1L005k751l34K043k118K94J006j423O35m68k96J259
$$ 1281 -585 -1295 1705 -532 -481 2524 -227 -561 1482 -636 -342 664 -759 -124 -592 -888 371
2215C71j691J242N66k241K294Q73k381K330K31k535K516k71j796J848r51q04O49
$$ 371 -1320 -78 488 -1753 541 1414 -967 1363 1594 -941 1575 1304 -492 1356 405 -399 250
2232B50p31K76j29j071J487j123q24K717j952j35K728k193J20K459j915L30J243
$$ 250 -481 -205 -334 -1405 82 -1041 -1865 852 -1100 -1235 1493 -700 -580 1879 -36 294 1537
2249A537j317J92P17r45N54j052L03O08j913J461K41k129J880L92k269K419j71
$$ 1537 220 412 1129 184 738 -314 -11 597 -1316 145 386 -1743 137 529 -1740 679 508
2266E08k219K257q3j199J629q66J64L83n95O33k23j131J988j736m34K510k673
$$ 508 -1711 546 463 -736 893 27 191 574 -21 612 389 -742 1246 -490 -924 1586 -1087
2283a087J27K408k670O33K196k043J92J406j497O72L9m89Q07o11K59O88k135J385
$$ -1087 -960 1448 -1222 -589 1607 -436 -244 1162 -335 337 376 -113 694 83 342 1030 -1105 280
2301B80K79k550K114L79k524K276J05k152K221m41q72J338l19L95L53q95J209
$$ 280 559 -1991 123 502 -2022 254 359 -1793 428 -13 -885 453 134 529 882 -13 1196
2318A196n43p81J779j772k1J881k129l27K061k362K36J623k341J041Q13j359J002
$$ 1196 653 -128 1651 -121 -142 1739 -390 -717 1344 -1018 -782 841 -1500 -459 354 -1005 -3
2335cn06k08J440j396R86O12k261K097J44k147K096Pk332K216k62j243J235o79
$$ -3 -509 -717 723 -673 313 925 -1336 761 905 -1242 854 861 -1471 745 483 -760 475 -204
2353b04l77P51m69Q53m52p42J477j138j07J993k037j86K025k107K0J812k090J23
$$ -204 -581 170 -299 554 102 -640 837 -301 -408 1585 -452 -638 1387 -720 -700 1112 -978 -855
2371h55J360j868J252J7o04P56q48M96P20j312J515p1j960K146N03k148K108l89
$$ -855 505 -1363 -111 -94 -698 58 -790 -294 426 -886 629 558 -1402 744 1247 -901 1207 818
2389H18j879K052m89q26J198r18m11O75l42M64q70l48J604j108j47J885j792k41
$$ 818 -1061 991 502 -324 874 -44 -455 220 -122 342 -528 -876 728 -380 -527 1358 -434 -675
2407f75J864k039M74J683k096O15M63j198J168n06k87Q23j148O22R95k010J535
$$ -675 1189 -850 -376 1307 -789 -174 289 -909 259 -247 -534 289 -859 -237 758 -1252 283
2424B83J69j943K213k02j747K112m96j497J760o06l50R10p51j33L49l97R58o36
$$ 283 452 -1491 722 520 -1227 885 389 -1108 652 46 -304 606 -145 -278 71 -326 632 -4
2442dm06J186j091J68J853k206J48J705k013O47J246j820O23L77r83R77o13pN41
$$ -4 -410 776 -315 -147 1706 -500 -352 1353 -660 -13 1233 -587 36 413 -570 407 -206 -213 328
2461C28j369R52L80j575J644k89j544K016m45j390J738o90q59J633n63k43O80
$$ 328 -1041 -89 291 -1284 360 71 -1473 543 98 -1292 446 -244 -1103 530 -33 -276 404
2478D04q06P73j85m72J257j511o6J582j589K79J580j935O92R02j482R68L94r26
$$ 404 -402 371 186 -286 971 -540 -606 976 -613 -334 1246 -689 3 905 -577 391 785 -141
2496a41Q06m71l69P92o50k41P76j505J278R3j605J821n80j440J823l19p64J495
$$ -141 665 194 -175 617 -33 -274 502 -1003 275 368 -1237 584 4 -1436 387 68 -696 799
2514G99j048j68R27p53L88M13p76O17o12o50J486j415p7J876k180M20J658j717
$$ 799 -249 -417 510 -243 145 558 -218 399 -213 -863 623 -792 -869 1007 -1173 -753 905 -812
2532h12N51J186j635J057P05j321P08M3J77M27j042Q08J10j594J116j43j362J537
$$ -812 -261 925 -710 347 1052 -269 439 482 659 1086 44 852 962 -632 484 341 -1021 516
2550E16m74j553J660o62q07J882q68k72J027j207J019J05p33J293j052n69J429
$$ 516 42 -1511 149 -513 -1320 562 -306 -578 449 -758 261 366 -367 926 -126 -695 734
2567G34j185r7J443j852N44J122j529P34M64j105J319j18n41N65l46N09J07o82
$$ 734 -451 -548 895 -957 -413 709 -820 -86 378 -727 592 474 -67 498 152 661 768 86
2585H6M05K44j534J434o46j166J096l07r96J561j039n12J551q32M13M18n11M96
$$ 86 491 735 -799 635 -11 -1177 -81 -388 -1384 177 -862 -1374 177 -655 -242 176 -335 161
2603A61r5J73J064j367k3J573j266j30J325k036L95P43j809J109J33j133P58K
$$ 161 66 239 1303 -64 -87 1486 220 90 1415 -621 -226 517 -1292 -183 -50 -1183 -425 -423
2621d23LP76p22M02L05q89J182L14j772J440m54j089J746n83j290J472j145j61
$$ -423 -420 356 -366 36 341 -548 634 948 -824 616 162 -927 819 236 -1054 418 -727 -888
2639h88P46k11L82M9l88M48m68L25J104j240L30J073j358M20R41k153J105L20
$$ -888 -142 -353 29 78 -310 138 -330 -5 1099 -141 189 1262 -96 324 1265 -888 217 537
2657E37j514Q57K72r47N33l26M2M34n75Q50l7r66J694k16j036J482p21o16J557
$$ 537 -977 -120 152 -795 -262 -588 -546 -112 -687 163 126 -840 854 638 -398 1084 363 -253 1304
2676A304j125m61Q97q28j42L63m05M78m57j31N49q04Q3J316j193L73R45j562Q59
$$ 1304 179 -282 615 -213 -355 8 -397 81 -376 -507 42 -762 -679 637 -556 -183 762 -800 59
2695E9P47j444O14Q19j553R95j31o91R84m77J46J11o84J115n19p19J333j15j056
$$ 59 806 -638 -24 795 -758 237 106 -585 399 -78 68 179 -505 610 91 -628 705 590 -466
2714d66J306o74o71J508p86q82J522r83j75M17o03M37k63k52Q91j176Q6J176j138
$$ -466 840 166 -505 1003 217 -665 857 -126 -301 116 -487 -50 -313 -565 326 -850 -764 412 -726
2733g26L15P19j062P02P38j277Q41K76p45O31J9k02M75r04N21P9p27Q51l03j349
$$ -726 -411 308 -754 -52 686 -591 250 526 -219 412 431 229 704 -200 321 400 -327 524 221 -1128
2753a128J810n60j031J452q41N0N85p15j69P53n08L37J82m99M41m07l7J008j216
$$ -1128 682 122 -909 543 -298 -248 337 -378 -547 206 -302 35 217 -282 159 -248 -285 723 -493
2772d93K81P93j233N13R26j278O98Q4j037J230k96m30Q31q97J96L54o98Q59n71
$$ -493 -212 581 -652 -139 787 -491 207 291 -746 484 188 -242 589 -308 -112 242 -456 403 -168
2791a68p01J151l03p12J242n14p93J290o20m90J187r58K20N16m03L06j85R6M70
$$ -168 -869 282 -21 -733 509 -5 -798 492 -128 -618 569 -389 -169 347 -56 250 65 161 631
2810F31n75j16P35j047M63O68j498R11M22j299Q09J97r49R54k32m20L19l92M53
$$ 631 56 -60 675 -372 91 759 -739 172 594 -705 104 301 -648 306 74 -346 -27 -419 34
2829C4K01n94O89j12q61J395n76r36J392p75o30J464q62l55R76q48M08L50l96
$$ 34 235 -359 330 218 -643 752 176 -760 632 -143 -773 691 -171 -526 450 -398 10 360 -36
2848c6O66p47n3P03r71M89P69j416Q20J64j083Q42K61j130O80Q1o94R43m37P0
$$ -36 630 -117 -170 533 -438 51 820 -596 224 388 -695 147 408 -722 -42 39 -655 288 -149 -79
2868g9J47r2L50l5p84J039k20o22J309r18n51J178q90k13R25p71j78P15r33O46
$$ -79 68 -24 326 291 -493 546 326 -296 1013 95 -456 722 -168 -381 544 -227 -405 310 -623 23
2888B3N4l97N71q35K96N49p07N10O69j119N69N56j336Q32J86j072Q55l04k34O57
$$ 23 77 -320 251 -584 -288 261 -446 64 733 -386 183 739 -597 235 421 -651 204 -100 -334 323
2908C23k10m15O58o41Q26k39p26R95l75o44J359r16m69J185o60j78L89n51L86
$$ 323 113 -302 356 -285 541 302 -424 571 196 -448 911 -5 -474 711 51 -127 262 -289 97
2927I7K02o37K76q2q5N62q41L85N23j009M46J153j152L14K90j105P19L09j138
$$ 97 299 -338 -62 -144 -229 333 -508 -123 400 -609 -163 990 -162 152 442 -663 56 365 -773
2946g73P50j44j49k1j00L57r9n92R91n03k43J055o46l73J065n21n47J298j050
$$ -773 -23 -167 -316 -337 -437 -80 -179 -771 220 -283 -526 529 -117 -490 575 54 -493 805 -245
2965b45L16N78o95Q6L58l17L34j61k66N49j018L11N80j251R06K57j244Q83N21
$$ -245 71 649 -46 40 398 81 415 254 -12 537 -481 -170 410 -841 65 322 -922 -39 482
2984D82r04M84J83r04J147m13k41N36r72M89L13p00O92k52o08J120o81m57J319
$$ 482 -422 62 245 -659 488 75 -166 370 -602 -113 200 -500 192 -60 -668 452 -229 -686 633
3003F33q22k2Q66r80L98M26n42N20j54m33N09n18k21P36r71L52M93j077Q76m0
$$ 633 -189 -211 655 -325 73 499 -43 477 323 -110 399 -119 -340 396 -575 -223 270 -807 69 29
3023B9p30Q23J14q37R75j39l09M32j14K71l38l08M15J40o26P41n15m13J013j070
$$ 29 -701 122 236 -601 374 235 -74 358 244 515 177 -131 284 424 -202 539 24 -389 624 -446
3043d46k26Q42q16L54L04n46L62N90n90M84j73k28Q62j214N89N31j042N46J74
$$ -446 -672 170 -646 -292 12 -534 -172 418 -172 312 139 -89 773 -441 148 679 -363 183 357
3062C57r74R26K05j140Q71j0p56Q94j95l01N85n85M92j88m41Q32n08l20P24o82
$$ 357 -617 309 514 -626 245 235 -521 373 178 -123 462 -123 369 181 -260 572 64 -256 468 -214
3082b14k33R62q85J42O43j206N03N07p75L89L00m39P63m93J9O77p95M42M16j042
$$ -214 -447 515 -370 -228 415 -791 -288 219 -556 -167 133 -306 457 -36 -17 660 -135 307 723 -319
3102c19O42K37j074O42K38r53Q33m5p30P32m89o2L97j78K15j88m63Q59mn92N82
$$ -319 323 560 -514 128 366 -587 246 201 -529 203 -286 -348 49 -129 86 -102 -565 294 290 -302 280
3123B80m33l04J097r48J84O98p59J95K44m90J62K17l61O23p75L44L56m61N82K41
$$ 280 -153 -457 640 -308 -124 574 -185 10 254 -236 -74 143 -218 405 -370 -26 330 -131 451 692
3143F92j058O64J81j052R55l11o17R08o26m44P34m06K16L88p53M87R4n36O19l75
$$ 692 -366 298 479 -573 382 71 -546 362 -264 -708 26 -380 -164 224 -529 -42 52 -484 135 -240
3163b40n4J083q94K14O40p04j57Q81j078N76J3n30N35m94KN54n08J37N68q44N49
$$ -240 -294 789 -105 109 749 45 -112 769 -309 267 280 -250 285 -209 -207 347 -161 -24 544 -300 249
3184B49M6p90O32K40p03R97n45l40P38k95l58L65m62M81k71n12R35n84m96J074
$$ 249 295 -495 137 377 -326 671 126 -214 524 229 -129 236 -226 255 -16 -528 407 -177 -673 401
3204D01n91l0O63n54j40Q19q66J21O99q60M36j05o11O14l32L22L72j049R04J88
$$ 401 -190 -220 443 -111 -251 568 -298 -177 522 -338 98 -7 -618 -4 -336 -14 358 -691 213 401
3224D01q78N50K51q25P86k42j63O70j23m06M05l86m5M03m95J21P9l95O14n12k91
$$ 401 -477 73 324 -501 285 43 -120 550 427 21 426 40 -5 398 -97 24 103 -292 322 -190 -481
3245d81R42p21l56J028p63k1N20o14M37K8l34L99l8j22K45k55J6L31o89M46K87
$$ -481 461 -260 -616 412 -351 -372 148 -466 -29 -1 -335 64 26 -96 149 -106 -90 241 -448 -2 285
3266B85q79P99J3o91P87J39j061R32P0l79L39r4m1J67o97O83k14m30P45o60m92
$$ 285 -594 205 218 -473 314 453 -608 324 394 15 354 260 219 386 -311 372 158 -272 473 -187 -679
3287f79J034p60J2Q60r30P0M75l01K02pj56J88P8j99O01m77K25J97o04L10J94
$$ -679 355 -405 -393 467 -463 -393 82 -219 -17 -24 -180 8 86 -113 488 11 236 433 -171 139 333
3308C33p15N23p3n41Q06m17j09L72m6j01R2l60L95j03l96P64l30m11P59o30k12
$$ 333 -382 141 68 -473 333 -84 -193 179 133 32 124 -236 159 56 -340 424 94 -317 442 -188 -400
3329d00R37p96J01K90o25L54K31k77K1L7N2L31k68n7M06n98M80J65r48Q58r0m02
$$ -400 537 -259 -158 132 -493 -139 92 -185 -164 -127 -75 256 -12 -69 337 -261 219 384 -564 294 204 -198
3351a98M45K4p05O56k80m90P28l28o8J66j25K98K79r15P74k54k02O31m42j11N31
$$ -198 247 271 -434 222 -58 -548 180 -148 -216 -50 -175 123 402 -513 261 7 -195 436 -6 -117 414
3372D14o80K20L12n72K27J08j79L70l02j8P6k27M19j48j99L03K28n31O31M3o30
$$ 414 -266 -46 266 -306 -79 29 -150 220 -82 -100 -24 -251 168 20 -179 124 352 -179 452 495 -135
3393a35M97J5p28O94o27L36M49n93Q5o0l32N74k15l92P46n52j62Q44l49k58O63
$$ -135 362 377 -351 343 -284 52 501 -92 -7 -67 -399 175 -40 -432 314 -238 -400 444 95 -163 500
3414E00p61J70M91m92K99l20j93N99l29j35K80o91O53J65o66O08O6r06R34j30
$$ 500 -261 -91 400 -92 207 -113 -306 293 -36 -171 109 -582 71 236 -430 178 244 -662 272 142
3434A42k80M85k51j88M01l01J96N1m10L84l61j04L50n20J11M41l11j8N71o37M70
$$ 142 -138 347 96 -92 309 8 204 255 -155 229 -132 -236 114 -406 -295 146 -165 -183 388 -249 221
3455B21J59p26N26j16j77N70m19k48L45l14M7K17k10J01q1k41P01l82p62P94j16
$$ 221 380 -346 180 64 -113 457 38 -210 135 -179 -132 85 -125 -24 -105 -346 355 -27 -789 5 -111
3476a11k79N75p2j96J50JJ18J28n25M23j08k79K65m47J54K92n24M18M03o96M30
$$ -111 -390 185 113 -83 67 68 186 314 -211 212 104 -175 90 -357 -203 89 -435 -17 386 -310 120
3497A20R9o04N85q4m50N93k61Q0J97j53k12M30o82K35K74p54P32k29l06O36j85
$$ 120 219 -385 200 116 -334 259 -2 78 275 122 -90 340 -342 -107 167 -587 145 -84 -390 246 61
3518F1l66M43k69jJ75o2L37Jl61L81o5l00O08n01k96N32l14m37N34o34L51K16
$$ 61 -305 138 -131 -132 43 -19 318 319 -42 339 274 -26 582 81 -215 317 3 -434 100 -534 -183 33
3540C3l24K96k55K77J39l88J27N97n84K50N0l29L82j85m83Q23k91l31L57k60j32
$$ 33 -291 5 -250 27 166 -222 -95 502 -82 168 218 -111 271 86 -397 426 135 -196 161 -99 -231
3561b31N30m82k5N27m59M41q7l98O11n03K96M20j026J51N18p82J52N17o15J86
$$ -231 299 -183 -208 319 -140 301 214 -184 427 -76 220 640 -386 -235 283 -499 -347 170 -445 -259
3581b59K97m20L67j77q5L71k17L3K99m59K33L36k62J57K78r11J069l43p10O76
$$ -259 38 -382 -15 -192 -277 94 -123 -90 209 -250 -17 319 57 214 492 -419 650 307 -403 273
3601B73m23l2K91m95O25k94k80K81P4p6M63n3l52M81n10j17N89m63q1L01o59L68
$$ 273 -150 -182 109 -386 239 -55 -335 -54 20 -56 407 354 2 483 -27 -144 445 -18 -99 202 -457 -89
3623h9K27k99P2k13l81Q16l93K43Q0l42N55K02q20L80J23k20K15k65o2M93n64
$$ -89 138 -161 -89 -302 -683 133 -260 -17 63 -279 276 478 -342 38 161 -59 156 -109 -171 322 -242
3644b42K5J86l42N34l49L09p6j04k99P17m34j23O62k70k56L00m28J65M32r21L50
$$ -242 -217 -31 -373 161 -188 121 45 -59 -358 359 -75 -198 464 194 -62 238 -190 -25 407 -514 -164
3665a64J94j33K19k13n4M26m99L78Po67M53K55m00N37k18l32K75k46k4K04Q5J49
$$ -164 30 -103 116 -97 -151 275 -224 154 161 -506 -53 202 -198 339 121 -211 64 -182 -206 -2 83 232
3687B32L9m26J11J65p27Q50o58K34O05p12J08N32n32K41K82m38L46k8j13K72k46
$$ 232 271 -155 -44 121 -606 244 -414 -180 425 -287 -179 353 -179 62 344 -94 252 224 111 383 137
3708A37l0l6j72P0M24n21K96k12m64N85q7j59J86o3k34L01j64K06J8p0J43j16
$$ 137 107 71 -101 -31 393 -128 168 -44 -508 77 -10 -169 17 -46 -280 21 -143 63 81 11 154 38
3730C8j69K06j67j24L58m95K30L02n19J84J33j20J81K9k96L33j06m6M97l88K06
$$ 38 -131 75 -92 -216 142 -353 -123 179 -340 -156 -23 -143 38 67 -229 104 -2 -48 449 61 267
3751B67p2j52J43J7n88O45k72j07K5J69k62J52J66J37j38k96J26K15j97J81j99
$$ 267 195 43 186 203 -385 260 -12 -119 -94 75 -187 -35 131 268 130 -166 -40 175 -22 159 -40
3772d0j46N49m80l2L51j38k26L63m13R7J31l07J79K12k14J89j1L7K10l62R0j27
$$ -40 -186 363 -117 -149 202 64 -162 201 -212 -115 16 -291 -112 100 -114 75 64 101 311 -51 39 -88
3794h8j73J29J99l34K54K23l99N41n44k15M29k21Q0L56m23K30K08m13P9k41J27
$$ -88 -261 -132 67 -267 -13 210 -189 352 -192 -407 22 -199 -119 237 -186 44 252 -161 -82 -323 -196
3815a96O88n86lO12m12k00L65m47l2N82o25J56pk09K47J20k38J54K0l8P6m09J07
$$ -196 492 -94 -97 515 103 -97 268 -179 -211 371 -254 -98 -105 -314 -67 53 -185 -31 -11 -49 27 -382 -275
3838b75L48k10K81j14N3l7p0O1j01k14j16M66l08N2J07l44N49j16k56M16j10j07
$$ -275 73 -137 144 30 83 46 -24 37 -64 -278 -394 72 -236 -184 -77 -421 128 12 -244 172 62 -45
3860d5j66J5L18p4j74R6M46n12R6q8J97o0l6k42L55l82K14L88p87N72k52k12N96
$$ -45 -211 -196 122 48 -126 -30 416 -96 0 -88 109 49 13 -229 126 -256 -42 346 -441 131 -121 -333 263
3883B63j04k80P85q06J13J30k28J97J53m33L36k03JK21m49P7M63l01j50K45m27
$$ 263 159 -121 664 -142 -29 101 -127 70 223 -210 126 -77 -76 145 -304 -227 236 -65 -215 30 -397
3904c97O02L8l99M04l61j24L55j73R1P1m00L91K96l81J34k61k28M90p5l41M88
$$ -397 205 243 -156 248 -113 -237 118 -55 36 107 -293 98 394 13 147 -114 -342 148 73 -268 220
3925B20k01j48L23n43L74J78k05K97p8l36J35l0j00K76n61J40N52m63M2M26o51
$$ 220 19 -129 194 -349 25 203 -2 295 217 -119 16 -14 -114 162 -399 -259 293 -170 -128 298 -353
3946c53L09N67n18J95q3k64K18j71rM03k48J83k7m54K96l1m65M67L9l64M38r8
$$ -353 -44 523 5 200 117 -147 71 -100 -109 294 46 229 202 -252 44 13 -452 15 54 -310 128 30
3968C0m05M92r1J74J7Q8k16k09P3K32M6l41K66l88J01L82o33N22j21k64R2O35
$$ 30 -375 117 26 200 217 305 89 -120 -47 185 231 -110 156 -232 -131 251 -382 140 19 -245 -153 482
3990D82p23K51J45j12j70L58k39K38j62J58K54p38M67n2n47K07l4pL24l30J33
$$ 482 -241 10 155 43 -127 231 -8 230 68 226 480 -258 209 157 -390 -183 -217 -224 100 -230 -97
4011i7L26j87k98L88j86K01k9l10M02n7k56L25k63o9L35n51K67N6j34j26K27l38
$$ -97 229 42 -256 132 -54 147 118 -192 210 153 -103 222 -41 -110 225 -326 -59 -3 -137 -263 -36 -374
4033c74K43K11o9K17j84M0J26j88j19L77j99j1M0k30K27k97k25O81m07J60J32
$$ -374 -131 80 11 228 44 84 210 22 -97 280 81 70 110 -120 107 -190 -415 266 -141 19 151
4054A51j19J94l6j92K21k34k18O96m59j56N64m20k40K85j54J68om02J93k20J28
$$ 151 32 226 190 -2 219 -15 -233 463 4 -152 412 -8 -248 37 -117 51 45 -357 -164 -384 -256
4075b56K28O7M3p0O8P0k06J24K52p5o19R08l01l53L61j69j35J74l45K57j9k5R0
$$ -256 -28 39 82 12 80 150 -56 68 320 245 -374 534 233 -120 241 72 -63 111 -234 23 4 -21 69
4098F9j97R0L80m57K57L6j77k16M11L5o3J63m26L73op35M58J91k88J51J7k05M65
$$ 69 -128 -38 342 -115 142 178 1 -215 196 231 168 331 -95 278 272 -463 -5 186 -102 49 66 -139 326
4121C26m41M14n9m00L22o0k83M87k40m76P19m27m4n1Q4J05M22o24J61j60J4L84
$$ 326 -115 299 240 -160 162 102 -181 306 66 -410 309 -118 -162 -213 -129 -24 398 -226 -65 -225 -211 173
4143A73k59J99j6P5J56j42m17L58K37n74L42j18j87L82l56n0j50K53K52j60k52
$$ 173 -86 113 97 172 328 186 -231 127 364 -210 132 14 -173 209 -147 -197 -347 -94 158 -2 -254
4164b54L77r3j46L80k58l40P15l56j57M01l52q1O43o58N47j77k17K60k27m65O59
$$ -254 123 30 -116 264 6 -334 381 25 -132 269 -83 -164 479 -179 368 191 -26 234 7 -458 201
4185B01l15R6J29n04N36J04m37Q9L28o47N09J89l18j08j02J77K62l78l4Ml3K10
$$ 201 -114 -18 111 -393 143 247 -190 -101 227 -420 89 278 -40 -148 -250 -73 189 -189 -223 -219 -252 -42
4207d2j6j34L37k26K6N92n90J17J36l13K37j45K6j01L61n37N75n30J12L21m0j89
$$ -42 -58 -192 145 -81 -55 537 -53 64 200 -113 124 -21 5 -96 265 -272 303 -227 -115 206 166 -23
4229b3J13k48J07J90k20J69J81n67M86J37m09K76k42RL60j85m9k04o4K24j81j51
$$ -23 90 -158 -51 139 -81 88 269 -298 188 325 -84 192 -50 -41 319 134 85 -119 -183 41 -140 -291
4251b91K77J91j81L81m09j57K27k55J38L55m97N11k54o3j4O3j45M34o46K77J27
$$ -291 -14 177 -4 377 -32 -189 38 -217 -79 276 -221 290 36 -27 -41 22 -123 311 -335 -58 69
4272F9k54J84K63l57K33J03l29M34k46N3j57N8k58O44m79L07n8n44P10j86m67
$$ 69 -185 -1 262 -95 138 241 -88 346 100 153 -4 54 -204 440 -39 268 210 -334 376 190 -277
4293b77K33J18j05L48m31J05K36m81K92J54n16L34o5J93J37l09N3L90j89l72K45
$$ -277 -44 74 -31 317 -114 -9 227 -254 38 192 -324 10 -55 138 275 -34 19 409 220 -152 93
4314I3l87L28L7k28J00l5k46O01k25J6J50l63K78K20m71M51k5m56K87j0k13k8
$$ 93 -294 34 71 -157 -57 -92 -338 263 38 54 204 -159 119 339 -132 319 294 -162 125 115 -98 -126
4336a26J63J09K49k49j38K52l52J83j42r7J77j68J68K11k31K4J80k55K45m5p0
$$ -126 37 146 395 146 8 260 -92 91 -51 -148 29 -139 29 240 9 33 213 -42 203 158 88
4357H8J1m4k65K47j7j6R9j74p2K55j48p8K94l81N12j90n04O37l47j6K28n91K24
$$ 88 99 55 -210 37 20 4 103 -71 -143 112 -36 -114 180 -201 311 121 -383 254 -93 -109 119 -472 -248
4380b48N43o58L00K73m30O12l45j29K49j77j60L28n07K83M13o50L11L20m63K75
$$ -248 295 -363 -63 210 -220 392 47 -82 167 -10 -170 158 -349 -66 347 -303 8 328 -135 140
4400A40Nq9N0R2l89L34l07R1L15j86K3j63j88K07J31K5M3l03K47J64m77P0K81
$$ 140 145 56 106 198 -191 143 -164 -73 242 56 79 -84 -272 -65 66 91 134 -169 78 242 -235 -165 116
4423A16k29K69m74L6N01r2l51K82j72l08O18k48PK64m70K45K29m76K81Q5j2J20
$$ 116 -113 156 -318 -282 219 127 -224 58 -114 -422 196 -52 -45 219 -251 -6 223 -253 28 113 101 221
4445B21l49J32j35J00K49m01m71P71j01p2L00j19m28M30k28J00N88n18o4J62m40
$$ 221 -128 4 -131 -31 218 -183 -654 117 16 -56 244 125 -303 127 -101 -1 587 69 5 167 -273
4466b73J27L59j29J96j41k61J11j4R2Q1k38M8J77l34J79J40l8M9J4m56N45j92
$$ -273 -146 213 84 280 139 -122 -11 -25 67 148 -90 -42 135 -199 -20 120 82 131 145 -311 234 42
4488D2k6Q2k02m5K29p8R0j07l79L54K45m55M37k70P2K94m45M89l67J24J38k76
$$ 42 16 98 -104 -149 80 2 92 -15 -394 -40 205 -250 187 -83 -11 283 -162 327 -40 84 222 -54
4510e4o5K95k41K00k79j04J20O9l88K08L03l71J74j93J81K59l13K79J57k34R5
$$ -54 -119 176 -65 135 -144 -248 -128 -59 -447 -239 64 -307 -133 -326 -145 114 -199 80 237 3 98
4531I8r0n4L58k76N3j77K98l35K19k97j92M80k33j32O17n41O6L09j39L01o20K47
$$ 98 8 -46 312 36 89 -88 210 -125 94 -203 -395 85 -148 -280 337 -204 -138 171 32 333 -287 -40
4553d0K08j89R3nJ8k01J93k47jK18k28K99o5mJ19J0l61L09k79K14L58m04K10o9
$$ -40 168 -21 72 67 85 -116 77 -170 -171 47 -181 118 53 49 168 178 -183 126 -153 61 419 15 225 156
4577A56j80J92k07k37N11m07J58M4l25L64k62P0R2j6k3L37l40q5L80l31j84O04
$$ 156 -24 168 -39 -276 235 -172 -14 30 -295 69 -193 -123 -31 -47 -70 267 -73 -158 222 -109 -293 311
4599C11n78M39j16l15K42o5L06k15k12JJ72J10k23Q3J89r6N3j04J23k0OK61m37
$$ 311 -267 172 56 -259 -17 -82 224 9 -203 -202 -30 80 -143 -60 129 33 86 -18 105 85 91 352 -85
4622h5J67q2q2J77j3m08K49K14k05J47l33O9M69m43j5J47k46P3K72k82M01J75
$$ -85 82 0 -82 95 82 -326 -77 137 -68 79 -254 -185 284 -159 -174 -27 -273 -200 72 -210 191 366
4644C66m25M46n36j24L32j26J12N0m00L46J73k82p3K81m63N46l2k12P4j07j87
$$ 366 -59 387 -149 -273 59 -67 45 95 -305 41 214 -68 -141 140 -323 223 191 -21 53 -54 -241
4665b41L58k07j4R9k93L11n3J31q2J0k17K38k28K38j0j48K48k9l5q8j89J48J11
$$ -241 117 -90 -104 -5 -298 13 -40 91 9 19 -198 40 -188 50 40 -108 140 111 76 -12 -201 -53 58
4688E8r7j01j6J15KL70l09j0J69l52J58J32k28K96j83j09K20l24K4L95k25K36
$$ 58 -39 -140 -156 -41 -39 331 22 12 181 -171 -13 119 -109 187 4 -105 115 -209 -185 210 -15 221
4710B21J09n23J93k27O0J24j14J38J90n09J57N31o46L49J69l62K04l08K63J37
$$ 221 330 -193 0 -227 -167 -43 -157 -19 171 -338 -181 350 -296 53 222 -140 64 -244 19 156
4730A56q0l15L75k60J07R7l21L15k74L28o4k4j24K18l61P2K55k53j19M18oj71
$$ 156 76 -239 136 -124 -17 80 -241 74 -200 128 64 40 -84 134 -227 -155 100 -153 -272 146 140 -31
4752c1J37k32J93oj26K92k06J20P6m38j1L36l83J76L21k96J26q3J21Q4j70j04
$$ -31 106 -126 67 61 -65 227 21 141 217 -221 -232 104 -279 -103 218 -78 48 -35 86 170 0 -104
4774a04K27j60J51P9j48M3j34j57K42O8k86L2J36j25n0L21k01K27k14M55m18j27
$$ -104 123 -37 114 193 45 88 -46 -203 39 107 -179 -147 -11 -136 -186 135 -66 161 -53 402 -16 -143
4796a43L29p0m50N56m4k31K60j08j76rk04K30rj79Q6J67j07J65k5j83N8l05M46
$$ -143 186 116 -334 222 178 -53 207 99 -77 -86 -290 -60 -69 -248 -162 5 -102 63 38 -145 -87 -392 54
4819E4K10j63q8J8k0k9rk03M19m50j15L82q6rM7r8M26k00O5m7k3n1qo7j03M12
$$ 54 264 101 13 31 11 -18 -27 -230 189 -261 -376 6 -80 -89 -42 -140 286 86 151 104 81 30 22 -45 -148 264
4845B64m56J88Q6j60L60k67J23r2n6k08K17k78J08K89l85L24J33l3j46l4j17J10
$$ 264 -192 -4 82 -78 282 15 138 46 -10 -218 -1 -279 -171 118 -267 57 190 157 11 -23 -140 -30
4867c0M8l2m9J09k37M36n19L58k16P3l2J6K48p1l26k8M96l09K35L6l01K90k6j08
$$ -30 18 -14 -63 46 -191 245 -274 84 -132 -59 -91 -75 173 102 -224 -252 244 -65 170 206 -95 195 169 61
4891F1J1k04J53O8l19M66k39k22K66kj30K09q5j26K17k05j58J55K93m19K88k03
$$ 61 72 -132 21 89 -230 236 -3 -225 41 39 -91 118 33 -93 124 -81 -239 -84 209 -210 78 -125
4913a25J43L33o26K00J01r7J36l70K71M0j58j54M88m18K40M0K27M3j78l14N56
$$ -125 18 351 -275 -75 26 -71 65 -305 -34 6 -152 -306 182 -236 4 44 271 314 136 -178 378
4934C78j85j39l0j01j11P4j92K05J26m74N87l67J81J80l6q3J88j47k7L0L6L00
$$ 378 193 54 24 -77 -188 -114 -306 -101 25 -449 138 -229 -48 132 96 13 201 54 27 57 93 393
4956C93j65n36K94K90l86l8oQ6K18j96j9K06j88r4L58l43m2K34l71M50q1k26L37
$$ 393 228 -308 -14 276 -110 -148 -154 -68 150 -46 -65 141 -47 -141 217 -126 -168 66 -305 145 64 -162 175
4979A75m17M20r5j99K50n6k59M95l85j17K90n10L93L32l56J79J84k50J5M00m74
$$ 175 -242 178 83 -116 134 78 -181 314 -71 -188 102 -408 -15 317 -39 140 324 74 89 489 15
5000A5J19j66j2K69l24n7M48o74M70k87j41N23k05l06O23l09L0r9K37j02k23L16
$$ 15 134 -32 -44 225 -99 -156 292 -382 88 -199 -340 183 -22 -328 295 -14 16 -83 154 52 -171 145
5022A45j37K17n1O0k77K9mN4N7l32K08n0O30n34k05L04k29J59jm0L24l42K33j93
$$ 145 8 225 174 234 -43 -14 -18 36 93 -239 -31 -81 549 15 -190 114 -115 44 43 3 327 -15 218 25
5046B5lM9j84K62j01j72r7K87j71J86p4M1k80L62j00j7j5k17M47l16J36R4J57
$$ 25 22 71 -113 149 48 -124 -221 66 -105 81 7 48 -232 130 30 13 -2 -219 228 -88 48 142 299
5069B99k20k4j43K63o6k77K13J32n11L47Q4r2l9K64l92L28k33J01Mk76J59J54
$$ 299 79 55 -88 175 109 -168 45 177 -334 13 97 5 -34 230 -162 166 -67 34 38 -238 -79 75
5091G5P2k22K44j27J3L4j73N5j3j18L23j22K6P9j92k16N24n14K56j17R7J60j94
$$ 75 147 -75 169 42 55 89 -84 -29 -42 -160 163 41 67 146 -46 -262 262 -252 4 -113 -16 144 -50
5114e0l8M67n67R7K30l5Nr0K3m2j17K1M99m06n1O6j01J69k6l21M37O5k43k6K82
$$ -50 -88 379 -188 -91 139 104 109 19 42 0 -117 -96 403 -3 -54 12 -89 80 54 -267 170 235 -8 -34 248
5139B48l91J93k33P4J40M6j27J23m3K8j31j22N32j41O2J10l38j9K36k57J00n9
$$ 248 -143 50 -183 -109 31 77 -50 73 30 58 -73 -195 337 196 258 368 30 11 247 -10 90 31
5161C1M7Rl26M7J45k09J69M5k68K27K8j53M24m11J60J08k5k85J54jrj01M38l93
$$ 31 78 87 -239 -192 -47 -256 -87 -42 -310 -83 -55 -208 216 -195 -35 73 48 -237 -83 -84 -93 -194 244 -149
5185a49j4R7J66m2j74J80k09k2M41k34J93j63K7j17L19k43j49K38q1K03k66j19
$$ -149 -163 -66 100 58 -116 64 -145 -167 274 40 233 70 97 -20 299 56 -93 145 64 267 1 -118
5207a18L49l67O2Q7m74P02j85k59J54K70o05N42l81J59L20l07K27j74l6M6j57
$$ -118 231 -136 -74 13 -461 241 56 -203 -49 221 -384 158 -223 -64 256 -51 176 2 -34 12 -145
5228a45L20r4l05q7M54l02J70q3J1n0J24r3K37r4j95M31l00r2K41l11K92J13m83
$$ -145 175 81 -224 -311 143 -159 11 -72 -61 -111 13 -80 157 63 -132 299 -1 -93 148 -163 129 242 -241
5251b41K40L32p01K12N28k78j5j1j05k6p9j04L95q4oj38K3K63k78r2K58N7p7K4
$$ -241 -1 331 -370 -158 370 92 77 66 -39 -65 -144 -248 147 63 57 -81 -58 205 -73 -165 93 150 73 97
5275I7kmj39R5j26K84m13K66j11p2J24j54q8M37k4r1L16k92n3J75rk7j0l40Q7
$$ 97 95 91 -48 47 -79 205 -208 58 -53 -125 -1 -155 -243 194 170 79 395 103 50 225 216 189 179 -161 -74
5300g4J35k96M39k57M2J85k12j33J23M2J9j96M74m45J47L18N5l23k85M33k32p2
$$ -74 61 -235 204 -53 -11 174 -38 -171 -48 -6 13 -183 291 -154 -7 311 366 43 -242 191 -41 -113
5322a13J13mk1K4m6J33L1k75R7L6L34k33l39J59K30j94K74jm01L17j1o5J32j69
$$ -113 0 -4 -25 -1 -47 86 117 -158 -61 -25 309 76 -263 -104 126 -68 206 205 -196 121 110 45 177 8
5346HoK17j05j67L2l3K24q5p7K35l69P4K29j35n4L50o02K33J48l90L44j02o2K03
$$ 8 2 219 114 -53 -21 -54 170 85 8 243 -126 -52 177 42 -12 338 -264 -31 117 -273 71 -31 -93 110
5370A10k06O1K09M6l58N08k26j38J77n21M68l4k59j32K53j4K23j32j96J28j82
$$ 110 -96 -35 174 220 -138 370 144 6 183 -338 130 96 -163 -295 -42 -56 167 35 -161 -33 -215
5391b15J24J55j53L28m39J48K93r9j97Q8j89L03J6l89M30j90M0M1j87k1K98m77
$$ -215 -91 64 -89 239 -200 -52 241 142 -55 33 -156 147 163 -226 204 14 54 95 -92 -113 185 -292
5413b92K36L09k46l8Rj6Q8k23J3L80K4k0Q8m05k33J28j39K58k5J2k31P72o76L5
$$ -292 -56 253 7 -31 -22 -38 50 -173 -160 220 244 224 312 -93 -326 -198 -337 -79 -104 -92 -323 449 -227 -192
5437a92K03j9L18l69j2K65L1n6l3l49J91M24l34j29j17J59J69k06j04K66j93L16
$$ -192 11 -8 310 -59 -71 194 225 169 136 -213 -22 402 68 -61 -178 -19 150 -56 -160 106 -87 229
5459B29J47o78M74k01j36L76j79j75J73k00K1K13k11O6r0oN6J19l21K89L8j74
$$ 229 376 -302 172 -29 -165 211 32 -143 30 -170 -149 64 -147 -81 -171 -177 -121 -2 -323 -34 4 -170
5481a70J61j93O6K97m49Q7L21k67K30K2Q0J13m17J48K57m13L5K45Q1j50J14m36
$$ -170 -9 -202 -136 161 -288 -201 120 -147 83 105 185 298 -119 29 286 -127 -92 153 234 84 198 -238
5503b38L76k96j72M08q7J61r9j15J99R8k87J08J2j27J12q5L18m65N5J15J04n9
$$ -238 138 -158 -330 78 -9 152 53 -62 137 235 -52 56 68 -59 53 -32 286 -179 -124 -9 95 36
5525C6J1J79k15j33q9j34M57j66j60L38l93L42j8j71K49k22K86Qk18J2l7Q2r5
$$ 36 47 226 11 -122 -211 -345 112 -54 -214 124 -269 73 55 -116 133 -89 197 205 -13 -1 -38 44 -51
5548e1K37l35K47l75Q6K84j3l14K25J35k75K65ll58M78l96o9K02j15P4J75k29
$$ -51 186 -149 98 -277 -191 93 80 -234 -9 126 -149 116 113 -245 233 -163 -232 -30 -145 -71 104 -125
5570a25K61j05j78L81j96j50J13q4q0oJ00K11m28J57J26j82K64M8k60J20J43k43
$$ -125 136 31 -147 234 38 -112 1 -83 -163 -169 -69 142 -286 -129 -3 -185 79 127 -133 -13 130 -113
5592a13L0P4j08J85j14J35j10J83k83L51l83J27q1K9Q8o8K4j81J15m5J76q2J70
$$ -113 -83 -9 -117 68 -46 89 -21 162 -121 230 -153 -26 -107 -78 10 -58 -34 -215 -100 -145 31 -51 119
5615A19j63J4j49K49k14L21n1%J40k31Q1j88K21l08R9J9J36J6m39L30M5k08N35
$$ 119 -44 -30 -179 70 -144 177 126 126 266 35 116 -72 149 -159 -60 -41 95 111 -328 2 47 -161 374
5638C74l72l73O48m84K08j5l8Q7K33m63L23j96q9k4J42n7K76n65L67K58o0k10
$$ 374 2 -371 277 -207 1 -14 -52 35 268 -195 128 -68 -157 -181 -39 -96 180 -385 -18 240 180 -30
5660c0J10r9J04l35Q7K16O2l47N49l39J57J15k28l20N04l31J04K26r4l7j39J83
$$ -30 80 -19 85 -250 -163 53 115 -232 317 -22 135 250 22 -298 206 -125 -21 205 111 74 -65 118
5682A18J9k30M4j81J33q2J98J01n6N4j50p7L95j18p4j70K06Q9k11r3J30J45j59
$$ 118 137 -93 -49 -230 -97 -179 19 120 64 118 -32 -109 286 168 94 -76 130 219 8 -85 45 190 31
5705C1m3p8R4P0j11P7J70j00j53j81J81K87n6k67L2j56K73o6j39K95k28J61P7
$$ 31 -12 -90 4 74 -37 40 210 110 -43 -224 -43 244 188 -79 -47 -203 70 4 -135 160 -68 93 170
5728A70O1j09k60K6J95j35J64R6m96k8N16j86n0J11k05K25J29m14Q0M14n0k65
$$ 170 231 122 -138 -112 83 -52 112 208 -288 -316 200 14 -36 75 -130 95 224 -190 -110 304 254 -11
5750a1N1j44M9J51j65k4k82M77P4k73P6p4L1J77L13o88N33o03N7L19j26M3L8l74
$$ -11 40 -104 -55 96 -69 -93 -375 102 176 -97 -21 -95 -64 113 426 -262 271 -332 -275 44 -82 -39 -1 -375
5774c75L14J3p8J77k63m1M03m15L65j27j27J23n6L15k44Q8l37P63n46j20K07j88
$$ -375 -61 -48 -126 51 -212 -253 150 -265 100 -27 -154 -31 -87 228 -16 72 -265 498 -48 -168 39 -149
5796a49M6K30q3k2k34j72L80j74O1L59kJ0k86j82J9M67m31k9M1J1o9K26NO1l41
$$ -149 -103 127 44 22 -212 -384 -4 -178 -117 242 240 250 -36 -218 -199 268 -163 -192 -151 -140 -209 17 22 83 -258
5821b58j57M09k66K01L10n51L47l43J15%K40k34M97k69j58N30o17R2J0J88m2j97
$$ -258 -415 -6 -272 -71 239 -312 35 -308 -193 -193 47 -187 310 41 -117 413 -204 -112 -102 86 44 -153
5843a53J10K48k2j64l20L68r1J89j23K62l58j69L19k71J12K40o42L40K21j46k34
$$ -153 -43 205 183 19 -301 67 -24 165 42 304 -54 -223 96 -175 -63 177 -465 -125 96 -50 -284
5864b84J00j6k42M09j4J28j28K1J23r4KR0m2p9J17k07r5Q4O4J06j69O9Oj80K91
$$ -284 -184 -200 -442 -33 -47 81 -47 -26 97 3 5 95 53 -26 91 -116 -211 -127 -63 43 -126 -57 -51 -231 60
5889F0J20j51K3J82k44j36K88j33K80j92P9N2l69J35k8j92K39k34k0M62j99j03
$$ 60 180 29 52 234 -10 -146 142 9 289 97 176 228 -141 -6 -34 -226 13 -221 -241 221 22 -81
5911h1L95m43M5J77j5l81O07k53J31k26J50q0j09N0K25J0l04j55P1J7L5p6L1J49
$$ -81 314 -129 -84 93 78 -303 304 51 182 -44 106 26 -83 -33 192 202 -102 -257 -186 -169 -134 -210 -179 -30
5935c0l9J60j88J31Q5l75J84M71l37j04J72n9j02L0j08K32j8l6J83k10n2j54L03
$$ -30 -69 91 -97 34 119 -256 -72 399 62 -42 130 71 -31 -1 -109 123 105 69 252 42 -10 -164 139
5958A39rp7L9j19q7J32J7L81m28L0M1j60K09j74mJ13j7L7k2j43K24j5l46J81P5
$$ 139 130 53 92 -27 -114 18 35 416 -12 18 59 -101 108 -66 -70 43 26 63 41 -102 122 107 -239 -58 17
5983A7k01K89j55J49j6l03M41j43l15L81r2k88K26j91K03Qj1J65k15p6J6K31j61
$$ 17 -184 105 -50 99 83 -220 221 78 -237 144 52 -236 -10 -201 2 10 -1 164 -51 -127 -111 120 -41
6006d1J59k17J50J56j44k32K51j26k0K6k3J00N6q5J66r1J06n06L70N9n0L4j44
$$ -41 118 -99 51 207 63 -169 82 -44 -64 -38 -61 39 95 10 176 85 191 -315 55 114 64 98 -46
6029d6J47j86K87j58n7K66l05k68L41j42Q7Q9j61Q9j14J9J66k8J84j1rj29j56
$$ -46 101 -85 202 44 -13 253 -52 -320 21 -121 -34 55 -106 -17 -131 -112 54 26 210 199 190 61 -95
6052i5J28P4r8k55L32J16k64m0J97j68K51j55q4J49k58J39K91k89o5p2J67K79
$$ -95 33 107 9 -246 86 202 -62 -102 95 -73 178 23 -61 88 -170 -31 260 -29 -94 -166 1 280
6074B80r4j15j38K19r5j48K5j7m6J14K1J4j33K85k22n2K22k37jJ55j8mJ90j35
$$ 280 186 71 -67 152 57 -91 -66 -83 -129 -15 6 20 -113 172 -50 -102 120 -117 -118 37 19 15 205 70
6098G0o8J24J05m3k22k5K58l50jK67l46n7L80j92K03n6Q4k84Q1P9K06m19k26N17
$$ 70 2 126 231 188 -34 -59 199 -151 -152 115 -231 -288 92 -100 103 47 131 -153 -72 7 213 -206 -432 85
6122H5k03o5J79j56J49K48l95J43r6J94q2m9Nk5k00Q3M16k43m3J49k48J14j08
$$ 85 -118 -183 -4 -160 -11 237 -158 -15 -111 83 1 -48 -43 -68 -268 -185 231 -12 -55 94 -154 -40 -148
6145a48K63j13J15j98K56k58NR8m2k27K35J57k72O0k03J81R4K01J9l81K18k78
$$ -148 115 2 117 -81 175 -83 -78 20 -22 -249 -14 143 -129 -69 -272 -91 3 204 223 -158 60 -218
6167b18K17m4J79m7J43J4r2j14j07J84k20j82K91J89j25K53l66lK70n4l08l1P
$$ -218 -1 -45 134 87 230 244 152 38 -69 115 -105 -287 4 193 68 321 -45 -48 222 168 -140 -171 -164
6190a64J39J45p4k5K43k52N7j17R8j2l36K42J62n1K18j9l58J65L8l47K39K28l89
$$ -164 -25 120 46 21 264 12 69 -48 50 38 -298 -56 106 55 273 254 -104 61 99 -248 -9 219 -170
6213a70J55j75J44K70o45N89K1l91K62l03J22J08N5J62k56j16L73m8j35q5m9K72
$$ -170 -15 -190 -46 224 -421 168 189 -202 60 -243 -121 -13 42 204 -52 -168 205 157 22 -63 -112 160
6235A60k16J80l9k88L63n82K81K05j52J31k39R0K5J28j6n5k73M03n8j88J16n6
$$ 160 -56 124 85 -203 160 -422 -141 64 -88 43 -196 -106 -81 47 31 -24 -297 106 48 -140 -24 -80
6257h0k3K11L1j00J27l74Q2j17J08J58ONQ4k60J01R4p3j63K10p5Q7J92k53J50
$$ -80 -103 108 139 39 166 -208 -126 -243 -135 23 29 34 118 -142 -41 53 -20 -183 27 -48 39 231 -22 128
6281A28l68J24Q8j5j88K9K20MK5j18K54k28j3P4j26J54K26k80J28J50l49J19j13
$$ 128 -240 -116 -28 -43 -231 -202 18 22 47 -71 183 -45 -58 16 -110 44 270 -10 118 268 -81 38 -75
6304g5l2L93j35j57J4n2j48L02k66Q5n3j52N23j6l15K90k04j01J05o6J48j45k35
$$ -75 -107 286 151 -6 8 -44 -192 110 -156 -71 -124 -276 247 231 -84 206 2 -99 6 -60 88 -57 -292
6327b92K43k9m9J45r8r7L94k95j18K36j48K0m8P2j69L38j11K0J28j3k30j25j27
$$ -292 -49 -78 -127 18 -80 -177 217 -78 -196 40 -108 -88 -136 -64 -233 105 -6 14 142 129 -101 -226 -353
6350c53K33K99m3k40n2L23k14J46n1R8J12j21J00j21k07M7K37m5j62K13K91p42
$$ -353 -120 179 136 -104 -156 167 -47 99 48 146 258 137 237 116 -91 -44 193 148 -14 199 490 -252
6372b52K53Q2j44J51n3J69r4k12M0r5K06Kn3Q1K33l22n1K63j51j73O5J24k57L75
$$ -252 1 83 -61 90 37 206 112 -100 -60 -155 51 53 0 81 314 -8 -59 204 53 -120 -55 69 -188 187
6396A87j48J20R7m02N04n66K58k60K24J09j62j20J17P0l53K03P8l0J71j13K28
$$ 187 39 159 256 -146 358 -208 50 -210 14 123 -39 -159 -42 28 -325 -122 -44 -74 97 -16 212
6417B12k58K4J75q6j56o7Jq6K84K6q9j04K79j60O1K09j62k8j40Q8n9l2J37q4j59
$$ 212 -46 -22 153 67 -89 -156 -155 -241 43 69 -20 -124 155 -5 56 265 103 75 -65 23 -36 -68 69 -15 -174
6442a74M6P5K18l8k81j7K26j16J54P8l8k82K10j96K41k15J01K01m3k53J36k92
$$ -174 -128 -53 165 127 -154 -171 55 -61 93 171 133 -149 61 -135 106 -109 -8 193 150 -103 33 -259
6464b59K53J57m64L18p2j82L49l24K60O5pK34j2l41J71P0j20j87K16j90M79k45
$$ -259 -6 151 -313 5 -67 -249 100 -224 36 101 94 328 316 -25 146 216 96 -91 125 -65 414 169
6486A69l67K65j42J81K93m45k8L37j44K66q1k74J05j90O7Ok9nJ48l29P1N04l56
$$ 169 -198 67 -75 106 399 -46 -74 263 119 385 304 30 135 -55 12 18 -11 -16 132 -197 -126 378 22
6509B2j20n0k1K70j19j29K00R9p8J13j80n1K18l70K23m7K5K46m18J91r1p7K41
$$ 22 -98 -148 -169 101 -18 -147 53 152 74 187 7 -44 174 -196 27 -20 5 251 -167 24 -67 -144 97
6532I7J9J3k15M2l4j14M65l17J17k29K86k39j14L3O73o56K5M41m12J40m6L7K83
$$ 97 116 129 -86 -44 -78 -192 273 -44 73 -156 130 -109 -223 -190 483 -173 -148 293 -119 21 -25 12 295
6555B95l07J74j95J80l42J69j97M05J28l65J15j07j46L07m1l50N28l04J9j33K28
$$ 295 -12 162 -33 147 -195 -26 -223 182 310 -55 60 -47 -193 114 73 -277 251 -53 -34 -167 61
6576F1j94K43k94K86j45l8N2j5R9J38l69M18j98k54K20J9oR7o9j40j86J89K86
$$ 61 -133 110 -184 102 -43 -81 -29 -44 55 193 -176 242 44 -210 10 29 23 120 51 -89 -275 -86 200
6599B00k50k04J74J95l61K95O4j98K41j12J72l58K54j24J74P2k68j9l8K83j47
$$ 200 -50 -254 -80 115 -246 49 113 -85 156 44 216 -142 112 -12 162 234 -34 -53 -91 192 45
6620D5j92p0L47j31J54k58K56k11J36N6j06J06O5l15J30K43k90L4N8J98m99L18
$$ 45 -147 -217 130 -1 153 -105 151 -60 76 132 26 132 197 -118 12 255 -35 -1 57 255 -244 74
6642G4k16J69Q5m02M21k30K98k7j73J68j7L8k28M41n14K14J18l85J94j48J8K61
$$ 74 -142 27 112 -290 131 -99 199 172 -1 167 150 188 -40 401 -113 101 219 -166 28 -120 -102 159
6664A59k21J77j11j6L4qr6J89j97J93j59j56L06j67K74k62N02p32L16P7J86k67
$$ 159 -62 115 4 -12 22 14 -82 107 -90 103 -56 -212 94 -73 201 -61 441 -291 25 102 288 21
6686B1n6r4K43J45n29L81p3K47q8n17M23k5m0J17j16k14J91n9K21m10K54J02o0
$$ 21 -35 -129 114 259 -270 111 38 285 197 -320 103 78 38 155 39 -175 16 -43 178 -232 22 124 64
6709F4j14O4l5J42m6k08L13r6k52J24J96k23J39J78j64J68k43k00L43k48J48k98
$$ 64 -50 14 -21 121 75 -133 180 84 -168 -44 152 -71 68 246 82 250 7 -193 150 -98 50 -248
6731b48K89J09j88j40P0J98l1n3K07m38K55L7Q0m9jk12L22m42J56J18m6n4M9l34
$$ -248 41 150 -38 -178 -108 90 59 6 213 -225 30 67 147 98 97 -115 207 -235 -79 39 -7 -61 -12 -346
6755c46O61m13L71o52L04j48L63n4R6n1mr5J04j44N2j80p6L30j34%J35l66K18
$$ -346 315 -98 273 -379 -75 -223 140 86 182 131 127 32 136 -8 44 -136 -212 118 -16 -16 119 -247 -29
6778b9j78J44K00k85j12K16J8J53j46r3K52k24J07k36L09j63K32k93P3p9J24n1
$$ -29 -207 -63 137 -148 -260 -44 -26 127 -19 -112 140 -84 23 -213 96 -67 165 -128 -55 -134 -10 -61
6800f1K79j98J44k34j02K76q0J52qk49K06j09O1nn3j59J56J00j58J30O6k14J32
$$ -61 218 20 164 -70 -172 104 24 176 168 -81 125 16 77 72 19 -140 16 116 -42 88 154 -60 72
6823G2k72l8M47m3j33K19m26K35L14l90J68j67o7J60k19J02j28J82k4q0j88J03
$$ 72 -200 -238 209 166 33 252 -174 61 375 -15 153 -14 -81 79 -140 -38 -166 16 -8 -88 -276 -173
6845a73L12j56P2L04j69j01m2J4R2k4k64J55j45K07J30m22M29k69O4L1p4J27N0
$$ -173 139 -17 55 359 190 89 47 61 153 129 -135 20 -125 82 212 -210 219 -50 14 45 -29 98 148
6868A48k42J88j46K57l22k2O3L19j39j28Pm3J15J5k63K08Oj93n8L29l70R7J31
$$ 148 -94 94 -52 205 -117 -139 -76 243 104 -24 -17 -60 55 70 -193 15 21 -172 -230 99 -271 -174 -43
6891d3M4p1J00o8k00J08J5O7P4j54K98k56K69j00R9j52J93j66j14J22q8K19l27
$$ -43 1 -70 30 -38 -238 -130 -115 -48 26 -128 170 -86 183 83 182 30 223 57 -57 65 -23 196 -131
6914a31J87j07Q2Q1J10l35K10Ok95L19l9J51m73L21O5Kl74M69k86K29j93J24M1
$$ -131 56 -51 31 112 222 -113 97 103 -192 127 88 239 -234 87 152 154 -220 249 -37 192 -1 123 164
6937A64l00J34j81K22q2J11j7k19J89j02m4P4q1J38q6k4P9j7k27J61j18J10O6
$$ 164 -136 -2 -183 39 -43 68 51 -168 21 -81 -125 -51 -132 6 -80 -104 -25 -42 -269 -108 -226 -116 -50
6960e0j32J23J90m59O14m77M5J21KJ16j83L50l36R3Q3o2k7j97K42kk88L33j67
$$ -50 -182 -59 131 -328 286 -191 -146 -25 -23 93 -90 260 -76 17 100 38 11 -186 56 54 -234 99 -68
6983f8k77N21N4l12J55k64L55j8q8j47Q2l2O4k93J07L38j66J96l10K60j13q1J0
$$ -68 -345 176 230 -82 73 -191 164 146 58 -89 -7 -39 25 -268 -161 177 11 207 -103 157 44 -37 -27
7006b7m7K36%k44Q2NJ14j27J46j09j53J50j78J25j21J32p3k60L28j10K48m6J24
$$ -27 -74 162 162 -82 0 5 119 -8 138 29 -124 26 -152 -27 -148 -16 -89 -349 -21 -131 117 71 195
7029A95j56m4n9K05rO0r4r3K12j38p8j69K72R8l21K76l0j52P1l44M73l31L53j16
$$ 195 39 -5 -64 141 132 192 98 5 217 79 1 -168 104 202 -119 157 127 -25 46 -298 175 -156 197 81
7053H1K0j29l5J7k94K08J4O2k66M71p5q2j34P9OJ3J86l34L75m72M5K86J51l58
$$ 81 101 -28 -63 -46 -340 -132 -118 -56 -322 149 74 -8 -142 -63 -57 -44 142 -192 183 -289 -244 42 193 -165
7077a65L80k01j08J64k39M69k04J12n1k82J49K41j72J00J34k93j30J31l62K96
$$ -165 215 14 -94 70 -169 300 96 208 157 -125 24 265 93 193 327 34 -96 35 -327 -31
7097c1q5J17K31l44M8J32L1j70J97k39M17n02J43m3J14l51M18K15l75J72j53l8
$$ -31 -116 1 232 -112 -64 68 99 -71 126 -113 304 -198 -55 -98 16 -335 83 298 -77 95 -58 -96
7119i6K22k46N3R2r1k29K70R3j8pN4k09k06L08Lj55J26j31J69kj90J15K43l62
$$ -96 126 -120 -67 25 -66 -295 -25 68 50 43 97 -112 -318 -10 -7 -162 -36 -167 2 0 -190 -75 168 -194
7143a94Q9N96o00N03k60k05K31k55n3o6J87P5j23J0J02J75k60n3p5J18J6q2J55
$$ -194 -105 491 -109 394 134 -71 160 -95 -148 -214 -27 48 -75 -65 37 212 -48 -101 -176 -58 -42 -124 31
7166C1J43m7j38K79k07l10k0J63K88k39j2K12J60k14J22j75J46j42o9R5l28J4
$$ 31 174 127 -11 268 61 -249 -269 -106 182 -57 -69 143 303 89 211 36 182 40 -29 66 -262 -248
7188b48L32O9j57M9K40j07r4l89J44L24k79K88k51j31l0K70l55M61l23J78J36
$$ -248 84 153 -4 45 285 178 84 -305 -161 163 -116 172 -79 -210 -240 30 -325 136 -187 -9 127
7209A27k44L71m74L29jN9l15K56j75J31q0R6j6k31N22l12K06m19L59j47N9k15
$$ 127 -117 254 -220 109 108 167 -148 108 -67 64 -16 80 64 -167 355 43 249 -170 189 42 101 -114
7231a14K04j31P5p8j25P6K0M5J11q1j06L65j13j03j31k56M95l94K59l7k57O5J06
$$ -114 90 -41 34 -44 -169 -93 -73 -28 83 2 -104 261 148 45 -86 -342 153 -241 18 -19 -276 -211 -105
7254a05J64k61L69j22O2M9K00l65k30M39P5j30k95R1K0Q2k13M26j77L8L5k06J8
$$ -105 59 -202 167 45 107 156 356 -9 -239 200 275 145 -150 -59 -39 43 -170 256 79 117 152 -54 -36
7277c6J65J6j74n2M62n34L1j5L12k81J19j36J47j50o5K26K66m56K37J26l94O7
$$ -36 129 145 -29 -81 381 -153 -122 -137 175 -106 13 -123 24 -126 -191 35 301 -155 82 208 -186 -119
7299a19q3L58l08L71j45N9K27l29K1M0j7m2k7L5P6j01Q7n4J50k75j74K17j78M31
$$ -119 -202 156 -152 219 74 133 360 31 52 92 75 33 6 41 117 16 103 49 199 -76 -250 -33 -211 220
7323B20J67n77J25L3O2J69k38j02J22L2P0M9l26QM9J32j54Pj8n0M26j60j03P6
$$ 220 387 -190 -65 -32 30 199 -39 -141 -19 13 83 132 -194 -186 -137 -5 -159 -152 -170 -220 206 46 -57 19
7347A9J19m6j52j27J93l9j40K70j43p2J33Q3R1m20K39%j06L44J92k08l27K1J41
$$ 19 138 92 -60 -187 6 -33 -173 97 -46 -118 15 98 189 -231 8 8 -98 246 438 230 -97 -76 65
7370F5J25m2l39K60K20l44N2J23k12L25k42k00J20Q3j67J36p6Q8jJ05N2p3o1J22
$$ 65 190 148 -191 69 289 -55 -3 120 -92 233 -9 -209 -89 -6 -173 -37 -113 -25 -26 79 131 58 -3 119
7394A19j36LN3l25Q7K47J06k62L79j54j71N7J00j8j58K15L1l60K1K50k96J44K51
$$ 119 -17 -14 39 -286 -199 48 154 -108 271 117 -54 3 103 85 -73 142 173 -187 -166 84 -212 -68 183
7417A83j14j24j96K39Kj11l1K43j10J03l11J43PL0K71l11j12M35j46l3Q1O3k59
$$ 183 69 -55 -251 -12 -10 -121 -152 91 -19 84 -227 -84 -77 -47 224 -87 -199 236 90 57 138 201 -58
7440e8J86o1j65J4j53j60M82p3o8J25j64Q9q1j9J58j25m1K80J25k00J69j69j84
$$ -58 128 67 -98 -84 -237 -397 85 12 -56 69 -95 -6 -87 -106 52 -73 -114 166 291 91 260 91 -93
7463i3R7K4j1j07N3J49J30l14K53j99q9L06m47K84k68M94m59L57k2N9j19j28J43
$$ -93 4 28 17 -90 -37 112 242 -72 181 -18 -107 199 -248 36 -232 262 -197 160 138 197 78 -50 93
7486I3k70J97N2j66L18j83J2k59J23j64j4J50J38j29j91N55k10k13n5M95k34K2
$$ 93 -177 20 72 -94 224 41 53 -206 -83 -247 -261 -111 27 -102 -293 262 52 -161 -216 279 45 67
7508F7mj19Q6j27n1L20J99k97m8J28l75J79k3J72k83J60qJJ21l11J46J79k95J86
$$ 67 63 -56 30 -97 -148 172 371 74 26 154 -221 -42 -65 107 -176 -16 -24 -23 98 -213 -67 112 -183 3
7532CN6k57M30k19j88J27M6j06J23M6r5Q2o8l7K12l56J65K59l19M1k1J16pn7K92
$$ 3 59 -198 232 13 -175 -48 -2 -108 15 61 -34 48 -20 -57 155 -201 -36 223 -96 -55 -76 40 33 -24 268
7557B68k35k36M67j31n1j11l6K46l51L09k21M4p7P3J93M4j60j27k1M6K14l1j49
$$ 268 33 -203 264 133 82 -29 -65 181 -170 139 -82 -38 -115 -42 151 195 35 -92 -113 -67 147 116 -33
7580c3j04K9K39Kj78J22j22K74l79k2O4Q3m8r9K64k43J69o7P3J31j03J4j22L04
$$ -33 -137 -108 131 133 -45 77 -45 229 -150 -172 -108 -25 -73 -172 92 -151 18 -49 24 155 52 66 -56 248
7604B48k76k23J34J0M0j70J36j25j01M04m2j87O25o33K94J83l12J04Ok60J50p3
$$ 248 -28 -251 -117 -107 -67 -237 -101 -226 -327 77 35 -152 473 -160 134 317 5 109 115 -145 5 -68
7626f8J85K80m35k25M24r1Q0k9m5K84m10J61k83L65p2K16l25pr7M97m87J78j99
$$ -68 117 397 -38 -263 161 70 150 121 76 360 -50 111 -172 193 121 337 12 5 -92 405 -82 96 -103
7649a03o1J95k90M58j64K19l37J71J02m63J97K33o22L74M8J49k42P3R6j36K62
$$ -103 -164 31 -259 199 35 254 -83 88 190 -273 -76 157 -465 -91 -43 106 -136 -63 33 -103 159
7670A59j48j73N5J31j89K69R9k23R7J12lk87O8L23k20K32l55J84O6j23L7j91L24
$$ 159 11 -162 -107 24 -165 104 203 -20 77 189 186 -101 -33 290 70 302 -53 131 197 74 111 -80 244
7693B44l66R3p0q7M30j63P8m8J82l38J18J88j81J66l61K92k64M2J56k37K14q9
$$ 244 -122 -29 -99 -186 244 81 159 111 293 -45 73 261 80 246 -115 177 -87 -45 111 -126 88 -1
7715aL28l27J29l72M8N16n16K30j3m9M5K73k28l6k95L86j14j84L74q5j28j55j1
$$ -1 327 0 129 -243 -195 321 -195 35 22 -27 18 291 63 27 -268 118 4 -180 194 109 -19 -174 -185
7738a85K52j33J88q4k69O0K28m57L14N9n9J91o7Q3j45K79j14m28K66j51J80J00
$$ -185 67 -66 122 38 -231 -171 57 -400 -86 -27 -86 105 38 121 -24 255 141 -287 -21 -172 8 108
7760A08l31K40j33J38l7j5KO0j14k94K69m7o0J71o3O0K52l35K05m90J46M82l86
$$ 108 -223 17 -116 22 -15 -30 -28 32 -82 -376 -107 -154 -214 -43 -106 -46 206 -129 76 -414 -268 214 -172
7783a72M84n20N3M94m02l2L38k63k0R3j5j56M4m2k4K57n02K73K08k14nK4r7K76
$$ -172 312 -208 -155 339 -63 -95 243 -20 -40 53 38 -118 -74 -116 -140 117 -385 -112 96 -118 -123 -99 -196 80
7807H0o7k54J00M9q8L52j10l34L11j7p1J72p3o9k48J3L34q6k8J06l39J89L14m77
$$ 80 13 -241 -141 -92 -180 172 62 -272 39 22 -49 123 50 -19 -267 -254 80 -6 -34 72 -267 -78 236 -241
7831b41K86q2N8j55L6n4L29j02p6J71n94K21J88j86L21o3J00J32k39j19l2J47
$$ -241 45 -37 21 -134 -98 -152 177 75 -1 170 -424 -203 -15 -201 120 57 157 289 50 -69 -101 46
7853D6K88n26K17k2j5m2K24P2m17LM29l29J27J99m64K35kl4L11l39j74K6j4J00
$$ 46 334 -192 25 3 -12 -54 170 242 -175 -172 257 -72 55 254 -210 25 23 -11 300 -39 -213 -187 -201 -101
7877a01Q4m2J98l23O9K04L4p1J12r4J27K13m28N5j85K85k7K0j18p5j85J78m5P0
$$ -101 -17 -59 139 -184 -115 89 123 52 164 70 197 410 -18 37 -148 137 110 130 12 -63 -248 -70 -115 -45
7901d5J08k20K25J03k33m3K64Mk71L47r4q1J5l92J97R9r9M5J44M0k99Q8J32r1
$$ -45 63 -157 68 171 -62 -105 159 163 -108 239 145 64 79 -313 -116 -17 -116 -71 73 113 -186 -98 34 -57
7925e7M6k8J85n05M79j73j15K32J5j89K43R3m58K99K15l71J41j17J28j28K10k39
$$ -57 -11 -39 146 -359 120 -53 -168 64 79 -110 133 226 -232 67 282 -89 52 -65 63 -65 145 -94
7947i4K99k01n5L70l99K83l43K89L0k87K29j22j40Q8J2q2M21j4k95j6rLK8J91
$$ -94 205 4 -51 319 -80 203 -140 149 179 -108 121 -1 -141 -53 -41 -123 298 284 -11 -27 -36 -33 -5 186
7971A86j65M8k7m5k53K89k2q5J75M6j62J7J47k34K35k75l7P0j2L6n5J31K85k47
$$ 186 21 69 42 -3 -256 33 11 -74 101 147 -15 2 149 -85 150 -125 -162 -92 -104 -68 -123 8 293 46
7995D6l32L99k29j17M1J57J15k7K5J00j01r8l61M00Q3l06J3J49K43j23j93J67
$$ 46 -286 113 -116 -233 -192 -35 80 53 78 178 77 -21 -382 18 101 -205 -192 -43 200 77 -116 51
8017E1n3k84J32O9J92j84J18K02j79j6j63n2J75J80j50j92R2J42l00J51j93J38
$$ 51 -2 -286 -154 -85 107 -77 41 243 64 48 -115 -167 8 188 38 -154 -62 80 -220 -69 -262 -124
8039a24J50J59j17J03j92j79P5m2J11j16Q8Q4R7M0k42J40J94l12J41J66o5j62
$$ -124 26 185 68 171 -21 -200 -125 -167 -56 -172 -84 0 97 137 -105 35 229 -83 58 224 159 -3
8061cJ73j36N4q7j34L48l14j00L08j00j24j13L80j38J23R7l42J21k17J58J28L
$$ -3 170 34 88 1 -133 215 -99 -199 109 9 -115 -228 152 14 137 234 -108 13 -204 -46 82 85
8083H5l2j16M7l7J41j43n5J14L62k38j78J29j25P7R1n80L59k23L86m0K34k44m6
$$ 85 53 -63 -16 -53 88 -55 -110 4 366 128 -50 79 -46 31 122 -458 -99 -322 64 24 258 14 -32
8106c2L32o42N40n1k10P0K19j37j29K15k6J22p6k62L4j3Jj00J28O3Oj69M7nK53
$$ -32 300 -342 198 147 -63 7 226 89 -40 175 149 271 195 -67 -33 -46 -45 -145 -17 46 52 -117 -70 -75 178
8131A78o9R6k36R6o6L2j23%l9k3Q5r7J10J25k21p5O3o3M08j00k16J30O5k06N8
$$ 178 109 205 -31 65 -1 31 -92 -92 -131 -154 -69 -166 -56 69 -152 -227 -164 -227 181 81 -135 -5 60 -146 -88
8156h8j47L56r7J8m2L8Q8j1j9l81K10M26l16J7j29K69j03p7L00j04r1Q3k59p8
$$ -88 -235 121 24 42 0 38 126 115 96 -285 -75 351 35 52 -77 192 89 12 312 208 117 200 -59 -137
8180a37j68J03J87L8K44j74j16j5j23J75k56
$$ -137 -305 -202 -15 23 267 93 -23 -38 -161 14 -242
8191b42
$$ Imaginary data points
##PAGE= N=2
##DATA TABLE= (X++(I..I)), XYDATA
0@%%%%%%%qJ6j6J6k4L2m0M8n6Q0j04J20j44J76k14K54k96L51m14M80n54O41p37
$$ 0 0 0 0 0 0 0 0 -8 8 -8 8 -16 16 -24 24 -32 48 -56 64 -80 96 -118 136 -160 191 -223 257 -297 344 -393
30c93Q46r69J100j247J412j593J791k009K245k506K796l110L451l823M232m680
$$ -393 453 -516 584 -663 749 -844 947 -1062 1183 -1323 1473 -1637 1814 -2009 2223 -2457
46b457N168n699O281o922P626q400R256j0209J1273j2465J3815j5359J7144j9236
$$ -2457 2711 -2988 3293 -3629 3997 -4403 4853 -5356 5917 -6548 7267 -8092 9052 -10184
60a0184K1719k4724K8460l3247L9625m8597O2227q5640J36564m38620L32879N50386
$$ -10184 11535 -13189 15271 -17976 21649 -26948 35279 -50361 86203 -352417 -19538 530848
72E30848r74863J88258O55444m94139m44169Q11836J78376p01065N4272N38240
$$ 530848 -444015 -255757 399687 -94452 -538621 273215 451591 -249474 -195202 343038
82C43038l49739k01547N03838l1313n25283J46513L00917j56703j20030J84707
$$ 343038 -6701 -208248 295590 264277 -261006 -114493 186424 29721 -90309 94398
92I4398l4795k74202R0453L61314j57191k69211K53798O5328l34628J92060L74220
$$ 94398 59603 -214599 -124146 237168 79977 -189234 64564 129892 -204736 -12676 361544
103C61544l49978l29011M32711J21176m98559J90316M70846n58014l25655P29798
$$ 361544 11566 -317445 115266 236442 -262117 -71801 399045 -158969 -484624 245174
113B45174P663o58855L49608M07532n94585j06622O93286j14134n76481L30019
$$ 245174 252837 -406018 -56410 351122 -243463 -350085 343201 229067 -347414 -17395
123a7395L45842m77379k9818N23023k26165m10944L17832J73504k99086J7231
$$ -17395 328447 -148932 -178750 344273 118108 -292836 24996 198500 -100586 -83355
133h3355K22687j42447k06072J79739J77535j96316p6592K08277o2889j74364
$$ -83355 139332 -3115 -209187 -29448 148087 -48229 -124821 83456 20567 -153797
143a53797J99222J48369k33887p9696K44648k3818k39182J93706J93641l72675
$$ -153797 45425 193794 -40093 -119789 124859 101041 -138141 55565 249206 -123469
153a23469p1604M20835j46177l26857L30898J13872m35525P8867M12094k28409
$$ -123469 -195073 225762 79585 -247272 83626 197498 -238027 -159160 252934 24525
163B4525k88881L41868R1589m00316J40845L65472l07662k02496L49470p433k75874
$$ 24525 -264356 77512 169101 -231215 -90370 275102 -32560 -235056 114414 106981 -168893
174a68893J66561J71136k29822r4380K26606K4835j92836P2919J40196j64933
$$ -168893 -2332 168804 -61018 -155398 71208 96043 -96793 -23874 116322 -48611
184d8611o2258K05403J731j66834M5221J17481q8096q2558J62051M1630k32763
$$ -48611 -110869 94534 96265 -70569 -25348 92133 4037 -78521 83530 125160 -107603
195a07603M1204K18609j61898j16435K36148l5507k50050J41036J89398k06396
$$ -107603 -66399 152210 -9688 -126123 110025 74518 -175532 -34496 154902 -51494
205e1494r2593K39438m2255k40014J89063J74798k76044k8801K65009j16167j60721
$$ -51494 -144087 95351 53096 -186918 2145 176943 -99101 -127902 137107 20940 -139781
216a39781K07784N2935k16745K7393J84546q5683j29040J45024M5529j84703M4150
$$ -139781 68003 120938 -95807 -68414 116132 30449 -98591 46433 91962 -92741 -48591
227d8591J60555j08487r0304J17906J8727j07700K0179J12187n2126j16883J02256
$$ -48591 111964 3477 -86827 31079 49806 -57894 -37715 74472 22346 -94537 7719
238G719Q2016j46606M772J49933r2999j06041J39179M6131j47603J0901J41479
$$ 7719 89735 -56871 -52099 97834 4835 -101206 37973 84104 -63499 -52598 88881
249H8881q0060j18120J55384M8918j95348N7570J58913j43147o5268J68455k4840
$$ 88881 8821 -109299 46085 95003 -100345 -42775 116138 -27009 -92277 76178 51338
260E1338j42580Q1882J02361j17489n4347J43440j7436j40974R5587Q6221j40583
$$ 51338 -91242 -9360 93001 -24488 -78835 64605 47169 -93805 1782 88003 -52580
271e2580o910J25625n0397q2603P2330N0692q3227k4810J04990j3618j08623P0500
$$ -52580 -59490 66135 15738 -66865 5465 56157 -27070 -51880 53110 39492 -69131 1369
283A369P2186j07023r123J03141m0656q1581O1479O0817q2206l7166J07004j7935
$$ 1369 73555 -33468 -42591 60550 19894 -61687 -208 60609 -21597 -58763 48241 30306
295C0306j12546Q8650P0849j27991J539J15442n7881p0605Q6852L4436j00451
$$ 30306 -82240 6410 77259 -50732 -49193 66249 8368 -62237 24615 59051 -41400
306d1400q93J08274m8301q8128J01024K5524j21448M4130R0010q1959l9371Q0844
$$ -41400 -42293 65981 17680 -70448 30576 56100 -65348 -21218 68792 -13167 -52538 28306
318B8306J207p1808K4719P2385n6281n7200Q9242J0619r0852M4378N7041p1752
$$ 28306 29513 -42295 -17576 54809 -1472 -58672 30570 41189 -49663 -5285 51756 -19996
330a9996k0269O6638m7o0331J2591O1404m4021m8942Q2739Q866r0684M3391O2193
$$ -19996 -40265 26373 26326 -34005 -21414 39990 -4031 -52973 29766 38632 -52052 -8661 53532
343E3532o7444j7516O8701p308o4463K7541O2058n9126m2647Q7271j3260q7208
$$ 53532 -13912 -31428 37273 29965 -34498 -6957 55101 -4025 -46672 40599 27339 -59869
355e9869O3083M2255q4928K837O7035k9723m7359M2820L6214n9366j0100P7647
$$ -59869 3214 45469 -39459 -36622 30413 690 -46669 -3849 32365 -27001 -37101 40546
367D0546k7634n9190O6860J9653o5295K1426M4373l2290k9579L1647K5406m6005
$$ 40546 12912 -46278 20582 40235 -25060 -3634 40739 8449 -21130 10517 35923 -10082
379a0082j4679N7550k4853n2687N7398J7848o3118J2241M4535k5042k8602L7098
$$ -10082 -24761 32789 7936 -44751 12647 30495 -32623 -20382 24153 -889 -29491 7607
391G607K4793n5460n470P0935l3125n0302O6161J343o9791L5235M3709m6763k2073
$$ 7607 32400 -23060 -28530 42405 9280 -41022 25139 26482 -43309 -8074 35635 -11128 -33201
404c3201M1425L480m5972K1575N0641m9363k7381O6204r422m2011M2379J4315
$$ -33201 8224 11704 -34268 -12693 37948 -11415 -38796 27408 17986 -24025 18354 32669
416C2669m1625o72L1594M361l3558M14L0291l5074k0979N2957r412m9948K3132
$$ 32669 -8956 -9628 21966 26327 -7231 -6817 23474 -11600 -32579 20378 10966 -38982 -15850
429a5850K2193k4594k429L3570K122m5015J6420N6651l7264j9910O0064k7126
$$ -15850 6343 -18251 -20680 12890 15012 -30003 -13583 43068 5804 -14106 45958 18832
441A8832m9822N6412J9924n3209k080K8653k2378k9227L7606K0363o1399k819
$$ 18832 -30990 25422 45346 -7863 -9943 18710 -3668 -32895 4711 25074 -36325 -39144
453c9144N2286k9905j5069N0178j4591l6620K3129K4511l406j2117N446R839k7234
$$ -39144 13142 -16763 -31832 18346 3755 -32865 -9736 14775 11369 -748 4698 14537 -12697
466a2697K906M1769k0436l3061J8788M804j4360R247K0664r989l6320K1802M2245
$$ -12697 -9791 31978 11542 -21519 -2731 2073 -12287 -3040 17624 7635 -28685 -6883 35362
479C5362l3736k987M6571m2352k8981O3426L208m9276J2746J5648l5373j0768
$$ 35362 1626 -1361 45210 2858 -26123 37303 40511 -8765 3981 19629 -15744 -26512
491b6512M5506m557o2126J6928L5585m2253R347M8595l8716k5572L9354J2390
$$ -26512 18994 14437 -47689 -30761 4824 -37429 -28082 20513 -18203 -43775 -4421 7969
503G969o246N463M825n391j5073J9105K7378k3939j7755J0890o507k864R922N751
$$ 7969 1723 7186 12011 6620 -8453 10652 38030 14091 -3664 7226 719 -2145 7777 13528
517A3528j2602k9990J6679L2215k8565K235L2878m2291j3260N9743n450l6532
$$ 13528 926 -29064 -12385 19830 -8735 -6500 26378 -15913 -29173 30570 25120 -11412
529a1412K0662P940l3612O149M5485j9101n1535L1145J8187m6932K7525L7727
$$ -11412 9250 17190 -16422 -10273 35212 16111 -35424 -4279 13908 -33024 -5499 32228
541C2228n5646j2683M4979o634j0268J8124j066j9014k595K5987R550k2849m96
$$ 32228 -23418 -36101 8878 2244 -8024 10100 9034 -9980 -12575 13412 22962 113 -383
554c83K597j3067R274Q964m402p401k1474J1480K5390k2831M048K3434l5656k881
$$ -383 2214 -10853 -1579 7385 2983 -4418 -25892 -14412 10978 -11853 -7805 15629 -20027 -22908
568b2908M7792r133k3935K0682L785k5221J0658L7613k2120l7218L5163M948m3713
$$ -22908 24884 15751 -8184 12498 16283 -8938 1720 39333 17213 -20005 15158 20106 -23607
581b3607L5070K3949o0040K486L9531k3638r179K5619r637k4583Q628K4703q472
$$ -23607 11463 35412 -24628 -22142 17389 -6249 -15428 10191 554 -24029 -15401 9302 830
594H30j5051J5133o005j5554K2156N177j1906L691j0227L674J8557j4943L682
$$ 830 -14221 912 -5093 -20647 1509 6686 -5220 -1529 -11756 -8082 10475 -4468 -786
607g86J5379k6687J408L1751j2406j4293J6777j90j8379Q290K6627j9603k5431
$$ -786 14593 -12094 -10686 21065 8659 -5634 11143 10953 -7426 864 27491 7888 -17543
620a7543L3375j972l7171L6018J3554n0630J4325K9920l0587k679K6194j2810
$$ -17543 15832 13860 -23311 12707 26261 -24369 -10044 19876 -10711 -13390 12804 -6
632fk1014J4857J7355j8774n653K3755j4428j4828K8494m199j6794J6653n036
$$ -6 -21020 -6163 11192 -7582 -13235 10520 -3908 -18736 9758 5559 -11235 5418 382
645C82o952J3575p004k55Q422j3602K611J2919j1089l657R297j359r846J758J6534
$$ 382 -6570 7005 1 -254 8168 -5434 -2823 10096 -993 -4650 4647 3288 -6558 -4800 11734
660A1734j2926j4492K8937n928k9515L1646P658l6995K0794J9487l0220J621K2895
$$ 11734 -1192 -15684 13253 7325 -22190 9456 17114 -19881 913 20400 -9820 -8199 14696
673A4696j0858j4279J4419Q644k1803P71K5608j9075j2290K7296j2651j5545K4570
$$ 14696 3838 -10441 3978 12622 -9181 -8410 17198 -1877 -14167 13129 478 -15067 9503
686I503n561j3501J2287l808m356P370k546N87j502m611M753J613J228j052o148
$$ 9503 3942 -9559 2728 -1080 -5436 1934 -612 -25 -1527 -6138 -1385 228 1456 404 -5744
701e744Q474l007p912K0775o361k2403K3806K699k3405K1086P414k6691N157J6452
$$ -5744 2730 -277 -8189 12586 6225 -16178 7628 10327 -13078 8008 15422 -11269 -6112 10340
715A0340q352q157J0869K622k0739N784K4401j9920q278K3908j7353j0126K7584
$$ 10340 1988 -6169 4700 7322 -13417 -7633 16768 -3152 -11430 12478 -4875 -15001 12583
728A2583o313j4337J0805l003m245O966K833j884r227J040P449n025M400L317
$$ 12583 6270 -8067 2738 -265 -4510 2456 5289 3405 -5822 -4782 2667 -2358 2042 5359
742E359j3937N343M839o064J3175m369j5779J4782K48j0691J7154k040j8115O196
$$ 5359 -8578 -3235 1604 -4460 8715 4346 -11433 3349 3597 -7094 10060 8020 -10095 -3899
756c899Q550l466k991M630Q6j6386P339K0924j7684n697J9611j7691m823K5857
$$ -3899 4651 1185 -1806 2824 2910 -13476 -6137 14787 -2897 -8594 11017 -6674 -11497 14360
770A4360p606j2159R349l638k871O378L870l126j1707L581P693r218P072L789
$$ 14360 6754 -5405 3944 306 -2565 3813 7683 4557 -7150 -3569 4124 -5094 1978 5767
784E767j7905N845P908p646J0005j406j2509R654R24k439J1394n143q770N246
$$ 5767 -12138 -6293 1615 -6031 3974 2568 -9941 -287 637 -1802 9592 4449 -4321 925
798I25K162K170p09j898J173j1426M107J5642j4882l862J3536j6000j431K0630
$$ 925 3087 5257 4548 2650 3823 -7603 -3496 12146 -2736 -6598 6938 -9062 -10493 10137
812A0137r347p794P218k897l58M063M539k183j0870O725O532j0173Q366L717j7677
$$ 10137 790 -7004 214 -2683 -3041 1022 5561 3378 -7492 -767 5765 -4408 3958 7675 -10002
827a0002P195P561r361P847l07j0170O377J152k3N724n338j761K710j256O091
$$ -10002 -2807 4754 -4607 3240 2933 -7237 -860 292 269 5993 655 -1106 1604 348 6439
842F439k211m242M903q739N91J2330j2221l076J0558j2995N57J3079r045l004
$$ 6439 4228 -14 4889 -3850 -3259 9071 -3150 -6226 4332 -8663 -8106 4973 -4072 -7076
856g076N449k152J533J268M185J021r100Q418N947j1602R015L908j5443Q190M757
$$ -7076 -1627 -3779 -2246 -978 3207 4228 -4872 3546 9493 -2109 6906 10814 -4629 3561 8318
871H318j1093N876j57q106L925q43q47J721m519K957J50l269P779l486l564R737
$$ 8318 -2775 3101 2944 -5162 -1237 -2080 -2927 -1206 -5725 -2768 -2618 -5887 1892 -1594 -5158 4579
887D579p231q85J1250j0286r66J0379r776O14P546p585j85L190j020J276k739
$$ 4579 -2652 -3537 7713 -2573 -3539 6840 -2936 -2322 5224 -2361 -2546 644 -376 900 -1839
902a839L610J874p405R048K760j2078R311L615j2431R044K079j1478N138J68n186
$$ -1839 1771 3645 -3760 5288 8048 -4030 5281 8896 -3535 5509 7588 -3890 1248 1416 -3770
917c770L403k706j136n67k996O342k452l566Q484o184j485J3072p145j516J0200
$$ -3770 -367 -3073 -4209 -4776 -7772 -1430 -3882 -7448 1036 -5148 -6633 6439 -706 -2222 7978
932G978r570Q86J0258p665j86L311o118J407J314k09k4o829L828K474p274R243
$$ 7978 -1592 -706 9552 1887 1701 5012 -1106 301 1615 1406 1382 -5447 -1619 855 -6419 2824
948B824J080j3452J0161L944j0060J0792N98j0933O304J956k926L164k507p95
$$ 2824 3904 -9548 613 4557 -5503 5289 5887 -5046 1258 3214 288 3452 945 150
962A50k618r14Q257n095m188P944q527q3J3130q836k228Q776j0059J881J0284
$$ 150 -2468 -3382 4875 -220 -4408 3536 -4991 -5074 8056 -780 -3008 5768 -4291 -2410 7874
977G874p317j203J510m326K178M54J996j802q172O287K125p774J0842o34j3347
$$ 7874 557 -646 864 -3462 -1284 -830 1166 -636 -8808 -2521 -396 -8170 2672 2038 -11309
992a1309J1544L442q347J1006j24r649O069K654p33J735k303k76m080O56Q738
$$ -11309 235 3677 -4670 6336 6212 -3437 2632 5286 4553 6288 3985 3709 -371 285 9023
1007I023q089l169P286j0678O63J2635j0745j946P739r465K376Q620n777j352
$$ 9023 934 -2235 5051 -5627 -4964 7671 -3074 -5020 2719 -6746 -4370 4250 -1527 -2879
1021b879J079j981K042K72L796k539q182Q681O33p806J1999k308j3245J2533J709
$$ -2879 -1800 -3781 -1739 -1467 2329 -210 -8392 289 922 -6884 5115 2807 -10438 2095 3804
1036C804q294R676n31q522N153K782m43N5j102J348o173J795R193r760j514Q371
$$ 3804 -4490 5186 4655 -3867 1286 4068 3625 3680 2578 3926 -2247 -452 8741 -1019 -2533 5838
1052E838j1821J654J1672j0998q01P785q790J816P897m839r62R17K2N41m81N056
$$ 5838 -5983 -4329 7343 -3655 -4456 3329 -5461 -3645 4252 -587 -1549 -632 -610 -69 -550 4506
1068D506l164p415R931j915q614J2563l585j2155J2553l31r113R355n78p601M206
$$ 4506 1342 -6073 3858 1943 -6671 5892 2307 -9848 2705 2374 -6739 2616 2038 -5563 -1357
1083a357K836o04j950J407L365p219K471R263j0770P31R737j2147J510J0888j0832
$$ -1357 1479 875 -1075 332 3697 -3522 -1051 8212 -2558 -1827 7910 -4237 -2727 8161 -2671
1098b671K92P374p847R42N299l447l99L3J711l90l206O710k632p190J0396l485
$$ -2671 -2379 4995 -2852 -1910 3389 -58 -457 -424 1287 897 -2309 4401 1769 -5421 4975 1490
1114A490r001J3066l989j0492J2057j926r107Q739K89o069L058K260o79l114L403
$$ 1490 -7511 5555 1566 -8926 3131 1205 -7902 837 1126 -4943 -1885 375 -304 -3418 -15
1129a5M989r053L311Q357j1185K942R945j2154J384Q689r938J129O716o787k52
$$ -15 4974 -4079 -768 7589 -3596 -654 9291 -2863 -1479 7210 -2728 -1599 5117 -1670 -1922
1144a922K788j949N56n51K678j834m147P524j891o007J0598m302q463J2239k945
$$ -1922 866 -1083 -527 -1078 1600 -234 -4381 3143 1252 -4755 5843 1541 -6922 5317 2372
1159B372p933J0535l841p165P278K26l686J212J072p12m065M717M973r591L409
$$ 2372 -5561 4974 1133 -6032 1246 1472 -2214 -1002 70 -642 -4707 10 4983 -4608 -1199
1174a199P411j1957M925R874j2309J467P448q777K233N968n715j199Q10Q26J33
$$ -1199 6212 -5745 -820 9054 -3255 -1788 5660 -3117 -884 5084 -631 -1830 -1020 -194 -61
1189f1j648M471l234n496R048j784n391J0239m902p607J1018k183n756Q513l722
$$ -61 -1709 2762 -472 -5968 3080 1296 -4095 6144 1242 -6365 4653 2470 -3286 5227 1505
1204A505n902N641L84j563p58Q8K00m796M768N136r672K791O872j0926N496R114
$$ 1505 -4397 1244 1628 65 -693 -605 -405 -5201 -433 4703 -4969 -2178 4694 -6232 -736 8378
1220H378j1238J487O295p155K453M738l799j682r49K379l12k728N230l458o596
$$ 8378 -2860 -1373 4922 -2233 220 4958 1159 -523 -1472 907 595 -2133 3097 -361 -6957
1235f957R194j564n510R606m981o401J0271k109m018O743l855l438L872L11N21
$$ -6957 2237 673 -4837 4769 -212 -6613 3658 1549 -2469 4274 419 -3019 853 1164 1685
1250A685k003k60J561n375M268N180r612K835N783r850M977P721r865K103M580
$$ 1685 -318 -578 983 -4392 -124 5056 -4556 -1721 4062 -5788 -811 6910 -2955 -852 3728
1265C728n282K179L102k134j601j668L402p90l748N993l753o448R167j892n614
$$ 3728 -1554 625 3727 1593 -8 -1676 1726 936 -2812 3181 -572 -7020 2147 255 -5359
1280e359Q589m329m869Q356j997j713M227k604j301K273K31J601l148L15K498
$$ -5359 3230 -1099 -5968 2388 391 -1322 2905 301 -1000 1273 1504 3105 -43 272 2770
1295B770n985L273M882r380K752M924q855N003M406p716K361L578m014K202J099
$$ 2770 -3215 58 4940 -4440 -1688 3236 -5619 -616 3790 -3926 -1565 2013 -2001 201 1300
1310A300k55q07k112M916j480m513O687l080o217Q820k711n196P266l105l767
$$ 1300 1045 238 -1874 3042 1562 -2951 3736 656 -5561 3259 548 -4648 2618 -487 -4254
1325d254O282k330r86K773j996J241%k99K680l755J100L900o466K297L947q404
$$ -4254 2028 -302 -1288 1485 -511 730 730 431 3111 -644 456 4356 -2110 187 4134 -4270
1341d270L665L855q096L727K952o216K814J998k429J213Q7J494l16k184N410j797
$$ -4270 -605 3250 -4846 -1119 1833 -4383 -1569 429 -2000 -787 -700 794 478 -1706 3704 1907
1357A907m550P191k351m942P587l725n267P043k768k730L920k574o90J047o94
$$ 1907 -2643 4548 2197 -2745 4842 1117 -4150 2893 125 -2605 1315 -1259 -1949 -902 -1596
1372a596K603k329m42L719m111K037M651o281J836L723o811M127L243o888K460
$$ -1596 1007 -1322 -1764 1955 -2156 -119 4532 -1749 87 3810 -3001 1126 4369 -2519 -59
1387e9J160m442L187P79j803J37j719L069j24k201N125k780m347Q222k070m387
$$ -59 1101 -3341 -154 625 -1178 -1041 -2760 309 185 -2016 3109 329 -4018 4204 2134 -2253
1403b253P577m473m158O113j787j659K199l137n28J22J70L128l757p17L797m350
$$ -2253 5324 851 -3307 2806 1019 -640 1559 -1578 -2106 -1984 -1814 1314 -2443 -3160 637 -3713
1419c713L162N157o873K273L267n435M802K920o137K177J49k709K968m82j244
$$ -3713 -551 4606 -2267 6 3273 -2162 2640 5560 -577 1600 1749 -960 2008 1526 282
1434B82j133k669L672l26l166N393l913l784Q351k290k850O766m179k931O118
$$ 282 -851 -3520 152 -174 -3340 2053 -1860 -5644 2707 417 -2433 4333 154 -2777 3341
1449C341j564q67J147k277L2j112J257K525n267J54L259n166L496M732o948K115
$$ 3341 1777 910 2057 -220 -188 -1300 -43 2482 -2785 -2631 628 -4538 -1042 3690 -3258 -1143
1465a143L061m501M487K321m346J575K6j183K504j044k21j717k950M150j130l265
$$ -1143 1918 -2583 1904 4225 -121 1454 1480 297 2801 1757 1536 -181 -3131 1019 -111 -3376
1481c376N190m554l401Q073k767j873N507l994j623N266n72k96P34j621Q50k166
$$ -3376 1814 -2740 -6141 1932 -835 -2708 2799 -1195 -2818 2448 1876 1580 2314 693 1543 -623
1497f23K574K003o164J051K445n909L900L816p601K417K733m238M065J866l352
$$ -623 1951 3954 -2210 -1159 1286 -4623 -723 3093 -4508 -2091 642 -3596 469 2335 -1017
1512a017J395o4N96J602r46J255j958k710M588j487l248M748m310l429O789l118
$$ -1017 378 314 910 2512 1566 2821 863 -1847 2741 1254 -1994 2754 -1556 -4985 1804 -1314
1528a314j571M953l942r17M075p49J35R6l46Q51j625K408J736n864J995K784o473
$$ -1314 -2885 2068 -1874 -2791 1284 535 670 766 420 1271 -354 2054 3790 -2074 -79 2705 -3768
1545c768M437K235p332K718K323m172L220J180k570Q90J11J267Q07j374K837k474
$$ -3768 669 2904 -4428 -1710 613 -3559 -339 841 -1729 -839 -728 539 1346 -28 2809 335
1561C35j860N648k688k779M975m371k629O273l812j590L922l232n56K957r41K7
$$ 335 -1525 4123 1435 -1344 3631 -740 -3369 2904 -908 -2498 1424 -1808 -2364 593 -348 -321
1577c21m78Q39R22k248K643J830n640L628J759n801M276J894p025L615J868m495
$$ -321 -799 40 962 -1286 1357 3187 -2453 1175 2934 -2867 1409 3303 -3722 -107 1761 -2734
1593b734K504O15j779M44J83J286j064q93L814k435j685N633l540k326N738l839
$$ -2734 -230 385 -1394 -950 -767 519 -545 -1438 2376 -59 -1744 3889 349 -1977 3761 -78
1609g8j945N277l406j595L293k769jJ403q97K25q74J142J012l332L475J237n078
$$ -78 -2023 3254 -152 -1747 1546 -1223 -1224 179 -718 -493 -1367 -225 787 -2545 930 2167 -2911
1626b911M290J648o388N000J238n296L345J159l852J773M48j103k67k57J892k030
$$ -2911 1379 3027 -3361 1639 2877 -2419 926 2085 -1767 6 454 -649 -916 -1173 719 -1311
1642a311o10M234l143j463N836m068j473N575l754j349M708l570q69K878j814
$$ -1311 -1921 2313 -830 -2293 3543 -525 -1998 3577 -177 -1526 3182 -388 -1257 1621 -193
1657a93k06K13m30N24j838J747J112l868L437R41m482M336J575n409M192R03m639
$$ -193 -399 -186 -616 -92 -1930 -183 929 -2939 498 1439 -3043 1293 2868 -2541 1651 2554 -2085
1674b085L819M46l304J017M1K8o32n89J800k411p77M817l421j138N563m433r58
$$ -2085 1734 2180 -1124 -107 -66 -38 -670 -1259 541 -1870 -2647 2170 -1251 -2389 3174 -1259 -2217
1691b217N725l534o47L617k701o06J918j018j35o45QM66k725K727Q21m396L496
$$ -2217 3508 -26 -673 2944 243 -363 1555 537 402 -243 -235 231 -2494 233 1054 -3342 154
1708A54O30m393N001O03m770M116N76l345L264M7k000O26m11N95r15r57K439l186
$$ 154 784 -3609 1392 1995 -2775 1341 1917 -1428 1836 1883 -117 509 98 693 -222 -1179 1260 -1926
1726a926p60M435l576q10N137m080m92N101l218m62L305k470j53J607q13M26j629
$$ -1926 -2686 1749 -1827 -2637 2500 -1580 -2072 3029 -189 -651 2654 184 31 1638 825 1251 -378
1743c78J012K27l232K551P36m774L447R26m410M238M89l834L650N37k398K612
$$ -378 634 861 -2371 180 916 -3858 -411 515 -3895 343 832 -3002 648 1185 -1213 1399
1759A399K9q38K65j92J146j653n09K450l212r77M474m285l46M299m306M6M110
$$ 1399 1428 590 855 663 1809 156 -353 2097 -1115 -2092 2382 -1903 -2249 2050 -2256 -2210 1900
1776A900l080J86K346j227J69O36J88L09j866J679O16l689K797K98m447L590J54
$$ 1900 -1180 -994 1352 125 294 930 1118 1427 -439 1240 1856 -1833 964 1262 -3185 405 559
1793E59m300L784K16l320L399l09j136J659l57M99J02l63K084k041m83L473l735
$$ 559 -3741 43 259 -3061 338 29 -1107 552 195 694 796 433 2517 476 -7 3466 -269
1810b69m47L548m454m02L868l864N8K537k857M48J750r59P79r6K49J372k144K459
$$ -269 -716 2832 -1622 -2024 1844 -2020 -1962 575 -2282 -1834 -84 -1043 -264 -360 -111 1261 -883 1576
1828A576P01l605L299L57m213L838k26l844K948m94k352K198n04j246Q48l02J167
$$ 1576 2277 -1328 1971 2328 -1885 1953 1727 -2117 831 337 -2015 183 -321 -1567 -719 -1021 146
1845A46o14k89K365k267j87L721k835m15L303l985p3L883l384k9J438k670O85
$$ 146 -468 -757 1608 -659 -846 2875 40 -375 2928 -1057 -1130 2753 -631 -660 778 -1892 -1207
1862a207P16n52Q96j673Q32R85j909K852M78l372L568K75k894L958p42l264K508
$$ -1207 -491 -1043 -147 -1820 -988 -3 -1912 940 1418 -1954 1614 1889 -1005 2953 2211 -1053 1455
1879A455k43k205K288j395q09j48r08K078j068o95K521k860J32M212k764M0L270
$$ 1455 1212 -993 1295 -100 -909 -1057 -1965 113 -955 -1650 871 -1989 -1857 2355 -409 -369 2901
1896B901l402N66L150k531O41N06k544P98j76j18L95k545J063Q97k441K930K31
$$ 2901 -501 65 3215 684 1325 1831 -713 85 -91 -209 186 -2359 -1296 -399 -2840 90 321
1913C21l619L533K96k036L735q72k482K611o51m16J331j088l51j058m08K086j897
$$ 321 -3298 235 531 -1505 2230 1358 -1124 1487 836 420 1751 663 312 -746 -1154 932 -965
1930i65o50K615l150J95L761l027N44K743l332J102K619k035P19O1j176Q36p62
$$ -965 -1615 1000 -2150 -1955 1806 -1221 -677 2066 -1266 -164 2455 420 1139 1200 24 860 98
1947I8L04N95l206J467O12k417K610j33l366L278Q8k258L446o01j866K077k95
$$ 98 402 997 -2209 -742 -130 -2547 63 -70 -3436 -158 -70 -2328 1118 517 -1349 728 433
1964D33k0R96r77M26n87p54K327j907p52K744l972N48L645l054K94K153k990P50
$$ 433 413 1409 432 858 271 -483 1844 -63 -815 1929 -2043 -1495 2150 -904 -610 1543 -1447 -697
1982f97J991j631R16j20q59J740j637J232M59k994J825M93k744K734m69l071L196
$$ -697 1294 -337 579 459 -400 1340 -297 935 1394 -1600 225 718 -2026 708 239 -2832 364
1999C64q35j600L264j518j278J804p78O72K75p13J601j819j55K747k630J09K368
$$ 364 -471 -2071 1193 -325 -1603 201 -577 95 370 -343 1258 -561 -716 2031 -599 -490 1878
2016A878l201L50K960l121L12J875k452J057J209j151J049o73K00N78j363J580
$$ 1878 -1323 -973 1987 -1134 -822 1053 -1399 -342 867 -284 765 92 292 870 -493 1087
2032A087L43k830K569P5k980L088p24k699K806n80j753K306j477j73R40n56N86
$$ 1087 1430 -1400 1169 1244 -1736 1352 628 -2071 735 155 -1598 708 -769 -942 -2 -558 28
2049B8r1r54J949j517j21K504k733M59K545l125P26K318l408J220J429k400R38
$$ 28 -63 -1017 932 -585 -706 1798 -935 -476 2069 -1056 -330 1988 -1420 -200 1229 -1171 -233
2066b33M43p17N78q53R14O80j954K240Qk459K759k58k670L118j050k080K630q89
$$ -233 210 -507 71 -782 132 812 -1142 1098 1106 -1353 1406 1148 -1522 1596 546 -1534 1096 207
2084B07j406J647q78k23O41o78O81m27k15J931j759L62J808k579P03K383l167
$$ 207 -1199 448 -430 -653 -12 -690 -9 -436 -651 1280 -479 -117 1691 -888 -185 2198 -969
2101i69J086J623l212J039J191j678P58m54m30P69q73R37M22j767K081K27k045
$$ -969 117 1740 -1472 -433 758 -920 -162 -616 -1046 -277 -1150 -213 209 -1558 523 750 -1295
2118a295K947l02k308L007r16j848K568j362j280J275p88N5J97r76J346j696N63
$$ -1295 1652 1350 -958 2049 1133 -715 1853 491 -789 486 -302 -247 -50 -1026 320 -1376 -813
2135h13J910k423R68J967l220J690K164k978R60J351k692J234O39j459N70l55
$$ -813 1097 -1326 -358 1609 -1611 79 2243 -735 225 1576 -1116 118 757 -702 -132 -487
2151d87k92N08r94J565j39k245L022m98j734L361p69k099L036j353j127K141j442
$$ -487 -779 -271 -1265 300 161 -2084 938 440 -1294 2067 1298 -801 2235 882 -245 1896 454
2168D54p89Q00r28L01m06r47J282j608M73K203k645O84K267k868J783J858k596
$$ 454 -335 465 -463 -162 -568 -1515 -233 -1841 -1368 835 -1810 -1126 1141 -1727 56 1914 -682
2185f82J574Q51k035J189N94j154O48j163K36L28j674J795q14j847K880j241j287
$$ -682 892 1743 -292 897 1491 337 985 -178 58 386 -1288 507 -307 -2154 726 -515 -1802
2202a802L246j361j710K951j270o75K048j198j57L24o94P17p52n41J123j669K40
$$ -1802 1444 83 -1627 1324 54 -621 1427 229 72 396 -298 419 -333 -874 249 -1420 -1180
2219a180K224k946Q69K040k934J926J392k306J462N87j245J263j49n34P37j052
$$ -1180 1044 -1902 -1033 1007 -1927 -1 1391 -915 547 1134 -111 1152 1003 469 1206 154
2235A54M48r9j469J565p30j843K451j138j508K829j308j241K872j374L2J329r68
$$ 154 602 503 -966 599 -131 -1974 477 -661 -2169 660 -648 -1889 983 -391 -359 970 2
2252BL27L63o02J329j481j09J539k202O72J547k777J037J248k402J185J285k360
$$ 2 329 692 90 1419 -62 -171 1368 -834 -162 1385 -1392 -355 893 -1509 -324 961 -1399
2269a399J479K5q99J322n22J75J34j225J685n3j754K035j151j080K617j134j631
$$ -1399 80 105 -794 528 6 181 315 -910 775 722 -1032 1003 -148 -1228 1389 255 -1376
2286a376K467j718m52J915j335n5R55q28Q99P0m76J275j562M66J394k502J159
$$ -1376 1091 -627 -1079 836 -499 -554 401 -427 472 542 66 1341 -221 245 1639 -863 296
2303B96J341k775J301R03k406J186L26j792J357N9p01P58q86P01P09j321J665
$$ 296 1637 -1138 163 1066 -1340 -154 172 -1620 -263 -204 -905 -147 -1033 -332 377 -944 721
2320G21k58j393K187o28j033K473j564j289K265j673j84J435j601J01L68n54R75
$$ 721 463 -930 1257 629 -404 2069 505 -784 1481 -192 -376 1059 -542 -441 -73 -627 348
2337C48j122N29L45j274P98J483k363J343J277k763J703Q37k026J210K77j368
$$ 348 -774 -245 100 -1174 -376 1107 -1256 87 1364 -1399 304 1141 -885 325 602 -766
2353g66J007l08o2N5n73P64J59j066J720m75j418K345j205p34K323j535q73K023
$$ -766 241 -67 -129 -74 -647 117 276 -790 930 455 -963 1382 177 -557 1766 231 -642 1381
2371A381j630M4J114j636O17j23m62J099j163n0J138k045J649P80k205J369J418
$$ 1381 -249 -205 909 -727 -110 -233 -695 404 -759 -809 329 -1716 -67 713 -1492 -123 1295
2388A295k616J726O77j965J268J27r56P23j85P4K56j260J549n89j149K201j084
$$ 1295 -1321 405 1082 -883 385 512 -444 279 94 168 424 -836 713 124 -1025 1176 92
2405I2j320K342q57q80K050j479k06R55o78J94N87j078M70l52j32J156j383L95
$$ 92 -1228 1114 257 -623 1427 -52 -258 697 19 213 800 -278 192 -160 -292 864 -519 -124
2423a24Q80k003J297P63k108J247O50j986J680R6j279J327l73n34O40m54L08J09
$$ -124 756 -1247 50 813 -1295 -48 602 -1384 296 392 -887 440 67 -467 173 -281 27 136
2441A36j483J834m66p99J954j389r14K250j562k11J945j472N0J180j369Q14j6
$$ 136 -1347 487 21 -778 1176 -213 -1127 1123 -439 -650 1295 -177 -127 1053 -316 498 482
2458D82l50P80j049J44J434j978L31J098j927J120N86k046J686J13j553J366K29
$$ 482 132 912 -137 7 1441 -537 -206 892 -1035 85 671 -1375 311 424 -1129 237 466
2475D66j077R01p39Q2P47r16R57m0j622K102j030o97J825j277q38K212j350m79
$$ 466 -611 290 -449 -367 380 -536 421 381 -1241 861 -169 -866 959 -318 -1156 1056 -294 -773
2493g73J595j241K68O76r88O99J56l79Q10j046K98J033j776R42Q49j960J003M74
$$ -773 822 -419 -151 525 -463 236 392 13 823 -223 75 1108 -668 274 1123 -837 166 640
2511F40j783J445J39j033R59j55p95P68k14L04Q2j053J557p41q47J518r68q82
$$ 640 -1143 302 441 -592 367 212 -583 185 -29 275 357 -696 861 120 -727 791 -177 -1059
2529a059J877j398o74J921j324j89R39q73N93L66p69J091m59J66P00r19K28J122
$$ -1059 818 -580 -1254 667 -657 -846 93 -780 -187 179 -590 501 42 208 908 -11 217 1339
2547A339j685J027P71k105J063M97j807J314l58j123J187n38JL90n11O19R3j023
$$ 1339 -346 681 1452 -653 410 907 -900 414 56 -1067 120 -418 -417 -27 -538 81 174 -849
2565h49J570p67p66J562q19o54J530j287j35J139j098j31R94j170O47R8l82Q07
$$ -849 721 -46 -812 750 -69 -723 807 -480 -615 524 -574 -705 289 -881 -234 -136 -518 289
2583B89r22P60M80p59O56Q26j730R24Q11j790J194j49j505J303o00o62M82l77
$$ 289 -633 127 607 -152 504 1330 -400 524 1335 -455 739 590 -915 388 -212 -874 -392 -769
2601g69m3M78o61J212l65p02J846q35p32J760j113r8J753j916M76R94j622N22
$$ -769 -812 -334 -995 217 -148 -850 996 161 -571 1189 76 -22 1731 -185 291 1285 -337 185
2619A85K46n19M16o52m45R09r38O03N49j064J184K44j585J461K22j574J185n8
$$ 185 431 -88 328 -324 -769 140 -798 -195 354 -710 474 718 -867 594 816 -758 427 369
2637C69j020J025n50m18M16m98J10M72n83M64j36n99J862p38l72J731j627J1J160
$$ 369 -651 374 -176 -594 -178 -676 -566 -94 -677 -213 -349 -948 914 176 -196 1535 -92 -81 1079
2656A079j135J92P85j497P17K24o51K85o03J24O28j077O45M17j578J580K47j173
$$ 1079 -56 136 921 -576 141 365 -286 -1 -604 -480 148 -929 -284 133 -1445 135 382 -791
2674g91J292K47j175J323n49m56R17m74k56K78p08O55k57l70O27n59n14J399j276
$$ -791 501 748 -427 896 347 -109 808 334 78 356 -352 303 46 -324 303 -256 -770 629 -647
2693f47J03J438j465J89Q89j037J91Q15j303M57K22j75N41p27L09N80j116R07
$$ -647 -544 894 -571 -382 507 -530 -339 476 -827 -370 -148 -323 218 -509 -200 380 -736 171
2711A71L43j477J345L56j524J548j47j048J136j07j73K95n35J24Rr41J184l05
$$ 171 514 -963 382 738 -786 762 615 -433 703 596 423 718 183 307 316 -625 559 254
2729B54o71J027j052n04J372j439J93J475j680L83J131j203M06M27n03P06k87
$$ 254 -417 610 -442 -946 426 -1013 -820 655 -1025 -642 489 -714 -308 119 -384 322 35
2746C5L6L69n25J59Q19j608J067M85j483J341k08j105J405o89n01Q48o44P4N33
$$ 35 71 440 -85 74 893 -715 352 837 -646 695 487 -618 787 98 -403 445 -199 -125 408
2765D08n68M28n72j57R23n16o78J400q90k67J014j214L12R30j096K83P06j019
$$ 408 -160 268 -304 -461 462 -54 -732 668 -222 -489 525 -689 -377 553 -543 -260 446 -573
2783e73O76P3m81R74p56j18O36r50Q19L08j138R31J78j295J326l55r27J047m57
$$ -573 103 176 -305 669 -87 -205 431 -519 300 608 -530 401 579 -716 610 255 -672 375 -82
2802h2m97Q67n44O6Q6J4L62m59k70J048o19k95J079q12Q5P94j160K56Q43j126
$$ -82 -579 288 -256 -190 -104 -90 272 -187 -457 591 -28 -323 756 -56 29 823 -337 -81 762 -364
2822c64L42M37o33M08l47j18O70q23M08N25j251Q77K88j179J406k51r23Q55j79
$$ -364 -22 415 -218 190 -157 -275 395 -428 -20 505 -746 131 419 -760 646 395 -528 327 148
2841A48r42R74K21q65P87n28J01K7k38O88n27k66J044p11j48J163j324L17P71
$$ 148 -794 180 401 -464 323 -205 -104 -77 -315 373 -154 -420 624 -87 -235 928 -396 -79 692
2860F92j359N06O34q51L50J9n28M49j89J35K63p71Q25L01j219R51M29j537J488
$$ 692 -667 -161 473 -378 -28 -9 -537 -88 -277 -142 121 -650 175 476 -743 208 637 -900 588
2879E88j18r82J250l67o69J133q11k62M81l83P49q19l56J014o34m57J006q63M2
$$ 588 470 -512 738 371 -298 835 24 -238 243 -140 609 -210 -566 448 -186 -643 363 -500 -458
2898d58Q97q71L68O13j120N05K67p19M20J66m69N72m87L14J9n05M65K15j199J587
$$ -458 439 -432 -64 549 -571 -66 201 -518 -98 68 -401 171 -316 -2 17 -488 -23 192 -1007 580
2918E80j0j255J185k12p40J208l48o75Q02n03q9M24m54M64l80l61R61o71m75J093
$$ 580 570 -685 500 288 -452 756 408 -267 535 32 -57 367 -87 377 -3 -364 597 -74 -549 544
2938E44j029K55P90r92M22M00p45M99K78p38O06l71k04N96l60m1K93q98Q08j85
$$ 544 -485 -230 560 -432 -10 390 -355 144 422 -316 290 -81 -285 311 -49 -90 203 -695 113 -72
2958g2p20J167l82q30R72j75n31R17l95q0P52l87J40j8l87Q53p39q5R10j027j4
$$ -72 -792 375 -7 -837 135 -40 -571 346 -49 -129 623 236 376 358 -29 824 85 0 910 -117 -131
2979a31Q44j262K68Q36r73K58Q90j257N82L51p98P16m30R8J24k71J98K05r13J329
$$ -131 713 -549 -281 555 -418 -160 730 -527 55 406 -392 324 -106 -8 116 -155 43 248 -665 664
2999F64p61r22J200k05o47P91m70j73R27n99J18L80k47M83l17k56P45q58m3P10
$$ 664 -97 -1019 181 -24 -671 120 -350 -523 404 -195 -77 303 56 539 222 -34 711 -147 -190 520
3019E20n21j11P17j189L76N73p34K51L98r06N40j84n4M91k83L80M06q19P92N2
$$ 520 -1 -112 605 -584 -208 365 -369 -118 280 -626 -86 -270 -324 167 -116 264 670 -149 643 695
3039F95j394J292j96r12J132k54j062Q35k71k87N84m57K2K43m00M51nm85J036
$$ 695 -699 593 397 -515 617 363 -699 136 -135 -422 162 -295 -273 -30 -430 21 16 -469 567
3058E67p88P1Q75r84J32N86p92K21O00q60M88J59p06L25J55m2K24m94M12M70p82
$$ 567 -221 -150 725 -259 -127 459 -333 -112 488 -372 116 275 -431 -106 49 7 231 -263 149 619 -163
3079a63P32k54q17J258l97o55P02l46p42J096p71j81N11n64J92K29k93O34P2o03
$$ -163 569 315 -502 756 359 -296 406 60 -682 414 -357 -538 -27 -591 -399 -170 -463 171 243 -360
3099c60Q95o59k5J352j311J76O54r81M80K18o75L55J7l88L76k34J1J26o48M19
$$ -360 535 -124 -149 1203 -108 68 722 -259 221 439 -236 119 136 -252 124 -110 -99 27 -621 -202
3119b02M01p61P42M8j122J350k72o04J011n36k77N46o40M3J25l26N83k53k34O40
$$ -202 199 -562 180 228 -894 456 184 -420 591 55 -222 324 -316 -273 -148 -474 109 -144 -378 262
3139B62m46p0R00q41J45R29j101M73L36o26O13m25j86L00k32k56L57l16P3L53
$$ 262 -184 -254 646 -195 -50 879 -222 251 587 -39 574 149 -37 263 31 -225 132 -184 -111 242
3159B42p38N20l1j071J127j63o89J202j99r52J360q45J65K82k74J96J2j70K83
$$ 242 -496 24 -7 -1078 49 -114 -803 399 200 -752 608 -237 -72 210 -64 132 144 -26 257
3178B57j60k22M60q51M27O97r74K52N24o46M05J28o00N30m0m77P05n80Q5L35o49
$$ 257 97 -125 335 -516 -89 608 -366 -114 410 -236 169 297 -303 227 187 -290 415 -165 -80 255 -394
3199c94M95K95q91R28m78n88P40n4p01J120l92m44O86m75L3M26m50M21j66l1L08
$$ -394 101 396 -495 433 -45 -633 107 53 -648 472 80 -364 322 -153 -120 306 -144 277 111 80 388
3220C88p22P3O62p02J33M12o00L0L04o58Q75J24q94R24k16k32L65j60P2L17n30
$$ 388 -334 -261 401 -301 -168 244 -356 -326 -22 -680 195 319 -575 349 133 -99 266 106 178 495 -35
3241c5J73L94p02Q42m81o83J061j70j001J182p91l0M80p29L90J69l58L77R1k60
$$ -35 138 532 -170 672 191 -492 569 399 -602 580 -211 -241 239 -490 -100 69 -289 88 179 -81
3261h1M35o08J64O81j004O9R57j127N05K94p11N39P9p89N11q1K39N8l07K81K64
$$ -81 354 -254 -90 591 -413 -344 613 -514 -9 285 -426 113 192 -597 -86 -167 72 130 -177 104 368
3282C68q55Q75M0p04O07k10o66Q54k28l28O80p21O2J06k02J49L36q76J065m22
$$ 368 -487 388 428 -276 331 121 -545 309 81 -247 433 -288 -226 -120 -322 -173 163 -713 352 -70
3302g0j95O86o46K24L23o69N15L56p62J62L22m95K72J89n86Q56q25K9L48m24M17
$$ -70 -265 421 -225 -1 322 -347 168 524 -238 -76 246 -249 23 212 -374 482 -343 -314 34 -390 27
3323B7M4m21O37j97n84Q85m55k84J148m46q77R27o19j3O69n35K85n51m2N55m46
$$ 27 71 -350 287 90 -494 391 -64 -348 800 354 -523 404 -215 -228 441 -94 191 -360 -402 153 -293
3344b93j1Q33p63JQ61j091P76L25p43N51j71m97P74p59r4N68l90M16q6l89K07
$$ -293 -304 529 -234 -233 628 -463 313 638 -105 446 275 -222 552 -207 -301 267 -123 293 207 -182 25
3365B5J96o16N53j84j92M12k79j87O41l47K46J72p62L29K61k11O0l81k26Q54m11
$$ 25 221 -395 158 -26 -218 194 -85 -272 369 22 268 440 -322 7 268 57 117 -264 -490 364 -47
3386d7O5K15o49K51M93p19N35J85o83J071k11n53L59l7j94J15l59R9M07q19O44
$$ -47 18 233 -416 -165 328 -391 144 329 -354 717 506 -47 312 275 81 196 -163 -64 343 -476 168
3407A68qo24P81m73R4J98r4k92O13j24m49N17n72O80j68m77L72jk22J24k82o9
$$ 168 160 -464 317 -156 -62 136 42 -250 363 239 -210 307 -265 415 247 -230 142 141 -81 43 -239 -308
3429c08N05p04O62J48o29M26N5n97O15j95j82L23j71J06J08m55O68m2p60O57k77
$$ -308 197 -507 155 303 -326 100 155 -442 173 -22 -204 119 -52 54 162 -293 375 333 -427 230 -47
3450d7k55O39l68l66M97k39j35L40l19J46K53q5Q4L85m81K50l85R4N41q07k9P07
$$ -47 -302 337 -31 -397 100 -139 -274 66 -253 -107 146 61 145 530 49 299 -86 8 549 -258 -287 420
3472D20o15K93K97j015P60J52p50P07j97l28L72j27R4L77n93L42r7k47M33j88
$$ 420 -195 98 395 -620 140 292 -458 249 52 -276 96 -31 63 440 -153 189 92 -155 278 90
3492I0o14R22k09m60N62l93J59K58j96j55J78j88K36m30n8Q68m68NN68p72M17
$$ 90 -524 398 189 -271 291 -102 57 315 119 -36 142 -46 190 -240 -298 570 102 107 675 -97 320
3513C20K78r01N50o2o24M44o8k06N16n51J06L38j77j93L43m14M56j17k86O73j36
$$ 320 598 -303 247 185 -439 5 -63 -269 247 -304 -198 140 -37 -230 113 -301 155 38 -248 425 289
3534B89l13O60n75j70M64l66q6O7j34l7l0k59P39m14O1N12l98oJ31m14L95M2l23
$$ 289 -24 636 61 -109 355 -11 -97 -30 -164 -201 -231 -490 249 -165 -104 408 10 4 135 -279 116 158 -165
3557a65M20J77o32K68R7l89K34m99L14J28l14N96Lm06N49j66k27P19q42r1Q21
$$ -165 255 432 -200 68 165 -224 10 -489 -175 -47 -361 235 238 -168 381 215 -12 707 -135 -226 595
3578E95p44O6M90o25l2Q4P5L1j28j7L05m65M25J12m43J61L94m30L25J80m53K06
$$ 595 -149 -83 407 -218 -250 -166 -91 -60 -188 -205 100 -365 60 172 -271 -110 284 -146 179 359 -94 112
3600A12o1k44M59k75m44N61j95j6M6j95L48j03l61L80m6j59O63n61PM60m18L70
$$ 112 51 -193 266 -9 -453 108 -87 -103 -57 -252 96 -7 -368 12 -34 -193 470 -91 -84 376 -42 328
3622C28j49j0m9J59n08N26n17K97J50o53N50P0o47K84M93o25L59P6n29L74k4l7
$$ 328 179 169 120 279 -229 297 -220 77 227 -426 124 194 -453 -169 324 -301 58 134 -395 -21 -45 -82
3644h2M44l88q7L59l14K2J5k58M15k14l23O90k15l05N98l44k39Q05n21M6L77p13
$$ -82 362 -26 -113 246 -68 -46 -31 -289 126 -88 -411 279 64 -241 357 13 -226 579 58 104 481 -232
3666b32M12nj0k13k24J95K64m56J7N14o46O22q9o35M02j6j54M47q9n9L84m96k73
$$ -232 180 175 165 -48 -272 -77 187 -269 -252 262 -384 238 149 -486 -84 -100 -254 193 104 45 429 -67 -340
3689c40K85l0J26L3m39O82m10m58P30j16k01M91n74r3K17%J02J02l72M07k5kJ41
$$ -340 -55 -85 41 74 -365 317 -93 -551 179 63 -138 353 -221 -314 -97 -97 5 107 -265 142 117 115 256
3712B56l48J7N98o74J51Qm77O53L5o79L49J10p9J25j82k9L13l78L48P4k91J98
$$ 256 -92 -75 523 -151 0 8 -469 184 219 -460 -111 -1 -80 45 -137 -166 147 -231 117 191 -100 98
3734I8o8l89O49k23l60J76N8j04M49o64J59J47r3J04j7nK94k67j46L18k85M39
$$ 98 30 -359 290 67 -293 -117 -59 -163 286 -378 -219 -72 -165 -61 -78 -83 211 -56 -202 116 -169 270
3756B70k01m03M64K17q69N20k6m54R23l12l17M08l91L16o2q1J18O1n97O10O2l23
$$ 270 69 -334 130 347 -522 -2 -28 -482 441 129 -188 220 -171 145 83 2 120 181 -416 194 256 -67
3778f7N70o11j51M70l80q8L50l15J36j66Q6L87j82l73L50q0oL37l79K81N6m56
$$ -67 503 -108 -259 211 -169 -257 93 -222 -86 -252 -166 221 39 -334 16 -64 -70 267 -112 169 225 -231
3800b31M46k8l04L13j39l38N32l74j25j0L71J02k2n75N37j18l49O51n12L7J64
$$ -231 215 187 -117 196 57 -281 251 -123 -248 -258 113 215 193 -382 155 37 -312 339 -173 -136 28
3821B8pk68N26k98j0K43l67J2M35n25O4M6JL20k52j35L77n02K71L90n85L48L37
$$ 28 21 -247 279 -19 -29 214 -153 -141 294 -231 -167 -121 -120 200 -52 -187 190 -312 -41 349 -236 112 449
3844D49m97P9l7q6L09m87p5N73j52j8l16p5M68k47J33J69l35L8K76jl47Q3K23
$$ 449 -48 31 -6 -92 217 -270 -345 228 76 58 -258 -333 135 -112 21 190 -145 -107 169 168 -179 -96 127
3867A27j2Q9L2J41m54q3O5J71k61K22j92L63j48j47K09P9l88K75l2j69K27k01
$$ 127 115 204 236 377 -77 -160 -95 76 -185 37 -155 208 60 -87 122 201 -187 88 56 -113 114 -87
3889h7J48O2m23J04P14n03M4J17n00M26j24l61N00j82q1L00l71j77N56k86p6L41
$$ -87 61 123 -300 -196 518 15 59 176 -324 102 -22 -383 117 -65 -146 154 -217 -394 162 -124 -200 141
3911A41l01K13J11k01M19o86L38J40l16Q9L80p88O84Q5q06N29J0k28L88k90P7
$$ 141 -160 53 164 -37 382 -304 34 174 -142 -53 327 -461 223 308 -498 31 41 -187 201 -89 -12
3932a2M12l41L2Q9k18K76j21k78L29l03k05O26m44J18j76j19J14J72l2K28p3j17
$$ -12 400 59 91 180 -38 238 117 -161 168 -135 -340 286 -158 -40 -216 -335 -221 -49 -81 147 74 -43
3954d3K83j13j49J29J79l24K67l58M4L79n33K07K56l22O7j29j16O51m96R1L04
$$ -43 240 127 -22 107 286 -38 229 -129 -85 294 -239 -32 224 -98 -31 -160 -276 375 -121 -30 274
3975B74l51M12j99l72L74J74l38K11p9k42N52l59l19M32m78O8L34p3J33j06k18
$$ 274 -77 335 136 -236 138 312 -26 185 106 -136 416 57 -262 170 -308 -240 94 21 154 48 -170
3996a70L42j2j19J06j25K07n8j16M3J65p27M95J85o75O02j34j45J63j65j17L01
$$ -170 172 160 41 147 22 229 171 55 98 263 -464 31 216 -459 143 9 -136 27 -138 -255 46
4017D6j97K45J17k29k5j45J35O21o82P6L25n60K00o2K79l14J2l21O44k60N1J02
$$ 46 -151 94 211 -18 -43 -188 -53 568 -114 -38 287 -273 -73 -135 144 -170 -158 -479 165 -95 -44 58
4039E8l26Q3J52j8P7J33k73L70j8l97K84l00J58J11l06J2N73n29K38o4m42L99
$$ 58 -268 -185 -33 -51 26 159 -114 256 238 -159 125 -175 -17 94 -212 -200 373 -156 82 18 -424 -25
4061b5l9o0O01o78j7O88m98K55J42m34l9K70n15O84n58J18r6L2r1L51k39K29K53
$$ -25 -64 -124 477 -201 -218 470 -28 227 369 -65 -104 166 -349 335 -223 -105 -201 -169 -260 91 -148 81 334
4084C34m98K71J26k06J75j52r4K13n5k3J8k99K12L28m21J53o4l27J25K87j35K14
$$ 334 -164 107 233 27 202 50 -44 169 114 91 109 -190 22 350 -71 82 18 -309 -184 103 -32 182
4106A82k70k9K64k7k0M4j75k00N23m05K73k08l46N54j20j01K4l13N69K75n10J47
$$ 182 -88 -117 147 120 100 144 -31 -231 292 -113 160 -48 -394 160 40 -61 -37 -350 219 494 -16 131
4128A31l16q2J81M86m31L53k83p9L08n22L01O7l96K47L8j04J54k15J34K31k29
$$ 131 -185 -267 -86 400 -31 322 39 -40 268 -254 47 114 -282 -35 3 -101 53 -162 -28 203 -26
4149b6L6M89o93K90P1l59P2J44k50L77J21n96M44l43L08k51j08K07j91n3K03J69
$$ -26 10 499 -194 96 167 -192 -120 24 -226 151 272 -324 120 -223 85 -166 -274 -67 -258 -311 -108 61
4171F1k43J22J08k37K06l8p5J89j79L3j6k75M34K15o67L73p9M1J60m04J62L20
$$ 61 -182 -60 48 -189 17 -21 -96 93 -86 -53 -69 -344 90 305 -362 11 -68 -27 133 -271 -109 211
4193B11m01K45K65l87K17m2j56l6K35k19L14j47k34J40k43K02Q2k71p4K21k5j8
$$ 211 -190 55 320 -67 150 108 -48 -84 151 -68 246 99 -135 5 -238 -36 46 -225 -299 -78 -103 -121
4215a21J46j38L25l12J01K71k55P6N5j52J19k6r3J82k11k70N36l76J5J03N6k39
$$ -121 25 -113 212 -100 1 272 17 93 148 -4 115 89 -4 178 -33 -303 233 -143 -128 -25 31 -208
4237b08M00j60J72p4j2K6k14O2M16n56J01K56k85J65k10j49K12q3J39N1l24L32
$$ -208 192 32 204 130 118 144 -70 -8 408 -148 -47 209 -76 89 -121 -270 -58 -141 -2 49 -275 57
4259E7l09j20N55n24J67J05Q0j07J26k40M2M78l34J52j26o7J37k9q1K05O8m25
$$ 57 -252 -372 183 -341 -174 -69 11 -96 30 -210 -168 310 -24 128 2 -65 72 43 -38 167 235 -190
4281a90K62J78k70J07j05j9L49j74M4K2j3n5l14j58O18l26k08K20J27j50k2J07
$$ -190 72 250 -20 87 -18 -37 312 138 182 204 191 136 -178 -336 282 -44 -252 -32 95 -55 -77 30
4303C0l5J66l76L35kl56L41J73m58K41j48O4K61k33J3M63m91q3K00q8L9j53J51
$$ 30 -5 161 -215 120 118 -238 103 276 -182 59 -89 -25 236 3 16 479 -12 -95 105 17 56 -97 54
4326E4m9k5J93k5k72L05k24m9K61P1j74K13k4o17M69r8k54L58l77K81l6k12K37
$$ 54 5 -20 173 148 -124 181 -43 -92 169 240 66 279 255 -362 107 9 -245 113 -264 17 -19 -231 6
4349Fj76J50K13k34k42M05O1k68L15j77j80K04m74K66n2J30J36r2j42M69n40J25
$$ 6 -170 -20 193 -41 -283 122 183 -85 230 53 -127 77 -397 -131 -183 -53 83 -9 -151 318 -222 -97
4371i7n2N1J64j37R2K10k73n8K35j28l77K32J0J22K38j38J48l01k46L27p7j56
$$ -97 -149 -98 66 -71 21 231 -42 -100 135 7 -370 -138 -128 -6 232 94 242 -59 -305 22 -55 -211
4393b11K45q0j81M10n9mJ68l44J02L2j05R8p0j6K35j87k68J22k27P8L25m39O62
$$ -211 34 -46 -227 183 124 120 288 -56 46 78 -27 71 1 -15 220 33 -235 -113 -340 -262 63 -376 286
4416B86j14l32k8J33j37L38j26j51M05n31K69J24j70J88l4k02L7M5j62Q5j9J0
$$ 286 172 -160 -188 -55 -192 146 20 -131 274 -257 12 136 -34 154 120 -82 -45 0 -162 -77 -96 -86
4438h6j43M1L27j23J5Pj53L0J75J31j75K40m68J38j32J10J64J30n74L38n1j89
$$ -86 -229 -188 139 16 31 38 -115 -85 90 221 46 286 -182 -44 -176 -66 98 228 -346 -8 -59 -248
4460b48K06Q2j89L19l43K24R7m70O36Qm17J22O4l15O12n78J76K57n66J21J17j66
$$ -248 -42 40 -149 170 -173 51 148 -322 314 322 -95 27 91 -224 388 -190 -14 243 -323 -202 -85 -251
4482b51M15J04k86j02J44k45N33l16O2Nj33K29j37k40M42l02k50N91Q3p10K12
$$ -251 164 268 -18 -120 24 -221 312 -4 58 63 -70 159 22 -218 224 -78 -328 263 346 -364 -152
4503a52L02n3lJ6k46L67j96j3J86k73L51j17j83N92m15l05L77k13k95L45k82L58
$$ -152 150 97 94 110 -136 231 35 22 208 -65 286 169 -14 578 163 -142 235 22 -273 72 -210 148
4525A48k50k78N69l13Q4J77j86J84j4m10L01N8m49M38j41J3L29k12K25m1j51l07
$$ 148 -102 -380 189 -124 -40 137 -49 135 121 -289 12 70 -379 59 -82 -69 260 48 273 232 81 -226
4547b26J68J47J71k21nJ55j79j60J9L10q9K73m13M7L74m53L15j54j42%J69k22
$$ -226 -58 89 260 39 34 189 10 -150 -131 179 90 363 -50 -3 371 -82 233 79 -63 -63 106 -116
4569a16L20j10j59j41J70k05O22l77r0J39j83N15n39k75M86o2j74L29l92r9L25
$$ -116 204 94 -65 -206 -36 -241 381 4 -86 53 -130 385 -154 -429 57 -5 -179 150 -242 -341 -16
4590a6j09q2J74j66L00n8q0J85j59j38M66l97R0J73l80J03K09k54M5j39k10M33
$$ -16 -125 -207 -33 -199 101 43 -37 148 -11 -149 317 -80 10 183 -197 -94 115 -139 -94 -233 -443 -10
4612a0j45L1L62o29L12j15n8N44k39l70L80J07k73J05l42J67K79k31jK48m34L30
$$ -10 -155 -124 238 -391 -79 -194 -252 292 53 -317 63 170 -103 2 -340 -173 106 -125 -126 122 -312 18
4634A8k32l4J62O9J82kr2p2K28n02O6Q3j26K75kp9L30j33j42K06j05o7J92o17
$$ 18 -214 -248 -86 -17 165 163 71 -1 227 -275 -209 -126 -252 23 21 -58 272 139 -3 203 98 31 223 -394
4658c94L69Q3l41K66M12n71L42k57k59K54K49j72L24L0l55kk1J38j09j35L4J08
$$ -394 -25 58 -283 -17 395 -176 166 -91 -350 -96 153 -19 305 335 -20 -22 -43 95 -14 -149 -115 -7
4680gj68N06m79J17Ok25J59J9M2%J7l9J73j11N3L03l04k01J23q9q3J11j45K47
$$ -7 -175 331 -148 -31 -25 -250 -91 -72 -30 -30 -13 -52 121 10 63 366 62 -139 -16 -105 -188 -77 -222 25
4704B5N0l11M13j64l83O58k37j15O5j99K55%N2J90k31j09J5j48K0J38k02J8P2
$$ 25 75 -236 177 13 -370 288 51 -64 1 -198 57 57 109 299 68 -41 -26 -174 -154 -16 -218 -200 -128
4727a28j61J00J01k83N83j92j78M55l44q6L50k55J59K8l62L10j73j67K32L3l48
$$ -128 -289 -189 -88 -371 212 20 -158 297 -47 -133 217 -38 121 149 -213 97 -76 -243 -11 22 -326
4748c26J78K0j25M28l62K35k25Q0J01J10Q3O4k35k80M78l88J98P8j06m7J21j05
$$ -326 -148 -128 -253 175 -187 48 -177 -97 4 114 197 261 26 -254 224 -164 34 112 6 -41 80 -25
4770b5J00k52O8R6j70O3M77n14L09j50k95J04M84j85j09q5K4L01k25j44J82Km5
$$ -25 75 -177 -109 -13 -183 -120 357 -157 152 2 -293 -189 295 110 1 -84 -60 241 16 -128 54 56 11
4793A1p7J81k42K82k32K95k33l45K86j1r6L35m18J46O13m80j55N5J29k98K25l32
$$ 11 -66 115 -127 155 -77 218 -15 -360 -74 -85 -181 154 -264 -118 495 15 -140 -85 44 -254 -29 -361
4815c61O41l75R5L61n71j1J66l3K60o3n06M78j9q5K25l24L6J31k05N3M3K7j06
$$ -361 280 -95 0 361 -210 -221 -55 -88 172 109 -397 81 62 -23 202 -122 -86 45 -160 -107 -64 -37 -143
4838a43L70l60J19k3k08M31k00n5K56o84M79L54n10M94j83k65K66j24m6j09Q5
$$ -143 227 -133 -14 -37 -245 186 -14 -69 187 -497 -18 336 -174 320 137 -128 138 14 -32 -141 -56
4859e6Q5pk33L55j2k04L24k19k07M61m57J39L00k20j23Or7R6J3j84K53R2k6RK5
$$ -56 29 22 -211 144 132 -72 252 33 -174 287 -170 -31 269 49 -74 -68 -165 -69 -56 -240 13 105 79 88 113
4884A13j41J14K13m29L46j57j27pm4N51k67l70L63j59J12j26L9m1K91l30J0R6
$$ 113 -28 86 299 -130 216 59 -68 -75 -119 432 165 -205 158 -1 111 -15 24 -17 274 -56 -46 50
4906E0j30K04r9K16P8o03J60J53m5R5j13L64j75J14k73k19K17l29M19k02R2J27
$$ 50 -80 124 25 241 319 -284 -124 29 -16 79 -34 330 155 269 -4 -223 -6 -335 84 -118 -26 101
4928A01l8k76K45R3J4q4k37L43M0m2J09k39l20L22j80L34l03k31L43k17q0K52
$$ 101 63 -213 32 125 139 55 -182 161 201 159 268 29 -291 31 -149 185 -118 -349 -6 -223 -303 -51
4950e1K01l81L25l53L22P4k17m3L54n80M93N0l37L57k66k05M21j71L29m38j11
$$ -51 150 -231 94 -259 63 137 -80 -123 231 -349 144 194 -143 214 -52 -257 164 -7 322 -116 -227
4971b27K70j26j05K41O1Rk18J43q1Rn3K28l04K39K5j4k29l9J28K65l5J19m77J31
$$ -227 43 -83 -188 53 114 123 -95 48 -33 -24 -77 151 -153 86 111 97 -132 -171 -43 222 187 306 -171 -40
4995d0j23p4N75n10J75k19L50K13m06MM8K17L9J78o81K99J63m62n6J23J6J6J52
$$ -40 -163 -237 338 -172 3 -216 134 347 -59 -55 -7 210 249 427 -254 45 208 -254 -310 -187 -171 -155 -3
5018cj23K15k69J72J09k36j45J45m1J86K05l18L96m81P1M53l50J0om2k24L81q1
$$ -3 -126 89 -180 -8 101 -135 -280 -135 -176 10 215 -103 293 -188 -117 336 -14 -4 -10 -52 -276 105 24
5041B4n6N5r2L12l10j6K37p6o4N1l84L79K53n87L26L2j82M0J04k40L96j65K3K2
$$ 24 -32 23 -69 243 -67 -83 154 78 14 65 -319 60 313 -274 52 84 -98 -58 46 -194 202 37 60 82
5065H2l95M23L1j37K9J15l11N44k08j86N9k40K49J54p12O48j28J09l97K57l61
$$ 82 -313 110 141 4 33 148 -163 381 173 -13 46 -194 55 209 -503 145 17 126 -271 -14 -375
5086c75O06k79k80K29k15K67K49l58J0K28l22J58J79m18L71k62K51J33m66L35
$$ -375 231 -48 -328 -99 -314 -47 202 -156 -146 82 -240 -82 97 -321 50 -212 39 172 -294 41
5106D1l5l1j1J91k27K44k06n9J31m5J29J61l65J26J76k27K19k6j68Pj81M7J53
$$ 41 6 -25 -36 155 -72 172 -34 -93 38 -7 122 283 -82 44 220 -7 212 186 18 25 -156 -109 44
$$ [...]
8191E
##END NTUPLES=NMR FID
##END=
