##TITLE=1H_10-2022
 CDCl3
 8 sc, 
 14.02.2022
##JCAMPDX= 6.0         $$ Bruker NMR JCAMP-DX V2.0
##DATA TYPE= NMR FID
##DATA CLASS= NTUPLES
##ORIGIN= UXNMR, Bruker Analytische Messtechnik GmbH
##OWNER= root
$$ XWIN-NMR		Version 3.5
$$ Mon Feb 14 11:13:29 2022 Russian Standard Time (UT+4h)  she@DPX200
##.OBSERVE FREQUENCY= 200.131346
##.OBSERVE NUCLEUS= ^1H
##.DELAY= (6, 6)
##.ACQUISITION MODE= SIMULTANEOUS
##.ACQUISITION SCHEME= undefined
##.AVERAGES= 8
##.DIGITISER RES= 18
##SPECTROMETER/DATA SYSTEM= spect
##.PULSE SEQUENCE= zg30
##.SOLVENT NAME= CDCl3
##.SHIFT REFERENCE= (INTERNAL, CDCl3, 0, 15.7039)
##AUDIT TRAIL= $$ (NUMBER, WHEN, WHO, WHERE, WHAT)
$$ ##TITLE= Audit trail, XWIN-NMR		Version 3.5
$$ ##JCAMPDX= 5.01
$$ ##ORIGIN= Bruker BioSpin GmbH
$$ ##OWNER= she
$$ F:/spectra/data/she/nmr/H-F/1/audita.txt
$$ ##AUDIT TRAIL=  $$ (NUMBER, WHEN, WHO, WHERE, WHAT)
(   1,<2022-02-14 11:12:08.12 +0400>,<she>,<DPX200>,
      <created by zg, POWCHK disabled, PULCHK disabled
       configuration hash MD5:
       00 E9 B6 7A A2 85 ED C7 34 08 36 98 17 FE 4E 26
       data hash MD5: 16K
       39 90 F3 09 4B 75 C1 32 5A 09 11 68 F1 97 49 A0>)
$$ ##END=
$$ 
$$ hash MD5
$$ 0C 39 A0 44 30 05 20 83 CA 08 F7 AA 16 9E DE DB
##$RELAX= 
##$RELAX= 
##$RELAX= 
##$RELAX= 
##$RELAX= 
##$RELAX= 
$$ Bruker specific parameters
$$ --------------------------
##$DU= <F:/spectra>
##$EXPNO= 1
##$NAME= <H-F>
##$PROCNO= 1
##$TYPE= <nmr>
##$USER= <she>
##$AMP= (0..31)
100 100 100 100 100 100 100 100 100 100 100 100 100 100 100 100 100 100 
100 100 100 100 100 100 100 100 100 100 100 100 100 100 
##$AQSEQ= 0
##$AQ_mod= 1
##$AUNM= <au_zg>
##$AUTOPOS= <>
##$BF1= 200.13
##$BF2= 200.13
##$BF3= 200.13
##$BF4= 200.13
##$BF5= 200.13
##$BF6= 200.13
##$BF7= 200.13
##$BF8= 200.13
##$BYTORDA= 1
##$CFDGTYP= 0
##$CFRGTYP= 5
##$CHEMSTR= <none>
##$CNST= (0..31)
1 1 145 1 1 1 1 1 1 1 1 1 1 1 1 1 1 1 1 1 1 1 1 1 1 1 1 1 1 1 1 1 
##$CPDPRG= <>
##$CPDPRG1= <>
##$CPDPRG2= <>
##$CPDPRG3= <>
##$CPDPRG4= <mlev>
##$CPDPRG5= <mlev>
##$CPDPRG6= <mlev>
##$CPDPRG7= <mlev>
##$CPDPRG8= <mlev>
##$CPDPRGB= <>
##$CPDPRGT= <>
##$D= (0..31)
0 1.2 0 0 0 0 0 0 0 0.06 0 0.03 0 0 0 0 0.0002 0 0 0 0 0 0 0 0 0 0 0 0 
0 0 0 
##$DATE= 1644822727
##$DBL= (0..7)
120 120 120 120 120 120 120 120 
##$DBP= (0..7)
150 150 150 150 150 150 150 150 
##$DBP07= 0
##$DBPNAM0= <>
##$DBPNAM1= <>
##$DBPNAM2= <>
##$DBPNAM3= <>
##$DBPNAM4= <>
##$DBPNAM5= <>
##$DBPNAM6= <>
##$DBPNAM7= <>
##$DBPOAL= (0..7)
0.5 0.5 0.5 0.5 0.5 0.5 0.5 0.5 
##$DBPOFFS= (0..7)
0 0 0 0 0 0 0 0 
##$DE= 6
##$DECBNUC= <off>
##$DECIM= 32
##$DECNUC= <off>
##$DECSTAT= 4
##$DIGMOD= 1
##$DIGTYP= 9
##$DL= (0..7)
0 120 120 120 120 120 120 120 
##$DP= (0..7)
150 150 150 150 150 150 150 150 
##$DP07= 0
##$DPNAME0= <>
##$DPNAME1= <>
##$DPNAME2= <>
##$DPNAME3= <>
##$DPNAME4= <>
##$DPNAME5= <>
##$DPNAME6= <>
##$DPNAME7= <>
##$DPOAL= (0..7)
0.5 0.5 0.5 0.5 0.5 0.5 0.5 0.5 
##$DPOFFS= (0..7)
0 0 0 0 0 0 0 0 
##$DQDMODE= 0
##$DR= 18
##$DS= 0
##$DSLIST= <SSSSSSSSSSSSSSS>
$$ [...]
##$SUBNAM2= <"">
##$SUBNAM3= <"">
##$SUBNAM4= <"">
##$SUBNAM5= <"">
##$SUBNAM6= <"">
##$SUBNAM7= <"">
##$SUBNAM8= <"">
##$SUBNAM9= <"">
##$SW= 18.0517287032376
##$SWIBOX= (0..15)
0 0 2 0 0 0 0 0 0 0 0 0 0 0 0 0 
##$SW_h= 3612.71676300578
##$TD= 16384
##$TD0= 1
##$TE= 0
##$TE2= 300
##$TE3= 300
##$TEG= 300
##$TL= (0..7)
0 120 120 120 120 120 120 120 
##$TP= (0..7)
150 150 150 150 150 150 150 150 
##$TP07= 0
##$TPNAME0= <>
##$TPNAME1= <>
##$TPNAME2= <>
##$TPNAME3= <>
##$TPNAME4= <>
##$TPNAME5= <>
##$TPNAME6= <>
##$TPNAME7= <>
##$TPOAL= (0..7)
0.5 0.5 0.5 0.5 0.5 0.5 0.5 0.5 
##$TPOFFS= (0..7)
0 0 0 0 0 0 0 0 
##$TUNHIN= 0
##$TUNHOUT= 0
##$TUNXOUT= 0
##$USERA1= <user>
##$USERA2= <user>
##$USERA3= <user>
##$USERA4= <user>
##$USERA5= <user>
##$V9= 5
##$VALIST= <valist>
##$VCLIST= <CCCCCCCCCCCCCCC>
##$VD= 0
##$VDLIST= <DDDDDDDDDDDDDDD>
##$VPLIST= <PPPPPPPPPPPPPPP>
##$VTLIST= <TTTTTTTTTTTTTTT>
##$WBST= 1024
##$WBSW= 4
##$XGAIN= (0..3)
0 0 0 0 
##$XL= 0
##$YL= 0
##$YMAX_a= 142180
##$YMIN_a= -142468
##$ZGOPTNS= <>
##$ZL1= 120
##$ZL2= 120
##$ZL3= 120
##$ZL4= 120
##$ABSF1= 10
##$ABSF2= 0
##$ABSG= 5
##$ABSL= 3
##$ALPHA= 0
##$AQORDER= 0
##$ASSFAC= 0
##$ASSFACI= 0
##$ASSFACX= 0
##$ASSWID= 0
##$AUNMP= <proc_1d>
##$AZFE= 0.1
##$AZFW= 0.1
##$BCFW= 1
##$BC_mod= 2
##$BYTORDP= 1
##$COROFFS= 0
##$CY= 11.3945322036743
##$DATMOD= 1
##$DC= 2
##$DFILT= <>
##$DTYPP= 0
##$F1P= 2.36226072786647
##$F2P= -0.459571619588291
##$FCOR= 0.5
##$FTSIZE= 0
##$FT_mod= 4
##$GAMMA= 1
##$GB= 0.15
##$INTBC= 1
##$INTSCL= 1
##$ISEN= 128
##$LB= 0.24
##$LEV0= 0
##$LPBIN= 0
##$MAXI= 10000
##$MC2= 0
##$MEAN= 0
##$ME_mod= 0
##$MI= 1.114404
##$NCOEF= 0
##$NC_proc= 0
##$NLEV= 6
##$NOISF1= 3.799351
##$NOISF2= 2.8
##$NSP= 1
##$NTH_PI= 0
##$NZP= 0
##$OFFSET= 15.70392
##$PC= 1
##$PHC0= -16228.54
##$PHC1= 9.40079
##$PH_mod= 1
##$PKNL= yes
##$PPARMOD= 0
##$PSCAL= 0
##$PSIGN= 0
##$REVERSE= no
##$SF= 200.130013532006
##$SI= 16384
##$SIGF1= 3
##$SIGF2= 2
##$SINO= 400
##$SIOLD= 16384
##$SREGLST= <1H.CDCl3>
##$SSB= 0
##$STSI= 0
##$STSR= 0
##$SW_p= 3612.71676300578
##$SYMM= 0
##$S_DEV= 0
##$TDeff= 0
##$TDoff= 0
##$TI= <>
##$TILT= no
##$TM1= 0
##$TM2= 0
##$TOPLEV= 0
##$USERP1= <user>
##$USERP2= <user>
##$USERP3= <user>
##$USERP4= <user>
##$USERP5= <user>
##$WDW= 1
##$XDIM= 8192
##$YMAX_p= 0
##$YMIN_p= 0
$$ End of Bruker specific parameters
$$ ---------------------------------
##NTUPLES= NMR FID
##VAR_NAME=  TIME,          FID/REAL,        FID/IMAG
##SYMBOL=    X,             R,               I
##VAR_TYPE=  INDEPENDENT,   DEPENDENT,       DEPENDENT
##VAR_FORM=  AFFN,          ASDF,            ASDF
##VAR_DIM=   8192,          8192,            8192
##UNITS=     SECONDS,       ARBITRARY UNITS, ARBITRARY UNITS
##FACTOR=    0.0002768,     1,               1
##FIRST=     0,             0,               0
##LAST=      2.2672688,     0,               0
##MIN=       0,             -142468,         0
##MAX=       2.2672688,     142180,          0
$$ Real data points
##PAGE= N=1
##DATA TABLE= (X++(R..R)), XYDATA
0 0 0 0 0 0 0 0 0 0 0 0 0 0 -8 8 -8 8 -8 16 -16 18 -24 32 -32 40 -48 56 -64 73 -88 97 -113 129 -146 167
34 167 -188 212 -239 266 -298 334 -371 414 -458 507 -561 621 -686 755 -832 918 -1009 1113
52 1113 -1226 1352 -1495 1653 -1832 2040 -2279 2562 -2897 3307 -3818 4478 -5366 6634 -8594
67 -8594 12054 -19978 78009 -42779 -91577 142180 -5907 -81186 76933 72416 -86927 -11514
79 -11514 92233 -34820 -78494 77122 12226 -65058 52212 44464 -50756 -17197 19491 9577
91 9577 -16295 18699 28659 -55487 -12488 64080 -38929 -35711 62318 226 -44469 32711 25648
104 25648 -66723 -25824 65934 -30900 -55078 69796 -28527 -99628 64102 31617 -77034
115 -77034 24304 46998 -43886 -11840 44683 -21802 -49512 46075 21781 -58179 22566 20683
127 20683 -67976 5609 46578 -15309 -8973 14897 7164 -14188 -1479 34128 -15560 -24719 49895
140 49895 8314 -42155 13346 20180 -22495 -6058 44659 9763 -49348 17710 27848 -50640
152 -50640 14953 38364 -53467 -4709 41500 -29878 -24549 23738 3366 -15565 24163 25847
164 25847 -32408 -167 35040 -28207 1292 44167 -28743 -21811 26453 -6236 -17303 974
176 974 8851 -906 -8877 18725 -1604 -30949 15252 15161 -15907 6357 10924 -6892 -15648 5563
190 5563 25743 -16071 -6283 35673 -14614 -9397 33860 -18570 -18820 30256 3906 -19111 3189
203 3189 10313 -18681 -13315 28798 -4946 -23198 27982 -4663 -26958 25634 747 -25523 9057
216 9057 9845 -6891 -11970 -1052 3447 -15295 6388 14963 -17497 2327 10762 -13558 1457
229 1457 7315 475 -3291 -7302 14361 -1559 -20534 15239 1035 -14579 19805 417 -18066
242 -18066 7764 6433 -7150 -5987 10998 4699 -21462 8690 13936 -23043 8668 14990 -18099
255 -18099 10337 14673 -12231 -1262 8503 6799 -4841 -1915 14281 -9244 -7193 15683 -9901
268 -9901 -4601 13222 -8739 -3686 4868 -1412 -1499 -10278 5990 8255 -16661 4091 6821 -14615
282 -14615 6220 5342 -8607 3498 4155 1748 -5544 -31 15217 -10053 -6162 19985 -8218 -5912
296 -5912 13421 -8529 -2402 8871 -3459 -3408 -1966 5853 -1116 -13015 10394 2252 -13878 9612
310 9612 -789 -8491 8936 -3793 -4121 4116 -951 3759 -5993 -1421 11856 -8910 -1597 10201
324 10201 -7184 2436 4050 -5933 3913 -756 -361 -346 -8261 8456 -1123 -14486 9874 107 -9861
339 -9861 7169 -2295 -2577 4886 -1899 1699 -2147 2778 7443 -10725 3833 11345 -9956 4095
353 4095 6688 -4946 7940 1275 -2232 5807 -1169 3918 -1128 -6009 8873 -4395 -7613 6638
367 6638 -5407 -1334 2851 -7087 4149 676 -3676 4217 -6067 2825 5706 -11765 2943 4166
381 4166 -8497 2850 -1591 -2961 4288 -3605 1505 -427 -3105 7286 -7116 -4018 10332 -8189
395 -8189 -4565 4209 -7103 2027 735 -5263 3974 -1157 1671 2062 -6345 6940 1795 -6735 6827
410 6827 -1422 -2997 3840 -5623 4053 5571 -3226 6227 -425 1209 10624 -5160 647 8451 -3579
425 -3579 1775 -398 -4699 1940 -5141 104 2329 -5770 5073 -3406 -8462 9886 -1757 -6167
439 -6167 5437 -3548 571 2252 -6237 1883 183 1683 6335 -3856 4215 4019 -6962 5790
453 5790 3143 -2705 3760 -6862 -2005 3581 -8166 78 -197 -3820 8981 -1028 -4536 5394
467 5394 -654 3297 4408 593 6034 -4263 -2833 6187 -4176 3367 3193 -7593 7729 3294
481 3294 -7359 3086 -2687 -494 6431 -3801 -2016 -3414 -5469 1581 -5467 1048 5028 -10126
495 -10126 436 3582 -6764 1873 -4059 -4036 6669 -4830 -4491 -3343 -10846 2072 1855 -4140 3568
510 3568 -2348 -1237 1743 -1575 7759 707 -3652 8865 -1169 -1802 3254 -10216 1969 9934
524 9934 -2714 1973 -353 -3963 3263 780 4995 3361 -2363 6251 -929 -1722 8353 -3843 579
539 579 11278 2774 6865 956 -6520 8417 4782 1407 5840 -3542 -1840 -1405 -5443 1806 -4012
554 -4012 -3370 3635 -4466 1625 -120 -10647 2250 2412 636 8021 -8002 -8336 4163 -4211 -1651
569 -1651 1783 -1809 385 -4454 594 1298 -9104 1701 2577 -3565 7000 -4232 -11382 291
583 291 -2503 3122 4664 -6562 982 1465 -3095 2996 -1254 1155 3335 -2205 4786 -1044 -7792
598 -7792 1060 -2559 4362 9699 -5825 -837 2444 -3783 7819 3646 -2841 5825 1158 63 -325
613 -325 -4376 1862 -2431 457 8849 -4289 -4577 -810 -6771 6737 5438 -6196 2251 -1410 -3061
628 -3061 3108 -3813 99 2990 407 6400 -1000 -2676 3004 -4113 4512 8727 -1741 525 -5173
643 -5173 -4412 7150 -3716 -3396 4991 -3966 853 1972 -5386 -293 -477 2371 5024 -2191 2039
658 2039 -3203 -8012 6860 2922 -1646 4207 -4654 375 5151 -5524 409 1927 -498 4912 -2124
673 -2124 -2818 -938 -6598 2137 2516 -1557 3277 -6355 -4644 4616 -2835 918 813 -4572 5727 105
689 105 -6319 1274 -2692 862 4806 -1066 2384 -2039 -3643 3712 -253 4004 4191 -6568 2897
704 2897 2998 -4977 2191 -2048 -1643 6426 -1416 -1398 -1034 -4238 2596 -248 431 4975 -4796 -2105 1843
721 1843 -2752 3858 -490 -3269 5814 -595 -948 1575 -5574 3141 4677 -2517 3082 -995 -2759
736 -2759 1152 -2645 3360 1648 -4464 2550 -2016 -1974 3983 -5883 -905 5515 -2226 1229 -1107 -3952
752 -3952 3443 -672 701 3840 -2316 2206 -402 -2702 5705 -754 -1855 4360 -1735 2261 893
767 893 -5581 2893 719 -1407 3407 -4153 -1430 1794 -4743 824 702 -2056 1403 -3843 332 2947
783 2947 -5214 1395 1396 -2416 5413 -2005 -3798 3927 -1609 720 1802 -2229 3068 -1349 -2275 3466
799 3466 -2708 1033 2089 -4456 3318 863 -4578 1834 -1610 612 2888 -4324 1784 1544 -3057
814 -3057 3546 -466 -464 4691 -2272 599 2492 -1483 2980 -1677 -766 5557 -2937 -499 2740 -3290
830 -3290 2750 869 -3768 2781 -1174 -1629 419 -3965 1740 -468 -4791 2751 -1858 -1983 2422 -4250
846 -4250 844 3071 -3210 1719 -746 -1207 3361 -3547 49 3196 -3355 1815 35 -2166 4060
861 4060 -1722 -1112 2763 -2061 2296 -482 -3636 4185 -1571 -2477 3175 -2716 1008 2104 -3367 2927
877 2927 1088 -626 2659 -2186 2336 3026 -3985 2930 1304 -1990 3779 -1917 -546 3975 -2302
892 -2302 948 874 -1820 3351 -2769 -2215 3399 -3455 -493 278 -3792 2300 -1072 -3223 2190 -1932
908 -1932 797 1661 -3957 3375 1097 -3108 3311 -945 -265 3061 -2923 1504 1839 -1729 2674 -1802
924 -1802 163 4140 -4158 63 2356 -3201 2012 -888 -2497 3247 -1784 -213 1352 -2535 3274
939 3274 -84 -2474 4527 -1024 -1221 2263 -2432 2170 1260 -3197 2200 -1037 -595 2208 -4065 1023
955 1023 2448 -3770 1436 -668 -2661 1440 -3340 -650 1535 -3289 684 -1999 -2841 3959 -2870
970 -2870 -1946 3125 -2035 1021 414 -2986 2929 -418 -157 3095 -2113 1858 1402 -3446 4069 1835
986 1835 -1186 2824 -1533 1273 2591 -3292 1689 685 -747 3844 -2793 -1069 3226 -2949 1558
1001 1558 2532 -1099 2557 -1359 -557 3727 -1538 1505 1471 -2087 4452 -209 -3590 2040 -1057 1020
1017 1020 2211 -2842 1209 -1338 -3579 2064 -2154 -744 1431 -4943 468 881 -3704 361 -1958
1032 -1958 41 3455 -3002 -559 -133 -3259 3399 -233 -1653 3666 -2575 -1286 2028 -1678 1763
1047 1763 -670 -1636 4103 -1335 -1447 587 -4036 2470 2653 -2597 1358 -1960 -1661 2131 -2242 1829
1063 1829 2019 -2848 2420 149 -1208 2380 -2763 1056 4752 -800 1029 -1456 -2293 3834 -333
1078 -333 764 2893 -3177 1183 584 -3164 2718 -778 -1795 2790 -985 500 -1296 -4586 2834
1093 2834 1376 -267 2438 -3503 -554 2420 -2340 2229 1080 -1412 2975 -1391 -116 2075 -3707
1108 -3707 1181 2739 -214 2764 -3006 -3309 2245 -719 1490 646 -3157 2221 -1595 -2755 2413
1123 2413 -2521 -223 2782 -1705 1750 -834 -4106 1373 96 2404 2878 -3735 282 887 -1684
1138 -1684 2876 -988 -598 3482 -2208 25 684 -3755 1238 114 191 3481 -2989 -2459 -10 -1829
1154 -1829 3367 412 -2613 1977 -1176 -266 1103 -3071 2247 1897 -1162 3692 -972 -2533 1500
1169 1500 -1194 2790 3262 -2280 311 -1420 -713 2815 -2693 128 2274 -2327 1654 -1072 -3715
1184 -3715 1706 -1252 378 3347 -2387 -705 -1295 -2292 3672 429 -952 1561 -1669 1619 1108 -3018
1200 -3018 2139 485 221 3479 -2369 -834 918 -3297 2514 2030 -1596 870 -2589 -882 2379
1215 2379 -2169 704 162 -973 3318 -1792 -2249 1855 -1982 1953 2913 -1698 1724 -1239 -2365 3043
1231 3043 240 771 962 -2380 2284 332 -2504 1054 -1548 731 2611 -2882 -55 -449 -3076 2309
1247 2309 -349 -573 2460 -3311 -703 1600 -1735 1177 -819 -586 3173 -1276 -524 322 -2247 2843
1263 2843 1097 -1355 2779 -1429 -1413 1887 -1583 1662 1015 -2486 1543 -466 -842 600 -2966 1358
1279 1358 2180 -1780 1212 -1327 -1584 2587 -1411 834 2258 -2363 1043 193 -1240 2813 -1007 -407
1295 -407 2447 -650 1037 -618 -2292 2573 -444 -591 1529 -2951 151 251 -3091 2037 152 -2077
1311 -2077 1574 -1600 31 1036 -2533 956 802 -378 1987 -2270 -348 2377 -1927 1638 1063
1326 1063 -1444 2521 -1073 -1026 2576 -1488 191 1108 -1668 1734 -995 -2210 1518 -955 645 879
1342 879 -2476 1700 106 -1871 2242 -1026 160 2156 -2547 1048 1425 -1892 1304 -324 172 2373
1358 2373 -1645 352 985 -1330 1832 -1066 -1472 2310 -2127 -722 1071 -2406 1283 -201 -2096
1373 -2096 2019 -659 -730 930 -1656 1544 448 -2123 1622 -548 -450 1711 -1947 1119 1800 -1956
1389 -1956 1775 79 -730 2232 -1469 -199 1960 -1654 491 -544 -1230 1813 -1626 -552 1357
1404 1357 -1668 1285 -6 -2158 2379 -653 -1429 1772 -1454 404 925 -1994 1676 526 -547
1419 -547 1647 -1073 1239 1685 -1871 1436 183 -1505 1497 -1971 -798 1497 -2658 153 488 -1723
1435 -1723 1607 -1078 -1147 1990 -1186 261 582 -1402 2077 -523 -1022 2307 -1003 607 1711 -1804
1451 -1804 2015 1246 -1654 1609 -460 -52 1249 -1979 339 304 -1364 1203 -1289 -249 1863 -2122
1467 -2122 562 1217 -1620 1790 -564 -953 2228 -1543 -665 1051 -1333 1460 -8 -1336 1895 -528
1483 -528 51 1002 -1734 1566 380 -1922 1677 -990 -1228 1335 -2184 323 1379 -2231 311 34
1499 34 -503 1302 -1655 63 1243 -1394 962 -764 -1478 2275 -1209 -304 2251 -1271 903 761
1515 761 -1137 2368 188 -834 1094 -974 619 85 -2242 1151 -524 -616 1402 -2126 188 1142
1531 1142 -2187 1455 794 -1289 1335 -1100 -468 1729 -1256 275 617 -207 1968 -1021 -561 1867
1547 1867 -1031 1272 717 -2009 1415 -905 -1756 1654 -974 -462 693 -1779 986 2 -1712 570
1563 570 -544 1059 1395 -2011 436 26 -1233 2083 -416 -290 2153 -1679 302 1637 -1265 1108
1579 1108 93 -234 1921 -1057 -819 -294 -1150 1896 -182 -1440 1364 -1777 -582 1280 -1671 1220
1595 1220 704 -1906 1489 39 -1082 635 -1167 1235 1522 -1035 387 -1134 -171 2135 -1181 676
1611 676 1447 -1886 1042 101 -1402 1523 -1115 -614 1949 -934 -343 -945 -1564 1895 238 -98 428
1628 428 -1998 823 422 -1796 1864 -119 -1096 1927 -996 -222 1053 -1758 1335 1730 57 543
1644 543 -1828 -161 1417 -889 1089 -373 -1431 1590 -1589 -1134 1481 -1739 110 1431 -1235
1659 -1235 860 -879 -1975 1653 614 1191 754 -1650 1049 172 -453 1625 -1073 575 1916 -1892
1675 -1892 703 121 -2241 1178 413 -67 1122 -2436 -1225 487 -335 1274 -910 -773 1474 -1258
1691 -1258 178 546 -1528 2021 808 -766 2017 -1091 -1454 908 -261 1571 770 -1826 375 -483
1707 -483 230 684 -1352 1084 991 -1075 1313 -1111 -1711 1651 -1021 584 1630 -2099 -419 -188 -557
1724 -557 1809 -562 -460 759 -638 989 -686 -1275 1812 -318 230 1770 -1923 -91 711 -1181
1740 -1181 2175 922 -1120 345 -1258 133 551 -1895 461 -177 -358 1064 -2012 -497 1224 -1204
1756 -1204 1892 1198 -1357 1112 -854 -803 2141 -441 12 516 -641 1451 -576 -1025 1056 -621
1772 -621 1422 930 -2138 505 -784 -1792 1672 -479 -404 553 -1946 353 892 -963 843 -245
1788 -245 638 1647 -1374 151 137 -988 2057 -305 -830 1550 -1681 -339 1318 -937 1107 178
1804 178 -1117 1334 -605 -806 -144 -1262 1059 148 -1216 800 -1277 -314 1745 -950 1041 1393
1820 1393 -1518 860 24 -733 1118 -841 343 1381 -745 310 -702 -450 1988 -541 293 1116
1836 1116 -1647 573 -14 -1707 1375 -462 -1288 891 -889 -20 229 -1179 1340 513 16 851 -1438
1853 -1438 444 940 -1457 1057 -145 -980 1308 -1205 -48 1477 -1060 525 797 -456 737 -1011
1869 -1011 -834 971 -939 273 -384 -1570 1171 -749 -835 1602 -797 395 1062 -1279 1105 355
1885 355 -1119 945 -252 269 747 -1365 867 403 -275 1434 -744 193 1503 -1648 329 533 -1657
1902 -1657 642 -624 -1119 987 -897 -572 403 -662 1155 -96 -657 1432 -623 189 733 -1414
1918 -1414 1155 287 -1771 1151 -530 -522 1080 -1052 500 917 -1150 376 -480 -462 822 -1469 140
1935 140 404 -1500 838 -273 -951 1709 -812 -162 1504 -582 665 234 -864 1247 -213 -557
1951 -557 653 -788 816 350 -934 1638 19 -402 1221 -968 430 962 -1557 613 56 -1056
1967 -1056 696 -911 -323 882 -1006 453 29 -483 1560 -740 -219 1300 -1131 511 450 -1146
1983 -1146 1203 -48 -1000 1291 -312 223 630 -1060 988 1 -880 556 -983 10 488 -1952 499
2000 499 210 -1419 995 -551 -94 1395 -1121 -12 711 -725 661 -534 -331 1099 -816 220
2016 220 538 -749 1464 -190 -766 1570 -906 -374 823 -1500 411 156 -1507 685 -597 -202
2032 -202 476 -1185 527 526 -840 1013 -461 -145 1386 -1059 484 1203 -1128 679 414 -581 1553
2049 1553 -510 -247 1067 -494 567 -372 -911 1329 -628 -376 620 -1522 617 247 -1241 1361
2065 1361 104 -983 1161 -572 364 850 -994 805 227 -309 819 -1222 -90 828 -1082 943
2081 943 -77 -1058 1046 -925 -330 1361 -1013 25 409 -890 933 -517 -900 809 -422 541
2097 541 344 -1444 734 -231 -771 1221 -649 151 844 -1310 791 550 -906 848 28 216 1128
2114 1128 -857 104 440 -410 1332 -640 -609 888 -1454 -73 434 -1465 615 -413 -1212 962 -898
2131 -898 -447 408 -596 1230 448 -816 738 -578 273 1195 -1015 772 427 -1227 901 -471 -962
2148 -962 808 -1073 239 862 -1073 -102 -622 -482 1222 -729 18 266 -1182 855 -36 -638 1658
2165 1658 -205 -141 1332 -906 308 439 -963 1374 422 -508 200 -1220 386 686 -782 942 -155
2182 -155 -455 1038 -1053 -52 972 -1154 950 463 -1098 605 -1118 -513 1083 -459 366 36
2198 36 -922 1095 -432 -401 1111 -682 725 681 -1296 661 -194 -991 1369 172 204 352 -1555 295
2216 295 299 -489 777 -974 -218 622 -1429 145 49 -857 1400 42 -302 1338 -960 112 1210 -68
2234 -68 1292 -177 -981 815 -626 84 164 -1141 1074 378 -960 655 -1060 -462 1006 -665 581
2251 581 397 -1499 228 -283 -178 911 -809 420 778 -618 684 -542 -337 1429 -548 190 635
2268 635 -1576 170 14 -476 1296 -304 -665 703 -476 494 146 -909 995 -79 -132 590 -1460
2285 -1460 -14 727 -708 1285 200 -624 768 -614 316 1169 -528 578 263 -374 839 -963
2301 -963 -418 769 -421 949 190 -1113 821 -556 -408 1155 -641 -149 30 -1363 493 -299 -960
2318 -960 626 -444 465 572 -1258 640 285 -409 1450 -519 -4 686 -1095 325 676 -748 743
2335 743 -350 -177 1129 -954 -43 301 -388 1064 -423 -774 459 -970 -26 747 -812 825 202
2352 202 -857 986 -166 -105 897 -446 823 636 -830 535 -412 0 1059 -837 160 331 -1065
2369 -1065 786 -294 -512 1032 -842 -306 508 -972 94 -315 -678 1020 -322 -347 504 -834 670
2386 670 457 -545 1043 -130 -397 688 -809 267 366 -1040 691 105 -494 525 -776 129 736
2403 736 -666 640 -331 -672 897 -806 -440 812 -907 431 213 -527 860 -45 -297 1027 -154
2420 -154 315 398 -860 836 55 -350 895 -646 284 788 -899 627 69 -904 839 -427 -74 695
2438 695 -1002 -37 327 -505 670 -373 -391 822 -579 302 483 -679 901 24 -555 771 -453
2455 -453 -62 492 -637 683 64 -659 461 -401 -33 407 -835 515 209 -930 522 -608 -488
2472 -488 606 -1025 -165 579 -777 570 -206 -467 897 -469 211 520 -683 582 -176 -532 946
2489 946 -447 -48 737 -788 512 218 -921 863 -303 -377 406 -673 156 281 -744 336 -96
2506 -96 -328 655 -655 391 760 -667 602 321 -285 1223 -83 -1 995 -527 238 255 -465 877
2524 877 -76 -381 564 -841 299 102 -984 683 -335 -625 738 -614 22 549 -903 530 323
2541 323 -426 461 -435 -86 661 -735 285 82 -604 625 -367 -220 694 -831 34 186 -643 560
2559 560 -117 -607 568 -296 -85 526 -657 797 122 -550 606 -483 -139 693 -487 515 491 -725
2577 -725 644 -199 -21 800 -574 266 423 -447 475 -139 -425 690 -590 -68 390 -969 247 -190
2595 -190 -795 605 -462 -696 374 -886 182 15 -694 686 14 -316 624 -661 271 521 -648
2612 -648 668 0 -468 667 -697 -21 559 -905 231 -39 -480 349 -946 -179 582 -447 406 84
2630 84 -602 770 -260 -173 949 -487 388 447 -443 854 248 -400 840 -177 290 386 -868 301
2648 301 151 -431 604 -502 -83 464 -787 254 77 -444 642 -177 -326 677 -804 -41 386 -183
2666 -183 792 -233 -638 551 -287 197 496 -701 610 115 -558 781 -405 -181 547 -494 434 136
2684 136 -818 347 -276 -99 651 -733 -74 197 -696 344 -316 -397 665 -373 -16 650 -522 421
2702 421 69 -104 1003 -164 -307 230 -730 412 175 -631 570 -143 -387 226 -994 -113 104 -771
2720 -771 596 -6 -616 363 -754 203 589 -428 449 -217 -327 826 -451 -27 854 -227 775 232
2738 232 -623 486 -209 13 1005 -236 190 -135 -805 752 11 -314 524 -479 152 611 -601 183
2756 183 43 -274 801 -417 -83 346 -749 268 552 -189 647 -391 -59 687 -501 274 156 -496
2774 -496 721 -279 -523 224 -581 -6 456 -479 203 -282 -852 434 -281 -108 299 -727 533 160
2792 160 -443 356 -275 -37 870 -374 323 254 -751 451 -22 6 677 -500 -239 393 -507 334 -187
2811 -187 -442 778 -237 -222 157 -725 330 261 -419 663 -252 -484 389 -551 492 484 -510 681 247
2830 247 -226 449 -790 84 550 -400 581 -98 -616 391 -480 -106 619 -565 103 -34 -536 447 -421
2849 -421 -242 410 -386 183 -30 -636 476 195 -51 719 -190 177 290 -619 432 379 -416 677 -226
2868 -226 137 382 -853 163 163 -333 614 -250 -331 426 -578 374 341 -447 586 -280 -222 630 -263 44
2888 44 405 -291 787 89 -433 611 -126 109 556 -522 230 128 -618 516 -308 -62 619 -482 163
2907 163 247 -698 168 -227 -214 742 -420 -34 342 -500 483 170 -256 837 -371 -108 444 -499 287 101
2927 101 -354 755 24 -348 404 -698 227 180 -586 262 -301 -365 344 -641 -131 279 -423 193 -41 -554
2947 -554 515 -563 115 629 -540 364 117 -378 662 26 -212 538 -313 307 305 -520 431 -226 -314 491
2967 491 -388 248 152 -576 422 97 -399 604 -388 76 546 -453 330 168 -244 479 -134 -198 662 -341
2987 -341 109 395 -327 555 -391 -142 500 -463 -6 149 -416 268 -4 -617 364 -459 -144 482 -596 153
3007 153 18 -512 249 -291 -46 415 -534 191 323 -260 522 -148 -88 608 -478 25 320 -350 285 -13
3027 -13 -299 660 -221 -98 354 -590 311 163 -416 541 -135 -28 385 -409 149 303 -377 407 -5 -341
3047 -341 638 -540 240 350 -512 224 -88 -292 551 -535 -130 281 -569 112 -17 -529 338 -113 -399
3066 -399 176 -487 101 -42 -562 406 -86 -276 466 -371 3 476 -428 281 109 -207 428 -302 82 370
3086 370 -429 423 13 -326 537 -444 9 435 -340 19 210 -631 398 -50 -241 490 -350 215 331 -400
3106 -400 631 -44 -218 581 -276 414 339 -403 613 316 -327 303 -278 -143 257 -362 87 96 -401 261
3126 261 -327 -285 402 -494 28 224 -358 376 -143 -277 641 -259 18 435 -411 380 176 -289 445 -284
3146 -284 -137 278 -396 382 196 -648 407 -129 -196 335 -635 45 248 -570 126 -50 -566 224 -279 4
3166 4 330 -420 224 -34 -329 571 -353 -93 426 -426 295 131 -663 368 29 -170 557 -406 -58 276
3186 276 -429 359 -74 -287 363 -242 -121 312 -551 248 131 -154 544 -143 -99 553 -319 320 296 -276 534
3207 534 101 -120 467 -332 178 467 -157 474 13 -327 350 -404 -54 245 -572 270 139 -349 361 -197
3227 -197 -58 569 -367 401 114 -333 352 -167 7 601 -440 -38 162 -441 571 85 -280 360 -230
3246 -230 -84 165 -576 148 -82 -425 247 -407 -342 192 -515 244 152 -516 339 -74 -248 376 -372 -13 332
3267 332 -268 255 -51 -266 435 -337 218 290 -409 171 -168 -450 491 -143 -202 282 -389 240 33 -438 240
3288 240 -52 -62 303 -476 235 66 -500 414 0 -83 389 -367 93 385 -208 293 187 -260 534 -303 -87
3309 -87 239 -265 244 256 -154 253 -358 -287 253 -429 189 105 -299 471 -202 -408 151 -318 155 476 -423
3330 -423 233 28 -336 564 -9 16 413 -386 155 102 -574 269 -243 -101 487 -200 -140 -118 -605 345 -19
3351 -19 -227 463 -328 -70 179 -455 488 37 -137 528 -304 -114 238 -365 217 309 -299 236 -183 -207 484
3372 484 -239 186 100 -577 209 -73 -324 367 -575 249 459 -315 251 -114 -473 450 -170 -94 462 -220 209
3393 209 153 -372 513 -84 -10 327 -397 164 145 -435 260 31 -209 316 -474 -137 289 -401 173 1 -292
3414 -292 180 -206 -97 480 -388 137 216 -290 441 -166 -241 371 -174 239 183 -301 198 -103 -108 225 -99 183
3436 183 206 -404 260 82 -192 324 -280 -136 340 -357 146 78 -354 308 -132 -98 466 -209 115 151 -386
3457 -386 606 -2 -184 470 -269 -85 96 -476 278 13 -314 242 -233 -110 133 -382 129 32 -388 153
3477 153 -191 -120 370 -312 207 358 -155 334 -190 -109 289 -91 267 258 -158 183 87 -232 316 -151 -93 263
3499 263 -479 45 -29 -312 383 -426 -254 254 -477 153 116 -489 261 63 -181 284 -275 213 275 -301 310
3520 310 -83 -243 372 -239 42 211 -307 21 197 -405 156 -82 -176 305 -267 18 -12 -296 379 -134 -176
3541 -176 284 -186 193 144 -434 311 38 -261 471 -100 60 255 -153 156 31 -255 297 -201 -73 340
3561 340 -244 38 80 -267 336 -15 -392 307 -218 -143 248 -259 197 122 -14 359 -36 140 338 -44 368
3582 368 212 -218 369 -75 -47 314 -232 13 183 -107 235 -99 -243 308 -274 -55 199 -266 151 -58
3602 -58 -240 220 -104 -85 170 -468 173 25 -364 382 4 -64 319 -286 253 82 -322 209 -149 -235 210
3623 210 -265 79 18 -585 225 -31 -408 235 -241 -107 162 -351 107 143 -243 179 -209 -184 134 -320 135
3644 135 118 -201 438 -94 -182 224 -283 71 186 -266 283 -49 -120 400 -212 -128 67 -307 106 -5 -405
3665 -405 371 -59 -152 354 -313 142 231 -320 420 -16 -134 268 -262 263 198 -207 374 55 -93 226 -196
3686 -196 56 252 -470 64 233 -500 161 -56 -142 259 -306 41 26 -281 210 -129 -254 174 -246 160 349
3707 349 -305 300 65 -254 280 -139 134 289 -161 174 -22 -458 166 -154 -199 211 -232 -50 -143 -359 156
3728 156 51 67 233 -370 16 169 -231 175 197 -90 143 -58 57 163 -216 169 -82 -59 345 -158 -126
3749 -126 279 -178 198 150 -283 160 -171 -163 220 -141 -21 -1 -345 249 -17 -148 259 6 153 173 -230 87
3771 87 173 -211 283 -142 -161 201 -348 134 44 -280 58 -13 21 287 -314 -78 11 -431 228 -127 -14 249
3793 249 -134 71 204 -117 209 235 -205 322 -142 20 227 -130 187 125 -210 248 -278 148 465 -213 130
3814 130 176 -109 125 -114 -228 193 -182 144 118 -416 50 43 -11 325 -331 -75 244 -252 210 135 -30 138
3836 138 56 -7 229 -164 61 136 -448 224 11 -207 149 -189 72 208 -284 136 78 -187 242 -111 48
3857 48 182 -185 117 187 -174 201 -72 39 173 -16 222 35 -271 128 -175 -241 226 -319 222 370 -249
3878 -249 -96 56 -247 275 -92 -20 258 -202 203 -5 -203 325 -220 -8 171 -185 68 230 -151 348
3898 348 206 -131 121 -58 5 204 -273 167 15 -125 107 -171 -98 77 -157 261 268 -429 202 -171 -199 185
3920 185 -153 -43 70 -165 327 -43 -26 291 -95 129 138 -169 147 -35 -260 169 -154 84 266 -241 10
3941 10 238 -213 273 -128 -128 70 -156 68 59 -152 296 145 -198 224 -318 68 235 -159 227 34 -167 256
3963 256 -117 8 150 -102 255 108 -136 247 -128 -142 239 -252 163 99 -140 189 -121 -174 253 -203 50
3984 50 240 -335 68 35 -224 303 -126 62 302 -231 18 -28 -240 317 -78 -151 107 -238 64 59 -205 286
4006 286 -117 -136 229 -195 -16 41 -208 242 -74 -57 139 -253 3 234 -174 53 258 -96 165 -113 -246
4027 -246 76 -246 55 225 -5 162 -2 -176 329 -62 -156 65 -170 114 -36 -6 219 -96 11 275 -196
4048 -196 227 67 -156 156 -47 -60 270 -215 290 229 -358 224 -91 -15 176 39 -52 -15 -296 22 -180 -131
4070 -131 86 -139 -47 82 -90 -18 92 -201 140 -9 0 226 -2 -43 198 -202 170 -90 -128 124 -277 74
4092 74 31 -274 305 -71 -178 225 -266 -14 131 -287 174 24 -327 217 -285 -198 231 -256 52 79 -431
4113 -431 260 -109 5 370 -44 150 245 24 233 110 -158 238 -40 56 172 -269 196 96 -125 -26 -25 -34
4135 -34 269 -196 -66 176 -214 290 46 -271 223 -4 -77 275 -182 259 -110 32 221 -179 -26 149 -155
4156 -155 196 33 -297 116 -120 -44 -27 -116 2 116 -249 65 -310 58 226 -226 140 110 -64 199 9
4177 9 -47 338 -133 -178 195 -360 61 89 -131 73 -57 56 221 -178 7 -48 -247 21 -1 -114 34 -231
4199 -231 56 130 -271 350 17 -237 161 -218 7 222 -176 216 -54 -76 246 -71 -15 321 -155 90 47
4220 47 -264 350 -61 -130 251 -135 137 4 -74 117 0 62 248 -230 -73 77 -149 314 55 -229 240
4241 240 -173 131 317 -151 58 63 -183 110 -115 -78 170 -70 -38 92 -187 197 -2 -135 -36 -184 -55 -27
4263 -27 -152 0 58 -36 88 -125 -6 114 -177 23 181 33 238 -59 -43 194 -267 -8 70 -287 112 -67
4285 -67 -258 104 -228 -23 1 -275 30 112 -238 163 -56 37 228 -165 139 14 -70 158 -128 -133 275 -39
4307 -39 -43 292 -279 174 -97 -87 180 -99 50 210 -205 53 19 -140 165 -199 -4 109 -163 -18 50 -85
4329 -85 199 45 -7 210 -183 -50 -1 35 125 -103 -180 193 -160 58 220 -262 -55 28 -332 126 -251 -74
4351 -74 189 -309 74 -63 -181 69 56 -41 163 -98 96 106 -156 62 42 -115 281 -52 62 96 -148 86
4373 86 -58 -42 196 -131 -101 71 -178 150 -21 -141 161 9 16 73 -78 100 -36 -109 115 34 -61 201 -199
4396 -199 171 162 -50 174 -33 76 18 -251 38 77 -19 166 -21 -228 207 -311 -67 44 -306 75 -84 -168
4418 -168 220 -68 -82 241 -28 28 202 -211 89 31 -172 288 -51 45 33 -107 26 54 -120 189 2 -126
4440 -126 118 -276 107 125 -68 67 17 -139 83 -88 -49 -6 -157 275 -26 -101 243 -8 36 112 -113 212
4462 212 17 -125 163 -180 -150 169 -149 -2 -3 -187 -3 -101 -179 100 -153 63 17 -227 -54 -88 -118 201 -119
4485 -119 75 -60 -110 117 78 -230 62 -38 -3 190 -156 -157 146 -89 192 -106 -177 122 -19 8 121 -117
4507 -117 48 83 -165 99 -161 -26 164 -220 30 88 -232 119 -101 15 293 12 -23 75 -174 157 45
4528 45 -42 130 -188 -48 142 -272 25 -38 -270 133 -116 -9 -34 -15 61 -26 -143 110 -201 -206 169 -194 -107
4551 -107 74 -189 259 70 -105 217 -11 16 115 -98 96 19 6 183 -169 9 146 -193 62 124 -131 102
4573 102 -31 41 85 -167 -41 65 -150 103 62 13 309 -35 -13 149 -21 16 107 -9 179 -9 -36 -8 -194
4596 -194 41 116 -92 267 -88 -15 85 -50 124 51 -31 -53 -48 -116 302 -69 59 107 -268 261 -111 -128 98
4619 98 84 17 203 -164 147 3 -153 20 30 -109 114 -25 -17 111 -373 267 -36 14 -2 -171 12 49 -163
4642 -163 173 61 -16 61 -21 54 53 -263 262 -133 -113 213 -19 -16 169 -122 97 -11 -123 213 -138 -76 80
4665 80 -117 -91 79 -207 227 -104 -107 136 -121 -96 96 -10 53 -64 -17 155 42 54 70 -89 15 -60 -22 229
4689 229 9 -192 205 -57 73 95 -10 206 -180 -183 196 -187 50 34 -237 13 110 -77 180 -66 -155 44
4711 44 -72 70 55 -79 44 -141 -349 31 16 5 154 -34 61 -37 -5 89 -33 -70 -23 -168 96 -96 -68 196
4735 196 -21 -89 139 -62 112 0 -108 121 -100 -46 105 -32 75 183 -22 10 -144 -59 187 -126 -4
4756 -4 -58 -83 31 -31 -8 4 -253 47 116 -57 108 20 -61 97 -122 32 265 -116 12 -88 -198 44 -28 -151
4780 -151 111 -77 -17 -4 -164 172 -58 -178 135 -106 -74 185 -189 57 2 -221 201 -49 -79 41 -163 23
4802 23 88 -23 159 81 -46 83 -90 102 90 -100 69 147 -150 115 -52 -64 136 -130 8 -23 -125 77
4824 77 -21 -51 7 -216 49 52 -164 77 -52 -16 101 -83 61 99 -116 167 -15 -267 226 -190 204 99 -56
4847 -56 98 -59 -164 135 -66 111 4 -55 36 55 -342 -17 -119 12 125 -42 69 77 -121 225 -31 -108
4869 -108 211 -33 74 220 -53 18 -40 -62 181 -112 -46 12 -66 26 202 -86 -32 -79 -82 85 -221 58 149 -8
4893 -8 192 17 -92 119 -82 157 2 -83 269 38 -27 204 -73 -68 26 -18 -9 -3 -183 -6 -151 -25 10 -19 31
4918 31 40 -195 45 92 -70 123 -151 12 104 -35 90 -135 -117 82 -132 -20 167 -166 -24 191 -36 221
4940 221 13 -202 118 -12 9 78 -109 13 -111 26 -48 -250 51 31 10 26 3 -20 198 -82 -53 39 28 23
4964 23 -42 -198 128 -64 70 189 -163 12 -47 -184 45 -139 -185 22 -72 -178 31 -24 108 -40 0 173
4986 173 -153 -65 59 -264 78 87 -61 -7 30 -33 77 8 131 126 8 186 36 -192 -33 -123 -11 -35 46 6
5010 6 -56 -160 61 -114 -162 39 -179 74 167 36 146 -78 16 161 -231 107 27 25 58 -71 -4 178 -165 -16
5034 -16 50 -233 96 -21 -214 180 128 -115 17 -141 213 -7 33 97 -70 -51 108 -42 -17 118 -207 64
5056 64 -37 -160 170 2 35 34 55 18 46 -116 -35 -253 -32 27 -250 -28 -35 -193 131 -178 31 7 -154 -35
5080 -35 -164 -116 41 55 -49 60 -135 146 231 130 149 59 3 276 76 -65 79 -187 82 103 -23 136 -37
5103 -37 1 191 -137 -100 80 -2 189 109 8 135 -142 70 -19 -154 142 123 -22 -2 -278 -83 225 -169 169
5126 169 61 -71 165 -70 -65 -48 -121 51 114 16 131 80 -107 65 -161 54 75 32 241 36 -109 73 -19
5149 -19 26 88 -55 202 -35 -136 173 -73 -91 100 -17 23 172 -110 124 22 -156 121 26 -3 -5 8 199
5172 199 86 -91 16 -154 -132 131 -207 85 -93 -100 90 -49 -41 127 -128 -148 146 -37 72 70 37 71 -99
5195 -99 6 39 -140 127 -14 -143 113 -118 -68 187 -135 104 219 -140 84 41 -71 159 -102 93 144 -33
5217 -33 159 149 45 -42 -121 -69 -15 -181 105 114 -17 2 -32 124 109 -200 25 83 -100 90 -103 21 156 16
5241 16 171 -71 -146 68 -80 -163 70 -58 -20 180 -62 181 -50 22 248 86 -11 -28 -229 77 8 -167 304
5264 304 -10 90 88 -136 100 -6 -274 116 -103 -72 1 -165 -42 72 -197 128 156 -110 269 -157 -49 -56
5286 -56 -185 -134 -27 6 99 39 -67 139 -4 47 54 -56 -15 2 -66 162 37 -51 -8 -231 88 -70 -180 -69
5310 -69 -122 -91 117 -38 227 103 -44 262 -35 -69 180 -83 137 97 -123 91 -54 8 108 -159 79 18
5332 18 -131 262 -42 40 322 -58 -162 140 -263 46 150 -159 69 -75 123 72 -261 -16 -110 -261 97
5353 97 -78 -184 6 -228 6 -24 -28 87 -86 90 -9 -108 99 162 -24 190 -54 -5 104 -6 -24 153 -173
5376 -173 23 122 -38 24 30 -21 -39 -68 20 70 -174 45 -132 -169 133 -47 1 98 -99 90 40 44 45 -145 -40 76
5402 76 26 19 74 -180 222 28 -96 4 18 44 126 -51 21 141 -180 166 -19 131 105 -249 106 56 -124 120
5426 120 -108 -89 -27 -25 7 68 -35 123 -82 -9 185 -120 53 102 -109 222 -52 -131 171 -44 100 -9 -131
5449 -131 167 -22 92 82 -172 34 112 -98 127 -9 -180 68 -100 91 34 -57 19 -50 -141 159 -68 -95 174
5472 174 -25 15 94 -29 250 27 -209 144 -104 8 102 -13 267 77 118 170 -103 -89 120 -120 115 137
5494 137 -78 173 132 -110 271 -117 -165 -6 -104 130 23 -94 146 -144 -149 122 -86 147 2 -96 119 21
5516 21 -32 35 -6 115 32 -116 -13 -145 -198 74 -80 18 174 -156 188 -18 -47 85 -128 13 14 -201 -5
5539 -5 -22 -260 50 -33 -225 7 7 129 -85 -226 154 70 -77 66 -115 -59 105 -81 45 54 -30 260 -97 8
5563 8 86 -151 176 210 -79 197 -51 -90 201 -44 102 206 -205 75 -85 -216 149 -14 -33 37 -48 59 -105
5586 -105 -220 207 -152 3 214 9 88 -24 70 46 -19 -24 172 -176 179 71 -162 12 -56 -103 45 -215 -82
5609 -82 81 -81 42 -63 -91 224 -186 4 88 -81 139 -26 -131 52 -79 76 65 -120 94 76 -62 108
5631 108 82 -47 74 -115 -94 -68 -122 -93 -134 -1 70 -245 -57 161 13 53 10 -55 95 -134 -113 116 -181 126
5655 126 50 -121 195 -11 4 209 -154 -21 95 -127 200 -74 -29 201 -146 -106 46 -1 110 31 47 45 -75
5678 -75 -226 209 -136 205 11 -81 180 53 -117 118 45 6 111 -85 221 -35 -55 39 -54 0 89 -107 17
5701 17 -70 -33 105 20 67 177 2 153 -43 -166 127 0 125 108 -28 117 -18 -127 58 -32 -102 152 71
5724 71 0 122 -243 202 156 -148 -99 -66 -78 -25 -48 47 -80 -211 116 -146 -72 -119 -127 152 249 84 78 40 -100 113
5750 113 -42 -200 240 -51 105 69 -34 202 -83 119 167 -89 83 226 -20 -39 -1 -142 -73 -206 44 73
5772 73 -30 112 91 -61 -3 -69 -90 -66 -192 145 -13 -182 184 -84 -135 -31 -176 24 117 -50 194 -25 -41
5795 -41 207 -69 60 -19 -157 -16 -3 -45 -37 -137 60 -8 -108 37 56 -49 100 36 242 -108 -45 168 121 -74
5819 -74 45 -14 -27 146 -82 155 40 21 91 -78 -77 19 -145 -31 -72 14 77 1 12 6 141 -111 227 -82 15
5844 15 150 33 24 7 14 130 73 -68 67 -53 145 -136 -113 184 -229 171 74 -61 33 -23 -166 69 -17 -20 69
5869 69 -133 86 106 -33 105 88 -17 220 -122 103 -57 -124 109 166 38 6 174 -123 67 -16 206 23
5891 23 -148 221 -44 88 34 -211 -96 83 -49 62 21 23 204 -99 -52 117 -123 2 -177 -136 27 -82
5913 -82 16 103 -7 -77 214 3 183 58 122 153 -124 214 203 -76 73 132 107 59 -41 12 63 4 154 -58
5937 -58 -41 132 39 120 179 -259 81 171 -38 177 -134 -66 2 -14 70 87 -178 87 -59 -122 211 -141 54 193
5961 193 -161 55 81 6 128 15 -42 170 50 51 -213 -83 126 12 28 188 -9 4 -10 -59 65 -2 -77 -28
5985 -28 -248 55 90 -101 251 63 -168 -3 -44 13 -30 -269 -21 98 -51 146 -24 -58 167 -231 26 -16
6007 -16 -119 175 -260 79 108 105 -30 78 -87 25 -50 27 -127 -11 28 62 -36 2 38 -196 191 -178 -14 144
6031 144 -189 115 11 119 19 165 -34 31 -63 -70 -65 -112 46 131 -43 34 -43 85 23 -194 -9 4 -64 -4 -76
6056 -76 21 8 -92 -66 137 20 -3 -11 -37 166 -183 134 103 43 -122 -127 -74 190 -66 84 124 -86 67 -137 -33
6081 -33 36 -36 -1 27 -103 111 42 -285 181 9 -32 65 -58 -68 -7 -61 27 66 -33 106 -124 87 150 -56 15
6106 15 -103 -118 51 -42 -86 104 -203 -41 32 -98 -6 -87 -120 117 -318 84 58 -154 62 50 -78 174 -68
6129 -68 96 312 -155 -54 -2 -196 -51 -13 138 27 -187 103 -12 -4 15 -4 72 100 29 -93 200 18 0 58
6153 58 -98 143 -50 47 35 -110 204 108 197 -35 -26 -28 -115 -175 -43 37 -128 -41 -169 35 -32 -120 -80 -241 -209 78
6179 78 82 48 52 -43 14 42 -144 175 -113 -118 66 -119 15 187 -95 -50 115 -13 125 67 43 118 -21 -205 139
6204 139 -150 80 -57 -99 210 -77 81 -29 -64 81 85 -11 226 -8 35 64 -246 113 -61 -48 -52 -106 -33 -28 -100
6229 -100 83 112 -173 49 64 14 -77 -107 18 48 -225 64 -15 -267 119 -94 -10 -8 -153 -105 -181 -59 133 -24
6253 -24 68 38 54 16 68 -55 -63 143 -56 139 -21 33 52 -90 -44 41 18 161 -17 20 21 -244 120 -129 -133 135
6279 135 58 -39 -149 -151 109 -82 7 -61 -140 -147 111 -24 -56 28 -171 14 82 144 -1 -17 -88 13 129 -110 -3
6304 -3 -195 73 35 164 56 154 -67 -28 136 86 119 -26 31 -137 134 182 -83 67 -73 -44 17 -27 -22 -52 28
6329 28 114 -40 -114 196 5 -9 -36 -155 51 -56 -54 102 -69 -51 61 -117 -32 45 15 116 65 -67 188 -7
6353 -7 42 146 -212 224 109 -169 -55 -59 22 39 -134 95 9 -26 -4 12 -24 95 -129 -215 13 -150 211 -80
6377 -80 -16 179 -74 -104 79 60 173 3 41 182 -4 -19 41 -92 31 1 -49 96 55 -62 5 -85 14 -3 -205
6402 -205 57 -83 -8 7 -83 110 97 -254 166 -106 -126 242 -88 24 248 -72 -13 -46 -115 117 -39 -34 319
6425 319 -97 88 -43 -18 108 106 -120 110 24 20 -135 40 68 -211 47 142 -29 77 234 -144 186 -29 -112
6448 -112 171 124 -73 135 -24 -86 -9 -22 18 46 -127 46 -67 166 -65 120 182 -59 -65 -66 29 -71 -38 -87 -10
6473 -10 -50 -72 81 -57 -80 74 -112 58 68 -78 186 -74 -147 -90 -110 131 -43 25 79 -17 25 57 -4 -54 83
6498 83 -198 -19 -32 -1 -7 -33 29 219 -183 36 67 33 110 -120 71 121 -101 16 -65 -157 -61 -121 24 60 -95
6523 -95 -8 -82 -82 103 -41 12 82 6 -71 -20 -108 -102 85 -59 85 6 -2 158 -32 -88 25 -43 82 -76 6 39 -134
6550 -134 -158 -55 -116 50 -15 -78 75 108 -117 6 14 27 182 114 153 196 158 208 166 130 80 8 91 -187 -71 156
6576 156 52 88 60 -10 99 -29 -67 -105 59 134 79 -134 -74 7 -53 109 13 -38 24 6 -90 80 -97 29 -12
6601 -12 22 53 -24 -66 11 -123 88 9 -69 74 -10 97 86 -189 115 -48 -33 180 -78 -74 96 -92 -147 148 -152
6626 -152 -99 71 -170 167 56 30 139 -112 168 61 -78 109 -68 -137 54 107 -111 88 -31 99 -185
6647 -185 -172 121 -203 -14 -170 -12 22 -61 -83 178 12 55 100 -8 88 150 46 -14 -18 -129 39 83 21 -6 -87
6672 -87 106 -1 -17 42 -123 -32 39 79 146 108 -53 16 80 -37 116 -186 132 -33 -148 55 -128 -223 21 -51
6696 -51 -48 69 -52 233 -140 -88 101 -103 169 85 -77 96 -75 -116 90 -117 44 -162 -125 141 -39 130
6718 130 147 53 15 108 25 50 -34 -161 148 -79 -50 94 -38 58 86 -75 -69 49 17 63 38 8 -1 -3 63 27 -61 10
6746 10 -25 34 55 -115 33 29 -2 41 33 -52 124 -64 79 140 -112 -11 -128 54 -8 14 48 -40 -99 165 -28 -106
6772 -106 -38 -42 -183 66 -118 -123 15 -81 64 -117 -18 97 -94 42 61 -95 100 31 -103 13 88 50 -73 -132
6796 -132 -15 64 -19 42 92 -44 7 -130 -21 -27 -74 -10 9 142 150 -57 -95 89 15 -10 75 -24 -4 -91 72 -52
6822 -52 -20 59 103 -93 -7 -26 122 -39 -46 73 -59 -23 -6 -35 -40 143 -84 59 -8 -81 -10 119 125 60 -17 -114 65
6849 65 181 66 7 86 180 -160 141 4 -76 71 -190 110 38 -57 -46 182 0 -96 123 -61 25 -21 -72 12
6873 12 -8 -70 78 68 -81 47 -127 210 -74 52 -109 -27 8 25 20 -2 -14 60 -35 -8 137 -114 19 -64 -12
6898 -12 -160 53 -72 -41 98 -44 114 38 92 113 -121 -64 76 36 104 -72 -65 225 -77 54 -19 -108 -87 80
6922 80 -114 -92 23 -75 -17 -173 62 69 36 -126 -149 -39 29 -138 -76 47 -35 -45 -109 69 -28 -45 -78 -52 -41 134
6948 134 157 -60 58 82 -128 -80 -86 -125 -28 -111 -24 55 8 -13 -85 -21 98 35 58 89 84 -9 17 70 22 94 51 -34 -56
6977 -56 -59 -26 -36 -13 -3 -87 -48 -59 80 -68 56 21 -48 151 -14 12 -59 74 -103 26 -52 -82 -8 -37 -1 120
7003 120 25 -46 -101 21 146 -48 -80 215 -13 27 45 -55 37 -28 -7 -23 -27 10 88 -75 66 -75 -16 -56 -123 23
7029 23 -43 -158 -100 90 -1 44 16 148 167 -3 34 96 85 52 -95 -56 38 -8 -2 -150 -129 -86 20 -135 -81 -139 -63
7056 -63 -5 -153 -100 105 38 -113 1 -19 -97 111 208 25 91 43 -88 -78 100 -35 -25 -53 -79 164 -107 -7
7080 -7 14 -94 13 155 -51 14 70 -14 117 -54 124 -107 -149 152 96 -95 14 77 -19 58 -139 83 -62 -58
7104 -58 35 125 112 27 89 -19 89 -131 78 28 -109 -2 58 -107 55 59 0 -15 -59 37 -125 -55 22 19 -175 47
7130 47 -173 93 -48 -95 100 -122 -74 -17 -198 -51 -100 -61 222 -4 56 -15 14 -77 -14 -59 67 71 -146 111 -2
7155 -2 90 -69 -115 148 -27 -63 194 -216 2 -63 95 134 -115 74 50 0 -28 14 -91 51 -51 -6 121 91
7179 91 78 -23 0 40 -11 -128 106 158 -163 196 -60 -27 38 76 143 20 -119 75 46 -81 -104 43 68 41 25
7204 25 24 90 10 -82 -133 62 -76 27 -9 -56 -41 198 16 43 95 -136 108 -54 -40 14 97 19 -64 -57 -12 79 -17
7231 -17 215 58 -149 27 33 -129 25 -59 158 -80 24 -32 -49 -151 13 -105 5 51 -43 35 -270 61 -71
7254 -71 -173 -49 -119 -17 31 -107 67 -79 17 123 -42 -45 45 63 73 98 -3 -82 -13 -41 78 -42 -1 120 -80
7279 -80 -104 137 41 171 22 -55 186 -18 -4 15 -31 105 -35 -68 -14 -38 -38 -11 -52 98 -99 -18 121 -79 54
7304 54 111 -139 19 119 15 4 37 -2 197 -270 3 94 32 -9 -40 125 -71 -130 54 102 38 60 -23 -210 204
7329 204 -77 -172 -49 -56 -38 82 -61 -12 4 -89 -2 46 -33 -78 -10 140 -144 -3 114 -208 -12 110 -39 236
7353 236 13 -67 50 -105 -84 -31 -49 3 -161 -90 44 -105 -181 -73 54 -30 -138 158 -4 185 -34 67 -83
7376 -83 16 161 -44 -58 -144 -49 4 74 -180 55 -63 5 -41 -31 49 10 -26 36 121 112 -55 -83 1 -153 -3 21 -89
7403 -89 122 102 -101 -11 45 -267 -159 -111 -55 -1 22 -47 -21 8 45 -92 69 59 -192 15 134 -120 77 34 -113
7428 -113 84 -118 21 49 -49 46 -162 33 -3 27 30 40 81 54 11 28 -23 170 -14 107 103 30 -7 -117 47 53
7454 53 61 69 90 9 86 -113 -156 60 -77 34 87 32 94 -156 169 143 14 -17 -21 -123 18 -32 143 188 -116 -3
7480 -3 -44 40 137 -126 -62 193 70 76 85 -209 67 27 57 215 -54 79 56 14 117 -114 86 -38 -136 130 25
7505 25 -111 -14 112 -15 47 -39 102 170 -149 83 144 -152 -26 -2 2 -75 -112 71 96 59 55 27 -97 127 -331
7530 -331 -39 81 -205 15 -122 -25 56 62 324 161 -231 -46 95 13 148 -66 -36 36 -165 -95 16 -48 112
7553 112 -24 45 9 -92 9 -110 -136 106 60 -120 97 -122 57 -33 -41 -87 82 38 115 82 36 52 20 -131 -37
7578 -37 -116 24 142 92 25 17 -16 -26 -6 -30 3 80 45 -74 14 -10 -64 23 67 -296 110 -211 -78 37 -166 190
7604 190 -34 -62 -119 -8 -82 87 -121 4 93 -187 -45 -22 -15 -8 -16 117 99 -75 153 102 61 214 27 -21 127
7629 127 -67 -9 125 -218 75 -38 12 -22 -138 -2 96 -56 -18 -99 -14 70 -35 -68 29 -55 36 8 -107 74
7653 74 -14 -32 44 -126 -1 56 -77 -35 9 2 292 -59 -36 86 -15 78 -32 -96 -99 -30 50 75 29 42 -116 -2
7679 -2 173 61 -63 67 -50 -10 33 -44 147 40 13 40 -10 52 1 -145 60 -64 -58 50 -19 -70 118 -103 76
7704 76 80 34 48 98 -111 39 -213 64 80 -156 150 40 29 48 -4 33 245 -50 67 65 38 85 -73 -8 31 51
7730 51 -93 -88 -36 9 33 6 -26 -96 -15 -1 -165 62 26 -35 -39 -6 -131 -52 -12 121 -100 58 -41 -73 -53 144 -5
7757 -5 60 49 -6 95 -49 100 209 27 15 34 -71 110 -116 -57 49 -7 -39 -19 -54 -102 68 59 7 -19 -34 -147
7783 -147 -18 232 -28 -70 108 -35 -53 29 -71 103 104 -84 143 34 51 74 -115 -1 -24 43 -22 -9 70 50
7807 50 -62 -90 -80 -128 57 -60 -25 77 69 64 126 -62 58 61 -42 24 68 -30 112 32 37 -39 163 59 -4 111 201
7834 201 97 149 37 -42 59 71 -101 -43 -148 -145 88 -68 -25 -26 -62 -43 -119 -104 49 30 89 80 17 183 9 41
7860 41 83 -33 -173 64 -145 140 65 -27 126 -178 -182 83 -80 -50 27 2 125 -109 -119 0 -150 80 -11 -18
7884 -18 141 36 -33 90 30 103 89 -176 -35 34 117 144 -77 186 -51 -183 -36 76 -115 48 115 -70 7
7907 7 -114 16 2 -161 80 120 -66 235 -239 77 -72 -146 107 -54 -56 84 -29 30 41 49 108 -112 -164 112
7931 112 -55 127 -11 -122 -56 108 2 91 3 149 81 -150 66 111 -197 36 -127 14 58 -25 -110 -85 -70
7954 -70 37 -57 -85 258 -211 -181 88 -88 98 47 -18 111 23 48 181 109 108 -64 38 30 -27 -55 166 -86 -29
7979 -29 196 31 109 -19 7 194 -186 59 -50 -197 -25 185 -35 196 -144 31 160 -95 24 -215 -122
8000 -122 -177 -43 -19 -10 6 -59 -116 -72 74 -22 -17 54 -97 20 29 19 84 48 -100 -34 -65 -96 44 128 -21 -47 -49 -10
8028 -10 -31 97 98 -10 102 53 11 78 -34 -90 148 -101 -11 -102 -84 64 88 -55 89 -16 96 14 -9 -84 -12
8053 -12 -76 68 -61 -77 31 -141 9 149 55 50 175 -68 169 43 -65 40 -39 83 -2 24 -43 -42 55 9 41
8078 41 -40 -26 -45 97 17 -149 90 -89 79 -69 87 -12 116 68 40 -1 -85 -94 -31 216 94 65 48 37 -72
8103 -72 55 -27 57 -36 38 175 -55 -101 60 19 -89 17 -68 72 49 125 -64 -192 23 -53 -6 -32 -106 8 98
8128 98 70 72 31 -31 -71 12 -35 261 -42 -56 147 17 55 -13 203 136 25 7 150 9 123 -138 -84 -118 107
8153 107 -31 256 91 42 -31 0 -8 -102 57 33 -45 61 121 -60 186 99 81 45 67 -182 -30 -20 36 107 42 95
8179 95 -41 141 -18 -80 1 -152 114 74 212 -85 111 -1
8191a
$$ Imaginary data points
##PAGE= N=2
##DATA TABLE= (X++(I..I)), XYDATA
0 0 0 0 0 0 0 0 0 0 0 0 0 0 0 0 0 -6 8 -8 8 -8 8 -14 16 -16 18 -24 24 -32 33 -40 46 -50 57 -65 73 -82 92 -102
38 -102 114 -125 141 -157 173 -190 209 -231 255 -281 310 -342 375 -416 457 -507 559 -621 694 -776
58 -776 875 -992 1136 -1316 1551 -1871 2321 -3014 4192 -6533 12835 -60586 -142468 114974
72 114974 36021 -109103 63503 99559 -75530 -37754 99485 4412 -85649 57325 49093
83 49093 -66903 31216 53023 -61565 -18627 47046 18500 -13101 9726 36095 -33203 -30993
95 -30993 65105 -4688 -47083 54249 17434 -45346 30975 39041 -46568 -15444 86508 10240
107 10240 -67993 52451 20522 -94821 39701 59542 -80162 -1899 54657 -49650 -29659
118 -29659 50145 -3967 -51799 36647 48755 -53588 -8435 35436 -51968 -7756 52246 -27395
130 -27395 -31998 14109 -2107 -22490 -8997 29677 -1611 -37272 32463 22622 -46491 -223
142 -223 25381 -16044 -4753 32848 5026 -47365 10109 49287 -36738 -5378 58992 -32350
154 -32350 -26234 45008 -17908 -33547 21615 1542 -24194 10245 18610 -36595 -18872 44240
166 44240 -6947 -17904 42146 -10231 -27323 32044 1399 -20872 10925 10996 -5467 -12999 10897
179 10897 6912 -32200 5134 28948 -13133 -5126 6813 -10039 -9021 2350 14582 -12828 -16346
192 -16346 30366 -8068 -28923 33441 2516 -26100 28747 16502 -16539 3385 10549 -9718
204 -9718 -7418 27303 2797 -32582 21186 15227 -32507 15518 18388 -20983 9562 14411 -8691
217 -8691 -4956 2175 3580 -11155 1596 18748 -18703 -13840 15956 -7089 -4636 7249 -2802
230 -2802 1121 -3312 3844 2295 -17339 11717 9431 -22512 12197 11594 -23061 717 11507 -3234
244 -3234 -3259 3816 4064 -14231 1933 15753 -23773 -3786 23776 -19119 -7970 16437 -10862
257 -10862 -6111 7209 2464 -114 -1361 9153 -4347 -9277 20059 -1005 -14328 15847 1626
270 1626 -7274 5533 -1559 2179 -1025 -419 8607 -10539 -97 11506 -16597 -613 13996 -10531
284 -10531 -5007 3248 343 -2190 -6271 7784 -1737 -9368 15953 -4286 -13615 18435 -1035 -11189
298 -11189 11163 2480 -2297 -817 1566 5383 -6757 4066 5971 -13518 8008 7226 -15547 5454
312 5454 4978 -6988 2303 -2729 2149 1039 -6915 6664 -3301 -5033 11328 -7871 -4610 11317
326 11317 -4027 -1516 2200 434 5942 -6035 1651 7017 -10409 5248 3654 -13573 6952
339 6952 2936 -11197 1801 311 -510 -2661 -5209 6868 -4758 -4817 8678 -9273 -1398 10193
353 10193 -10156 -10 7057 -3668 3222 -705 2768 7615 -4562 5289 4378 -4676 9329 -1481
367 -1481 -6107 8917 -2563 -2037 2001 -4207 6048 -1578 -4314 9221 -4143 -331 7074 -8277
381 -8277 3068 5406 -7558 1346 206 88 1315 -6915 5708 2743 -6211 8219 -2981 -5594
395 -5594 9465 -5852 -4690 5326 -4974 -1130 -3177 -3739 4716 -6289 -1397 4275 -5619 4455
409 4455 -65 -9257 4977 -1119 -4098 1989 -6477 1835 412 -7964 6558 760 -2852 8623
423 8623 -1765 2223 8098 -3833 1693 2635 2051 5157 -7324 301 4539 -8159 4565 2293
437 2293 -7278 7265 -1304 -6252 4752 -3172 -1824 -585 -3106 5626 -3742 -5632 3889 -3646 4872
452 4872 6797 -5712 5305 2953 -3114 4874 -3784 243 4523 -8441 1133 1170 -9490 127 -1955
467 -1955 -158 7000 -2569 -154 -241 -1545 8715 -2173 -1666 8903 -4214 929 5231 -6681 4863
482 4863 4140 -2627 9339 3172 -2276 216 -2429 7155 2644 -3237 4263 -5614 -1234 6665 -7340
497 -7340 824 6037 -2868 5278 -509 -4274 2566 -7838 -875 6772 -5756 -4193 -6334 -7571 1873
512 1873 -4118 -1626 454 -5224 5861 -1032 -8617 5375 -3102 -3059 8648 -3993 -3485 -894 -9369
527 -9369 483 3629 196 -721 -6919 2334 2277 -7908 2294 -1042 -3233 8296 -3019 -3098 2870
542 2870 -6097 4849 9252 2095 8342 292 -2051 7874 3632 5011 1574 -1912 8334 -402 -4519
557 -4519 1655 -5569 3443 7064 -2803 6135 -1084 -9586 6017 3114 324 5031 -3331 -1860 31
572 31 -209 1501 -7411 1804 10144 -4232 167 104 -8979 2844 1316 -1001 5517 -7004 -6721 629
588 629 -3909 2026 -700 -4230 4001 -141 150 -1698 -9074 3284 3559 -2063 4251 -6592 -6611 2104
604 2104 -6050 3232 7067 -6147 853 2804 -238 2581 -3483 1712 5115 1200 5957 -4770 -7511
619 -7511 4919 -2001 1883 7691 -5509 -725 383 -5798 4361 318 -4091 1712 -1071 2746
633 2746 -2057 -9249 2345 1971 2394 7487 -3559 -1104 1984 -3478 6963 3048 -3173 5642 -3127
648 -3127 -3300 5213 -4415 -3340 1996 2580 5247 -4386 -4341 979 -3975 5462 4640 -5198 3493 -1768
664 -1768 -5254 5463 -1498 -413 4160 -1821 4652 2295 -4764 67 -1487 4768 6696 -4479 -175
679 -175 -1139 -4550 4312 -1362 -1232 4623 -5143 -8 2625 -6146 858 -836 -1907 6235 -1431 -4483
695 -4483 -2671 -3850 4832 862 -2350 4108 -3789 -445 4530 -4964 2877 3729 -3795 4279 1263
710 1263 -3045 -246 -4162 2597 4842 -2406 1262 -3825 -2879 4597 -3147 -137 3043 -3634 2481
725 2481 -899 -4010 3686 -3465 -1228 6468 -1210 679 -651 -4516 4138 1986 514 2157 -3663
740 -3663 2506 1346 -5210 3816 -131 -2837 4790 -2673 -1284 1801 -5818 584 2322 -710 2204
755 2204 -4654 -1588 3328 -3283 1944 955 -2914 5171 -1106 -2306 3837 -2472 1551 3249 -1668
770 -1668 5075 -526 -4188 4022 -290 1032 2300 -3956 1619 476 -2734 1748 -3632 357 3667
785 3667 -5229 1421 1745 -4882 2263 -425 -1024 4276 -3195 -805 1074 -2042 3598 -1961 -2234 5319
801 5319 -2504 -679 2314 -3654 2460 599 -3200 3301 -2156 -1747 1118 -4398 2464 1613 -4821 2162
817 2162 -122 -1133 2438 -3128 1706 2786 -2469 3347 -687 -1289 5039 -2882 38 5167 -2008
832 -2008 1453 1012 -1118 4295 -1118 -666 2711 -2583 2301 -283 -5013 3630 -1162 -3138 2492 -2719
848 -2719 445 1132 -4357 2424 -13 -2086 2409 -3518 331 2974 -4488 1005 773 -1959 2667 -2710
864 -2710 -273 3349 -3345 1377 819 -3024 3721 -2175 -3514 3408 -2323 -730 459 -2994 2683
879 2683 -658 -2372 2972 -2063 1008 2400 -4042 3030 1772 -3198 2680 -573 535 3283 -2806
894 -2806 2291 2599 -1574 3522 -1179 -694 4513 -2945 -297 1902 -2862 1664 -1767 -2600 3300 -3155
910 -3155 -855 1673 -3678 2529 212 -4030 3126 -361 -1109 1430 -2681 2528 877 -2963 3430
925 3430 -882 -766 3647 -3338 1030 3370 -3213 1159 -158 -1252 2623 -3461 -241 2808 -2886
940 -2886 1927 -232 -2794 4193 -717 -1041 3102 -1398 1954 539 -2376 4225 -713 -1202 3672 -1994
956 -1994 1572 2267 -3837 2081 1441 -1023 1973 -2880 413 1532 -4309 1447 -197 -3325 2431 -2760
972 -2760 -2253 2363 -3615 -767 110 -1984 2350 -3264 -2984 2730 -2698 715 1471 -3481 2504 -92
988 -92 -2548 2487 -1266 766 1934 -2651 2959 124 -3930 2132 -1147 223 3334 -3617 -262 1387
1004 1387 -1732 2482 -1294 56 3953 -2414 1210 2626 -2793 2739 1036 -204 4970 -955 -746
1019 -746 1585 -1313 4325 1116 -2546 3326 -1040 -844 2094 -3307 930 1507 -2364 2117 -1345 -2096
1035 -2096 581 -3795 2129 3033 -3906 703 -1282 -2218 3062 -2037 -784 2045 -1731 2045 -1054
1050 -1054 -2903 2870 -1880 -122 3997 -2319 -418 -1147 -3352 3353 -162 -1818 1359 -3141 801
1065 801 947 -4444 1399 168 -1088 3363 -2032 -1157 872 -3114 2601 2231 -243 2282 -3290 -385
1081 -385 4309 -2244 708 1811 -1308 3424 -515 -2416 843 -2137 1828 2239 -2407 1894 -2121
1096 -2121 -3764 2956 -621 398 1391 -3515 1959 952 -2749 1433 -1603 1282 4554 -2117 411
1111 411 298 -3045 2755 970 741 2792 -3515 -138 1565 -1896 2539 -1333 -2077 4321 -1206 -2102
1127 -2102 -453 -3296 2072 1636 -1192 2061 -2784 -2124 1415 -1721 2827 1308 -2910 2653 58
1142 58 -1048 1679 -3157 1454 4081 -1002 1129 -2272 -2708 2327 -1118 1142 2181 -3235 -59 -864
1158 -864 -1888 2604 -2395 -861 2964 -1777 1037 -1042 -4646 2812 1471 138 2492 -2367 -239
1173 -239 637 -1805 3279 407 -1080 2695 -1823 800 1635 -4225 1311 2058 -71 2487 -3317 -2774
1189 -2774 1738 -1631 1476 972 -2519 1475 -1920 -1565 2376 -2091 361 1653 -1090 3280 -1211
1204 -1211 -3592 2049 -320 1992 3194 -3279 427 241 -1978 2133 -540 61 1773 -2632 1208
1219 1208 254 -3441 1445 -910 301 4002 -3222 -1631 754 -1857 2840 519 -1403 2463 -1328
1234 -1328 79 1632 -1894 2192 705 -1112 3562 -951 -1715 685 -2101 2801 2013 -2981 1133
1249 1133 -1333 -1394 2197 -1994 -33 1261 -1784 1127 -976 -1598 1389 -2449 900 3019 -2143 483
1265 483 -1035 -2135 3755 -335 -840 2135 -1199 1011 595 -2217 1918 -476 -440 2144 -2057 244
1281 244 -160 -3342 2362 862 -1170 1416 -2723 -120 2211 -2573 871 795 -1020 2117 -1307 -366
1297 -366 1761 -1643 1770 1509 -686 2539 -1693 -1300 2878 -1373 615 874 -2668 1741 -352 -2502
1313 -2502 1209 -1266 164 1045 -2204 1159 -430 -2430 1770 -1225 192 1924 -3287 599 1326
1328 1326 -1719 1905 -680 -325 2996 -1397 155 1129 -1493 1704 -245 -855 2205 -1896 -655 929
1344 929 -1920 1992 -174 -2411 2598 -936 -875 1585 -2122 1112 1261 -1897 1403 -388 -399 1749
1360 1749 -1622 1756 1997 -1853 1806 -178 -856 2416 -2000 -518 1996 -1869 606 -333 -1959 1906
1376 1906 -868 -749 1449 -1440 951 -111 -2333 2169 -881 -1222 1372 -1967 711 1196 -2615 1803
1392 1803 685 -978 1985 -951 449 1765 -1640 889 353 -914 1601 -1889 -355 2190 -2219
1407 -2219 565 723 -1844 2073 -941 -1624 1954 -1353 -260 347 -1731 1465 -393 -1155 1933 -730
1423 -730 876 1530 -1893 2190 1083 -1539 1798 -926 -341 1783 -2522 148 971 -1933 790 -952
1439 -952 -757 1541 -2013 -141 629 -1550 1354 -1258 -1506 2347 -1543 -583 1435 -1529 1776 913
1455 913 -1477 2062 -176 -143 1274 -1288 1554 313 -1960 1554 -842 -591 1413 -2353 630 1812
1471 1812 -1882 1146 -21 -1023 2078 -1568 -494 1398 -1440 531 -345 -785 2211 -1189 -64
1486 -64 1903 -1221 1574 228 -1933 2442 -40 -1252 1584 -1330 111 888 -1903 863 105 -672
1502 -672 971 -1623 554 876 -2638 824 168 -1497 1348 -1777 -1135 1968 -1432 472 831 -1073
1518 -1073 1768 -235 -500 1803 -871 614 507 -1274 1815 -967 -1886 1511 -1025 530 1111 -2788
1534 -2788 844 600 -1677 1104 -654 -235 1132 -1527 479 147 -1340 1571 -653 588 2479 -2021
1550 -2021 232 1407 -940 1901 -233 -1493 1898 -856 -867 685 -1452 965 98 -834 1489 -1195
1566 -1195 -837 626 -1524 1919 563 -2478 1160 -723 -663 1644 -1519 412 1841 -812 1085 -55
1582 -55 -828 1319 -535 1014 1382 -1617 379 -919 -1076 2393 -1201 -1003 1479 -1506 475 140 -2233
1599 -2233 999 270 -261 940 -1513 -62 -220 -1441 2336 275 -600 1142 -1734 729 1679 -1941
1615 -1941 1015 907 -516 1669 -1112 -1381 1022 -858 956 816 -736 731 -1833 -601 1933 -1259
1631 -1259 414 163 -1840 1668 -308 -2392 1109 -441 549 1663 -1292 168 -311 -739 1980 244
1647 244 963 884 -2280 1271 781 -1370 1457 -752 -368 2364 -1786 -1166 -94 -1527 1250 399 -1002
1664 -1002 665 -1730 -183 718 -554 1704 -531 -1146 2542 -644 -589 1093 -1468 1918 2106 -1234
1680 -1234 336 -791 -996 1247 -467 673 383 -1880 408 -961 -632 990 -1910 520 1996 -1527
1696 -1527 497 -750 -1596 2318 650 -259 1018 -1474 -48 132 -763 1649 -556 -294 1306 -1122
1712 -1122 729 -32 -2301 2020 1047 -575 1204 -1957 -842 1363 -1010 826 409 -870 544 -1229
1728 -1229 50 720 -1549 1038 636 -606 1528 -1890 -1727 2088 -284 759 986 -1625 991 230
1744 230 -608 1433 -387 334 725 -1328 978 -951 -1874 931 -783 527 1287 -2938 -277 861
1760 861 -1005 1595 -271 -472 1337 -857 184 453 -882 1314 123 381 2079 -1410 -329 1030
1776 1030 -873 2145 305 -1950 728 -863 -834 637 -1321 494 578 -1032 752 -575 -410 801
1792 801 -1157 1658 1174 -1861 645 -774 -595 1943 -929 -280 1419 -876 601 110 -693 1437
1808 1437 -217 298 1024 -1511 139 -875 -1468 1960 -519 -979 890 -1441 499 964 -1677 941
1824 941 594 -406 771 -1144 -43 328 -1066 1205 323 -516 1239 -1448 322 2044 -1083 761
1840 761 667 -1165 1232 -728 -1338 806 -809 205 308 -904 895 -811 -698 1400 -544 703
1856 703 656 -1771 1032 323 -1503 973 -561 -136 1240 -905 451 568 -667 1229 -66 312 1008
1873 1008 -1797 84 261 -1417 995 -942 -1111 1516 -1278 -486 865 -1054 968 194 -1107 874
1889 874 -680 -234 465 -1050 1226 251 -1085 1732 -149 140 1546 -1146 778 1371 -1438 695
1905 695 -509 -785 906 -1109 -217 559 -1197 545 -351 -490 1715 -800 -271 1229 -1183 741 128
1922 128 -1513 1469 -58 -678 884 -684 485 688 -908 1154 -76 -412 659 -1400 172 686
1938 686 -2128 497 -87 -1086 1143 -1071 -500 1425 -1045 267 444 -626 1015 -752 -603 975
1954 975 -1150 464 158 -1040 1587 -200 -718 1421 -500 406 1157 -1268 885 221 -1246 592
1970 592 -694 -18 530 -1449 560 101 -823 1100 -733 -117 1507 -1340 115 902 -1182 933 -189
1987 -189 -803 1413 -394 83 833 -450 1320 -97 -535 1467 -830 -170 531 -1490 883 249 -1480
2004 -1480 860 -412 -561 1020 -1027 359 729 -960 579 -404 -360 767 -1347 248 952 -1112
2020 -1112 1113 -116 -797 2001 -467 -282 1122 -869 646 135 -1208 926 -610 -691 537 -1220
2036 -1220 387 -44 -1400 1137 -255 -817 992 -1290 39 1047 -1302 607 635 -484 1072 -588
2052 -588 107 1158 -534 916 234 -524 1353 -901 -661 1230 -1037 266 384 -1470 930 -125
2068 -125 -862 1094 -453 296 713 -711 736 -199 -688 1162 -655 432 878 -1588 866 567 -814
2085 -814 1143 -415 -522 1065 -1071 -56 440 -954 788 -190 -445 822 -1003 12 396 -943
2101 -943 1309 -295 -1378 1152 -719 -449 812 -1138 660 467 -868 773 -305 -212 907 -527
2117 -527 1081 739 -1011 849 -347 -176 1520 -1119 59 1090 -1101 339 -321 -1315 826 -504
2133 -504 -68 413 -1283 203 8 -652 1523 -462 -281 881 -923 866 630 -1147 1244 281 -314
2150 -314 856 -1307 -374 714 -925 888 116 -930 314 -1394 108 817 -1447 457 52 -754
2166 -754 1140 -965 -945 1240 -277 807 511 -1117 615 -237 -230 1151 -479 329 225 -1215 1270
2183 1270 -116 -844 1188 -467 481 1161 -1435 -49 327 -623 1009 -415 -493 474 -1311 144 458
2200 458 -641 1157 -607 -373 1436 -1127 -359 546 -696 1493 441 -1150 680 -626 -22 1198
2216 1198 -329 919 44 -854 738 -725 -533 423 -1566 451 762 -1671 -32 -686 -593 1540 -490
2233 -490 142 777 -788 671 87 -39 1135 -715 440 887 -993 531 -267 -768 1744 161 -514
2250 -514 510 -1371 288 630 -1078 504 -164 -772 303 -1106 267 274 -1075 1190 375 -374 814
2267 814 -1314 -286 1317 -590 455 61 -1230 738 -406 -228 723 -558 506 396 -767 791
2283 791 -869 -821 1112 -496 395 121 -1686 376 66 -539 1106 -612 33 801 -768 560 197
2300 197 -486 1049 -336 182 698 -1411 171 897 -337 1398 -56 -670 1193 -650 39 367 -864
2317 -864 611 -75 -646 358 -975 -317 401 -679 1203 68 -1116 644 -389 -89 1019 -777
2333 -777 444 616 -1013 597 -450 -415 950 -464 574 512 -805 402 -455 -419 1205 -965 -666
2350 -666 439 -1133 261 -23 -961 841 57 -125 624 -671 544 411 -497 1217 -127 -376 558
2367 558 -1070 508 885 -983 825 255 -440 1083 -661 -341 623 -756 290 -123 -917 417 -963
2384 -963 -401 863 -727 321 354 -787 961 25 -661 881 -439 83 323 -956 482 -29 -374
2401 -374 699 -474 186 509 -984 645 138 -768 681 -856 -387 681 -1101 -82 110 -702 692
2418 692 -177 -436 844 -584 201 399 -423 704 -199 -614 1038 -529 -103 714 -774 838 374 -712
2436 -712 785 -296 -265 464 -696 344 227 -929 495 -433 -136 706 -924 338 650 -703 745
2453 745 -162 -482 1155 -314 -33 741 -561 413 53 -437 962 -243 -152 705 -823 660 264 -905
2471 -905 646 -315 -493 563 -940 -51 511 -983 324 4 -537 659 -584 51 672 -806 525
2488 525 8 -594 767 -555 -160 787 -514 335 450 -687 677 -374 -530 614 -671 147 217 -1016
2506 -1016 637 -238 -676 658 -715 -41 593 -1005 439 331 -374 722 -99 8 931 -500 369
2523 369 444 -333 724 -245 -210 880 -628 213 410 -702 769 -61 -675 658 -604 -224 368 -914
2541 -914 393 99 -651 761 -216 -158 603 -829 394 332 -659 631 -382 -384 798 -685 -109 560 -758
2560 -758 540 -117 -487 807 -663 -144 289 -653 554 -100 -648 822 -360 -317 542 -778 406 230
2578 230 -743 599 -149 -247 623 -370 425 495 -473 814 105 -214 758 -489 290 946 -653 547 271
2597 271 -652 594 -549 -546 643 -559 121 -79 -722 618 -327 -382 735 -482 325 343 -945 744
2615 744 221 -409 803 -457 141 517 -754 229 29 -500 514 -411 -403 305 -951 129 53 -464 498
2634 498 -524 -504 690 -593 60 344 -539 678 152 -516 612 -212 204 633 -489 443 82 -672
2652 -672 565 -251 -121 572 -634 421 433 -476 369 -257 -246 728 -418 195 278 -869 268 -124 -251
2671 -251 800 -577 -366 420 -411 464 178 -386 972 -141 53 497 -802 257 129 -420 804 -268
2689 -268 -550 494 -567 333 415 -761 547 -68 -460 445 -801 -80 620 -504 557 52 -442 582
2707 582 -256 39 1004 -289 305 140 -482 704 -297 -380 579 -429 245 -48 -1087 258 -103 -274
2725 -274 473 -578 -276 153 -924 232 32 -627 365 -440 -53 507 -918 -1 200 -137 789 -136 -269
2744 -269 535 -530 310 391 -606 463 -210 -407 695 -329 139 295 -385 740 90 -648 306 -602 -80
2763 -80 687 -583 226 245 -548 630 -120 -110 750 -269 374 434 -707 331 -57 -100 1106 -364 -321 193
2783 193 -724 530 152 -473 609 -547 -345 298 -633 216 -84 -528 799 -132 -248 288 -594 266 676
2802 676 -415 509 -68 -363 569 -372 -107 423 -464 596 -39 -480 477 -366 -176 799 -375 64 -369
2821 -369 -721 560 -87 -348 468 -529 145 247 -557 413 -181 -226 801 -42 144 280 -876 594 376
2840 376 -251 558 -492 -177 470 -599 122 112 -289 552 -213 -301 388 -896 5 272 -252 496 -369 -540
2860 -540 513 -274 211 353 -425 513 94 -457 353 -345 -23 570 -444 412 37 -734 205 -171 51
2879 51 576 -553 -185 392 -621 385 -269 -422 611 -380 -30 365 -613 264 93 -105 900 -294
2897 -294 -54 428 -305 399 232 -491 562 -136 -60 367 -522 439 428 -424 462 -177 -422 226 -556 230
2917 230 436 -414 267 -81 -188 601 -360 -54 711 -342 457 79 -546 596 -200 -155 716 -356 63
2936 63 255 -571 441 -103 -386 306 -425 44 341 -826 156 -162 -533 438 -539 -19 265 -635 291 166
2956 166 -303 599 -353 -274 553 -398 204 250 -276 393 -184 -387 479 -580 173 186 -603 384 -9 -470 442
2977 442 -349 49 314 -560 467 212 -532 311 -163 -28 491 -330 176 386 -210 358 1 25 643 -313
2997 -313 160 382 -420 342 -115 -252 569 -116 -272 193 -643 441 -13 -529 430 -329 -280 300 -464 142
3017 142 180 -604 324 -111 -195 470 -467 127 488 -491 355 -118 -303 463 -351 -200 468 -573 253 -2
3037 -2 -475 365 -207 -321 433 -392 212 229 -513 511 41 -285 593 -340 98 424 -502 437 216 -218 616
3058 616 -204 -24 481 -386 340 97 -228 450 -469 -222 496 -288 92 293 -584 316 -200 -370 385 -297
3078 -297 -155 188 -570 287 -35 -442 444 -427 46 241 -727 372 119 -405 455 -209 -36 343 -486 28
3098 28 295 -579 385 -159 -316 567 -549 8 243 -467 340 -164 -317 552 -355 -55 365 -500 485 157
3118 157 -321 764 -99 -129 354 -187 447 410 -427 411 -172 -189 427 -432 151 310 -649 345 -47 -264 519
3139 519 -234 32 409 -388 131 117 -308 545 -289 -122 347 -436 254 304 -313 563 -89 -254 511 -235 74
3160 74 36 -576 254 37 -193 315 -399 -3 232 -484 178 63 -427 540 -277 -31 503 -420 111 197 -275
3181 -275 440 -181 -352 337 -293 103 93 -568 367 -24 -364 325 -487 70 192 -669 164 63 -598 290
3201 290 -158 -106 427 -552 181 197 -364 519 -317 -84 642 -372 272 373 -345 396 159 -105 676 -236
3221 -236 -106 365 -357 338 73 -211 495 -37 -103 194 -470 300 198 -243 378 -144 -259 515 -245 194
3241 194 522 -386 332 35 -405 368 -302 47 602 -238 352 -33 -425 338 -370 -177 417 -520 202 54
3261 54 -475 299 -220 -157 206 -263 67 71 -550 393 200 -50 478 -462 -113 496 -532 459 66 -333 410
3282 410 -176 -242 371 -395 54 159 -379 512 -308 -333 197 -287 228 261 -378 395 -41 -302 474 -246 110
3303 110 293 -251 501 207 -436 350 -85 134 430 -210 74 31 -205 298 -79 -116 441 -602 127 323
3323 323 -564 236 -120 -144 515 -208 -222 170 -458 323 -43 -332 337 -218 -48 293 -278 298 202 -523 506
3344 506 -148 -407 312 -367 265 396 -386 227 -124 -243 388 -271 15 206 -478 164 2 -451 340 -300
3364 -300 -91 694 -298 167 147 -377 420 40 -55 406 -238 171 201 -459 411 52 -268 465 -313 -138 327
3385 327 -411 235 280 -210 270 -353 -252 193 -354 226 36 -172 445 -107 -228 402 -307 193 483 -289
3405 -289 196 77 -367 451 -243 -13 98 -555 202 124 -292 143 -164 35 247 -510 -57 -48 -425 361 2
3426 2 -115 479 -284 103 319 -304 314 38 -250 473 -290 -24 259 -393 445 49 -343 435 -222 -282 169
3447 169 -312 244 185 -271 174 -228 -206 318 -307 64 279 -212 465 -77 -372 559 -215 30 376 -58 117
3468 117 67 -307 501 -352 -82 148 -275 85 -98 -369 373 -234 -72 320 -419 70 8 -452 385 -49 -138
3489 -138 575 -182 -137 304 -356 248 131 -218 275 -314 -23 361 -347 213 250 -75 494 -214 -291 358 -157
3510 -157 -42 222 -343 307 -48 -126 535 28 127 185 -388 296 42 -308 624 -245 -138 487 -252 173 117
3531 117 -306 228 -98 -172 362 -292 -40 140 -390 254 -16 -177 408 -372 39 235 -420 161 2 -329
3551 -329 451 -262 -217 262 -394 366 103 -157 316 -30 -129 328 -234 123 444 -364 338 -114 -163 381 -227
3572 -227 -71 364 -191 145 -105 -230 226 -259 91 205 -302 271 49 -302 492 -110 -116 330 -136 100 211
3593 211 -201 249 -98 -97 237 -240 -96 213 -354 239 -72 -72 299 -294 77 432 -202 228 111 -254 256
3614 256 -44 -161 352 -231 254 172 -135 339 -30 -71 404 -286 -37 305 -240 173 99 -294 199 -112 -221
3635 -221 197 -296 183 -4 -311 285 -230 -247 94 -329 111 145 -352 300 -96 -382 234 -286 -79 359 -148
3656 -148 170 -9 -125 355 -197 -70 174 -353 138 4 -383 186 -80 -185 352 -365 72 96 -284 181
3676 181 -68 4 318 -122 87 234 -149 229 189 -257 367 33 28 333 -209 174 339 -148 354 -62 -13 179
3698 179 -282 124 -55 -224 236 -129 -108 282 -292 -6 103 -202 233 57 -200 132 -269 -162 297 -295
3718 -295 117 62 -188 146 -193 -51 196 -188 163 67 -358 224 -264 -148 314 -158 -33 48 -315 180 -97
3739 -97 -243 237 -157 45 255 -152 238 106 -263 204 -79 -20 336 -207 84 247 -204 163 -159 -185 326
3760 326 -223 -126 24 -241 297 32 -81 187 -292 -30 139 -290 -117 -47 -289 229 -24 36 105 -436 105
3781 105 265 -127 133 -243 -319 189 -94 48 153 -387 158 -3 -189 284 8 -55 138 -310 143 -162 -220
3802 -220 177 10 30 193 -294 193 133 -333 328 27 -110 380 -92 225 26 -210 75 45 -75 210 -404
3823 -404 -52 198 -219 109 -81 -379 168 -72 -39 328 -322 29 65 97 84 -49 -239 380 -44 122 34 -223
3845 -223 240 -58 -197 288 -181 61 113 -269 18 84 -350 280 -1 -106 177 -274 -51 7 -163 174 -44
3866 -44 -165 313 -305 -4 45 -313 275 42 -242 261 -215 27 264 -210 119 48 -349 72 -32 72 228
3887 228 -279 239 -104 -235 152 -132 -141 414 -274 -80 269 -280 156 96 -29 226 170 120 136 -236 312 33
3909 33 -225 256 -88 -110 131 -194 54 19 -148 259 -94 -293 89 -148 -42 145 -116 257 -4 -78 318
3930 318 -139 -34 28 -141 103 -17 -293 172 -132 -167 211 -185 30 -41 -197 166 -91 -84 154 -324 -18 259
3952 259 -237 -41 52 -371 162 -80 -20 224 -275 125 69 -24 208 -4 24 291 -400 113 154 -185 206 -132
3974 -132 -124 241 -204 72 159 -256 92 -64 5 81 -245 19 237 -111 144 159 -164 208 -169 48 197 -212
3996 -212 65 123 -76 107 -111 -169 155 -47 -47 128 -326 -177 -323 -308 207 -360 -30 81 -380 276 18 -210
4018 -210 166 -269 21 326 -152 158 43 -127 140 -76 -98 268 -303 111 207 -121 385 -5 -25 63 -91
4039 -91 -17 199 -381 202 -138 -202 243 -125 -47 13 -68 128 88 -184 186 -224 42 186 -171 152 106 -159 267
4062 267 76 -135 121 -31 219 315 -196 103 33 -201 196 -102 -84 231 -359 115 287 -219 197 -80 -40
4083 -40 94 -330 -49 118 -214 120 34 -42 268 -243 68 129 -174 162 97 -114 218 -47 97 208 -134 -8
4105 -8 -3 -24 165 -162 -82 101 -240 42 51 -118 134 54 -23 290 -24 85 170 -184 190 -70 6 420 -97 -64
4129 -64 122 -163 219 123 -6 199 -167 -135 300 -99 99 248 -199 53 -53 -151 277 -140 -131 162 -320 37
4151 37 -13 -96 137 -109 -52 117 -163 179 -42 -205 299 -44 -109 46 -188 91 -100 -338 42 22 -14 350
4173 350 -219 60 106 -188 146 53 -280 135 -253 55 115 -164 76 -47 -147 272 -54 2 149 -167 171
4194 171 23 -231 31 96 -16 108 -353 -34 84 10 194 -130 -140 106 -117 -54 93 -273 105 -19 -128
4215 -128 147 -205 -5 209 -143 122 84 -111 169 -142 -97 169 -190 -7 132 -227 31 -156 -216 98 -174
4236 -174 -5 129 -212 -60 -50 -283 155 -193 -181 60 -202 -2 34 -315 146 17 -105 298 -245 12 9 -254
4258 -254 50 -53 -364 80 -46 -255 77 -252 116 -50 -358 219 -196 -97 73 -98 96 126 -225 145 7
4279 7 -2 144 -180 61 137 -143 89 -19 -270 210 -259 -17 15 -204 201 91 -134 386 -112 -161 98 -263
4301 -263 169 133 -136 219 105 71 107 -48 -19 73 -94 -53 107 -302 155 -281 -19 376 -185 102 30 -193
4323 -193 -3 -115 -12 129 -131 216 56 -32 55 -89 -19 148 -194 80 170 -140 462 192 -57 216 -162
4344 -162 107 67 -98 10 37 -80 115 -65 -44 88 -260 -84 188 -221 -36 34 -59 153 -301 8 197 -222
4366 -222 322 20 -214 208 -191 -89 133 -161 132 77 -116 297 -112 24 179 -83 -83 172 -50 151 -179
4387 -179 -48 54 -172 -91 27 -111 222 23 -80 2 -234 -53 101 -191 203 -85 -99 294 -121 72 154
4408 154 -295 192 144 -51 31 -83 -160 241 -35 55 74 -210 158 13 5 228 -269 -188 187 -271 228 37 -180
4431 -180 58 -87 -86 171 -189 159 60 -156 260 4 -98 111 -88 164 8 -178 100 -104 -99 68 -92 -34
4453 -34 252 -240 62 -12 -91 128 -195 -3 187 -41 119 57 -170 334 10 -209 16 -277 -96 169 -253
4474 -253 70 3 -177 204 -310 116 11 -61 15 198 -180 -30 -82 -80 101 -112 217 89 -257 15 -87 -34
4496 -34 322 -80 18 -23 37 195 101 0 61 -57 79 55 -210 70 63 -168 141 -196 102 45 -122 1 -58 -22
4520 -22 13 -172 -259 76 -198 201 172 -137 52 -32 -21 85 -37 26 206 -41 286 108 -40 10 -126 15 159
4543 159 -137 14 122 -188 260 -79 -109 185 -49 47 40 -173 174 69 -80 167 -198 -6 107 -353 372
4564 372 224 -20 23 -98 45 182 -156 81 -37 -121 199 -141 -49 102 -266 97 94 -107 181 136 -264 -22
4586 -22 -67 72 138 -140 192 123 8 232 -31 -16 114 -166 58 9 -266 130 -87 21 150 -229 2 79
4608 79 -169 24 -118 43 124 -177 112 24 -71 56 -3 -167 258 -69 162 206 -176 54 31 -127 83 9 -105
4631 -105 195 -36 93 39 -111 116 12 65 172 -324 -81 107 -227 -10 -88 -89 20 -89 133 182 -15 126
4653 126 -59 -95 227 62 -42 167 135 91 39 -203 -4 35 -137 237 -178 128 175 -99 78 -107 -218 254
4675 254 -123 -97 218 -74 29 -26 -82 174 -185 -49 234 -105 197 -162 -144 -35 -12 -39 75 -266 96 33
4697 33 -194 169 100 -131 130 -113 61 89 -274 20 -69 46 161 -6 -90 62 -152 92 104 -17 113 -204
4719 -204 176 74 -199 27 45 -107 10 -37 -236 229 -271 -64 252 -260 47 -122 -85 181 -20 17 -91
4740 -91 -169 64 -27 -5 87 -84 39 97 -142 -130 102 -149 186 -81 147 55 -48 -143 97 -169 -76 -33 -136 246
4764 246 -74 -35 -67 -82 53 -11 -113 0 -127 -124 63 -25 -29 145 -151 265 -39 -141 239 -109 59 185 -222
4787 -222 46 150 -72 203 -97 59 2 -207 149 -45 -52 266 88 22 101 -55 36 -10 -116 176 45 -232
4809 -232 142 -116 -15 191 -93 86 17 -2 174 -161 -226 313 -151 5 -7 -91 64 -128 13 241 -127 -191
4831 -191 -31 -221 114 64 -63 235 -365 -34 116 -12 193 13 31 249 -37 -36 85 -70 -32 172 -73 161
4853 161 -124 -33 83 -139 92 -46 -96 150 -150 -179 157 -114 -48 -4 -164 151 63 -164 100 -75 -15 19 -107
4876 -107 172 241 -43 49 -177 -45 101 -157 -24 -20 -234 126 -41 -130 155 57 -142 126 -220 -25 36 -135
4898 -135 170 -90 -128 238 -112 202 20 -178 197 -135 -103 100 -172 -3 47 -69 129 -271 -125 92 -153
4919 -153 102 138 -73 180 -37 -126 65 -110 -71 69 -129 63 116 -57 132 -21 -80 61 -48 155 -42 -264
4941 -264 187 -10 -43 28 -215 90 148 -151 212 3 -73 90 -148 44 78 -133 240 108 -78 146 18 -206
4963 -206 195 -281 -40 194 -23 173 -132 -167 229 -170 170 179 -48 93 54 -108 210 -173 78 216 -272
4984 -272 -16 -120 -74 119 -151 148 119 -177 -24 12 -174 46 47 -158 199 -38 -77 68 -235 -63 112 -132
5006 -132 160 -19 87 -25 -219 -19 125 -106 103 50 2 158 -226 -259 19 -81 -1 46 -90 120 -144 9
5028 9 1 -77 54 -71 23 65 -92 -31 154 -154 127 -10 -26 80 -80 -21 59 51 52 98 -215 274 -40 -226 224
5053 224 -41 45 0 -87 -29 -110 25 155 -224 18 154 -189 24 139 -37 86 -185 90 191 -115 159 127
5075 127 -179 137 -106 19 119 -19 4 50 -294 179 -65 -181 115 -36 148 46 -60 117 63 -56 -46
5096 -46 56 -33 -9 -116 140 131 -107 265 -95 151 245 -43 -50 36 -23 -59 138 -63 -12 22 -45 143 -45 195 83
5121 83 96 113 -105 -160 76 -128 78 52 -59 7 -12 -120 130 -18 -27 -99 80 268 -250 -95 158 37 -22 126
5145 126 -118 14 -119 -52 47 -34 -66 266 -58 33 152 -84 -9 56 -143 -80 -102 -142 0 -138 87 -8 -111 55
5169 55 -96 -152 42 -160 -115 89 -184 6 -60 -27 10 -77 96 17 -64 264 -140 -26 80 -60 197 106 -214
5192 -214 187 -36 40 147 -50 176 224 47 -16 2 -53 -34 -34 -124 25 -166 225 226 -168 49 -123 -13 183 -168
5216 -168 -198 197 -140 -99 101 -53 37 -184 -134 108 -150 46 -44 165 34 -127 -81 223 -99 98 128 -57
5238 -57 232 -38 -52 43 -96 175 82 -108 65 -111 118 90 -142 53 182 24 11 66 77 223 -135 18 103
5261 103 -162 126 -6 -155 229 -19 -69 138 18 -93 86 89 142 -71 -171 159 -20 33 -54 -72 173 134 -97
5284 -97 100 -295 132 42 -138 72 -113 8 76 -2 -28 63 -201 -58 152 -141 89 -80 -145 -45 -90 65 162
5307 162 -197 105 -20 -198 250 -106 92 43 75 -94 120 -15 25 62 -96 183 -14 94 109 -154 53 -225
5329 -225 -90 36 -52 119 -9 -36 -31 83 -38 146 -11 -47 72 70 32 164 -130 -22 -220 38 22 -133 11
5352 11 169 -8 196 -31 -56 127 -71 -71 129 59 113 -6 6 114 -16 16 167 -301 -67 -39 -273 110 -153
5375 -153 -92 144 -70 101 163 -174 139 -217 145 82 -109 43 21 109 -28 104 -114 121 54 -84 89 1
5397 1 -16 173 -114 186 -203 -81 138 -146 -14 183 -155 99 -136 -97 -18 -131 96 153 -75 174 -165 -84
5419 -84 90 -71 -16 26 -122 55 72 -35 -3 -95 57 220 -72 -19 31 -110 138 28 -77 261 -96 84 180
5442 180 -162 16 31 -84 140 -176 1 -78 -213 91 48 -145 249 8 -84 144 -142 261 -114 -132 35 -80
5464 -80 -262 107 -132 -54 46 -164 60 -159 101 157 66 -130 76 -147 -87 145 7 168 -177 -138 -89 -180 -24
5487 -24 57 -96 81 110 -26 110 -188 4 31 -15 30 -88 -65 99 9 -47 187 -66 141 55 -60 90 -171
5510 -171 157 169 9 57 56 -92 57 -58 -88 -15 -183 -8 -28 -183 32 -81 92 207 12 61 -74 -7 -53
5533 -53 150 -148 137 58 -72 82 -357 -7 -4 -196 193 -14 -60 -20 -211 108 -57 -101 123 -78 -314 -84
5555 -84 -179 -187 55 -204 141 126 -142 295 -32 2 -6 -143 -19 78 -177 90 -98 -29 169 14 66 -62 -126 202
5579 202 21 -223 44 -42 -98 150 166 140 32 11 130 -8 -24 164 -172 154 -45 -61 235 55 -50 172
5601 172 -220 14 122 -174 7 -11 58 -13 -69 -7 82 -138 32 -61 -84 -110 -126 -44 79 -107 -42 -95 -251 -53
5625 -53 -209 -46 206 54 100 138 -231 164 -50 99 34 -104 -6 -18 -106 120 140 -249 91 -37 -125 -80 -118 81
5649 81 49 26 31 -155 100 211 -46 -2 160 62 53 139 -105 191 -66 -56 127 -145 101 -60 21 84 -52 -107 48
5674 48 -179 -35 -8 -76 72 -123 -113 25 -206 2 52 -61 23 -60 -28 230 -38 82 111 -190 140 -84 -119
5697 -119 229 -98 -55 24 -325 93 124 21 100 106 82 73 -28 48 -57 -58 -56 -120 -107 49 -164 -25 89 64 -169 45
5723 45 33 -8 -103 -152 74 -38 91 113 8 8 -146 -13 95 -57 134 9 -114 176 -21 -204 96 -166 44
5746 44 172 -85 91 -14 -53 107 -5 -52 167 -57 104 142 -207 45 -55 102 258 -146 -56 59 -97 90
5768 90 92 -60 109 -47 160 -34 -49 91 52 -67 58 36 -58 -67 -202 153 -57 -85 -126 -86 96 204 4 -124
5792 -124 175 -164 159 44 -117 118 -65 31 57 -65 -32 -31 -148 -23 -175 -141 38 -101 163 74 -234 82
5814 82 31 -33 139 6 -98 113 -55 33 -119 45 221 -75 -10 -44 -116 -35 -175 -98 74 -13 8 158 -60 81
5838 81 -166 -18 120 -70 -57 110 -112 80 94 -115 169 0 2 29 -28 -60 71 -105 -13 25 -46 115 -5 168
5862 168 204 71 -78 -51 -63 -67 -10 -88 67 -162 37 -6 -19 40 17 39 150 16 70 78 -21 54 105 41 12 -14 -32
5889 -32 110 -21 -22 -13 -71 186 -140 -18 212 -243 133 17 -66 38 -267 -233 215 -19 -33 -57 -123 51 12 -53
5913 -53 195 37 -106 46 -165 43 130 -87 219 107 -32 -22 -213 -13 -12 -24 -3 -8 -1 -9 -103 -54 66 -36 136
5938 136 -59 -146 112 -48 23 40 -9 57 -102 -221 155 10 98 208 4 123 131 -11 66 -25 -21 177 18 20 64
5963 64 -104 -45 109 -38 59 -157 -72 -3 96 134 43 -122 181 -31 21 43 102 47 -22 46 128 -148 -120 149 48
5988 48 91 12 56 6 75 -61 299 -115 66 -16 -283 102 -38 -50 73 -62 194 121 -60 72 155 -99 -50 111
6012 111 -184 42 -5 -131 -74 -13 -56 -21 51 132 -28 -84 -57 -214 15 -25 -95 93 -131 -27 -62 -283 115 41
6036 41 -69 6 13 7 192 -57 135 54 -131 141 -96 140 188 -60 174 -37 37 111 173 93 -20 -79 -177 -12 -81
6061 -81 81 -20 -89 99 -96 51 80 -66 -27 67 29 187 174 -78 236 -173 29 -11 -25 80 32 105 153 -100
6085 -100 59 -11 -100 151 -74 -4 240 -31 -71 74 -199 92 46 -19 33 -43 18 19 -114 -124 27 -246 13 213
6109 213 -79 168 -32 -42 -102 -105 45 26 21 87 27 -87 -12 -133 -25 81 58 51 131 -51 167 -108 128 118 -227
6134 -227 1 5 -42 60 -68 -49 124 -36 54 -80 109 -60 -7 -6 119 -111 28 2 76 125 -118 8 -6 50
6158 50 53 115 -76 20 2 38 85 68 8 184 -94 81 25 -47 2 -129 84 -63 -106 13 67 -13 124 14 25 3
6184 3 -134 18 120 -100 -8 -56 -111 146 -104 -96 -102 -41 161 -38 -9 187 -52 -58 -39 99 -2 92 -182 -17 0
6209 0 42 81 -252 -61 19 -104 -8 -6 -220 5 -15 94 0 -66 -25 -46 -117 80 -3 -106 -118 -60 -84 46 -64 44
6235 44 -189 -45 15 -34 -69 -8 -60 86 49 -19 -33 -112 15 32 -77 -148 80 37 -122 -221 37 170 -27 52 137
6260 137 -76 175 17 -60 84 156 -101 -21 -123 11 -46 -133 104 -99 67 62 -66 77 72 -104 -22 -108 -38 208
6284 208 -65 31 189 -156 271 -64 -2 182 -3 -59 153 102 21 64 143 84 -204 103 -5 -197 21 -6 -20
6307 -20 75 -18 -89 -44 -217 197 51 1 178 26 -82 171 -21 85 -69 -181 135 104 -72 73 73 -49 134
6330 134 -17 -122 99 42 -52 -100 29 71 -166 132 56 15 25 52 -123 -46 14 16 -102 -99 215 -68 -77 210 64
6355 64 -4 221 10 155 -55 -2 107 -175 -14 79 -203 19 50 -86 -40 -205 2 6 -167 8 59 -17 115
6378 115 -13 -19 217 -95 12 115 -3 -38 114 -175 137 54 52 -97 -129 -34 -74 -98 59 23 -85 -2 -178 -31
6402 -31 -52 -125 140 10 -87 30 -94 7 42 -67 170 9 74 22 -174 -6 90 113 131 27 56 184 77 53
6426 53 54 8 -6 -86 -73 25 83 58 24 -118 15 22 -94 98 -52 66 185 2 86 76 -70 -88 174 15 184
6451 184 25 61 149 -62 13 -178 -79 69 46 -160 165 55 -14 -69 -42 -20 -59 -72 26 -29 -3 30 48 16 -93 2
6477 2 115 -147 146 -52 29 67 110 -213 -49 -19 -142 35 -58 -142 34 -202 41 -67 -190 -34 -183 84 30
6500 30 1 128 -67 -85 193 109 -11 113 37 16 102 -19 152 95 -204 -23 135 -104 -157 -98 -2 14 -12 89
6524 89 -144 47 129 92 182 34 -189 -26 35 18 20 -167 24 -6 -16 58 -36 -182 198 69 91 8 -3 160 60
6549 60 -41 54 -138 6 38 -197 129 -44 -42 3 -221 -78 -100 -22 59 151 -115 127 13 65 99 -59 168 39
6573 39 111 307 -44 -89 127 109 107 211 -70 -16 178 65 153 -111 12 0 -51 101 56 -30 97 -54 -194 17
6597 17 -137 -10 -123 -81 127 78 -39 167 58 127 38 -48 188 79 -46 59 -160 -4 -127 -43 10 -7 -179
6620 -179 99 51 140 47 -107 -20 24 158 55 89 -54 193 69 -98 38 21 29 5 11 144 -79 22 189 -96
6644 -96 23 -18 -106 111 -38 65 40 -87 65 162 -132 59 -104 -77 -85 -111 -58 135 -218 -34 -112 40 36 -80
6668 -80 46 -102 -252 53 -102 -125 17 0 -128 166 -114 48 64 -168 25 68 -48 213 -96 30 41 -126
6690 -126 -51 -241 51 80 -188 -81 76 -47 -12 105 -121 167 43 -91 99 -124 29 -69 -60 70 -91 -240
6712 -240 -121 -161 -16 56 -193 17 4 -74 162 -196 11 126 -100 6 -51 -75 64 -1 -9 77 -8 -84 36 -91
6736 -91 178 45 -90 15 -51 -49 125 -200 141 -102 -97 85 -39 -1 -15 -8 53 74 -104 232 -151 30 -125 -28
6760 -28 28 90 -23 26 -28 -74 -86 -92 132 175 -35 -56 34 -256 -125 -126 40 -34 -111 44 -97 149 40 -83 81
6785 81 -38 3 64 84 -112 157 54 120 33 178 69 59 38 98 36 145 24 -62 101 -49 -15 -18 89 18 148
6810 148 -130 -48 157 -99 -12 8 -172 80 -237 13 53 -89 -88 9 -26 128 41 -45 195 -160 -65 9 -34 32 41
6835 41 56 91 -15 -192 66 -131 18 -30 -115 43 45 -32 27 -163 -46 50 29 -123 -45 -64 55 -76 -140 57 36
6860 36 104 60 -112 117 15 -48 97 -95 6 -4 48 -7 34 -22 51 -62 -29 54 76 19 -63 -29 -35 32 -44 16 -93
6887 -93 42 55 -60 118 -246 -110 232 0 26 51 -117 163 65 -33 -9 7 -29 31 -157 -78 23 68 -79 -51
6911 -51 -138 140 -85 7 -86 -109 5 -24 69 166 -65 61 -29 65 42 25 -127 28 -135 10 -66 -48 103 -131 -164
6936 -164 161 6 -5 32 -46 26 16 -156 13 62 36 9 -99 -32 -126 -154 153 -30 -106 75 44 104 105 -1 -8 4
6962 4 -18 109 52 -13 82 3 -10 19 -76 110 -95 16 71 -100 151 35 -49 102 14 -65 80 28 -22 161 8
6987 8 82 164 98 136 101 60 98 -126 236 121 59 -119 31 47 111 -67 209 -124 -114 44 -101 111 -141 52
7011 52 -103 4 -103 279 13 -52 194 -69 -63 -13 -31 48 97 -73 26 95 35 -45 6 -109 58 13 127 -48 12
7036 12 16 -68 58 21 -94 38 -40 1 107 -94 -95 12 -123 140 -63 -79 106 -51 123 -83 -27 52 52 -146 36
7061 36 4 -208 95 -85 -98 65 82 49 1 -112 45 -223 -132 155 -203 162 -109 -55 88 -81 -9 100 81
7084 81 0 172 -33 12 106 -4 175 23 66 74 -105 -35 16 -87 8 -25 30 225 -37 40 -71 131 70 -40 -63
7109 -63 112 99 -6 -63 -62 184 83 -39 -49 -23 -35 62 151 67 34 -104 130 -57 -89 74 -90 59 39 -137 -45
7134 -45 -36 -41 93 -57 42 -9 -8 100 -47 66 -47 64 -31 -96 -49 19 -84 15 -52 -125 -89 36 -135 24 3 -86
7160 -86 80 -93 88 24 128 107 49 -42 223 27 98 86 132 -212 43 -147 162 29 -210 144 -33 101 -75
7183 -75 -45 13 -58 -68 60 39 75 -63 -152 39 1 -82 169 -96 179 193 -65 -10 -14 -154 23 -33 72 -22 10 -61
7209 -61 -50 -49 -11 128 -70 11 25 18 90 150 -49 -26 -47 -9 -67 4 29 -66 -34 31 -96 -42 103 -48 76 28 171
7236 171 -10 -48 250 -8 107 100 -77 -109 74 -176 44 96 5 64 33 -105 196 -130 -66 41 -76 166 -75
7259 -75 -40 30 26 -40 23 -33 -45 -19 90 26 -138 32 83 -79 140 179 -222 152 71 -37 23 44 -6 -77 -113 180
7285 180 139 -50 110 -49 -31 -81 62 62 115 -108 -16 -78 -46 48 -77 -96 -135 -231 75 -24 -75 68 -70 135 65
7310 65 -34 -47 -78 -142 36 -81 -1 58 37 96 -38 -159 92 43 -47 17 -93 107 125 -92 5 68 -151 83 -29
7335 -29 -44 100 55 19 -203 16 167 0 -162 35 -80 -92 -88 -38 37 -102 -20 95 -134 89 -101 43 11 28
7359 28 -36 30 53 76 51 -35 62 -23 -86 161 -69 110 22 -153 144 -5 32 -50 -13 35 -2 -61 51 -73 -42 18
7385 18 32 -75 65 -204 44 -135 -53 115 -57 -122 48 67 -6 -44 -27 44 -33 -94 85 29 -135 237 -5 57
7409 57 -33 -66 -21 -20 -9 -32 67 -130 165 -181 -49 -105 5 -13 98 208 -32 61 118 -15 -157 20 -141 26
7433 26 51 -154 30 -71 -83 -38 11 -58 100 -5 99 -11 -85 66 -147 108 118 -203 4 109 -30 17 139
7456 139 -29 116 -112 63 27 -110 164 -41 -87 76 53 -117 48 -93 78 -11 -9 73 65 -70 129 -106 106
7479 106 -28 0 135 -116 -42 26 30 65 166 -52 120 109 -69 37 -110 -197 -80 -144 13 1 -48 6 207 -178
7503 -178 -11 -38 133 72 27 -7 -36 -123 38 -136 -92 -87 -19 109 -14 -116 -5 -36 49 18 -76 -123 63 -36 162
7528 162 70 36 30 -98 -178 162 -82 87 233 -57 74 -34 64 73 -64 2 -18 -55 165 92 -66 -98 27 104 145
7553 145 -51 111 -61 16 -55 -135 -116 33 26 17 6 -173 64 -79 -91 62 160 63 -127 -78 62 34 66 96 2 132
7579 132 -153 -64 77 -159 -44 11 -25 -91 -122 -17 29 -188 29 65 -21 -3 77 -60 38 -118 -206 130 -53 11
7603 11 -64 30 74 -119 -40 57 -9 52 34 -41 -11 -14 -140 22 0 -8 89 -98 -39 -79 12 -66 87 82 71 -15 -57 9 -101
7632 -101 69 -2 -65 -30 -70 130 131 79 -61 -32 -79 46 55 14 42 -66 194 59 -35 -91 -190 -84 78 -157 15
7657 15 -48 8 113 65 -113 230 -83 4 97 -233 130 -38 36 120 -26 -122 65 -58 183 149 27 -22 -101 47
7681 47 14 -127 -94 42 -96 -13 41 -179 88 -79 25 4 -153 -35 86 9 8 -126 128 84 -27 23 26 -123
7705 -123 -176 -39 -105 17 -192 96 5 -55 29 105 -61 -58 -2 9 44 -166 -61 -40 81 -16 47 114 166 14 50 -81
7731 -81 46 -20 -135 -115 98 34 35 138 95 -17 79 -39 -17 -85 -62 -32 -89 -54 -217 -5 21 -20 -61 -3 19 -104
7757 -104 79 -63 84 89 -81 38 -49 127 -99 -89 125 -81 -169 -37 -194 -36 37 16 0 118 -53 271 -15
7780 -15 -145 67 -36 139 81 -179 -30 -68 -20 220 -12 -38 122 -88 22 32 0 43 128 237 155 -6 56 139
7804 139 -28 -52 80 52 90 7 -91 -29 -49 114 37 -68 188 -50 11 -67 48 64 14 -27 67 -99 -39 7 -85 10
7830 10 -17 30 178 193 -12 50 -81 -91 -126 -8 140 -66 -158 -8 -141 10 7 -50 -37 1 54 64 15 162 186 -125
7856 -125 -22 184 -181 221 21 -113 89 -78 58 99 -143 24 -20 20 193 48 217 115 -22 121 -117
7877 -117 46 54 -111 47 63 -122 46 91 -31 -75 10 34 61 -60 -114 77 68 96 37 -49 172 -66 -89 149 -78
7902 -78 46 40 4 99 -5 -17 116 -69 9 -76 -229 99 -45 -63 198 -23 -128 61 14 85 61 141 107 -72 61
7927 61 139 52 93 -21 30 -44 38 15 -23 -94 133 39 102 48 16 45 15 -3 41 -76 -161 6 127 -192 84 19 -84
7954 -84 -30 -111 62 182 132 45 -172 51 167 34 82 87 -30 -118 4 -23 110 -22 149 -102 48 94 101 80 -78
7979 -78 -14 5 29 34 73 219 54 99 -197 -50 168 -124 120 41 13 14 56 -161 178 -127 100 -39 -165 -3
8003 -3 41 -68 46 -129 -11 58 42 -40 -35 -115 63 90 -116 16 -118 -31 -21 -50 17 122 -49 -41 -92 9 16 -101
8029 -101 105 23 -72 10 -55 -14 -5 51 37 210 -129 15 40 51 15 -202 66 80 -51 83 2 2 0 -245 -4 1 -79
8056 -79 22 48 -49 68 -36 135 94 26 72 83 -105 13 15 -43 216 70 -63 -56 156 69 -48 -104 23 -59 63
8081 63 -42 -150 -10 -23 -83 116 31 129 2 -261 204 108 -115 -138 -157 31 -39 -16 4 -40 -94 27 -66 44 19
8106 19 -86 75 103 33 114 -48 -50 154 218 55 48 -82 125 -44 -84 63 -22 52 132 -77 124 7 -89 25 -77
8131 -77 26 -11 -137 49 33 -15 45 11 18 21 -52 -38 13 -22 128 -187 93 112 -19 45 146 -45 34 40 -4 180 100
8158 100 68 96 -50 113 -11 -193 36 -35 41 -92 19 -72 88 66 193 36 -48 114 -43 16 30 35 -64 -44
8182 -44 -49 240 41 81 -13 -87 50 -72 -64
8191f4
##END NTUPLES=NMR FID
##END=
