##TITLE=1H_10-2021
 CDcl3,8 sc, 
 12.03.2021
##JCAMPDX= 6.0         $$ Bruker NMR JCAMP-DX V2.0
##DATA TYPE= NMR FID
##DATA CLASS= NTUPLES
##ORIGIN= UXNMR, Bruker Analytische Messtechnik GmbH
##OWNER= root
$$ XWIN-NMR		Version 3.5
$$ Fri Mar 12 10:40:47 2021 Russian Standard Time (UT+4h)  she@DPX200
##.OBSERVE FREQUENCY= 200.131506
##.OBSERVE NUCLEUS= ^1H
##.DELAY= (6, 6)
##.ACQUISITION MODE= SIMULTANEOUS
##.ACQUISITION SCHEME= undefined
##.AVERAGES= 8
##.DIGITISER RES= 18
##SPECTROMETER/DATA SYSTEM= spect
##.PULSE SEQUENCE= zg30
##.SOLVENT NAME= D2O
##.SHIFT REFERENCE= (INTERNAL, D2O, 0, 15.7039)
##AUDIT TRAIL= $$ (NUMBER, WHEN, WHO, WHERE, WHAT)
$$ ##TITLE= Audit trail, XWIN-NMR		Version 3.5
$$ ##JCAMPDX= 5.01
$$ ##ORIGIN= Bruker BioSpin GmbH
$$ ##OWNER= she
$$ F:/spectra/data/she/nmr/H-F/1/audita.txt
$$ ##AUDIT TRAIL=  $$ (NUMBER, WHEN, WHO, WHERE, WHAT)
(   1,<2021-03-12 10:39:53.14 +0400>,<she>,<DPX200>,
      <created by zg, POWCHK disabled, PULCHK disabled
       configuration hash MD5:
       00 E9 B6 7A A2 85 ED C7 34 08 36 98 17 FE 4E 26
       data hash MD5: 16K
       41 C3 2D 85 B6 D6 34 22 5A A4 E3 40 30 8B A3 45>)
$$ ##END=
$$ 
$$ hash MD5
$$ EE B2 C9 30 D3 8F 8D ED D0 6E 9B 5F 4B F6 FA A9
##$RELAX= 
##$RELAX= 
##$RELAX= 
##$RELAX= 
##$RELAX= 
##$RELAX= 
$$ Bruker specific parameters
$$ --------------------------
##$DU= <F:/spectra>
##$EXPNO= 1
##$NAME= <H-F>
##$PROCNO= 1
##$TYPE= <nmr>
##$USER= <she>
##$AMP= (0..31)
100 100 100 100 100 100 100 100 100 100 100 100 100 100 100 100 100 100 
100 100 100 100 100 100 100 100 100 100 100 100 100 100 
##$AQSEQ= 0
##$AQ_mod= 1
##$AUNM= <au_zg>
##$AUTOPOS= <>
##$BF1= 200.13
##$BF2= 200.13
##$BF3= 200.13
##$BF4= 200.13
##$BF5= 200.13
##$BF6= 200.13
##$BF7= 200.13
##$BF8= 200.13
##$BYTORDA= 1
##$CFDGTYP= 0
##$CFRGTYP= 5
##$CHEMSTR= <none>
##$CNST= (0..31)
1 1 145 1 1 1 1 1 1 1 1 1 1 1 1 1 1 1 1 1 1 1 1 1 1 1 1 1 1 1 1 1 
##$CPDPRG= <>
##$CPDPRG1= <>
##$CPDPRG2= <>
##$CPDPRG3= <>
##$CPDPRG4= <mlev>
##$CPDPRG5= <mlev>
##$CPDPRG6= <mlev>
##$CPDPRG7= <mlev>
##$CPDPRG8= <mlev>
##$CPDPRGB= <>
##$CPDPRGT= <>
##$D= (0..31)
0 1.2 0 0 0 0 0 0 0 0.06 0 0.03 0 0 0 0 0.0002 0 0 0 0 0 0 0 0 0 0 0 0 
0 0 0 
##$DATE= 1615531192
##$DBL= (0..7)
120 120 120 120 120 120 120 120 
##$DBP= (0..7)
150 150 150 150 150 150 150 150 
##$DBP07= 0
##$DBPNAM0= <>
##$DBPNAM1= <>
##$DBPNAM2= <>
##$DBPNAM3= <>
##$DBPNAM4= <>
##$DBPNAM5= <>
##$DBPNAM6= <>
##$DBPNAM7= <>
##$DBPOAL= (0..7)
0.5 0.5 0.5 0.5 0.5 0.5 0.5 0.5 
##$DBPOFFS= (0..7)
0 0 0 0 0 0 0 0 
##$DE= 6
##$DECBNUC= <off>
##$DECIM= 32
##$DECNUC= <off>
##$DECSTAT= 4
##$DIGMOD= 1
##$DIGTYP= 9
##$DL= (0..7)
0 120 120 120 120 120 120 120 
##$DP= (0..7)
150 150 150 150 150 150 150 150 
##$DP07= 0
##$DPNAME0= <>
##$DPNAME1= <>
##$DPNAME2= <>
##$DPNAME3= <>
##$DPNAME4= <>
##$DPNAME5= <>
##$DPNAME6= <>
##$DPNAME7= <>
##$DPOAL= (0..7)
0.5 0.5 0.5 0.5 0.5 0.5 0.5 0.5 
##$DPOFFS= (0..7)
0 0 0 0 0 0 0 0 
##$DQDMODE= 0
##$DR= 18
##$DS= 0
##$DSLIST= <SSSSSSSSSSSSSSS>
$$ [...]
##$SUBNAM2= <"">
##$SUBNAM3= <"">
##$SUBNAM4= <"">
##$SUBNAM5= <"">
##$SUBNAM6= <"">
##$SUBNAM7= <"">
##$SUBNAM8= <"">
##$SUBNAM9= <"">
##$SW= 16.9725357007746
##$SWIBOX= (0..15)
0 0 2 0 0 0 0 0 0 0 0 0 0 0 0 0 
##$SW_h= 3396.73913043478
##$TD= 16384
##$TD0= 1
##$TE= 0
##$TE2= 300
##$TE3= 300
##$TEG= 300
##$TL= (0..7)
0 120 120 120 120 120 120 120 
##$TP= (0..7)
150 150 150 150 150 150 150 150 
##$TP07= 0
##$TPNAME0= <>
##$TPNAME1= <>
##$TPNAME2= <>
##$TPNAME3= <>
##$TPNAME4= <>
##$TPNAME5= <>
##$TPNAME6= <>
##$TPNAME7= <>
##$TPOAL= (0..7)
0.5 0.5 0.5 0.5 0.5 0.5 0.5 0.5 
##$TPOFFS= (0..7)
0 0 0 0 0 0 0 0 
##$TUNHIN= 0
##$TUNHOUT= 0
##$TUNXOUT= 0
##$USERA1= <user>
##$USERA2= <user>
##$USERA3= <user>
##$USERA4= <user>
##$USERA5= <user>
##$V9= 5
##$VALIST= <valist>
##$VCLIST= <CCCCCCCCCCCCCCC>
##$VD= 0
##$VDLIST= <DDDDDDDDDDDDDDD>
##$VPLIST= <PPPPPPPPPPPPPPP>
##$VTLIST= <TTTTTTTTTTTTTTT>
##$WBST= 1024
##$WBSW= 4
##$XGAIN= (0..3)
0 0 0 0 
##$XL= 0
##$YL= 0
##$YMAX_a= 804664
##$YMIN_a= -623327
##$ZGOPTNS= <>
##$ZL1= 120
##$ZL2= 120
##$ZL3= 120
##$ZL4= 120
##$ABSF1= 10
##$ABSF2= 0
##$ABSG= 5
##$ABSL= 3
##$ALPHA= 0
##$AQORDER= 0
##$ASSFAC= 0
##$ASSFACI= 0
##$ASSFACX= 0
##$ASSWID= 0
##$AUNMP= <proc_1d>
##$AZFE= 0.1
##$AZFW= 0.1
##$BCFW= 1
##$BC_mod= 2
##$BYTORDP= 1
##$COROFFS= 0
##$CY= 11.3945322036743
##$DATMOD= 1
##$DC= 2
##$DFILT= <>
##$DTYPP= 0
##$F1P= 15.9154993809931
##$F2P= -4.1035820241983
##$FCOR= 0.5
##$FTSIZE= 0
##$FT_mod= 4
##$GAMMA= 1
##$GB= 0.15
##$INTBC= 1
##$INTSCL= 1
##$ISEN= 128
##$LB= 0.24
##$LEV0= 0
##$LPBIN= 0
##$MAXI= 10000
##$MC2= 0
##$MEAN= 0
##$ME_mod= 0
##$MI= 1.114404
##$NCOEF= 0
##$NC_proc= 0
##$NLEV= 6
##$NOISF1= 3.799351
##$NOISF2= 2.8
##$NSP= 1
##$NTH_PI= 0
##$NZP= 0
##$OFFSET= 15.70392
##$PC= 1
##$PHC0= -11117.68
##$PHC1= 11.00094
##$PH_mod= 1
##$PKNL= yes
##$PPARMOD= 0
##$PSCAL= 0
##$PSIGN= 0
##$REVERSE= no
##$SF= 200.130013532006
##$SI= 16384
##$SIGF1= 3
##$SIGF2= 2
##$SINO= 400
##$SIOLD= 16384
##$SREGLST= <1H.CDCl3>
##$SSB= 0
##$STSI= 0
##$STSR= 0
##$SW_p= 3612.71676300578
##$SYMM= 0
##$S_DEV= 0
##$TDeff= 0
##$TDoff= 0
##$TI= <>
##$TILT= no
##$TM1= 0
##$TM2= 0
##$TOPLEV= 0
##$USERP1= <user>
##$USERP2= <user>
##$USERP3= <user>
##$USERP4= <user>
##$USERP5= <user>
##$WDW= 1
##$XDIM= 8192
##$YMAX_p= 0
##$YMIN_p= 0
$$ End of Bruker specific parameters
$$ ---------------------------------
##NTUPLES= NMR FID
##VAR_NAME=  TIME,          FID/REAL,        FID/IMAG
##SYMBOL=    X,             R,               I
##VAR_TYPE=  INDEPENDENT,   DEPENDENT,       DEPENDENT
##VAR_FORM=  AFFN,          ASDF,            ASDF
##VAR_DIM=   8192,          8192,            8192
##UNITS=     SECONDS,       ARBITRARY UNITS, ARBITRARY UNITS
##FACTOR=    0.0002944,     1,               1
##FIRST=     0,             0,               0
##LAST=      2.4114304,     0,               0
##MIN=       0,             -623327,         0
##MAX=       2.4114304,     804664,          0
$$ Real data points
##PAGE= N=1
##DATA TABLE= (X++(R..R)), XYDATA
$$ [...]
2039a628K535j352K671j457k043J759r24L097j220j149j397J299J840Q93k160
$$ -1628 907 -445 2226 769 -1274 485 -439 2658 1438 289 -1108 191 2031 2924 764
2054G64k177J742P39L435m271j242K28J199L768l691q45j221J258K844q55k054
$$ 764 -1413 329 1068 4503 232 -1010 -782 417 4185 494 -351 -1572 -314 2530 1675 -379
2070c79j475J525J785J774l766j27m56K446K226l395O84k399L322M32p03o43j792
$$ -379 -1854 -329 1456 3230 -536 -663 -1119 1327 3553 158 842 -1557 1765 2197 1494 851 -941
2087i41J540O00P14j938n16j117K097j34p47j48k437L209j850J331j59j864J396
$$ -941 599 1199 1913 -25 -541 -1658 439 305 -442 -590 -3027 182 -1668 -337 -496 -2360 -964
2104i64r33K238K49j077r50J290O39J573n69k045J188n58L510j408j380l71j142
$$ -964 -1897 341 590 -487 -1437 -147 492 2065 1496 -549 639 81 3591 2183 803 432 -710
2121g10L696o74r63k518p6K321J393j767k683j84J680K700k227q98k220J878L030
$$ -710 2986 2312 1349 -1169 -1245 1076 2469 702 -1981 -2165 -485 2215 -12 -910 -3130 -1252 1778
2138A778j865J86l356J917K425j50q39k224J98J925J738j994j16j958K571Q98
$$ 1778 -87 99 -3257 -1340 1085 935 96 -2128 -1930 -5 1733 -261 -377 -2335 236 1134
2154A134q73J69k906K763l05J031n63j910J035K90J179k88m90j223J389p9N30
$$ 1134 261 430 -2476 287 -18 1013 450 -1460 -425 -135 1044 756 266 -957 432 353 883
2171H83O6j703J206j590K714r56m07N5j758K630n64K44j295o12N95J508l93j096
$$ 883 949 -754 452 -1138 1576 620 213 268 -1490 1140 576 820 -475 -1087 -492 1016 623 -473
2189d73p18q63L227j435N15k011p32K942j70O69k822R2J449J641k63j469j212
$$ -473 -1191 -2054 1173 -262 253 -1758 -2490 452 282 951 -1871 -1779 -330 1311 1048 -421 -1633
2206a633R70K726n68q1k640J306J763k07L60l214J671K21J595p05k209L85N26
$$ -1633 -663 2063 1495 1414 -1226 80 1843 1636 1996 -1218 453 674 2269 1564 -645 -260 266
2223B66J193q03o02j627J662m94Q48l81j872J957j468J767r09o66P41p73J375
$$ 266 1459 656 54 -1573 89 -405 443 62 -1810 147 -1321 446 -463 -1129 -388 -1161 214
2240B14p94L94m95N32r95J127k12J9M35j358J484p14J221p40r04J322o03J933
$$ 214 -580 -186 -681 -149 -1144 -17 -229 -210 225 -1133 351 -363 858 118 -786 536 -67 1866
2258A866j608J2l08Q46O24j25j182n58J701n78J608k343j46M86j55J910k792O0
$$ 1866 258 270 -38 808 1432 1307 125 -433 1268 690 2298 -45 -191 295 140 2050 -742 -682
2276f82j0P53Q15j413p32M10O77J56K92k093J109K61M53P21k090J626o69J484
$$ -682 -692 61 876 -537 -1269 -859 -182 -26 266 -1827 -718 -457 -4 717 -1373 253 -416 1068
2294A068o27q59N92k7Q68p33k0o38R99m81M86q92m63J341j480J816j949N97O16
$$ 1068 441 -418 174 147 1015 282 262 -376 623 142 628 -264 -727 614 -866 950 -999 -402 214
2313B14p58J069j367J010j09N75q48K78l17N74L35j053Q68j474J864p13l22k03
$$ 214 -544 525 -842 168 59 634 -214 64 -253 321 656 -397 471 -1003 861 148 -174 -377
2331c77n64J453m99k62q59N73L78K11m97l51J94P1J797j843N91n98O87J351j778
$$ -377 -941 512 13 -249 -1108 -535 -157 54 -443 -794 -600 -529 1268 -575 16 -582 105 1456 -322
2350c22J011j282J281J96m43k48m40O44n9N91j611Q41k63R73m26j234J434j077
$$ -322 689 -593 688 884 441 193 -247 397 338 929 -682 159 -104 869 443 -791 643 -434
2368d34J600j263j9M06l99Q60o30k94l46O97l87P57j334L95O20m73P61j890J252
$$ -434 1166 -97 -116 290 -109 751 121 -173 -519 178 -209 548 -786 -391 229 -244 517 -1373 -121
2387a21l57N58M93j616J114K3M06l93p2k46J137j61l36m8p53K227j644J021j067
$$ -121 -478 80 573 -1043 71 94 500 107 35 -211 926 765 429 381 -372 1855 211 1232 165
2406A65l90J403r89Q81j599K80O77m3J6p57k51P47P96j404R48j184J091N76r32
$$ 165 -225 1178 189 1070 -529 -249 428 385 401 -356 -607 140 936 -468 480 -704 387 963 31
2425C1O81j463J541j57L15l76n16M90M02K15p56K95o74J134o38p7J13j052J797
$$ 31 712 -751 790 633 948 572 56 546 948 1163 407 702 28 1162 524 447 560 -492 1305
2444A305j299P47j050R0O32n72M95p29N60k37M89p94L07j86R6Q20j670K059j467
$$ 1305 6 753 -297 -207 425 -147 348 -381 179 -58 431 -363 -56 -242 -146 674 -996 1063 -404
2463d04J400m88o04Q56l00J096j224J27l9P91j9k80p04l28J650r22O12j917L21
$$ -404 996 508 -96 760 460 1556 332 459 420 1211 1192 912 208 -120 1530 608 1220 -697 -376
2482c76J089n94P56k267N35M46Q55j52j054l00P60R51j96M1j360J524L36K97j2
$$ -376 713 119 875 -1392 -857 -411 444 292 -762 -1062 -302 649 453 494 -866 658 994 1291 1279
2501A279j823J505l75J433j112p31K43k7O73n96n21o00R25n39O30p47o49Q47q03
$$ 1279 -544 961 586 2019 907 176 419 392 1065 469 -52 -652 273 -266 364 -383 -1032 -185 -988
2520i88J690j266L01J49j60Q05m59Q34n67M0k54R18j00J39m95j004J718j091J012
$$ -988 702 -564 -263 -114 -274 531 72 906 339 379 125 1043 943 1082 587 -417 1301 210 1222
2539A222j351r13R96k31P58j502l10j55Q87O48n22j093K1J459K31R69k285L88
$$ 1222 -129 -1042 -46 -277 481 -1021 -1331 -1486 -599 49 -473 -1566 -1545 -86 145 1114 -1171 -783
2557g83N75J226Q66k267N25k71J739K17j164o85j43J233J50m26j802O80j30J594
$$ -783 -208 1018 1884 -383 142 -129 1610 1827 663 -22 -165 1068 1218 792 -1010 -330 -460 1134
2575A134n99j548M88o35K312r61o58j50k15J166J75j42p87j02j79J280n71R2l97
$$ 1134 535 -1013 -525 -1160 1152 191 -467 -617 -832 334 509 367 -420 -522 -701 579 8 100 -297
2594b97n46J661j224J102j174j30K62O8J160j046k14m89R08L49M41j261l97O82
$$ -297 -843 818 -406 696 -478 -608 -346 -278 882 -164 -378 -867 41 390 831 -430 -827 -145
2612a45K92J645k093k13l8N92J419j562o9p96Q23J030l33j298p64J056J020O97
$$ -145 147 1792 -301 -514 -552 40 1459 -103 -172 -968 -145 885 552 -746 -1510 -454 566 1263
2630A263j899R1n91J951M03j292m68j117K075J86j41r17n20Q05J052j21j287R9
$$ 1263 -636 -545 -1136 815 1218 -74 -542 -1659 416 602 461 -456 -976 -171 881 760 -527 -428
2648d28n45K034n54l16l54r98K066q68P31j220N9R06m23P01m66m58l23J155l01
$$ -428 -973 1061 507 191 -163 -1161 905 37 768 -452 -393 513 90 791 325 -133 -456 699 398
2667C98L59p40l92P45p05J257r85j5l75Q1J230p40O8j317O91N97N20p21p12L6
$$ 398 757 17 -375 370 -335 922 -63 -78 -453 -372 858 118 186 -1131 -440 157 677 -44 -756 -720
2687g20N13J421j481J33j294J092J408j214M07j740J199N20L27n49j039J16J372
$$ -720 -207 1214 -267 -134 -1428 -336 1072 -142 265 -1475 -276 244 571 22 -1017 -901 471
2704D71P40j124p8j142K050j70j06k93j287J679j90P72j129n52K66O34K20q37
$$ 471 1211 87 9 -1133 917 747 641 348 -939 740 550 1322 193 -359 -93 541 761 -76
2722g6k85p27J480p90M64n15l48J021p78Q83n97J36m8m09J053l70K09n73K48l4
$$ -76 -361 -1088 392 -398 66 -449 -797 224 -554 329 -268 -132 -180 -589 464 94 303 -270 -22 -56
2742e6P86n78J28j18p63J527r56P24j155K8Q89m78P69j465j3L79P09q9p07l23
$$ -56 730 152 280 162 -601 926 -30 694 -461 -433 456 -22 747 -718 -731 -352 357 268 -439 -762
2762g62L55Q90m13M14j750J272J60K5M64j756R31K10N11m31n84k25M09N61k09
$$ -762 -407 483 70 484 -1266 6 166 191 655 -1101 -170 40 551 120 -464 -689 -280 281 72
2781G2j17q57J154n08Q66m13r20J072n76J264j001j69K83j32O62o05j74l71Q38
$$ 72 -45 -902 252 -256 610 197 -723 349 -227 1037 36 -133 150 18 680 75 -99 -470 368
2800C68o18N61q68N06J86p81J091j066J072m10k16M55m97L61QJ43m64L23J1M41
$$ 368 -250 311 -557 -51 135 -646 445 -621 451 41 -175 280 -217 144 152 295 -169 154 165 606
2820F06m84j96M46n16R02j215L81k56L25P20j130L36m65L36n7N8m73J53K32O0
$$ 606 122 -74 372 -144 758 -457 -76 -332 -7 713 -417 -81 -546 -210 -267 -209 -682 -529 -297 -237
2840b37R76j646Q71n27J039j88p00Q43p69J031m34q3k97K20M47k64r1o09Q78q43
$$ -237 739 -907 -36 -563 476 288 -412 431 -338 693 259 176 -121 99 546 282 191 -418 460 -383
2860c83R51r63L6P85r42J120j160O31j98M2L05o29K90R2J72n19N38n19N33j06
$$ -383 568 -395 -359 426 -516 604 -556 75 -123 -81 224 -405 -115 -23 149 -370 168 -351 182 76
2880G6j85L93r94J453p75N63l60l36R11l47M08r70K73k8L62l65l8k32k22J025
$$ 76 -109 284 -710 743 -32 531 171 -165 746 399 807 -163 110 82 444 79 41 -191 -413 612
2900F12j322P70q82M56L98n17K41n53P21j59J77l26m1K84K34M76q20O56o23J091
$$ 612 -710 60 -822 -366 32 -485 -244 -797 -76 -235 -58 -384 -425 -141 93 569 -251 405 -218 873
2920H73k47l88M89r39J199o91J46o39J82l9p3j58m56M06l00O78p37P9N8L7Q56
$$ 873 626 238 727 -212 987 296 442 -197 -15 -54 -127 -285 -741 -335 -635 43 -694 -615 -557 -520 336
2941C36j258R38k82P08J37m52P92n78N92l61L00o94P88m45j47R0p73Q76r21O18
$$ 336 -922 16 -266 442 579 127 919 341 933 572 872 178 966 521 374 464 -309 567 -354 264
2961B64q53Q0N65n25N08j329N14L73M83k05j76j83M96P03p15N32r41R66J25m2
$$ 264 -589 -509 56 -469 39 -1290 -776 -403 80 -125 -301 -484 12 715 0 532 -409 557 682 640
2981F40J62j221O87O8N02q34m76oN04K05r74M44r62J328o22L84m04o24J252m52
$$ 640 802 -419 268 336 838 4 -472 -478 26 231 -743 -299 -1261 67 -555 -171 -575 -1199 53 -399
3001c99R19o82L0K3K43L53k85O0l96O58l70M03r68M15L58j076J154r07O46n35
$$ -399 520 -162 -132 -109 134 487 202 262 -134 524 154 557 -411 4 362 -714 440 -467 179 -356
3021c56k07P06j43R9k65j51K64P02m71J61j57l41R99q13Q34j317O27K01LK66j338
$$ -356 -563 143 0 99 -166 -317 -53 649 178 339 182 -159 840 27 861 -456 171 372 375 641 -697
3042f97P02l12Q82n22l16q12O70R46o37J98j421J258k67O57p7j009J008l16Q59
$$ -697 5 -307 575 53 -263 -1075 -405 541 -96 102 -1319 -61 -328 329 252 -757 251 -65 794
3061G94n40m74j84O18K51k97l33n24R17m92O99p71n14O13n19J132p54J30n00L32
$$ 794 254 -220 -404 214 465 168 -165 -689 228 -264 435 -336 -850 -237 -756 376 -378 -248 -748 -416
3081d16O87o6k38l94L96R9O65n48N2j36l68J088q40O97j114K39N24K6M16j282
$$ -416 271 205 -33 -427 -31 68 733 185 237 101 -267 821 -19 678 -436 -197 327 353 769 -513
3101e13J63O3O41k25N0q17J3J078j77L70j575N70P9Q28K92j608N17j95J121k3
$$ -513 -350 -287 354 129 179 -638 -625 453 276 646 -929 -359 -280 548 840 -768 -251 -446 675 652
3121F52m74p51M24L29N19l0j405Q17l79J163m68p77J33k16J313p32k9n69K6Q97
$$ 652 178 -573 -149 180 699 669 -736 81 -298 865 397 -380 -247 -463 850 118 89 -480 -454 443
3141D43k34j54o33L62m87J489p85q1j75n37J440r56O84j025M35N23j58L16m32
$$ 443 209 55 -578 -216 -703 786 1 -80 -255 -792 648 -308 376 -649 -214 309 151 467 35
3160C5n7l76Q10l70M11o76k2N70m76J290j773P15n45M99O06n34r9l94P35J40L49
$$ 35 -22 -398 412 42 453 -223 -245 325 -151 1139 -634 81 -464 35 641 107 8 -386 349 489 838
3181H38j475M50Q0N45L82j108L21p75J426j45m15M9j105J408l03M06j164J8N72
$$ 838 -637 -187 -107 438 820 -288 33 -742 684 539 124 173 -932 476 173 579 -585 -567 5
3200EK69L31j027K98m90J322o49Jl70k96J208n64K53o06j30M58l5L07n00J16l14
$$ 5 274 605 -422 -124 -614 708 59 60 -310 -606 602 38 291 -315 -445 13 -22 285 -215 -99 -413
3221d13R52o97N45r57J28N91n37R98q62M19k68P5M09j35J4m78M99k59N79r40M30
$$ -413 539 -158 387 -570 -442 149 -388 610 -252 167 -101 -26 383 248 262 -216 283 24 603 -337 93
3242I3j12j31R07j023N72q86P51J43k72K61r70O74L2L26l70k31j16O82n1l79M00
$$ 93 -19 -150 757 -266 306 -580 171 314 42 303 -667 7 39 365 -5 -236 -352 330 279 -100 300
3263C00q33J063k75O0J29j031R13m04O30p87O1k15O50pk53r4n69P30l58N40n24
$$ 300 -533 530 255 315 444 -587 326 -78 552 -235 -174 -389 261 254 1 -93 -662 68 -290 250 -274
3284b74L7M54n88P82r94L26l2J74K27k66j50j64L79l58M74l98M49j97k71R36j081
$$ -274 -237 217 -371 411 -583 -257 -289 -115 112 -154 -304 -468 -89 -447 27 -371 78 -119 -390 546 -535
3305e35J058p43J06J72k52N36p09L93k46M39l48L13o08j6N32l68N57j175R20m71
$$ -535 523 -220 -114 58 -194 342 -367 26 -220 219 -129 184 -424 -440 92 -276 281 -894 26 -445
3325d45L39j0q32R38k80L35k50K81m90M70L43n7j2o37R18n95N53o92j32P02m54
$$ -445 -106 -116 -948 -10 -290 45 -205 76 -414 56 399 342 330 -307 611 16 569 -123 -255 447 -7
3346gN91q43K50k48r9J49j12J36n00K54k33L73l25J98L39m88O13n70O74j35J28
$$ -7 584 -259 -9 -257 -356 -207 -319 -183 -683 -429 -662 -289 -614 -416 -77 -565 48 -522 152 17 145
3367A45J13k39L17j38K72o84N53l35J26o0n66N56o99Q50r11N77n20Q7M96l69K24
$$ 145 258 19 336 198 470 -214 339 4 130 70 -496 60 -639 211 -700 -123 -643 -556 -60 -429 -205
3388b05l98N20k9K27k02K65M7J31L42p07O13n75L70L1p81M87m06J40M6Pn31J44
$$ -205 -603 -83 -112 115 -87 178 225 356 698 -9 604 29 399 430 -351 136 -270 -130 -84 -77 -608 -464
3410d64J85o9Q3m96O94p24Q51j97L4M4k52R21m95L84m87K27lJ80k10o9K55l80
$$ -464 -279 -348 -265 -761 -67 -791 60 -137 -103 -59 -311 610 115 499 12 239 236 416 206 137 392 12
3432A2N63j064O57l62j6K74q18R28p05K79k06O8J80o4J88j23K53k53M53j61O2
$$ 12 575 -489 168 -194 -210 64 -754 174 -531 -252 -458 -390 -210 -274 -86 -209 44 -209 244 83 145
3453A45l2k6N47p92M13n98L40O0j38L22o80L72j10P8j63j0n7L17J22m66N66n64
$$ 145 113 87 634 -158 255 -343 -3 57 -81 241 -439 -67 -177 -99 -262 -272 -329 -12 110 -356 210 -354
3475c54O20J4k07K78m10P88l81L10n74J06m3K54j96m13J98k87N02l75J67l42P2
$$ -354 266 280 73 351 -59 729 348 658 84 190 147 401 205 -208 -10 -297 205 -170 -3 -345 -273
3496b73M27o93P42o80M16m5K3J47r9J65l43M97j58N18o88Q4K86o13P66n61R9m83
$$ -273 154 -539 203 -477 -61 -106 -83 64 -35 130 -213 284 126 644 -44 40 326 -287 479 -82 17 -466
3518d66K76L06k06J17m28L17j44N02o14J76m4K30J61k94L41n33M64M0M3k31m41
$$ -466 -190 116 -90 27 -401 -84 -228 274 -340 -164 -208 22 183 -111 230 -303 161 201 244 13 -428
3539d28N07m3M44p11J23n4J40K77m20K24p90J108m93L39p9p47Q23k86M64p46M57
$$ -428 79 36 480 -231 -108 -162 -22 255 -165 59 -731 377 -116 223 144 -603 220 -66 398 -348 109
3560A09k08J62M29l52m7l61M12m73O66l34M3o7k22P94o36J71k23j93M05j56J54
$$ 109 -99 63 492 140 93 -268 144 -329 337 3 46 -21 -243 551 -85 86 -137 -330 75 -81 73
3581G3k33J21k88O34o67K85j03n4Q03p76N40j016N42J53pK1n78K46j64Q17k07
$$ 73 -160 -39 -327 307 -360 -75 -178 -232 571 -205 335 -681 -139 14 7 28 -550 -304 -468 349 142
3602A42j98p64Q05K45j62K79j182R16k26M10N3q28N07l86R60m05l40L2L01L43
$$ 142 -56 -820 -15 230 68 347 -835 81 -145 265 318 -510 -3 -389 571 166 -174 -142 159 502
3622E02l21%n16N84m27P05m72n93N99k88P99k99j88k38L19K96m40R0k80J54k87
$$ 502 181 181 -335 249 -178 527 55 -538 61 -227 572 273 85 -153 166 462 22 112 -168 -14 -301
3643c01R72q64K20k20q1O28o26O69o72K91j06k2L47l86J32j19N04l30K19o52M3
$$ -301 671 -193 27 -193 -274 354 -272 397 -275 16 -90 -112 235 -151 -19 -138 366 36 255 -397 -354
3664c54O23j05J82r86N09k44P06j36l64n6l8J81J78L2n89K13K98J94M7o50L96
$$ -354 269 164 346 -640 -131 -375 331 195 -169 -225 -263 -82 96 128 -461 -248 50 244 291 -359 37
3685C7k94N66p6m24K90l39P19l91n5k73M45k9J57j27k25J6l62O50m06K76k65j19
$$ 37 -257 309 233 -191 99 -240 479 88 33 -240 205 176 333 206 -19 -3 -365 285 -121 155 -110 -229
3707b29O24m24L08m57Q4K50q1L07n63J97j69M39m68M40n52J22K95k44M80p71K08
$$ -229 395 -29 279 -178 -94 156 75 382 -181 16 -153 286 -182 258 -294 -172 123 -121 359 -412 -204
3728b04K12j20J18K80m57n0L31j56K36n49J29K2J64L92q01M91m52N06J26k99o1
$$ -204 8 -112 6 286 -171 -221 110 -46 190 -359 -230 -208 -44 348 -453 38 -414 92 218 -81 -142
3749a42m31N65o7K62m82q9J96M40n8m67L00m22R00m38J15j64l43O61m64K89l75
$$ -142 -573 -8 -75 187 -295 -384 -188 252 194 -273 27 -395 505 67 182 18 -325 336 -128 161 -214
3770b14K0L1L07l20O5n8j91O75n67L81k26K6L89o12O58o61M56l80K19K36j12k66
$$ -214 -194 -163 144 -176 -111 -169 -360 315 -252 129 -97 -71 318 -294 364 -297 159 -221 -2 234 122 -144
3792a44J38m3j22M32l78j04m7J34K78o14N14o21J90L17j11K26k57L09j53K80k83
$$ -144 -6 -49 -171 261 -117 -221 -268 -134 144 -470 44 -577 -387 -70 -181 45 -212 97 -56 224 -59
3813e9n2K55%M5k84K57l10M74l39n6M9j45J48k84L53m55L8j7L43O8m3p2l34M35
$$ -59 -111 144 144 189 -95 162 -148 326 -13 -69 -20 -165 -17 -301 52 -403 -365 -382 -39 29 -14 -86 -420 15
3837A5k19L19r4k71N29m29O73m42K19k06J09J80l34l9Q0K28n66L71k47q4J32q5
$$ 15 -204 115 21 -250 279 -150 523 81 300 94 203 383 49 10 90 318 -248 123 -124 -208 -76 -161
3859a61J63l82O20n35J45j26K91J0k65K04k0L20k97L56m47J46M31l41K50m12R6
$$ -161 2 -380 240 -295 -150 -276 15 25 -240 -36 -56 264 -33 323 -124 22 453 112 362 -50 46
3880D6k29L26k51q6K76m76K87k05L84l92l1J42K32k7k89L76n04O68J05l63K75
$$ 46 -183 143 -108 -194 82 -394 -107 -312 72 -320 -351 -209 23 -4 -293 83 -421 247 352 -11 264
3901B64l75M35m37K69j91K12k8j41n5K4J49k90L59l99K41J20l48N19l39J04j21
$$ 264 -111 324 -113 156 -35 177 149 8 -47 -23 126 -164 195 -204 37 157 -191 328 -11 93 -28
3922b8Q8J85j84M7j80K96j98K28k14J95j21oQ7k39K17j69j6j55K72J92m47L18
$$ -28 60 245 61 108 -72 224 26 254 40 235 114 108 195 -44 173 4 -12 -167 105 297 -150 168
3944A68k19j7M0J95k15K47p4k88M17m88K82k19M33J4m81L37k94L13m8j41k54K01
$$ 168 -51 -68 -28 167 -48 199 125 -163 254 -234 48 -171 262 276 -205 132 -162 151 103 -38 -292 -91
3966i1k0l6K78j32J0k73K57j25L9r0J36L35m95L05k21J95j56O6L10k55k7r8L94
$$ -91 -111 -147 131 -1 9 -264 -7 -132 -93 -183 -47 288 -207 98 -123 72 -84 -18 292 37 10 -88 306
3989C06n56L83k93J62J89k97M62o80L83k14J48K55j22O9m12L75l25M75k78O7J00
$$ 306 -250 133 -160 2 191 -106 356 -324 59 -155 -7 248 126 195 -217 158 -167 308 30 97 197
4010A97j68M12o76K96k31M17j80j41N9q5J82rL00o61J79m8J74K60n75L50l21M04
$$ 197 29 441 -235 61 -170 247 67 -74 -15 -100 82 73 373 -288 -109 -157 17 277 -298 52 -269 135
4032A35l94L1J91P9o4p9jl10N02k26Q8J35k65K34j79M15l00J39l9q3R2l20L77
$$ 135 -259 -228 -37 42 -22 -101 -102 -412 90 -136 -48 87 -178 56 -123 292 -8 131 92 9 101 -219 158
4055A58l04J89l78M30qk8j6j12J57j77R1j40K84m4k58O15o00M43l95L27O2k11
$$ 158 -146 43 -335 95 87 59 43 -69 88 -89 2 -138 146 102 -156 459 -141 302 -93 234 296 85
4077H5k14J63ol4M37p13K88l83L41K25k63K44n22M78j71K19l0k32L46j42J2L7
$$ 85 -129 34 28 -6 431 -282 6 -377 -36 189 -74 170 -352 126 -45 174 144 -88 258 116 128 165
4099A65q6j95J24J02l9j49j97O01m01L98m01j14K17LJ1o7K64k93R6K6l0j38N6
$$ 165 79 -116 8 110 71 -78 -275 326 -75 323 -78 -192 25 28 39 -28 236 -57 39 65 35 -103 -47
4122d7K49k60M25o80J55o8lM86m71L55o01L41K92k28O1n9k1p4J18n1oK0l0K42
$$ -47 202 -58 367 -313 -158 -226 -229 257 -214 141 -460 -119 173 -55 6 -53 -74 -148 -30 -81 -87 -67 -97 145
4146A45k94K65l08K82l5q3J76m50L24P4P8k78K76m01K81J55m42K00m70P00k87
$$ 145 -149 116 -192 90 55 -28 148 -302 22 96 174 -104 172 -229 52 207 -235 -35 -505 195 -92
4167i2L35k59j43K23l5L47n48L58l96M59r5p1Ql44K95q6K47j94j71K83j44K16
$$ -92 243 -16 -159 64 29 376 -172 186 -210 249 154 83 91 -253 42 -44 203 9 -162 121 -23 193
4189A93j35n3k07L09l8P4R2l41J49j00L16j98j5r8l3K23j31K12n26M76j10j20
$$ 193 58 5 -202 107 69 143 235 -106 43 -57 259 61 46 -52 -85 138 7 219 -307 169 59 -61
4211f1J46k4j65J25J97j76j6j57LK10k02K08k45J09r2K25j62j41J57k09L91j73
$$ -61 85 61 -104 21 218 42 26 -131 -128 82 -120 88 -157 -48 -140 85 -77 -218 -61 -270 121 -52
4233e2J07q7K0J89p4J37n43L42%K2k25J92k02N8L17m17L28n30M45J24K2j88n9
$$ -52 55 -32 -12 177 103 240 -303 39 39 61 -164 28 -174 -116 201 -216 112 -418 27 151 173 -15 -74
4256g4j9k0M58l95L6j12k77M34j88N11m63J65n6J47j96j24K38j11L9r7O7O8k52
$$ -74 -93 -113 345 -50 -14 -126 -403 31 -157 354 -109 56 0 147 -49 -173 65 -46 -7 -104 -37 31 -221
4279b21J67j27K5k9K07P8mr8R4j51J28o2r8K64l25j7J96m9J39j81P3j87L01k65
$$ -221 -54 -181 -156 -185 22 100 96 -2 92 -59 69 7 -91 173 -152 -169 27 -22 117 -64 9 -178 123 -142
4303a42K7J43q7L5J00O2k07J26J9k2M7j87J26j66J19J08J06k08l9N6m0L00m41
$$ -142 -115 28 -59 -24 76 138 -69 57 76 54 101 -86 40 -126 -7 101 207 -1 -40 16 -24 276 -165
4326a65K80k82J54K21k54J93l61J59R8l03K55j10J36j29O8or6m6K43J57k09J04
$$ -165 115 -167 -13 208 -46 147 -214 -55 43 -260 -5 -115 21 -108 -40 -46 -142 -188 55 212 3 107
4348A07j13J65k57K02k45K22j25J07L3j96Qj27L87l68K59o2l8K18j76m1j45K8
$$ 107 -6 159 -98 104 -141 81 -44 63 96 -100 -92 -219 168 -200 59 -3 -41 177 1 -40 -185 -157
4370a57K01J24k29J22m4K5O7l28L69L25n10M4P8O5n55O04k5q1j48J62n4l07L30
$$ -157 44 168 -61 61 17 42 109 -219 150 475 -35 9 87 152 -403 201 176 95 -53 109 55 -252 78
4393G8o3J73k79J69Q5l67M57j49j98J90J44j46l9j43J28J59j68J3k52M47m53k2
$$ 78 15 188 -91 78 163 -204 253 104 -94 96 240 94 55 -88 40 199 31 44 -208 239 -214 -236
4415b36L62k36R0K0p2j22J99o5N5k9L8R2K75j24n72K30M1m3J34q2K67m26J52K0
$$ -236 126 -110 -20 0 -72 -194 5 -60 -5 -34 4 96 371 247 -325 -95 -54 -97 37 -45 222 -204 -52 -32
4439c2j70K33j82M29m16K12N4q1J16k01Q4j9J51l78J97j26o6K36j38K4j9L29j96
$$ -32 -202 31 -151 278 -138 74 128 47 163 -38 46 27 178 -200 -3 -129 -195 41 -97 -73 -92 237 41
4462D1p4J14J79j62p3J27m43L75k28L20j83j32j93L67R0j74J11j38J97J92k48
$$ 41 -33 81 260 98 25 152 -291 84 -144 176 -7 -139 -332 35 125 -49 62 -76 121 313 65
4483F5O0j86K02j29J97j94o1K4j10L15l83K53j31n9K98k47J22q9K40l48O4Q7M9
$$ 65 125 -61 141 12 209 15 -46 -22 -132 183 -200 53 -78 -137 161 -86 36 -53 187 -161 -97 -10 39
4506C9k1l11M75k77m3M0J60j27J20N3k75J77N8j13o9J34M8k9J56l30L02k58L72
$$ 39 18 -293 182 -95 -138 -98 62 -65 55 108 -167 10 68 -45 -114 20 68 39 195 -135 167 -91 281
4529B81n92J21N9L20p3j54J81k64J34j74L00j75J89j86K7K18j39K1q7L6Q8n6j02
$$ 281 -311 -190 -131 189 116 -38 143 -121 13 -161 139 -36 153 -33 -6 212 73 94 7 43 131 75 -27
4552b7k0J40j54K69k41p2J07k0K20k93J31k27L20j75K2K63m81K24N3O6j23K4K9
$$ -27 -47 93 -61 208 -33 -105 2 -18 202 -91 40 -187 133 -42 -20 243 -238 -14 39 105 -18 6 35
4575C5k6j40K65O9l9l1j37j86L25j20J97k79K92k74J37j27j9K83k21J32k60J64
$$ 35 9 -131 134 203 164 133 -4 -190 135 15 212 -67 225 -49 88 -39 -58 225 4 136 -124 40
4597D0k65L41k69J98J28j30K25k82L15l56j1J35J7K68l74K1M2M07o45k1J12K79
$$ 40 -225 116 -153 45 173 43 268 -14 301 -55 -66 69 86 354 -20 1 43 450 -195 -216 -104 175
4619A75j01k20L26l28J8n6J50O1n8L3o3J28l0M9l7j89J88k05L12k89Q0k44L90
$$ 175 74 -146 180 -148 -130 -186 -36 25 -33 0 -63 65 35 84 47 -142 46 -159 153 -136 -56 -300 90
4642I0p4J40j71k29L42j78N6j10k8JL61j09r4j5J9j73K58K0qj61K21k08R5mJ6
$$ 90 16 156 -15 -244 98 -80 -24 -134 -162 -161 200 91 -3 -18 1 -172 86 106 98 -63 158 -50 45 41 57
4667E7r8J68j66m0J48k13N5R9J32p6j28K42j49Lm25M79m5J16k65JJ12o5K69k79
$$ 57 -41 127 -39 -79 69 -144 -89 10 142 66 -62 180 31 34 -391 88 43 159 -106 -105 7 -58 211 -68
4691f8R1O9l3l0j22m8P0q0K0J98J09l20J88j53K59j77Pk5k7j2J02ml53R3J26J59
$$ -68 23 92 59 29 -93 -141 -71 -151 -131 67 176 -144 44 -109 150 -27 -20 -45 -72 -84 18 14 -339 -246 -120 39
4717C9j31K74k98%Q5P1k24J16K5n2O6o1N3J24k91kL89k28k59J48L52k51J99m95
$$ 39 -92 182 -116 -116 -31 40 -184 -68 -43 -95 -29 -90 -37 87 -204 -206 183 -45 -304 -156 196 -55 144 -351
4741c51K89P4L1P3mm5j03J20j32K6l21M61k1j83N08p19L18r9j3J23j74K50l66
$$ -351 -62 12 43 116 112 67 -36 84 -48 -22 -343 118 97 -86 422 -297 21 -78 -91 32 -142 108 -258
4764b58P7L81j22k51J56j07J52n4M3J45o8j7%K5j21p8J40j80M95m44NK57k73J
$$ -258 -181 200 78 -173 -17 -124 28 -26 17 162 94 77 77 102 -19 -97 43 -137 358 -86 -81 176 -97 -96
4788i6K32k36k34K22L5J71r9R0j35r6J77j61L94l37K65jo2m4k8L7l5j45j28L3
$$ -96 136 -100 -334 -112 -77 94 -5 85 -50 -146 31 -130 264 -73 192 191 129 85 57 94 59 -86 -214 -181
4812a81K76j48J70l52Q0q6K24N5p2L6j42K36j13J81l02J03R4J0J66l57J79j13
$$ -181 95 -53 117 -235 -155 -241 -17 38 -34 2 -140 96 -17 164 -138 -35 59 69 235 -122 57 -56
4834e6n3J55R1r7j11J62j70J10j60o1J54j82K24M9j04j43J69j37L08o8J90m20
$$ -56 -109 46 137 40 -71 91 -79 31 -129 -190 -36 -218 6 55 -49 -192 -23 -160 148 80 270 -150
4856a50j17M19k86L22r7R8j49pN0m2P8j43K17l29J27R1J8M8m24J49k65N22j99
$$ -150 -267 152 -134 188 91 189 40 33 83 41 119 -24 193 -136 -9 82 100 148 -276 -127 -392 130 -69
4879f9o3J93j24Q3m5K42k85KoJ51o7j4N6j28P5k21J53n1K00n1j93L74j11m7l8
$$ -69 -132 61 -63 20 -25 217 -68 -66 -72 79 12 -2 54 -74 1 -220 -67 -118 82 31 -162 212 101 54 16
4904A6k03K98k9Lk11K87k22R5j02J11K58l75L8j54M03l06K0j2m3O6NK06k04M06
$$ 16 -187 111 82 85 -126 161 -61 34 -68 43 301 -74 -36 -190 213 -93 -73 -85 -128 -62 -57 149 -55 351
4928C51n22K14k91j3K44J84l01K50r5j57J78Q4j5J39m30P7P5q9p8Q1OO8R0j44
$$ 351 -171 43 -248 -261 -17 167 -134 116 21 -136 42 126 111 250 -180 -103 -28 -117 -195 -114 -108 -40 50 -94
4952i4j30L06j18k9K42k21k29M44l52L66l15K02m9O4J44r2p3oM8k19k0J35m0L07
$$ -94 -224 82 -36 -65 177 -44 -273 171 -181 185 -130 72 23 87 231 139 66 60 108 -111 -131 4 -36 271
4976B71m26L40o5n0l17M96k13l87M68k19J44m8m3r5q9K20K1J18k70p1J18K15j33
$$ 271 -155 185 120 70 -247 249 36 -351 117 -102 42 -6 -49 -144 -233 -13 8 126 -144 -215 -97 118 -15
4999a5j64Q9J03K85k56M2o1LK35j00p7j79k1k1J25n5O8j29J40J86k24l9O5J27
$$ -15 -179 -90 13 298 42 84 23 26 261 161 84 -95 -116 -137 -12 -67 1 -128 12 198 -26 -65 0 127
5023A27l8k71J40j3J53J48j00n9j60k16J32L51m07R0K07L3j13N5K8p8K29m82K99
$$ 127 89 -182 -42 -55 98 246 146 87 -73 -289 -157 194 -213 -123 84 117 4 59 87 9 238 -244 55
5046E5k42J14J66l10K24q0K59j43l4r3J14p7k93K96j53J93L5O6l29Q0K46K29l91
$$ 55 -187 -73 93 -217 7 -73 186 43 9 -84 30 -47 -340 -44 -197 -4 31 97 -232 -152 94 323 -68
5069f8Q8J00k53L71l78L55l06P0J12j62P4k98L96Nl07L91k28Q9j37J6J79J24j57
$$ -68 20 120 -133 238 -140 215 -91 -21 91 -71 3 -295 101 106 -201 190 -38 51 -86 -70 109 233 76
5092G6m18K57J07J5k93L39k20J30J46k07J49l52M64j80R4j20Rq9K0L23k91Q6j61
$$ 76 -342 -85 22 37 -256 83 -137 -7 139 -68 81 -271 193 13 107 -13 -4 -93 -73 250 -41 45 -116
5115a16P9p3O2K20l76K90j44R0j14k61L18LJ42j46K14k34K00j94l0j34J63J43
$$ -116 -37 -110 -48 172 -204 86 -58 32 -82 -343 -25 -22 120 -26 188 -46 154 -40 -70 -204 -41 102
5137A02km5j70J98j76J33J65n53M52j77J63q9O2k30l0J6L9K9L6J28k96K14J60
$$ 102 100 55 -115 83 -93 40 205 -348 104 -73 90 1 63 -167 -197 -181 -142 -113 -77 51 -245 -31 129
5160A29j17K31j39j77k4q3K67j89K21j34M3k15J76m2J3J78k65K46m09J23J33J16
$$ 129 12 243 104 -73 -97 -180 87 -102 119 -15 28 -187 -11 -53 -40 138 -127 119 -290 -167 -34 82
5182H2P1j76J09k8M62m48P8k39J95mJ82k33m8J49q1Q6j40p1M7r0j7r0K96l41P5
$$ 82 153 -23 86 58 520 72 150 -89 106 102 284 51 3 152 71 157 17 -54 -7 -97 -114 -204 92 -249 -174
5207a74K18M9k42j48M47m03K94k52L21j78J19J91P0j1j71L6q5J23j40m7o9l2M79
$$ -174 44 93 -149 -297 150 -253 41 -211 110 -68 51 242 312 301 130 166 81 204 64 17 -52 -84 395
5230C95j91j33l49M5J86k46M31m73K09k4J76l23K78k8n6O6j20M27l31K11j7J3
$$ 395 204 71 -278 -233 -47 -293 138 -335 -126 -150 26 -297 -19 -47 -103 -37 -157 270 -61 150 133 146
5252A46j03j41J89m13L47%j5P2k11M59o82L65j25J86j95K18J6l28J92l34M48j70
$$ 146 43 -98 91 -322 25 25 10 82 -129 330 -352 13 -112 74 -121 97 113 -215 -23 -357 91 -79
5274g9%K01r4K67l01k7J3j01P8r3K22l12J85j82K79j93J53L3p6j00L05j13k76
$$ -79 -79 122 28 295 -6 -33 -20 -121 -43 -136 86 -226 -41 -223 56 -137 16 49 -27 -127 178 65 -211
5297b11M30l99K73k21J02J06J36j93k86K29m7L10k90k23M78l90J34P6L06l50K86
$$ -211 219 -180 93 -128 -26 80 216 23 -263 -34 -81 229 -61 -284 194 -196 -62 14 320 -30 256
5318B56m3l87K02j10L19k70J40j45J37j14j12J55O0j07j08K24n0k17k0J44J4J7
$$ 256 213 -174 28 -82 237 -33 107 -38 99 -15 -127 28 88 -19 -127 97 47 -170 -190 -46 -32 -15
5340a5j52J42K07j44j45J5j72L53j65L4J00k50L72ok6k67L78k10L8j28O7p7J15
$$ -15 -167 -25 182 38 -107 -92 -264 89 -76 -42 58 -192 180 174 148 -119 259 49 87 -41 26 -51 64
5363F4q4Q1K01m33L22j1p9M8l48L96k29J00J43k60J02k65K90JkP9k53r5N31j27
$$ 64 -20 61 262 -171 151 140 61 109 -239 157 -72 28 171 -89 13 -252 38 39 37 116 -137 -232 299 172
5387A72k24J29R7j66p3K05l3k56J11R1J36j87N1j50k0J02P9j56l7J82k67L86l32
$$ 172 -52 77 174 8 -65 140 107 -149 -38 53 189 2 53 -97 -117 -15 64 -92 -129 53 -214 172 -160
5410a60J60j34l6K05o3K14j45M0l40L87L2k90M42k19J12l03J61j25J36L6o3J11
$$ -160 0 -134 -170 35 -28 186 41 81 -259 128 160 -130 312 93 205 -98 63 -62 74 110 47 158
5432A58l42K95j91P4oL9J10m32J96L7M71k30j63M2o7q8q0M44m64M08j28l65J99
$$ 158 -184 111 -80 -6 -12 27 137 -295 -99 -62 409 179 16 58 -9 -97 -177 267 -197 211 83 -282 -83
5455h3J41k90o8L21j28K61m57L23J4j20J24k48K10lJ44k46j14K35k25L63j97%
$$ -83 58 -232 -300 21 -107 154 -303 20 34 -86 38 -210 0 -3 141 -105 -219 16 -209 154 -43 -43
5477d3k44J07J7J31J24k94K08O4K3q6kK45l16K54l47K65j03P3o1j86K13j0m7m0
$$ -43 -287 -180 -163 -32 92 -202 6 70 93 7 5 250 -66 188 -159 106 3 76 15 -171 42 32 -15 -55
5501e5o3j20J10L95l34O9k58K67k9q6m6K58n9l0M1j98J38m6J08k18J8L30n7K7
$$ -55 -118 -238 -128 267 -67 2 -256 11 -18 -104 -150 108 49 19 60 -138 0 -46 62 -156 -138 192 135 162
5525A62p0l9j80K41k24K35j24J8L53m76L57l04N1L3r6j46l5R8J27R6l79J22K15
$$ 162 92 53 -127 114 -110 125 1 19 372 -104 253 -51 0 33 -63 -209 -244 -146 -19 77 -302 -180 35
5548C5mL66o09Q0J98J92m50M9K2O5L82l65L9k46L32l58L27N7j21o7Q8N7k35K30
$$ 35 31 397 -212 -132 66 258 -192 -143 -121 -56 326 -39 0 -246 86 -272 55 112 -9 -76 12 69 -166 64
5572F4N0m5m2j09N6J88J53j32j62J34k63M30k32L83k93m52N2M37n0j15j31m8m5
$$ 64 114 69 27 -82 -26 162 315 183 21 155 -108 322 90 473 180 -272 -220 217 167 52 -79 -127 -172
5595a72O7m3J11k29Q1j84N55k45O8m5J14n4r9P3k42L19m4k8K19j91M5J91k55L1
$$ -172 -105 -148 -37 -266 -185 -369 186 -59 9 -36 78 24 -75 -2 -244 75 31 3 222 31 76 267 12 43
5619D3J40j35l22L87lL8j86j55j13K66J18k5k72K27j65J59L67l21K9K39k02J22
$$ 43 183 48 -274 113 110 148 -38 -193 -306 -40 78 53 -219 8 -157 2 369 48 77 316 114 236
5641B36k98K26k42K65k03j22M8j92J74lj11j05K93j58J92Kj87K30p3p1k5L57k31
$$ 236 -62 164 -78 187 -16 -138 -90 -282 -108 -111 -222 -327 -34 -192 0 2 -185 45 -28 -99 -124 233 2
5664BR3N0N8j3Q8r7K2r3j45R7O1k45L28j13Q4l02J45j73J19P4k78M0m4K54OOj45
$$ 2 95 145 203 190 278 181 203 110 -35 62 123 -122 206 93 177 -125 20 -153 -34 40 -238 -198 -242 12 18 24 -121
5691a21Q3j23K89Ok73K12j34J12j34j53K26j95L24r8j3j78Q8J86k66K06L2J13
$$ -121 -38 -161 128 134 -139 73 -61 51 -83 -236 -10 -205 119 21 8 -170 -82 104 -162 44 76 189
5713A89j72O3m1J65k37j77L73l65L90k45j41J51k11L35j09J35l23K07J41p3m1
$$ 189 17 80 39 204 -33 -210 163 -202 188 -57 -198 -47 -258 77 -32 103 -220 -13 128 55 14
5734A4K7J93m73N01k25j00k8k67L60j80J28K6O2J07j84J10k61K78k13J42N6j27
$$ 14 41 234 -239 262 37 -63 -91 -358 2 -178 -50 -24 38 145 -39 71 -190 88 -125 17 73 -54
5756e4q5q4K35Q8J4r4j19m6K01k3l24L55k23K87j92rN0k59M28j04%j72K00j6q2
$$ -54 -139 -223 12 100 114 20 -99 -145 56 33 -291 64 -159 128 -64 -73 -23 -282 146 42 42 -130 70 54 -28
5781b8J05Jj59J66j48p2O6o4j62K30k33L29j86O9M9M9O1j33N6j39K6J57J14j57
$$ -28 77 78 -81 85 -63 -135 -69 -133 -295 -65 -298 31 -155 -86 -37 12 73 -60 -4 -143 -117 40 154 -3
5805cJ6k87K24J63k06K56j98K93j74j45P9n2K41rj22p8M3j23J41j17k1m2j07L83
$$ -3 13 -274 -50 113 -93 163 -35 258 84 -61 18 -34 207 198 76 -2 41 -82 59 -58 -79 -121 -228 155
5829A55l22L35j84j96K73p1K01r8k32K02n6M3j33J55j64J19k10L18k21K7j41L30
$$ 155 -167 168 -16 -212 61 -10 191 93 -139 63 7 50 -83 72 -92 27 -183 135 -86 -59 -200 130
5851A30k7j40M9k35K18J13m30J18k2L76k02M2j11J69R0l34J50P6J26m78L64N2
$$ 130 103 -37 12 -223 -5 108 -322 -204 -226 150 -52 -10 -121 48 138 -196 -46 30 156 -322 42 94
5873I4j47L9o9Q2J12Q1j99j03KM31l48P2q3M6L02l07L5%J51l27r5K13q4K09j96
$$ 94 -53 -14 -83 -1 111 192 -7 -110 -108 323 -25 47 -36 10 312 5 40 40 191 -136 -231 -18 -102 107 -89
5898h9o3J85k5j3k5q1J92J02%Joo1k96l4L91j26k35K80l62M75j60J96n4m0k74
$$ -89 -152 33 8 -5 -30 -111 81 183 183 184 178 117 -179 -213 178 52 -183 97 -265 210 50 246 192 152 -122
5923a22K50r4m4J17o6R2l12L22k37K08LM1j19k43L11j77J69L7r8o5j49J70j05
$$ -122 128 34 -10 107 41 133 -179 143 -94 114 117 158 39 -204 107 -70 99 136 38 -27 -176 -6 -111
5946a11J95o7NL2k5m5j31K31p5P0j49O8l2K01k38P3j20L5L24k13k36K19K9K67
$$ -111 84 17 22 54 29 -16 -147 84 9 79 -70 -2 -34 167 -71 2 -118 -83 241 28 -208 11 40 307
5970C07k22o2N9j28J01K29k15PJJ7k5j94K17p3K1N0k07M9j62J99Q4K2l7j7j11
$$ 307 85 23 82 -46 55 284 69 76 77 94 69 -125 92 19 40 90 -117 -68 -230 -31 53 75 38 21 -90
5995i0J9m3n8L07j55Pm8k03K94k63L05k04J75nK59k87p0K20n8J5j26K2p4l8L96
$$ -90 -71 -114 -172 135 -20 -13 -61 -264 30 -233 72 -132 43 38 297 10 -60 160 102 117 -9 13 -61 -99 297
6020B97l42K49k29K28J4k71J0J09j67k00M12l49L42K2P0j67k76K45j06J28j25
$$ 297 -45 204 -25 203 217 -54 -44 65 -102 -302 110 -239 103 125 195 28 -248 -3 -109 19 -106
6041a06M6n5j03Q9k44J83N0j79L31K5k26K45j35R6J41j52N9k4R1l0l1L14l52J84
$$ -106 -60 -115 -218 -129 -373 -190 -140 -319 12 37 -189 56 -79 17 158 6 65 41 132 102 71 385 33 217
6065B17o6j10m6L6j7P6j44r2K78k02j04P0M6Kj25K55j04Q5J01k29P3j04J59L1
$$ 217 151 41 -5 31 14 90 -54 -146 132 -70 -174 -104 -58 -56 -181 74 -30 55 156 -73 0 -104 55 86
6089H6Q9k81L31k60J35j16P5J89k52J59k09M6p0J0K64k05j0p5J96J5k13o4N1J9
$$ 86 175 -106 225 -35 100 -16 59 248 -4 155 -54 -8 -78 -68 196 -9 -19 -94 102 117 -96 -160 -109 -90
6113i0K72j32K16J8j61j07J76j84K15j28j4MK3l3Jj93r0O7j41J62J27n1J4q7J47
$$ -90 182 50 266 284 123 16 192 8 223 95 81 85 108 75 76 -117 -207 -140 -281 -119 8 -43 -29 -116 31
6138C1q7J03k48J74J98k7J95l04k7j21Q5M2K87m66K23%k12K13l88O41l41J98N5
$$ 31 -56 47 -201 -27 171 144 339 35 8 -113 -28 14 301 -165 58 58 -154 59 -329 312 -29 169 224
6161B24k77P0l9J64n5j71J0OK36o4k04j92K21J84R8k66j54J97k32L19m20M21l62
$$ 224 -53 17 -22 142 87 -84 -74 -68 168 104 -100 -292 -71 113 211 -55 -209 -12 -244 75 -345 76 -286
6184b86M39j28k4j98J33Q7j0J61j24P7j9J7J08l71M3O9R5J07J1j81R8j9k33L26
$$ -286 153 25 1 -197 -64 23 13 174 50 127 108 125 233 -138 -95 -26 69 176 187 6 104 85 -148 178
6208A78l57K93k8No7N9j91J81j55J6j8P6j85K53mL45m15K08l22J75M8N1r3j48
$$ 178 -179 114 86 91 24 83 -108 73 -82 -66 -84 -8 -193 60 56 401 -14 194 -128 47 95 146 53 -95
6232i5N1O3K8j20o6j11J65k0PL3K8LK01q9k41j53J88qJ56lj15N7J10K6j92K49
$$ -95 -44 19 47 -73 -139 -250 -85 -105 -98 -65 -37 -34 167 78 -163 -316 -128 -136 20 17 -98 -41 69 95 -97 152
6258A52k90J4J8J18j76J50J64k24J33J17k11K24k34K77k26L2m0J79J2j43Q3l3
$$ 152 -138 -124 -106 12 -164 -14 150 -74 59 176 -35 189 -45 232 6 38 -2 177 189 46 129 96
6280I6n5l00M28l27L21j64j33J05j36K77k50M7P6M44l44j5j82J01ML6L13o15L92
$$ 96 41 -259 169 -158 163 -1 -134 -29 -165 112 -138 -91 -15 429 85 70 -112 -11 -7 29 342 -273 119
6303A19j23J36j26jN4j07J52k90J35k6L5J00j40J14l42K13J15J13J02k81l6K8
$$ 119 -4 132 6 5 59 -48 104 -186 -51 -77 -42 58 -82 32 -310 -97 18 131 233 -48 -84 -56
6325e6J64j65P1K33k83n5K38k81M6Q3J42P3l48q0K34l11J03j49L74N7j65Q4j10
$$ -56 108 -57 14 247 -36 -91 147 -134 -88 -5 137 210 -138 -218 16 -295 -192 -341 33 90 -75 9 -101
6348a01K57k90O9p8K60j49P8mN7j48P0o1K2Q4j12J88k9j48k5j2Q1J35o7J9k00
$$ -101 156 -134 -65 -143 117 -32 46 42 99 -49 21 -40 -18 66 -46 142 113 -35 -60 -72 9 144 77 96 -104
6373a04RK70j71J05k77M49l5j63K8j55j76L63k62N6Q6m2l8MJ15k20J69L9pj29
$$ -104 -95 175 4 109 -168 281 246 83 111 -44 -220 143 -119 -63 23 -19 -57 -53 62 -158 11 50 43 -86
6397h6M2MR6P6p5j30K6j45L65j61J07l33L94l64L14N9l25K73j7L4l35K79j70K73
$$ -86 -44 -40 56 132 57 -73 -47 -192 173 12 119 -214 180 -184 130 189 -136 137 120 154 -181 98 -72 201
6421B01j70P1j47n7J59j20M4M2Kk01K59l95J80L13l99K66J6k44L66j89k6j38K30
$$ 201 31 102 -45 -102 57 -63 -19 23 25 -176 83 -312 -132 181 -218 48 64 -180 186 -3 -29 -167 63
6444F3o7J26j67k20L12j85K38l32J00j35M41l75K78j84k3Q9k39M46l03P7J75m3
$$ 63 -4 122 -45 -265 47 -138 100 -232 -132 -267 174 -201 77 -107 -130 -41 -280 166 -137 -60 115 72
6466G2k07j32K03j1J56r9J29m9k22LJ52J23j90L29k97J11j02L0M31o47K76j34
$$ 72 -135 -267 -64 -75 81 -18 111 62 -160 -157 -5 118 -72 257 -40 71 -31 -1 430 -217 59 -75
6488g5j47O5M46l99r6p6M08k09l7R8j61J09L22k64K02j29j30L45q8j83q4K91o1
$$ -75 -222 -157 289 -110 -206 -282 126 -83 -120 -22 -183 -74 248 -16 186 57 -73 272 184 1 -83 208 147
6511A47J74k48j9j93L39Lj68M2M2j33r4p2L41k29K50m59J68J85k43J26j17J50
$$ 147 321 73 54 -139 200 203 35 77 119 -14 -108 -180 161 -68 182 -277 -109 76 -167 -41 -158 -8
6533hj87L19%O8k42j21K40N5P3l32J81jP2l94K35Jk42P00n38J52l85J87QJ08m3
$$ -8 -195 124 124 192 -50 -171 69 124 197 -135 46 45 117 -277 -42 -41 -283 417 -121 31 -354 -167 -159 -51 -94
6558i4j56L53k24J39q3j58J86m4R9r0j86J49J14K6j31q4J44Q2j12J11J78k91R2
$$ -94 -250 103 -121 18 -65 -223 -37 -81 18 -72 -258 -109 5 31 -100 -184 -40 42 -70 41 219 -72 20
6581B0O7J09l04K14j32J12j47O1p3P0q1J87r7N0Pj11J17q8k0K69p0r4K3o4J7n2
$$ 20 87 196 -108 106 -26 86 -61 0 -73 -3 -84 103 6 56 63 -48 69 -19 -39 230 160 66 89 25 42 -10
6607a0j00qQ2j95K64k20K66P7q8k1j41J88j47K1j11K18k6j38J21j35L7N3J04j6
$$ -10 -110 -118 -36 -231 33 -187 79 156 68 47 -94 94 -53 -32 -143 75 49 -89 32 -103 -66 -13 91 75
6631G5j76P7j07P0P7K2m2j59L21k22p8L22j32J04Kj52J36k33Q7L49k95o7k43M66
$$ 75 -101 -24 -131 -61 16 38 -4 -163 158 -64 -142 180 48 152 154 2 138 -95 -8 341 46 -21 -264 202
6655B02j21j76J78l23J71l5P6p4J4j78L33r5j87J56k7J24O0o5N6k06L50l02J73
$$ 202 81 -95 83 -240 -69 -104 -28 -102 -88 -266 67 -28 -215 -59 -86 38 98 33 89 -117 233 -69 104
6678A04j78k8J97K44m76J12J30k02J32n0j25K23O5J4j53J95j37k1j3o6m7o9J32
$$ 104 -74 -102 95 339 -137 -25 105 -97 35 -15 -140 83 148 162 9 204 67 46 33 -33 -80 -149 -17
6701a7N4m2MJ8N7J17k40K4K2L1l6K05k92J10P6j25L9R2j17j22L27j68j71L07L4
$$ -17 37 -5 -1 17 74 191 -49 -25 -3 28 -8 197 -95 15 91 -34 5 97 -20 -142 185 17 -154 153 187
6726A87l86O5J27J59k01M8L7k41L07l07J32k23N01k66L4K16k66J03k08M59l59
$$ 187 -199 -134 -7 152 -49 -1 36 -205 102 -205 -73 -296 205 -61 -27 189 -77 26 -182 277 -82
6747h2pLj7K16K90m19j70K90j60q4J63k80R0J65j11L6P8J07o5k5q9L0P0M7j52
$$ -82 -89 -86 -103 113 403 -16 -186 104 -56 -140 23 -257 -167 -2 -113 -77 1 108 43 18 -71 -41 29 76 -76
6772g6K93j77O8k0j52L2j82J24l1K67j48m3J9m6L34k63oj19J14J13k13J83o6l8
$$ -76 217 40 108 88 -64 -32 -214 -90 -121 146 -2 -45 -26 -72 262 -1 -7 -126 -12 101 -112 71 5 -33
6796c3J8J0K23j69Kj11J05q1J25k1j07m6J06p4k58N14l80K41P2j46J4J76k03j45
$$ -33 -15 -5 218 49 51 -60 45 -36 89 68 -39 -85 21 -53 -311 203 -177 64 136 -10 4 180 -23 -168
6820a68J19L51l1n02M61k53K50j11l73L55pM2j16r1j3o8J65j09Lm3J77j36j43
$$ -168 -49 302 271 -231 230 -23 227 116 -257 98 91 133 17 -74 -87 -155 10 -99 -96 -139 38 -98 -241
6843b41K78k36L20j41J70j00k30J98M3R5l81J55J3J58j64Q5J05j27L30l79L35
$$ -241 37 -199 121 -20 150 50 -180 18 61 156 -225 -70 -57 101 -63 22 127 0 330 -49 286
6864B86k78MP0J57n6j22J47k95L08l09K74j74K12m08R7K15k89J52N6j7J19Jm3
$$ 286 8 12 82 239 183 61 208 -87 221 -88 186 12 224 -184 -87 128 -161 -9 47 30 149 150 107
6887A07k5k26o8K83l17K48J20j32j64QK57k39J99m5m3J89j97R1N3q1K9M7J16k14
$$ 107 82 -144 -212 71 -246 2 122 -10 -174 -166 91 -148 51 6 -37 152 -45 46 99 18 47 94 210 -4
6911dl21L03j98K23O6p5o1m1J0K5p9J71j28L76q1j15j68l9K28k02K57o2l0k8l40
$$ -4 -325 -22 -220 3 69 -6 -67 -108 -98 -73 -152 19 -109 267 186 71 -97 -136 92 -110 147 85 55 27 -313
6936c13M05q9k47K52j01R0J41j65j01J50j93K13j38J34j80Q7K27q4O0m0r0j31
$$ -313 92 3 -244 8 -93 -3 138 -27 -128 22 -171 42 -96 38 -142 -55 172 88 148 108 18 -113
6958a13pJ06K01j50J0j39J71q6M7p4J71k58K12j44j50K50J2k16K79p0k74K41k67
$$ -113 -120 -14 187 37 47 -92 79 -7 40 -34 137 -121 91 -53 -203 47 59 -157 122 52 -222 19 -248
6981b48J61Q1k8r0M5J61k59J11L1J50r4K4q9r9L50k32J81j20N0j16K36m34M4J53
$$ -248 -87 -6 -34 -124 -79 82 -177 -66 -35 115 21 45 -44 -143 207 -25 156 36 86 -30 206 -228 -184 -31
7005c1rM4j05K03l62K82K84j66J5j57K85j01k59J36k15J22j73M01l07R9k53K50
$$ -31 -40 4 -101 102 -260 22 306 140 155 -2 283 182 -77 59 -156 -34 -207 194 -113 -14 -267 -17
7027a7o2J38k71J44j05J80J45j80J47j72k0J94q6J4o8m6p8P0O8n9K30j70j3o1
$$ -17 -79 59 -212 -68 -173 7 152 -28 119 -53 -73 121 35 49 -19 -65 -143 -73 -5 -64 166 -4 -17 -78
7051g8J58j18j35L87m20J62J46m1k7j68K77j63n7L4K23J0k34M8m9k3p2K26l52
$$ -78 80 -38 -173 214 -206 -44 102 61 34 -134 143 -20 -77 -43 180 190 -44 4 -45 -68 -140 86 -266
7074b66M15j91N9o4o1K16j26N7k05K27j97K54j32k29QJ83K53m34K52R0j44J31
$$ -266 149 -42 17 -47 -108 108 -18 39 -166 61 -136 118 -14 -243 -235 -52 201 -233 19 109 -35 96
7096I6K6j65k02K34m21M45M2J92m04J34q4k9J48q0J78j12j12k3K26J56k89J97
$$ 96 122 -43 -245 -11 -432 13 55 247 -157 -23 -107 -136 12 -68 110 -2 -114 -137 89 245 -44 153
7118A53j22m6Q9r9K55l37k3K93K0r9j23k4Q9Mk30K62j88L4R5r8J07q4j1Q6R1J03
$$ 153 31 -15 74 -25 230 -107 -130 163 183 84 -39 -63 26 30 -200 62 -126 -92 3 -95 12 -72 -83 3 94 197
7144A97j09N7l11L89l76L52j81J45k07J05K2r2J84j59N7j42M3q7j83P7K51n0n0
$$ 197 88 145 -166 223 -153 199 18 163 -44 61 83 -9 175 16 73 -69 -26 -113 -296 -219 32 -18 -68
7167f8j80J87J57k30j08K27j85K82k76K01j65N5L64k03j00l2J82J6J81k38j36
$$ -68 -248 -61 96 -134 -242 -15 -200 82 -194 7 -158 -103 261 58 -42 -74 108 124 305 67 -69
7188f9J34j42J39j37O7L0k63L55J2P6j40j13J95q0P0o0k00LK47ol1p0j36J35k29
$$ -69 65 -77 62 -75 -8 22 -241 114 126 202 62 -51 144 64 134 74 -126 -123 124 118 87 17 -119 16 -213
7213b13J84ORm7J90r8j56J79P8k77MJ12J48J9o6k2n6j19K41j98K07j24q4J81r0
$$ -213 -29 -23 -14 -61 129 31 -125 54 132 -145 -141 -29 119 138 72 50 -6 -125 116 -82 125 1 -83 98 8
7238Hk2M0k26J00j37J12P8j07J98Q8l09J46O4J19l21J54L0j04L34n48M83k24J87
$$ 8 -14 26 -200 -100 -237 -125 -47 -154 44 132 -177 -31 33 152 -169 -15 15 -89 245 -303 180 -44 143
7261A43n2J25j26N4j89J58L9l33J6K07L0k8j7J46n6K5q1N6p4l22L24l3Q7K8M7
$$ 143 91 216 90 144 -45 113 152 -181 -165 42 72 44 27 173 117 142 61 117 43 -279 45 12 99 127 174
7286A74Q5m31J20rJ42J31m61K55P7l6k21k1K25j96R1J68m02K51P3M6j54J38j30
$$ 174 259 -172 -52 -61 81 212 -249 6 83 47 -174 -195 30 -166 -75 93 -309 -58 15 61 -93 45 -85
7309h5k6L78k68J91L3k14M30p37J92M8q9L26j75o2P9K12l39L73l44Q0o8L9q2J86
$$ -85 -111 267 -1 190 223 9 439 -298 -106 -58 -147 179 4 -58 21 233 -106 267 -77 3 -65 -26 -108 78
7333G8J4k40r1J78R3R5l78J47R9J92m72N27k9k44N9j57M22l15J62r2l15K72j7
$$ 78 92 -148 -239 -61 32 127 -251 -104 -5 187 -285 242 213 -31 28 -129 293 -22 140 48 -267 5 -12
7356a2r9J16L7N7j72J43J87j54k77K06JK25k50J87j10p0M7p3J87j72j44J11K98
$$ -12 -111 5 42 99 -73 70 257 103 -174 32 33 258 8 195 85 15 62 -11 176 4 -140 -29 269
7379B69j84p1j39N0n7jJ01O6J41k61n9J63k2J88j04q7L1Kk01L08n1j58L52j26
$$ 269 85 14 -125 -75 -132 -133 -32 34 175 -86 -145 18 -4 184 80 -7 24 26 -175 133 82 -76 276 150
7403A50j99K02k37J52r5m5K75q6l64L18j80J53p9L08l77Q6J68j62K51j93M2L0
$$ 150 -49 153 -84 68 -27 -72 203 117 -247 71 -109 44 -35 273 -104 -18 150 -12 239 46 88 118
7425A18j77J40j36J17j97j15L22k18R8k29L34o5n7l8o0J46m5l3J42k41J39J66
$$ 118 -59 81 -55 62 -135 -250 72 -146 -48 -277 57 -8 -65 -103 -163 -17 -62 -95 47 -194 -55 111
7447A11J05j39j40J46j3j69J94j69J05J85k33J08k36L20k46L71l32J25K9j54J3
$$ 111 216 77 -63 83 70 -99 95 -74 31 216 -17 91 -145 175 -71 300 -32 93 122 -32 -19
7468a9j19K19k44K44o1K9j7Q3m4p4Lj21L98k00j22L12k93J68n4r0j73P5P3%Q7
$$ -19 -138 81 -163 81 20 49 32 115 71 -3 0 -121 277 77 -45 267 -26 142 88 -2 -175 -100 -27 -27 60
7493F0r2N8J2q6K24k66K42k8o5Q4j73j34K90m9P6P7n29L61l9J67m5j80K56l12
$$ 60 -32 26 38 -48 176 -90 152 124 59 143 -30 -164 126 77 153 230 -299 62 23 190 145 -35 221 -91
7517i1K91l38J77j2J46k19%L4j88J43J73k12p6P9q3K16j11J21p3n3K24k63J49
$$ -91 200 -138 39 27 173 -46 -46 -12 -200 -57 116 -96 -172 -93 -176 40 -71 50 -23 -76 148 -115 34
7540C4j45J21O7j30J56k23l4J36L0k20L29k41PK43j04k66M44l10J03PK86j90j06
$$ 34 -111 10 77 -53 103 -120 -154 -18 12 -208 121 -120 -113 130 26 -240 204 -106 -3 4 290 100 -6
7563fl7J34J22k99N0kj09J41J8j6j02J20J17j06J30M6l50K01l76M00O5l06J66
$$ -6 -43 91 213 -86 -36 -38 -147 -6 12 -4 -106 14 131 25 155 201 -149 52 -324 76 141 -165 1
7586Am2P3j35K14k6R1j96j71J68L49k94Q9j22N0k80M60m57K65m9P5j39J05l6j16
$$ 1 -41 32 -103 111 85 176 -20 -191 -23 326 32 121 -1 49 -231 229 -228 37 -12 63 -76 29 -7 -123
7610a23m1J47K11l03R9Q0j13K62p1N9m12N70l98J22J09k11L60m01J78k72L2J67
$$ -123 -164 -17 194 -109 -10 70 -43 219 148 207 -205 365 -33 89 198 -13 347 -54 124 -148 -116 51
7632E1o0J65l5q2K03k20J36k88J73o8J76j24L7j43J02%j03K81j78J81m31K02J26
$$ 51 -9 156 121 39 242 22 158 -130 43 -25 151 27 64 -79 23 23 -80 201 23 204 -227 -25 101
7655A01q7R7K15l95j5K33j29r4J54j5Kj56R0J00kj8J83k32N3j2p0%J17l06J52
$$ 101 14 111 326 -69 -84 149 20 -74 80 65 67 -89 1 101 99 81 264 32 85 73 3 3 120 -186 -34
7680c4Q0k4l8R2j81K04j13J48k52RK11O0Kj82J03L7j90p8K28j73lJ73l28L99j2
$$ -34 46 22 -16 76 -105 99 -14 134 -118 -109 102 162 164 -18 85 122 -68 -146 82 -91 -94 79 -249 150 138
7705A38n9Rj22J5M8J11k73L16q5R1l34K02j44K47p5J60j24k3k6j1m9j16J4o1k7
$$ 138 79 88 -34 -19 29 140 -133 183 98 189 -145 57 -87 160 85 245 121 98 72 61 12 -104 -90 -151 -178
7730a78J56k6k31L00l7j15J6K56l71J59J20p7o4L63l80J34N9l0j75L2J63j11%
$$ -178 -22 -48 -279 21 -16 -131 -115 141 -230 -71 49 -28 -92 271 -109 25 84 54 -121 -89 74 -37 -37
7753c7J6m8P7o7J52J03l48M49l08k3O7O2p2O3N3k18O9p7K10k5o0m6k48J19K84
$$ -37 -21 -69 8 -59 93 196 -152 297 -11 -34 33 95 23 86 139 -79 -10 -87 123 98 38 -8 -256 -137 147
7778A47j67N9l0l5r8o0R2N3J37j28M0j19J88j56o4Q4J50k73K52k34J17R6j44Q5
$$ 147 -20 39 9 -26 -124 -184 -92 -39 98 -30 10 -109 79 -77 -141 -57 93 -180 72 -162 -45 51 -93 -8
7802ho3o4m4J43N1K1Qj26L8o8K61k54J18O3J57k18p1J23K95k47j90K42j39n8j7
$$ -8 -71 -135 -179 -36 15 36 44 -82 -44 -112 149 -105 13 76 233 15 -56 67 362 115 -75 167 28 -30 -47
7827d7k72P6l4K90J77l14N0J86j0j49K0L06k41l79J92J18%J29k19J72k04J38j36
$$ -47 -319 -243 -277 13 190 -124 -74 112 102 -47 -27 279 38 -341 -149 -31 -31 98 -121 51 -153 -15 -151
7850a51J26K68j90P6j44M8k4J65q5J85k34j47J71J39k13J07p7M5l4j51J15O5j37
$$ -151 -25 243 53 129 -15 33 9 174 89 274 40 -107 64 203 -10 97 20 65 31 -120 -5 60 -77
7873g7K88j84J67j37j48M12n27O2k8J65j37l0L12o4r4O8N4m37L38J15j24L5j52
$$ -77 211 27 194 57 -91 321 -206 -144 -172 -7 -144 -174 138 74 -20 48 102 -335 3 118 -6 29 -123
7896a23J54q3L67l17o1J1m2L00k70P5Jn4O3n3q3J11Q7ok0j14r7L6J12l6N8K05
$$ -123 31 -52 315 -2 -63 -52 -94 206 -64 11 12 -42 21 -32 -115 -4 83 77 57 -57 -154 -118 -6 -42 16 221
7922B21j80j28oJ27n8K14n28J95J15j14J16n2L4j42N8j5k2L50j80n6L23k45J98
$$ 221 41 -87 -93 34 -24 190 -338 -143 -28 -142 -26 -78 -44 -186 -128 -143 -165 185 5 -51 272 27 225
7945B25M0k56R6q7J61l06J8L3O3l6p0J99j34J70m89M36J81j53j85L27j71J7k21
$$ 225 265 9 105 18 179 -127 -109 -76 -13 -49 -119 80 -54 116 -373 63 244 91 -94 233 62 79 -142
7968a42j8L04j54m2K43J40l78J3q4J14j87K34o1J33q6j83nM8K10j07j08K05k9
$$ -142 -160 144 -10 -52 191 331 -47 -34 -118 -4 -191 43 -18 115 29 -154 -159 -111 99 -8 -116 89 60
7991F0Ko2p0J70j64J85k43K09k61L40p3p3R4P7m7K2l77O6K84p0O3N0j93J42k84
$$ 60 62 0 -70 100 -64 121 -122 87 -174 166 93 20 114 191 144 166 -211 -145 139 69 132 182 -11 131 -153
8016a53J64J37j39K22l46P3J15j55Q7j32L01r0k96m4K08J23l5j0O7O2k51J32R7
$$ -153 11 148 9 231 -115 -42 73 -82 5 -127 174 84 -212 -256 -48 75 40 30 97 159 -92 40 137
8039A37j07j43J01P1j36P2O5P8Q0k23K50k90m7K92l28J82r9L3l9N1j92M8J49L7
$$ 137 30 -113 -12 59 -77 -5 60 138 218 -5 245 -45 -92 200 -128 54 -45 -12 -51 0 -192 -144 5 42
8063D2k11k06L54J14k56K66J16k49O3oP5r8K61l69K06PK9k40K32J9r5O6j93O2
$$ 42 -169 -375 -21 93 -163 103 219 -30 33 27 102 4 265 -104 102 109 138 -102 130 149 54 120 -73 -11
8087a1R6o6J79k25m1p1Q4K3J95k37J84J02j00j53K6r1J46j11O5kM8q5J67K23k73
$$ -11 85 19 198 -27 -68 -139 -55 -32 163 -74 110 212 112 -41 -15 -106 40 -71 -6 -8 40 -45 122 345 72
8112G2l39K95K85k45K10k67m4j02N7J32j22P9o3J57j21j05J37J03nJ1j61l36L32
$$ 72 -267 28 313 68 278 11 -33 -135 -78 54 -68 11 -52 105 -16 -121 16 119 114 125 -36 -372 -40
8135d0K2j16L45j93L17l73Q8Q5l09J77k67J30J83nj17Q0j00L53j98k4J8l30L39
$$ -40 -18 -134 211 18 335 -38 50 135 -174 3 -264 -134 49 44 -73 7 -93 260 62 38 56 -274 65
8158F5l6j46j35J86J62k8P1J5r2K7r2N5k16P1J86q4L5j45K38k89j9K45k90K09
$$ 65 29 -117 -252 -66 96 68 139 154 62 89 -3 52 -164 -93 93 9 44 -101 137 -152 -171 74 -216 -7
8182gj51K8L74k78P1lr9O6L9
$$ -7 -158 -130 244 -34 37 34 -65 1 40
8191D0
$$ Imaginary data points
##PAGE= N=2
##DATA TABLE= (X++(I..I)), XYDATA
0@%%%%%%%%qJ6k4L2l6M4n6Q0j04J28j60J93k33K81l37M03m77N57o51P59q78J015
$$ 0 0 0 0 0 0 0 0 0 -8 8 -16 16 -20 24 -32 48 -56 72 -88 105 -128 153 -184 219 -258 299 -352 407 -471 544
30E44j169J339j526J731j959K214k498K810l152L526l931M376m864N399n982O619
$$ 544 -625 714 -812 919 -1040 1174 -1324 1486 -1666 1860 -2071 2305 -2559 2840 -3142 3477
46C477p316Q074q903R808j0802J1898j3105J4441j5925J7582j9447K1560k3976
$$ 3477 -3839 4235 -4668 5140 -5662 6236 -6869 7572 -8353 9229 -10218 11342 -12634
59a2634K6769l0046L3949l8688M4592n2182O2356p6828R9397j41604L57189p49352
$$ -12634 14135 -15911 18038 -20650 23942 -28240 34116 -42712 56685 -84919 272270 -477082
71d77082P51547P3896r38053J394356q40408l67129Q32405p53949L32470M53776
$$ -477082 274465 348361 -589692 804664 -35744 -402873 429532 -324417 8053 461829
81D61829r33509M76665K4867k35600N09094l47919k39643L82927j10908O6222
$$ 461829 -471680 4985 29852 -205748 303346 -44573 -284216 98711 -12197 54025
91E4025J95913m80361J75635L25946m21042M41585k37575m09089P20545m01997
$$ 54025 249938 -230423 -54788 271158 -149884 291701 54126 -354963 365582 -36415
101c6415p7589N36871q59021M15428L88578q16220P50713l20263m46502Q85294
$$ -36415 -114004 422867 -436154 -20726 367852 -448368 302345 -17918 -464420 420874
111D20874o21877Q3361M16765o44275M16626Q4479l55503M37717k54421p8425
$$ 420874 -201003 -117642 299123 -345152 71474 155953 -199550 238167 -16254 -94679
121i4679K84476k43808K04345m5183j64088J57845p8899M6744O4701j31070o7227
$$ -94679 189797 -54011 150334 105151 -58937 98908 20009 66753 131454 384 -66843
132f6843J33993p7246M1380R2961l19084J39293J54814k18932K26076j47064k64450
$$ -66843 67150 -10096 31284 124245 -194839 -55546 99268 -119664 106412 -40652 -305102
143c05102M75787k08349n7373K58429m84938L32176J34135l02142K95663k75627
$$ -305102 170685 -37664 -95037 163392 -321546 10630 144765 -157377 138286 -137341
153a37341q439L26074k40375J04225m3851j97895L50678j30226m0359J05472k71006
$$ -137341 -145780 180294 -60081 44144 293 -197602 153076 22850 -17509 87963 -183043
164a83043K64260K6506j56788J31599j33506R276J67347r4705o1478Q4607j00144
$$ -183043 81217 107723 -49065 82534 -50972 -41696 125651 30946 -30532 54075 -46069
175d6069M8713J06907j57651J1358Q4646j28769R1922M2916k07230K01248q4295
$$ -46069 2644 109551 -48100 -36742 47904 -80865 11057 53973 -153257 47991 -36304
186c6304r6170K21271k19311J04178N5618j94667K02894o2096n6489J59635j92182
$$ -36304 -132474 88797 -130514 -26336 29282 -165385 37509 -24587 -81076 78559 -113623
197a13623Q1997J18031j77801J87122j16883p1885K16304j48616O8803P268j43410
$$ -113623 -31626 86405 -91396 95726 -21157 -93042 123262 -25354 43449 50717 -92693
208i2693J33769L0693p8370L7112o8677j1503J30500o6899l8840K653k4967N5074
$$ -92693 41076 71769 -6601 30511 -38166 -49669 80831 13932 -24908 -22255 -47222 7852
220G852N0566q7750k8200O3081n3598J17291n7469r8325J17593o9123P1986K6194
$$ 7852 58418 -29332 -57532 5549 -48049 69242 11773 -86552 31041 -38082 33904 60098
232F0098j45181Q8663J9007n2853J10991j30665p906J32301j34394J04393m2230
$$ 60098 -85083 3580 22587 -30266 80725 -49940 -57846 74455 -59939 44454 2224
243B224r3483J47923p5116j654M6227q7126N4561M8397r0610N6343j5365k9265
$$ 2224 -91259 56664 -18452 -20106 26121 -61005 -6444 41953 -48657 7686 -7679 -36944
255c6944Q8583p3094j803L4884j5839J4271J0209n1781J9890N7922o6822M6103
$$ -36944 51639 -21455 -23258 11626 -4213 10058 20267 -31514 -11624 46298 -20524 25579
267B5579l6099k9173R4700n1405j4800K5993n1259N1891M2460j02442N8283k0853
$$ 25579 -10520 -39693 55007 3602 -11198 14795 -36464 15427 57887 -44555 13728 -7125
279g125j6107J03812j13177J7632L1020l9031P2572l6592n8889N9392p733l394
$$ -7125 -23232 80580 -32597 -14965 16055 -22976 49596 13004 -45885 13507 5774 2380
291B380M0230r3589M1865L3570l4702L6645n4860m04M3114P29k6602O098k3404
$$ 2380 42610 -50979 -9114 24456 -10246 26399 -28461 -28865 14249 14978 -11624 -5526 -28930
304b8930K1736M5588o0822J4649m492K591M0669k4887l4183K9972O303k399L3119
$$ -28930 -7194 38394 -22428 -7779 -12271 -9680 30989 6102 -28081 1891 8194 5795 38914
317C8914p6601L7212K6559l1213M0906n8444L564M5522j9173n936j225l6997M9341
$$ 38914 -37687 -475 26084 -5129 35777 -22667 -19103 26419 7246 1310 85 -36912 12429
330A2429J0655m7363K9028m1903L7510K3092m0153N106q487J9347J6194o783l5960
$$ 12429 23084 -24279 4749 -37154 356 23448 -16705 -11599 -20086 -739 15455 8672 -27288
343b7288K2947R383Q910N028m1380J5757J5067J2151j7060j0023j7516K9181J8134
$$ -27288 -4341 5042 13952 18980 -22400 -6643 8424 20575 3515 -6508 -24024 5157 23291
356B3291m0382J4163l4034L2770K1305l5980R57j1713J5453K6653j4579k9030
$$ 23291 -17091 -2928 -36962 -4192 17113 -18867 -17910 -29623 -14170 12483 -2096 -31126
368c1126K3748p000L4113k205m1381L2001j0019L3691n988k7514Q437P550J7688
$$ -31126 -7378 -14378 19735 17530 -23851 8150 -1869 31822 25834 -1680 6757 14307 31995
381C1995q382j3308j4685K3813j046j688j8055r837J6847m125N806l1925J2990
$$ 31995 23613 10305 -4380 19433 18387 16699 -1356 -11193 5654 1529 7335 -24590 -11600
394a1600k168Q573M40l2002K3931q220J8124q346k3315J6795J2807J305o1k0510
$$ -11600 -13768 -5195 -4755 -36757 -12826 -21046 -2922 -11268 -34583 -17788 -4981 -3676 -3737 -24247
408b4247k76M7165k6595J3370k0255j1629N9541k3716M199j7492p594L6927J2119
$$ -24247 -24523 22642 -3953 9417 -10838 -22467 37074 13358 17557 65 -7529 29398 41517
421D1517j9329j7883j919J8065L2490k9440j6914j5952K6891K2388k1752j5689
$$ 41517 22188 4305 2386 20451 52941 23501 6587 -9365 17526 39914 18162 2473
433B473l3249L8631O149j891k1041l3932L4906N179Q466j2955l1471J8123L2458
$$ 2473 -30776 7855 14004 12113 -8928 -42860 -7954 -2775 5691 -7264 -38735 -20612 11846
446A1846j4901J4268k4179j2041O3732l4009J7839m106k5679M3556j3476K77L31
$$ 11846 -3055 11213 -12966 -25007 38725 4716 22555 18449 -7230 36326 22850 23127 23458
459B3458p688p53M663o053J512o494k754m518j3530K7880k3535J4108j0443k2440
$$ 23458 15770 15017 19680 13627 15139 8645 5891 1373 -12157 15723 -7812 6296 -4147 -26587
473b6587L8695o207J4909k2949q099K2714J6701J7931l2002j9597K9703J5588
$$ -26587 12108 5901 20810 -2139 -10238 12476 29177 47108 15106 -4491 25212 40800
485D0800M389P93o6915L3607K6893k0265K4900p5040K211L8108J029K385m8222
$$ 40800 45189 45982 -20933 12674 39567 19302 44202 -30838 -28627 9481 10510 12895 -35327
498c5327j5362K7146L0183L154l7992k4670M4432J1234K6471j4221n2702N5479
$$ -35327 -50689 -23543 6640 9794 -28198 -52868 -8436 2798 29269 15048 -37654 17825
510A7825O525K3691J373m3112J2111J9337K8331j9178j9179q808j645K9711j640
$$ 17825 24350 48041 49414 6302 18413 37750 66081 46903 27724 18916 17271 46982 45342
523D5342m5444J2461p506j8137N1861n3002J861J2567l7824M4941r250o567l258
$$ 45342 -102 12359 4853 -13284 38577 -14425 -12564 3 -37821 7120 -2130 -8697 -11955
536a1955j0838J7229Q363Q189l143k6743J6954J7252r133L8239n5719q301M1567
$$ -11955 -22793 -5564 2799 10988 7845 -18898 -1944 15308 6175 44414 -11305 -19606 21961
549B1961j3759L5021l9797l0937K1191K7994J3724l3876j9539k532K6555L6940
$$ 21961 8202 43223 3426 -27511 -6320 21674 35398 1522 -18017 -20549 6006 42946
561D2946k5519m4929K3131n816M5476J6073p9575K0435J194L3218K4262n4332
$$ 42946 17427 -27502 -4371 -10187 35289 51362 -28213 -7778 -6584 26634 50896 -3436
573c436j7177M158M1252J0285l3063j8663p903J9382M4543m0681j9140J1311k4905
$$ -3436 -20613 -16455 24797 35082 2019 -16644 -24547 -5165 39378 -1303 -20443 -9132 -34037
586c4037O6388j9174l2684J3287j7244L7857L405j5708j0302k499J7358N589n578
$$ -34037 32351 13177 -19507 -6220 -23464 14393 17798 2090 -8212 -10711 6647 12236 6658
599F658M377k2198K555K5410k3528K9785k7981j8412L0682j2917K4583j8220j3616
$$ 6658 11035 -11163 -8608 16802 -6726 23059 -4922 -23334 7348 -5569 19014 794 -12822
612a2822J529N570K8211j1041j6638l547o191L3655K0432n0605Q345j3476J8656
$$ -12822 -11293 -5723 22488 11447 -5191 -8738 -14929 18726 39158 -11447 -3102 -16578 2078
625B078M9389n7463n831q508J3535L9517k5687k3861j4824J4288L3385l414l0423
$$ 2078 51467 -5996 -11827 -20335 -6800 32717 7030 -16831 -31655 -17367 16018 12604 -17819
638a7819r924p494M8104O532l4792M89k2192M7931J3153k3917q227j5500L2095
$$ -17819 -27743 -35237 12867 19399 -15393 -14904 -37096 10835 23988 71 -8156 -23656 8439
651H439J2461m896j6291j3791J5514J9338q213k247j9579k525L4600k3646J3501
$$ 8439 20900 16004 -287 -14078 1436 20774 12561 10314 -9265 -11790 22810 -836 12665
664A2665j6963j2767L1811k1775J4505o291j2244J2091p073M535J2136j5677o35
$$ 12665 -4298 -17065 14746 -7029 7476 1185 -11059 1032 -6041 -1506 10630 -5047 -5682
677e682K433p679K9962k0931j192k109j0502L2844j3047m96j3853m788K2345O375
$$ -5682 -3249 -10928 19034 -1897 -3089 -5198 -15700 17144 4097 3601 -10252 -15040 7305 13680
691A3680o321j9060m806J6535J9962j2211j1128j9549K3364J8633j1929K29l5039
$$ 13680 7359 -11701 -16507 28 19990 7779 -3349 -22898 466 19099 7170 7399 -27640
704b7640K6406J5901n758N58l1808J1567K1660Q58p717j5840r522L1053j50p383
$$ -27640 -1234 14667 8909 9467 -22341 -10774 10886 11744 4027 -11813 -21335 9718 9568 2185
718B185o831j9815L4980o338J292o421j7157K5241j093M81m973p165N191J3011
$$ 2185 -4646 -24461 10519 4181 5473 -948 -18105 7136 6043 6524 1551 -5614 -423 12588
732A2588q047j966j167k061J3670j2939N543q348Q532J857j3268J0629j2552J5174
$$ 12588 4541 2575 1408 -653 13017 78 5621 -2727 5805 7662 -5606 5023 -7529 7645
746G645m975j1291N188j275P006J440j2921k398J3375n947J5694k0712m212J8673
$$ 7645 2670 -8621 -3433 -4708 2298 3738 -9183 -11581 1794 -4153 11541 -9171 -13383 5290
760E290r045K1149k1915o655J5463K244P502r020j3679Q216J6173p617K293j9388
$$ 5290 -3755 17394 -4521 -11176 4287 6531 14033 5013 -8666 -450 15723 8106 10399 -8989
774h989N734J4774l925q48j9785R638K361J0023r507j5005R836q00J2488q686
$$ -8989 -3255 11519 7594 6746 -13039 -3401 -1040 8983 -524 -15529 -5693 -6493 5995 -2691
788b691j0931K673J0862L48J989j2026k149K1254j2092J1693j5476j394J9595
$$ -2691 -13622 -10949 -87 261 2250 -9776 -11925 9329 -2763 8930 -6546 -7940 11655
801A1655j0273O358j1307j286J1518K521r623m3n029P630R939j8292O006r559
$$ 11655 1382 7740 -3567 -4853 6665 9186 -437 -480 -5509 2121 12060 -6232 -226 -9785
815i785J2336M586j1767O81o750J5924j899k125q156R81J1325J173l174r250M461
$$ -9785 2551 7137 -4630 -3949 -10699 5225 3326 1201 -6955 -5974 5351 6524 3350 -5900 -1439
830a439L699J1629j4371q49o00K583J6215k0649M289n415N748J1432j4404l227
$$ -1439 2260 13889 -482 -1331 -1931 652 16867 -3782 507 -4908 840 12272 -2132 -5359
844e359m33M955N867k603j6968J1011q32N330K214k1657J4747k554Q424k089j2670
$$ -5359 -5792 -837 5030 2427 -14541 -3530 -4362 968 3182 -18475 -3728 -6282 2142 53 -12617
859a2617N913L969Q021n640l316l759J2622J943j403n719k011J2460k715N630
$$ -12617 -6704 -2735 5286 -354 -3670 -7429 5193 7136 5733 14 -1997 10463 7748 13378
873A3378j5858O685M281j491N765j9179Q266J868j14o57j0301k556J0797k482
$$ 13378 -2480 4205 8486 6995 12760 -6419 1847 3715 3601 2944 -7357 -9913 884 -1598
887a598n851J073j2859K1749n779n151L420j0499K0961k400k796l433J85J0713
$$ -1598 -7449 -6376 -19235 2514 -3265 -8416 -4996 -15495 5466 3066 270 -3163 -2978 7735
901G735O172o320p019M312L077J2899j3990m039k907O423J0317j5411j518j1987
$$ 7735 13907 7587 568 4880 7957 20856 6866 2827 -80 6343 16660 1249 -269 -12256
915a2256J4437M275r943k667j0943J2063Q083n164p439N55r77J8618m480j0847
$$ -12256 2181 6456 -3487 -6154 -17097 -5034 3049 -2115 -9554 -8999 -9976 8642 4162 -6685
929f685Q626j0055K2988n829q000L754o006J3656l288n638k998J120K73M364r575
$$ -6685 1941 -8114 14874 9045 1045 4799 -1207 12449 9161 3523 525 1645 1918 6282 -3293
944c293j1K510o520R512j2855P394j443j094M312r325J1179k908N855m159n408
$$ -3293 -3304 -794 -7314 2198 -10657 -3263 -4706 -5800 -1488 -10813 366 -2542 3313 -846 -6254
959f254R285N036n75k743p141K041J9251j3192J957j0542l186K3334j1828Q67
$$ -6254 3031 8067 7492 4749 -2392 -351 18900 5708 7665 -2877 -6063 17271 5443 6310
973F310j4599j105J5941J468m815j2801l780J3754J1649j1792l943j3487J6668
$$ 6310 -8289 -9394 6547 8015 3200 -9601 -13381 373 12022 230 -3713 -17200 -532
986e32J4890j1855r05j6862J4680J0161K72q159j3620J0061N440P444p862j2891
$$ -532 14358 2503 1598 -15264 -584 9577 9849 1690 -11930 -1869 3571 11015 3153 -9738
1000i738R01J4041k033J912r434r686K1645r799Q001n521r642J3189n981P860
$$ -9738 -8837 5204 3171 5083 -4351 -14037 7608 -2191 5810 289 -9353 3836 -2145 5715
1014E715k631m545J122o92J290P359p851j768K592r955J8296q686n58j773j0527
$$ 5715 3084 -1461 -339 -1031 259 7618 -233 -2001 591 -9364 8932 246 -312 -2085 -12612
1029a2612J4938L41L368j2861l970Q146Q507N078j3289j0034Q756J3877j628J321
$$ -12612 2326 2667 6035 -6826 -10796 -2650 5857 10935 -2354 -12388 -3632 10245 8617 9938
1043I938k3795P432J7047l194Q116k6895J052J3374P037L400k1094p351J1683
$$ 9938 -13857 -6425 10622 7428 15544 -11351 -10299 3075 10112 13512 -7582 -14933 -3250
1056c250J2145J039j0631j8712J5763P628L883j074k4326J3286M322R407j279
$$ -3250 8895 9934 -697 -19409 -3646 3982 7865 6791 -17535 -4249 73 9480 8201
1069H201j6249J616L829J3470l629q742m851M451N567N676r585m355N207p694
$$ 8201 -8048 -6432 -2603 10867 7238 -1504 -6355 -1904 3663 9339 -246 -4601 606 -7088
1083g088J6350r453j003J272j1340J5389k524O97l406p384M858P168p74N29q401
$$ -7088 9262 -191 -1194 78 -11262 4127 1603 2300 -1106 -8490 -3632 3536 2762 3291 -5110
1098e110n211J4732l497R511j3834r708J3513J308J2719j5879j0050M918J0751
$$ -5110 -10321 4411 914 10425 -3409 -13117 396 1704 14423 -1456 -11506 -6588 4163
1111D163Q468r345j2482r06J3279P199N23k0043P00N948J1448P692k4778J638
$$ 4163 12631 3286 -9196 -10102 3177 10376 10899 -9144 -8444 -2496 8952 16644 -8134 -6496
1125f496o30J4533Q149j8464n460L87J1455P787p651j3549M363K824J1544k439
$$ -6496 -7126 7407 15556 -2908 -8368 -7981 3474 11261 3610 -9939 -5576 -2752 8792 6353
1139F353j4358M987n502J7048k720r207J700n442J1710K82m262k392K17k10N500
$$ 6353 -8005 -3018 -8520 8528 5808 -3399 -1699 -7141 4569 4851 589 -1803 -1586 -1796 3704
1154C704j832q04l12o840Q607m404P841o272o951P328n573J2140n514o570J47
$$ 3704 1872 1068 756 -6084 2523 -1881 5960 -312 -7263 65 -5508 6632 1118 -5452 -5305
1169e305O57O658L827q043p148M941K947J2718j2818m997j77M406J6676j4156
$$ -5305 -4648 2010 5837 -2206 -9354 -4413 -1466 11252 -1566 -6563 -6740 -2334 14342 186
1183A86l167m536N456J3526m924q890m316M182Q415O223j4664k347q00J0253O332
$$ 186 -2981 -7517 -2061 11465 6541 -2349 -6665 -2483 5932 12155 -2509 -4856 -5656 4597 10929
1198A0929j2523q87p332J3951K877p285k050o648R331M232k624o065K06n08Q836
$$ 10929 -1594 -2481 -9813 4138 7015 -270 -2320 -8968 363 4595 1971 -4094 -3888 -4396 4440
1213D440k324m863J419m134J1600p156J970q59l916Q805o630K261N25p20n68N53
$$ 4440 2116 -2747 -1328 -5462 6138 -1018 952 93 -3823 4982 -1648 613 1138 418 -150 403
1229D03l079M519Q19n668L394o084Q930k488q77j502n566J0870k786K013n643
$$ 403 -2676 1843 2662 -3006 388 -5696 3234 746 -131 -1633 -7199 3671 885 2898 -2745
1244b745k947O579M229j700n156k193J537J0830o161j243o458K994J0342o132
$$ -2745 -5692 887 5116 3416 -1740 -3933 -2396 8434 2273 1030 -5428 -2434 7908 1776
1258A776J460j0493M311P264j402k222o676J322N741L919p306q58l715Q442K469
$$ 1776 3236 -7257 -2946 4318 2916 694 -5982 -4660 1081 5000 -2306 -3164 -6879 1563 4032
1273D032n754Q82o341J1310j805r59j423m009Q295p05o28l010P32J437N143n512
$$ 4032 -1722 -840 -7181 4129 2324 1365 -58 -4067 4228 3523 2895 -115 617 2054 7197 1685
1289A685p07J484j592P391r250K640j511J565M081q006J856k159M163l25l055
$$ 1685 978 2462 870 8261 -989 1651 140 1705 5786 -2220 -364 -2523 1640 1315 -1740
1304a740l086K314J993O45j634o494P075k115N099m041n224O978j962O725o462
$$ -1740 -4826 -2512 -519 126 -1508 -8002 -927 -3042 2057 -1984 -7208 -230 -2192 4533 -1929
1319a929j982L123K483K590k691m095J584N891k638K504q257L300M940l116L441
$$ -1929 -3911 -788 1695 4285 1594 -2501 -917 4974 2336 4840 -3417 -117 4823 1707 5148
1334E148r923N040J582P98n10n832K256K333K405l834q56k832P096j162j788p38
$$ 5148 -4775 265 1847 2645 2135 -3697 -1441 892 3297 -537 -1393 -4225 2871 1709 -79 -817
1350h17m351R530m230J472m154j217O855k884P71m659N53L190J654m100k74j490
$$ -817 -5168 4362 132 1604 -2550 -3767 3088 204 975 -3684 -3131 59 1713 -2387 -2661 -4151
1366d151K886M509p849L685m285N827K624o219K479l871O968O04k647k288J038
$$ -4151 -1265 3244 -4605 -920 -5205 622 3246 -2973 -494 -4365 2603 3207 560 -1728 -690
1381f90K939K162k465m692M140j593O582o391l037K495j020O992p777q34r81K743
$$ -690 2249 4411 1946 -2746 1394 -199 6383 -8 -3045 -550 -1570 5422 -2355 -3189 -4170 -1427
1397a427M052n079k872r6L586J337M64p700L917J335K088K258r477O115j971N345
$$ -1427 2625 -2454 -5326 -5422 -1836 -499 -35 -7735 -3818 -2483 -395 1863 -7614 -1499 -3470 1875
1413A875r0o340K740K22L862o15k846j435M246r50K122l029k421O419m333M590
$$ 1875 1785 -4555 -1815 -1593 2269 1654 -1192 -2627 1619 669 2791 -238 -2659 3760 -573 4017
1429D017n448Q91L270k987L456n329K459J126j88j402j057p08L535k17m443K159
$$ 4017 -1431 -540 2730 -257 3199 -2130 329 1455 1267 -135 -1192 -1900 1635 1418 -3025 -866
1445h66m318Q120k732l859J235l630Q805l017k252j965j67N517J674m360k761
$$ -866 -5184 2936 204 -3655 -2420 -6050 2755 -262 -2514 -4479 -4646 871 2545 -1815 -4576
1460d576J251K262P416q283q37p98K644Q606q052n86l494M973N374l635k840l331
$$ -4576 -3325 -1063 6353 -1930 -2767 -3565 -921 7685 -367 -953 -4447 526 5900 2265 -575 -3906
1476c906L478M720J17n965J05j794P073P47o249J553n020Q762q20l158M3l632
$$ -3906 -428 4292 4409 -1556 -1451 -3245 3828 4575 -1674 -121 -5141 3621 2801 -357 -314 -3946
1492c946N648l14p81j186p63l4L229k650J446J89m503O329n015M836j091l028
$$ -3946 1702 1388 607 -579 -1342 -1376 1853 -797 649 838 -3665 2664 -2351 2485 1394 -1634
1508a634K850m206N542l39r05k128j316K201M831k595l431o51l15R447m954j929
$$ -1634 1216 -2990 2552 2213 1308 -820 -2136 65 4896 2301 -1130 -1781 -2096 7351 2397 468
1524D68l198r51J0075l542l59o603K29P267J935k750o044j875N737O378n139k775
$$ 468 -2730 -3681 6394 2852 2493 -4110 -3881 3386 5321 2571 -3473 -5348 389 6767 1628 -1147
1540a147o281O827O554m557J27r540O242N427r18j005p329J899N431K346k894
$$ -1147 -7428 -601 5953 1396 1523 -8017 -1775 3652 2734 1729 -5600 -3701 1730 4076 1182
1555A182l315l410P351J290r94j908n393P189k184L231j758m476L797k071L716
$$ 1182 -2133 -5543 1808 3098 2104 196 -5197 1992 -192 3039 1281 -3195 602 -1469 2247
1570B247l64k578j167M38J046L591k358k521J327l267P488l304L31j533n003Q095
$$ 2247 1883 -695 -1862 -1424 -378 3213 855 -1666 -339 -3606 3882 578 909 -624 -5627 2468
1586B468l07Q37l876l940L968N342j167l264m505P95Q500j929j32q264O93P027
$$ 2468 2161 2998 -878 -4818 -850 4492 3325 61 -4444 -3649 4851 2922 2790 -5474 -4781 2246
1602B246K5K674j0500p56N235L722J432p495m289M301O042m71k899p472M476L855
$$ 2246 2271 4945 -5555 -6311 -1076 2646 4078 -3417 -7706 -3405 2637 2166 -733 -8205 -3729 126
1618A26J997l62r482M813L96N069M03p739J300J599L992M27l285l518L997O82
$$ 126 2123 1761 -7721 -2908 -2512 2557 2960 -4779 -3479 -1880 2112 2539 -746 -4264 -267 415
1634D15K369j913l458L049k968N452k282q54L95l969N161n23L0j421j788J19L224
$$ 415 2784 871 -2587 462 -2506 2946 664 -190 205 -3764 1397 874 904 -517 -2305 -2186 1038
1651A038q8l14k088l143M934q06L706n316l462M192K72N431n727m165J789L594
$$ 1038 950 636 -1452 -4595 339 -467 3239 -2077 -5539 -1347 -1075 4356 -1371 -5536 -3747 -153
1667a53K843j888n583p35N356J620K070p557m39K896L452L853q598K24J85M997
$$ -153 2690 802 -4781 -5516 -160 1460 3530 -4027 -4466 -1570 1882 5735 -2863 -2639 -2454 2543
1683B543L260n470k694O93L913K091j106o078J980P85L664l84n798K174k422O144
$$ 2543 5803 333 -2361 -1668 2245 4336 3230 -2848 -868 -83 3581 3197 -2601 -427 -2849 3295
1699C295j835l424N63k036L984n84j809p69Q11r91K659j809K51J053l153M053
$$ 3295 1460 -1964 -1401 -3437 547 -37 -1846 -2615 -1804 -2795 -136 -1945 -1694 -641 -3794 259
1715B59k453K853o09k178K666j847L288n50j068r34J297J076K198j802k764J455
$$ 259 -2194 659 50 -2128 538 -1309 1979 1429 361 -573 724 1800 3998 2196 -568 887
1731H87J99M956m121j694k66J59N585m116r32k575J214M228j088l132k191J294
$$ 887 1086 6042 1921 227 -39 120 5705 1589 657 -1918 -704 3524 2436 -696 -2887 -1593
1747a593K379K523n519L60j526L539K568n040J020l003M590J209k478r61j229
$$ -1593 786 3309 -2210 -1850 -3376 163 2731 -2309 -1289 -4292 298 1507 -971 -1932 -3161
1762c161K894J496n67l082J386m64L356j139j965J576j810M438k714K65pl44K724
$$ -3161 -267 1229 662 -2420 -1034 -1498 1858 719 -1246 330 -1480 2958 244 509 502 158 2882
1779B882k212K41m4J091j0qj990J562N53j110J289m368L834r32j0m58l303L119
$$ 2882 670 911 867 1958 1948 1940 -50 1512 2065 955 2244 -2124 1710 778 768 310 -2993 126
1797A26n85J043k129j515R76J921n66j146o58o90M743k768J219k523K28M033j848
$$ 126 -459 584 -1545 -3060 -2084 -163 -729 -1875 -2533 -3223 1520 -1248 -29 -2552 -2324 1709 -139
1814a39J567l711J654J843N24l86k150M24J679J378k589O93k384L484M23k307
$$ -139 1428 -2283 -629 1214 1738 1352 -798 -374 1305 2683 94 787 -1597 1887 2310 3
1830CJ024l248M384p34q03o38j478K216P5n15j711M12l7K255k737m39L99r27L472
$$ 3 1027 -2221 2163 1429 626 -12 -1490 726 801 286 -1425 -1013 -1050 1205 -1532 -1971 -1572 -2499 973
1849I73l801J201j127Q97K115l031Q71r49K109P62p08j581J301O96J156J01k805
$$ 973 -2828 -1627 -2754 -1857 258 -2773 -1902 -2851 -742 20 -688 -2269 -968 -272 884 985 -1820
1866a820L183j597L144j581k124K365r35K788k455r45JJ175Q50r66j808l66K378
$$ -1820 1363 -234 2910 1329 -795 1570 635 3423 968 23 24 1199 2049 1083 -725 -1091 1287
1883A287j011J372l860J199J884j257K031m409K123P5J323l6k349K86R63J387
$$ 1287 276 1648 -2212 -1013 871 -386 1645 -2764 -641 -566 757 721 -1628 -1342 -379 1008
1899A008r80m86j819L142n63j52l95k357L978j967J854j792j029K413n31J142
$$ 1008 28 -458 -2277 865 302 150 -245 -2602 1376 -591 1263 -529 -1558 855 324 1466
1915A466j977K47O59J297j172K23j088J096J591k664J954k502K463K53k109J259
$$ 1466 -511 -264 395 1692 520 743 -345 751 2342 -322 1632 -870 1593 1846 -263 996
1931I96j854K326k85j189n88O40J63J147j304j551J766p77L365l128p60J026k14
$$ 996 -858 1468 1183 -6 -594 46 209 1356 52 -1499 267 -510 2855 -273 -1033 -7 -221
1948b21L545l331m37m32J598J628j221j919j16K073M48P63l998J268J63J753J223
$$ -221 3324 -7 -444 -876 722 2350 1129 -790 -906 1167 1615 2378 -1620 -352 -189 1564 2787
1965B787m209J822j469L362O1k578m6j93K344Q4r49k008J657o41K532j689j786
$$ 2787 -1422 400 -1069 2293 2354 -224 -270 -463 1881 1965 1016 -992 665 24 2556 867 -919
1982i19J992k383L615k274j48J94q13J458j272P54p34O59n12L42l41Q99p4j555
$$ -919 1073 -1310 2305 31 -117 77 -736 722 -550 204 -530 129 -383 -41 -382 517 443 -1112
2000a112J807j969L145j551j065O16p25L100j784n22r29N25J361Q09j525j948
$$ -1112 695 -1274 1871 320 -745 -129 -854 2246 462 -60 -989 -464 897 1706 181 -1767
2016a767Q36Q31K870l570j29j202J694L684l787j44k102K447K331r17j963j518
$$ -1767 -931 -100 2770 -800 -929 -2131 -437 3247 -540 -684 -2786 -339 1992 1075 -888 -2406
2032b406J569K177J045l006k86r91L854O86k503k00k268M429o00m09j248j650
$$ -2406 -837 1340 2385 -621 -907 -1898 1956 2642 139 -61 -2329 2100 1500 1091 -157 -1807
2048a807K205M41O6j526p98l74K279j025J33j165j870L407k053J997j946r64J860
$$ -1807 398 839 905 -621 -1419 -1793 486 -539 -406 -1571 -3441 -34 -2087 -90 -2036 -3000 -1140
2065a140j194J935o83j31o43P96N65J716j200r66M82j73L375k359j6j640M05L384
$$ -1140 -2334 -399 -1082 -1213 -1856 -1060 -495 1221 21 -945 -463 -636 2739 380 364 -1276 -871 2513
2083B513j672kk959N27K033J256j408k721m46K015K976k413p72l067L296K269
$$ 2513 841 839 -2120 -1593 440 1696 288 -2433 -2879 -864 2112 -301 -1073 -4140 -844 1425
2099A425j344R3m058K745J800P70r05k878N35K294J628j741j355k086L458O41
$$ 1425 81 174 -3884 -1139 661 1431 526 -2352 -1817 477 2105 364 -991 -3077 381 1022
2115A022n53r50k863L289p02J783j899j512J255L76J752r55q34r08J904Q4J166
$$ 1022 469 -481 -3344 -55 -757 1026 -873 -2385 -1130 -754 998 43 -791 -1699 205 289 1455
2132A455j462n19J011j034L173k388N94n96j154K622j165L83j654o10Q61J401
$$ 1455 -7 -526 485 -549 2624 236 830 234 -920 1702 537 920 -734 -1344 -483 918
2148I18q22j008j157M0L063j815O70k993Q51K169m78J457l872N80J304K208j1
$$ 918 96 -912 -2069 -2029 1034 -781 -111 -3104 -2253 -84 -562 895 -2977 -2397 -1093 1115 1104
2165A104k320q65J358K571l81l23l359K119J268J259k04l636J896K2K621j104
$$ 1104 -1216 -2081 -723 1848 1467 1144 -2215 -96 1172 2431 2227 -1409 487 509 3130 2026
2181B026k330rO22J804m53j628j531J798n29J760j646j593J583j075K357j810
$$ 2026 -304 -313 309 2113 1660 32 -1499 299 -230 1530 -116 -1709 -126 -1201 1156 -654
2197f54O4l85j40J667q70k08n97N08j74J336q53L75k77q64J689j293J621j746
$$ -654 -590 -975 -1115 552 -318 -526 -1123 -615 -789 547 -306 69 -208 -1072 617 -676 945 -801
2215h01k82J096l33J933j949l56K44R58Q52n43j617J74J362k73J830l176P37K58
$$ -801 -1083 13 -320 1613 -336 -692 -448 510 1362 819 -798 -624 738 465 2295 -881 -144 114
2233A14R00J260k632J12p23J901M57j302j147j09J105Q60m18k689J597n76J889
$$ 114 1014 2274 -358 -246 -969 932 1389 87 -1060 -1169 -64 796 378 -2311 -714 -1290 599
2250E99l73j985J198j190K804j000l64n94J58J714k97m49q87J049k26J201j283
$$ 599 226 -1759 -561 -1751 1053 53 -311 -905 -747 967 670 221 -666 383 157 1358 75
2267G5m0N75r43J744j983J065n63J42Q53j102O80n93M71l47L56o11J045m16p65
$$ 75 35 610 -333 1411 -572 493 -70 72 925 -177 503 -90 381 34 390 -221 824 408 -357
2286c57P26j174K137j719M33n85k24J503j081J93j292M69N35M38j049l79oP81
$$ -357 369 -805 1332 -387 46 -539 -763 740 -341 -148 -1440 -971 -436 2 -1047 -1426 -1432 -651
2304f51J167j579N63p94J611O03j378J127j604J682N42o27l32m78O59R22j53j151
$$ -651 516 -1063 -500 -1294 317 920 -458 669 -935 747 1289 662 330 -148 511 1433 1280 129
2322A29O08p17J511r93m21J51q79K213j810L76n95L90O07o40L9p33R19N0M60j293
$$ 129 737 20 1531 538 117 268 -611 1602 -208 168 -427 -37 570 -70 -31 -764 155 205 665 -628
2342f28N22K98n9Q39j880J622j121J109j85j113J075o92P17k56m05l54J083l25
$$ -628 -106 192 133 972 -908 714 -407 702 517 -596 479 -213 504 248 -157 -511 572 247
2360B47K61n71o18J682q33Q99j313n0J247n90J110j932O87o3N37k17n52n30O80
$$ 247 508 -63 -681 1001 168 1067 -246 -296 951 361 1471 -461 226 163 700 483 -69 -599 81
2379H1O51r52M95j685J761J03j92L43j648K004p95N64l31m51N15M25K10q63J9
$$ 81 732 -220 275 -1410 351 454 262 605 -1043 961 166 730 399 -52 463 888 1098 235 254
2398B54m10J309j002M12n76m00J674j774J359j524P31N23m51J12q16O09K51K42
$$ 254 -156 1153 151 563 -13 -413 1261 -513 846 -678 53 576 125 237 -579 30 281 523
2416E23j009R23o93Q72K64j126J215j036J393q30o96P31n90J085p93K6l51M05
$$ 523 -486 437 -256 616 880 -246 969 -67 1326 496 -200 531 -59 1026 233 259 -92 313
2434C13O0k1p38j59J124p68J246k259Q42J58J68J126k342R18k48J029r2p65l40
$$ 313 373 352 -386 -545 579 -189 1057 -1202 -360 -202 -34 1092 -1250 -332 -580 449 357 -408 -748
2453g48L16R74K3k12j571J733k46N70o17j152J469n96J104q25n82K93L31M92p59
$$ -748 -432 542 565 353 -1218 515 269 839 222 -930 539 -57 1047 222 -360 -67 264 756 -3
2472cm75l70J074p12Q62j306K68N71p37J305j437J001m13K36M64m96M34m10M59
$$ -3 -478 -848 226 -486 376 -930 -662 -91 -828 477 -960 41 -372 -136 328 -168 266 -144 315
2491C15k58O64j55O21p51k25P16j088J700k196K53M4k63R45j374j45m04P09M96
$$ 315 57 721 566 1187 436 211 927 -161 1539 -657 -404 -360 -623 322 -1052 -1197 -1601 -892 -396
2510c96o51o32j33J011J77Q65k056R89k43J663P61k033O12n94K221k35q00q18
$$ -396 -1047 -1679 -1812 -801 -624 241 -1815 -826 -1069 594 1355 -678 -66 -660 1561 1326 526 -292
2528b92K11O96Q31p50j654O30l17J667j268r86K13p19K183r59k59q39N04J246
$$ -292 -81 615 1446 696 -958 -328 -645 1022 -246 -1232 -1019 -1738 445 -514 -773 -1612 -1108 138
2546A38l18j16o89O53L42O85n41L88o64k34J352r19R64j485L39L2k26Q64j095
$$ 138 -180 -296 -985 -332 10 695 154 542 -122 -356 996 77 1041 -444 -105 -73 -299 565 -530
2565e30M1k57L92J45M29j132J05J93K63J366j825N61r30J407J177j527L26r72
$$ -530 -489 -746 -354 -209 220 -912 -807 -614 -351 1015 -810 -249 -1179 228 1405 -122 204 -768
2583g68J258Q28m14j208o91O98J191L70j860j52o55K272n9j158l83j188K535k75
$$ -768 490 1318 904 -304 -995 -297 894 1264 -596 -748 -1403 869 810 -348 -731 -1919 616 341
2601C41k66j076l40J076N77L86j037o33k22K223r00P5j001j76K030q05N66j668
$$ 341 75 -1001 -1341 -265 312 698 -339 -972 -1194 1029 129 204 -797 -973 1057 252 818 -850
2619h50L52O99j7O99p84m38K32P94k32N60j211O5N21j74J280j792L34n70P24O20
$$ -850 -498 201 184 883 99 -339 -107 687 455 1015 -196 -131 390 216 1496 -296 38 -532 192 812
2639H12p98J70j153N48N01Q39j285l91k70Q79Q34j005J38j469J641O21l23j95
$$ 812 14 184 -969 -421 80 919 -366 -757 -1027 -148 686 -319 -181 -1650 -9 612 289 94
2657I4j547J311L67Q44j102j200K31J431P46q52n78j253K079J37N0j031j024J823
$$ 94 -1453 -142 225 1069 -33 -1233 -1002 429 1175 323 -255 -1508 571 708 758 -273 -1297 526
2675E26l00J147j517o51O09N67O99j082o49n22J702l76N11j246k30P33k10J188
$$ 526 226 1373 -144 -795 -186 381 1080 -2 -651 -1173 529 153 664 -582 -812 -79 -289 899
2693H99j744M97l00M87Q14j010L75l46L40K34O23r66K15l4k92J324j204Q96j679
$$ 899 -845 -348 -648 -161 653 -357 18 -328 12 246 869 -97 118 84 -208 1116 -88 808 -871
2712h71O78N72k19M81j435P16k51J062m50n64m83N62Q44m85L46j608J247N0O32
$$ -871 -193 379 160 641 -794 -78 -329 733 283 -281 -764 -202 642 157 503 -1105 142 192 824
2731H24l10j480J157n28J624q35o58l63M07J056m27q59p64J412n57P80j073n16
$$ 824 514 -966 191 -337 1287 452 -206 -569 -162 894 467 -392 -1156 256 -301 479 -594 -1110
2749a110Q10l24J421j421K01k31M69O52l85k63k7L28J71M13j055O11j42j7O76
$$ -1110 -300 -624 797 -624 -423 -654 -185 467 82 -181 -208 120 291 704 -351 260 118 101 777
2768G77j069R62q29L97p8mK62n87L95k98L76k44M22m86J77N2k59J114j475P13
$$ 777 -292 670 -159 238 160 156 418 -169 226 -72 304 60 482 -4 173 225 -34 1080 -395 318
2788C18q18N32N86j126M90p03R26J07j25n28p7J26O89J64j185O04n99J390n06
$$ 318 -500 32 618 -508 -18 -721 205 312 187 -341 -418 -292 397 561 -624 -20 -619 771 265
2807B65n65K85k18J262q00j07o42P34L22j29l11m27M45l01R35j396M18km93J199
$$ 265 -300 -15 -233 1029 229 122 -520 214 536 407 96 -331 114 -187 748 -648 -230 -232 -725 474
2827D74j423J014r42Q34RR5j50k43M44p3N17r38J166o76L05O1q71J431j280J060
$$ 474 -949 65 -877 -43 -34 61 -89 -332 112 39 556 -382 784 108 413 474 -397 1034 -246 814
2847H14q65J03J59l64Q34j007L11l80P00m05K27n49lJ099j142P13j343J108K1
$$ 814 -51 52 211 -153 681 -326 -15 -395 305 -100 127 -422 -425 674 -468 245 -1098 10 31
2866C1k44M30r53J045k39K42k39ln7L72q7l58K35n29J329q17N9m5m91J069p85
$$ 31 -213 217 -736 309 70 312 73 70 13 385 298 -60 175 -354 975 158 217 172 -319 750 -35
2887c5K74o11M84J57j14o8o82K78l61P69r47N08k49K81O98j038J063j017J009
$$ -35 239 -372 112 269 155 87 -595 -317 -678 91 -856 -348 -597 -316 382 -656 407 -610 399
2906C99k58j50L48l44O39k45K80p30O63m18M51o78k97R58r58J141j307L13j22
$$ 399 141 -9 339 -5 634 389 669 -61 602 184 635 -43 -340 618 -340 801 -506 -193 -315
2925c15RL51j034N04m93Q99j96L16p59N53M79k99O70j218J232l45N58l2q63R75
$$ -315 -306 45 -989 -485 -978 -79 -275 41 -718 -165 314 15 685 -533 699 354 912 880 17 992
2945I92o41P91o67l47l24L50L64o22l85n87J319q17L83o43k07P96m97Q39r36N44
$$ 992 351 1142 475 128 -196 154 518 -104 -489 -1076 243 -574 -191 -834 -1041 -245 -742 97 -839 -295
2965b95qN10K19l11K06j13M83l81N97o63K38M4m98N83j097Q88q66K20km75L57
$$ -295 -303 207 426 115 321 208 691 310 907 244 482 526 28 611 -486 402 -464 -244 -246 -721 -364
2986c64p4j73nO00n77O69n92M56L75l17R38j366R85l87O04M8j006O07m33R26m02
$$ -364 -438 -611 -616 -16 -593 76 -516 -60 315 -2 936 -430 555 168 772 820 -186 421 -12 914 512
3007E12l61o72L74O05k07k78j163J443m66N82n92n98Q55m47J229o58j63m27M40
$$ 512 151 -521 -147 458 251 -27 -1190 253 -213 369 -223 -821 34 -413 816 158 -5 -432 8
3026HO75%p15o38R00k27J115j376j4l8L28P06j402M87m79M61K40k42j08k98N88
$$ 8 683 683 -32 -670 230 3 1118 -258 -272 -310 18 724 -678 -191 -670 -209 31 -211 -319 -617 -29
3047b9J29J79l30L08m01L9Q92n59L25q81M97o2K27M0p18J66k71Q52n72K40r33
$$ -29 100 279 -51 257 -144 -105 787 228 553 -328 169 107 334 374 -344 -178 -449 403 -169 71 -862
3068h62M25K65M00M84j941J409n85P16M6q49M14m51J516n81L3q96N43N56K05k77
$$ -862 -437 -172 228 712 -1229 180 -405 311 357 -492 -78 -529 987 406 439 -457 86 642 847 570
3088E70j065M83l88J423p91k64m39j05J476p09j51j115O04N80K48l50m82O2L57
$$ 570 -495 -12 -400 1023 232 -32 -471 -576 900 191 40 -1075 -471 109 357 7 -475 -413 -56
3107e6J049r46j4q09N23Q21p96O18j098N54K86k9L04q15L32m08R14o87N14r57
$$ -56 993 47 33 -776 -253 568 -228 390 -708 -154 132 103 407 -408 -76 -484 430 -257 257 -700
3127g00P52r1J19O80j387P73p06R90L5p62K50o73J023M4k9p37L48j38O77L79j339
$$ -700 52 -39 80 760 -627 146 -560 430 465 -297 -47 -720 303 347 318 -419 -71 -209 468 847 -492
3148d92O05o32J301j10m06m30l98J287l53L01j096m7O22M29n6n66k73l73J682
$$ -492 113 -519 782 672 266 -164 -562 725 372 673 -423 -470 152 581 525 -41 -314 -687 995
3167I95j027M28j111l3J080k92M91j096K88M19M6J84m76K9l37Q74m30L75q32M28
$$ 995 -32 396 -715 -748 332 40 531 -565 -277 142 188 372 -104 -75 -412 462 32 407 -425 3
3187CJ70j52N12j148J000o94K64M82n41J84m12L44J23K37p78J13l42N88L37n87
$$ 3 173 21 533 -615 385 -309 -45 437 -104 80 -332 12 135 372 -406 -293 -635 -47 290 -297
3207b97N94j035Q41K17j64q1n67K13K78O14p93k54k37R51K89p23pq30J452n29
$$ -297 297 -738 103 320 156 75 -492 -279 -1 613 -180 -434 -671 280 569 -154 -161 -991 461 -68
3227f8Q07r26k75P99k75P56j008j42J70M41M2k06m56j97R59p26O94r45R8M76k01
$$ -68 739 -187 -462 337 62 818 -190 -332 -162 279 321 115 -341 -538 421 -305 389 -556 -458 18 -183
3248a83P75j150N25m43L12J62j54J37l0L2j35O02p32N94o07K01O06p30N46j018
$$ -183 592 -558 -33 -476 -164 -2 -156 -19 -49 -17 -152 450 -282 312 -295 -94 512 -218 328 -690
3268f90P31r6j99L94n14J2P1J7O7O7n12N49M7k55M30q31Q91n79R32o52m76O56
$$ -690 41 -55 -254 140 -374 -362 -291 -274 -207 -140 -652 -103 -56 -311 119 -712 179 -400 532 -120 -596 60
3290F0k54O57n71L69o88M29K39J06m07m44P19k06R47q79j67N39o99P19q07N14
$$ 60 -194 463 -108 261 -427 2 241 347 -60 -504 215 9 956 77 -90 449 -250 469 -338 176
3310A76p67M13J61J06k74k47N05l18N58j032O62n6l1N35r20O50n34O16k27j25
$$ 176 -591 -178 -17 89 -185 -432 73 -245 313 -719 -57 -113 -144 391 -529 121 -413 203 -24 -149
3330a49L27q5K78l14M40n03L58p08M83k79p9N83p98L93n02L13M9l08L28m96K26
$$ -149 178 93 371 57 497 -6 352 -356 127 -152 -231 352 -446 -53 -555 -242 -193 -501 -173 -669 -443
3351d43J28J88l82L90O4K54J58m12K78m61J054m14k22M09n36N71o57K15k84N3
$$ -443 -315 -127 -509 -119 -55 199 357 -55 223 -238 816 402 180 589 53 624 -33 182 -102 -49
3371d9J37j55K3q14P13o01R88r93N12j29P0O73q04R43o45O50l25M7L22l08N75
$$ -49 88 -67 -44 -858 -145 -746 242 -751 -239 -368 -298 375 -429 514 -131 519 194 241 563 255 830
3392H30l14M8n67O47o11Q9N5l17L00p98R49p42O2K72l00M95m71k9K82M12l38L88
$$ 830 516 564 -3 644 33 122 177 -140 160 -638 311 -431 -369 -97 -397 98 -373 -402 -120 292 -46 342
3414C42o20L70N56r71R21n68K62N7j43rk64J07k39L45k41P2j89K12l49M9J68m10
$$ 342 -278 92 648 -323 598 30 292 349 206 197 -67 40 -199 146 -95 -23 -212 0 -349 -300 -132 -542
3436e42Q64m55K13m9k73J096q29N00l60k6M7N44k32m94M46m08O24n99K76o24K04
$$ -542 322 -133 80 31 -242 854 25 525 165 139 186 730 498 4 450 42 666 67 343 -281 -77
3457g7K37o62O35m87L48q1J88l91j60O57m06L36k78M90m98M45k9j8L47o34O45
$$ -77 160 -502 133 -354 -6 -87 101 -290 -450 207 -199 137 -141 349 -149 296 267 249 596 -38 607
3478F07p24K53j02j73K07l90L52k19M49m37k6k72K82K59k59L19o52R43n74N68
$$ 607 -117 136 34 -139 68 -322 30 -189 260 -177 -203 -475 -193 66 -193 126 -526 417 -157 411
3498D11j8o18N30k83N68l35m21J65K23m45K83j38k82L55k61L42n80q6L88k34O16
$$ 411 393 -225 305 22 590 255 -166 -1 222 -223 60 -78 -360 -5 -266 76 -504 -590 -202 -436 180
3519A80n29J74J1l0L15J0l21r6N27k63O37p59J58J42r4N87m55J89p80N17K07m94
$$ 180 -349 -175 -164 -194 121 131 -190 -286 241 -22 615 -144 14 156 62 649 194 383 -397 120 327 -167
3541a67k9J91Nm7K61l18Q8j21L08l7k66N94r43Q19l72L52p4l61M9n7N98l71j44
$$ -167 -196 -5 0 -47 214 -104 -16 -137 171 134 -132 462 -481 338 -34 318 244 -117 -68 -125 473 102 -42
3564d2m91Q59j76k75K29n79M88k23P58m69m33L86j92M65k34j03k59N84l2Mm34
$$ -42 -533 326 150 -125 104 -475 13 -210 548 79 -354 32 -160 305 71 -32 -291 293 261 265 -169
3585a69j96N64k16R60j147L56k71N4N23n14M62p96L82L1J75p1j83O0r4N72o26
$$ -169 -365 199 -17 943 -204 152 -119 -65 458 -56 406 -390 -8 23 198 127 -56 4 -90 482 -144
3606a44L10l55j4N41n39M97o84L83j3J20Q2l42R5N3K65p0M0m62K32N5J35J31p64
$$ -144 166 -189 -203 338 -201 296 -388 -5 -18 102 184 -158 -63 -10 255 185 225 -237 -5 50 185 316 -448
3629d48J89L1O10j47m80J70n6L23k01J29l72J61M7j2J23m18N7k1P81l29j37k26
$$ -448 -259 -228 382 235 -245 -75 -131 192 -9 120 -252 -91 -44 -56 67 -351 -294 -315 466 137 0 -226
3651b26k60Q72l24Q7n35J62J1M53j81l27K88m66J069q91Q4m31K97N89l62M36q06
$$ -226 -486 386 62 149 -386 -224 -213 240 59 -268 20 -446 623 -268 -184 -615 -318 271 -91 345 -461
3672d61M94O5p8j04l4J50q5K97k12L08n64K94j66J28L98r90P20l04O71m76k02
$$ -461 33 98 20 -84 -118 32 -53 244 32 340 -224 70 -96 32 430 -560 160 -144 527 51 -151
3693a51J7j55L61M7K29o62M89l56K16m0l39L14n11O73M0j32k60j76M21k47N21
$$ -151 -134 -289 72 119 348 -314 175 -181 35 -5 -344 -30 -541 132 172 40 -220 -396 25 -222 299
3714B99o38J94J16J05L05n71J58n88R72n33K99l68J66K74k83L09q09K79j87N70
$$ 299 -339 -145 -29 76 381 -190 -32 -620 352 -181 118 -250 -84 190 -93 216 -593 -314 -501 69
3734F9O5l15l5j01N56k76L47r31N97r5j21O08p24M42k35K85k41J71J3o0N5l01
$$ 69 134 -181 -216 -317 239 -37 310 -621 -24 -119 -240 368 -356 86 -149 136 -105 66 79 19 74 -227
3756b27O37n66L78q09O14J03k97M28p60Q72n89K7K28l92J77P4K38k84L02n47P01
$$ -227 410 -156 222 -587 27 130 -167 261 -499 373 -216 -189 39 -353 -176 -102 136 -148 154 -393 308
3777C08n5m13K22j13N58p00M35j45l42M97l69L66n79L49m42M50k49K02K2l65K71
$$ 308 253 -160 62 -51 507 -193 242 97 -245 252 -117 249 -330 19 -423 27 -222 -20 2 -363 -92
3798i2j75N58p08Q5M14l05N01m73K07k39L92j53O4J95k74J59l7J13l79M24k25
$$ -92 -267 291 -417 -332 82 -223 278 -195 12 -227 165 12 76 271 -3 156 119 232 -147 277 52
3819E2j35K67m01K65j90J35j22J71j3m43K45L80K71m43K59n19L80j51K21K24n57
$$ 52 -83 184 -217 48 -142 -7 -129 42 29 -414 -169 211 482 39 298 -221 159 8 229 453 -104
3840a04M32m09M57j95j81j04pL32m66J56o7J13j80L57r3l86M93k71L92k36Q6J1
$$ -104 328 -81 376 181 0 -104 -111 221 -245 -89 -156 -43 -223 134 41 -345 148 -123 269 33 119 130
3862A30q2L10j53O2j53j16K81j82j10j0J04l47M30n64M15R6l06J05j88K96k95
$$ 130 48 358 205 267 114 -2 279 97 -13 -23 81 -266 164 -400 15 111 -195 -90 -278 18 -277
3883b77K37j36K25k07J58K08j08qj64L98k70l8m2l2K09k34J83p5j43J61j48M43
$$ -277 -40 -176 49 -158 0 208 100 92 -72 326 56 18 -24 -56 153 -81 102 27 -116 45 -103 340
3905C40l92J59j18Q5k24j86J48P4K47k04L62l28K36j18q1L30k68K43r5n0J4q9
$$ 340 -52 107 -11 74 -150 -336 -188 -114 133 -71 291 -37 199 81 0 330 62 305 210 160 174 85
3927H5j35J67j02l33L13k67N49p65L03R0J65L2l00K61l84L70k9J81l59K77p7l16
$$ 85 -50 117 15 -318 -5 -272 277 -488 -185 -95 70 102 -198 63 -321 49 20 201 -158 119 42 -274
3949b74Q42n11K05m70K07J20k68M31n97M87l82Q5L01k61O3j22L46j36R7k10K02
$$ -274 568 57 262 -208 -1 119 -149 282 -315 172 -210 -125 176 -85 -22 -144 202 66 163 -47 155
3970A55l77K58k8q9K55n31L81PL4p5j48M08k65Ql46L93j72K29p6k76L46k67L34
$$ 155 -222 36 8 -81 174 -357 24 31 65 -10 -158 250 -15 -7 -353 40 -132 97 21 -255 91 -176 158
3993A58k5k2j94j66L99l43N51l53J12k16K77l09K08nk19L54k85L52n01J26K53
$$ 158 133 111 -83 -249 150 -193 358 5 117 -99 178 -131 77 72 -147 207 -78 274 -227 -101 152
4014A52o3Q6m06M89j30j09n4n8Q6J78n3l83M71n07K88r3R0p6r6J40l39N14l98
$$ 152 89 175 -231 258 128 19 -35 -93 -7 171 118 -265 206 -301 -13 -106 -16 -92 -188 -48 -387 127 -271
4037b71L13j11l5o1J44K22n10M07j02J19J9j52J35m88Q39o33M05m37J27K76j41
$$ -271 42 -69 -104 -165 -21 201 -309 98 -4 115 134 -18 117 -371 468 -165 240 -197 -70 206 65
4058F5K06m41Q8J42K29j12mj3m11P32n62L83l98Q8j00p3M59l24J07l12K95j18
$$ 65 271 -170 -82 60 289 177 173 160 -251 481 -81 302 -96 -8 -108 -181 278 -46 61 -251 44 -74
4080g4K72k66r7L15k62M13l62K05j00p7J67l18M01o74N33k18K04k66Q0L55k23
$$ -74 198 -68 -165 150 -112 301 -61 144 44 -33 134 -184 217 -457 76 -142 62 -204 -124 231 8
4101HL44l97P2k80L50n4j8Jo0K56j52P2l30rN0P8J05o3N5L7J01k37J44J30m34
$$ 8 352 -45 27 -253 97 43 25 26 -34 222 70 142 -188 -197 -147 -69 36 -27 28 65 166 -71 73 203 -231
4126b31K77j18K40j79M4q9J17K76l32l1k14K38K7J90k57J42p5p4N11n52K53k25
$$ -231 46 -72 168 -11 33 -56 61 337 5 -26 -240 -2 25 215 -42 100 25 -49 462 -90 163 -62
4148f2j19M99k37j05l03N02k16J63j46q4k34M29L9k59L28o62O55o0j69J55l92
$$ -62 -181 318 81 -24 -327 175 -41 122 -24 -108 -342 87 126 -133 195 -467 188 128 -41 114 -278
4169b78K91j38K52j24l63L32k9K90j84%j22K8J5p0K99m28j50K06J82l71M36k18
$$ -278 13 -125 127 3 -360 -28 -57 233 49 49 -73 -45 -30 -100 199 -229 -379 -173 9 -362 74 -144
4191a44jL71l24M3J0J12j97K2L02k44P2l46M61j54k18L36l08L88k60k8O5J78l06
$$ -144 -145 226 -98 -55 -45 67 -130 -108 194 -50 22 -324 137 -17 -235 101 -207 181 -79 -107 -42 136 -170
4214a70L01l0j61J20k19M20j85J03l03O6J83j99l7M4L40j82J06Q8n84K01K0l8
$$ -170 131 101 -60 60 -159 261 76 179 -124 -58 125 -74 -111 -67 273 91 197 285 -299 -98 -78 -116
4236a16qL43m76L77k77J06K52l71P7M1J85q2n3j11j31L25j88pm4L93l50L63j14
$$ -116 -124 219 -257 120 -157 -51 201 -170 -93 -52 133 51 -2 -113 -244 81 -107 -114 -158 235 -115 248 134
4259A34l20K33J1K29n51K86j89k82L79Q3J6j63J65K5N8k16n4J19j5L11j83J55
$$ 134 -186 47 58 287 -264 22 -167 -449 -70 13 29 -134 31 56 114 -102 -156 -37 -52 259 76 231
4281B31p83O46K22k86K93q0m2k70l5K18J6l46P3K64l53J47K25j50k40J33L29j34
$$ 231 -552 94 316 30 323 243 201 -69 -104 114 130 -216 -143 121 -232 -85 140 -10 -250 -117 212 78
4303G8nk03N5K52K5k57J40j56Q4J15k43P9k0J11J23k08j35LM30l55J82j27n8K60
$$ 78 73 -130 -75 177 202 -55 85 -71 13 128 -115 -36 -56 55 178 -30 -165 -162 268 -87 95 -32 -90 170
4327A70o6K86l30j08p1K57J1q2J0N3j82p1J55l78J52L01j09K63k58K45n23K32
$$ 170 104 390 60 -48 -119 138 149 67 77 130 -52 -123 32 -346 -194 107 -2 261 3 248 -275 -43
4349d3k71O9nJ23J78j26K21j41j62J09j11L18k97N6m2K96n0L3l28LL98j90J17
$$ -43 -314 -245 -250 -127 51 -75 146 5 -157 -48 -159 159 -138 -82 -124 172 122 155 -173 -170 228 38 155
4372A55m63L80j6N0J12n5j21l31J93j73O6J12J74r5l5K52l22O3j99K02J37l5j49
$$ 155 -308 72 56 106 218 163 42 -289 -96 -269 -203 -91 83 -12 -47 205 -117 -54 -253 -51 86 51 -98
4395i8L8L77m47L57k45J05j37K83j35k65J13J12Kr5l9K21k58N6j15R4o0L9K62
$$ -98 -60 317 -130 227 -18 87 -50 233 98 -167 -54 58 60 -35 -74 147 -111 -55 -170 -76 -136 -97 165
4418A65j35J61j26q4K61k31k22N9J67N8j3k97K06r4P5m0J25q6j89K13l03O11k34
$$ 165 30 191 65 -19 242 11 -211 -152 15 73 60 -237 -31 -125 -50 -90 35 -51 -240 -27 -330 281 47
4441D7R1J43j84k9J17Q0l83K93j36L6k51J17M42n19J49R0L3P2j88l1M5K1L8k81
$$ 47 138 281 97 68 185 265 -118 175 39 75 -176 -59 383 -136 13 103 136 208 20 -11 34 55 93 -188
4465a88N2L10l27R1J13j73n2K8K29k42J57j12K37j95J38O8l32L19j97L54k75j49
$$ -188 -136 174 -153 -62 51 -122 -174 -146 83 -159 -2 -114 123 -72 66 134 -198 121 -76 278 3 -146
4487a46N5K2J30j49L5J17j24P5Rp1J44j67K7P0n3N4j02L3J68j08J81k62O2L18
$$ -146 -91 -69 61 -88 -53 64 -60 15 24 -47 97 -70 -43 27 -26 28 -74 -41 127 19 200 -62 0 318
4511C18k28M6k81J97k78M13k55K08l10j4P4J50L8m1j8j0J84k81J84j15j86J73
$$ 318 90 136 -145 52 -226 187 -68 140 -170 -184 -110 40 78 37 19 9 193 -88 96 -19 -205 -32
4533c2k00K49n3p6L18j65N4j12o9J5K96k72K6q6K9R0K59k38j44K42j95l8K29j59
$$ -32 -232 17 -36 -112 206 41 95 -17 -86 -71 225 -47 -21 -107 -78 12 271 33 -111 131 -64 -102 127 -32
4557c2L5R5l4j50J71N9k22m1j75L75k58M05j19j5Q9m29K80k0M9J3J03l27O1J36
$$ -32 3 98 64 -86 85 144 -78 -119 -294 81 -177 228 109 94 183 -246 34 14 63 76 179 -148 -87 49
4581D9L5J16m51M39k13J11o0j45J29K0M9m2j61J27J1M9J27k96J26J76l77K68K0
$$ 49 84 200 -251 188 -25 86 26 -119 10 30 79 37 -124 3 14 63 190 -106 20 196 -181 87 107
4604A07j76Ko3L59k83J6p6j18J51J80p4k08R8j10O9k6J18r9K34J1j87J2j90P5
$$ 107 -69 -67 -130 229 -54 -38 -114 -232 -81 99 25 -183 -85 -195 -126 -152 -34 -133 101 112 -75 -63 -253 -178
4628a78K77j58J11j60L47l02O2j13r3J18k1k6Q9K19j05j30p3J04J22j14J5k54
$$ -178 99 -59 52 -108 239 -63 -1 -114 -207 -89 -110 -136 -47 172 67 -63 -136 -32 90 -24 -9 -263
4650b63M66k84J93l4q7J39q4m00J17K04pR6j96L56l16J62n7O2J5k20L42l87J97
$$ -263 203 -81 112 78 -9 130 46 -354 -237 -33 -40 56 -140 216 -100 62 5 67 82 -138 204 -183 14
4673A4N2l07O9K8K25k43J24j11J94o7lJ86j50J90j05J34k25j20J07k16M17m04
$$ 14 66 -241 -172 -144 81 -162 -38 -149 45 -22 -25 161 11 201 96 230 5 -115 -8 -224 193 -211
4695b11Q2r3J04j23J65L2k09J87p0M97l26J90j91o0m1J5J73m37N41q3o8J18m29
$$ -211 -129 -222 -118 -241 -76 -44 -253 -66 -136 361 35 225 34 -26 -67 -52 121 -316 225 142 74 192 -237
4718b37M68l89N2J66j35K93k62J14J08j4k82L33l96J06O5k6K3K4J08j12J83r7
$$ -237 231 -158 -106 60 -75 218 -44 70 178 164 -118 215 -181 -75 -10 -36 -13 11 119 7 190 93
4740I3J11n6j40R6q5m5J02J24j52l0P0j75J39r6J03l19K43j78L02k31K82k67M
$$ 93 204 148 8 104 19 -26 76 200 48 18 88 -87 52 -44 59 -260 -17 -195 107 -124 158 -109 -105
4763a05J15l2J17j60r2K11p7P3No4l4Q4J6jo5NQL8J20k16Q0L3l72M59l52K19j04
$$ -105 10 -22 95 -65 -157 54 -23 50 55 -9 -43 41 57 56 -9 -4 4 42 162 -54 26 59 -313 146 -206 13 -91
4790i1n7R1K2n4j11L34o9M7j46J7J23k93jK10N3j49K28o0m1o6m4R8J17l68J31
$$ -91 -148 -57 -35 -89 -200 134 65 112 -34 -17 106 -187 -188 22 75 -74 154 94 53 -13 -57 41 158 -210 -79
4815g9P0l8r4M35l07j00J84J51r7N6k00l2K61k22j03J69j61L7n1O9j93M72l58
$$ -79 -9 -47 -141 294 -13 -113 71 222 125 181 -19 -51 210 -12 -115 54 -107 -70 -121 -52 -245 227 -131
4838a31K95l87J86N5m17L30j63K71m6J67n75N09r8L2q1M6k4M1J04J6j17j09K26
$$ -131 164 -223 -37 18 -399 -69 -232 39 -7 160 -415 94 -4 28 -53 -7 -31 10 114 130 13 -96 130
4861A30K5k66K63j21m9p0K26j29p8N5j15J86L7j36J89J7J15n15M21l67R1Q2m8
$$ 130 155 -111 152 31 -18 -88 138 9 -69 -14 -129 57 94 -42 147 164 279 -236 185 -182 -91 -9 -57
4884e7J32l45M38j65L42k83o4kn2L00l21K04j15j2j90J57J80k40R7r1Q7P7L8k54
$$ -57 75 -270 168 3 345 62 -2 -4 -56 244 -77 127 12 0 -190 -33 147 -93 4 -87 0 77 115 -139
4908a39K35l5l3m6J41p3o7J42j92j97J27q4L6J12m0O0j2J43j15j14K9L9r6J56
$$ -139 96 61 28 -18 123 50 -17 125 -67 -264 -137 -221 -185 -73 -113 -53 -65 78 -37 -151 -122 -83 -179 -23
4932b3O9J07k67Q8J23o9L70m70K15j21q0j14P5J94l71L19J1q9j74J61K87n37N18
$$ -23 46 153 -114 -26 97 28 398 -72 143 22 -58 -172 -97 97 -274 45 56 -33 -207 -46 241 -296 222
4955B22m51R0J64J40k32m5OL1R7l47N78j2p2j01nJ70j05P9j47q1j10K96k88K46
$$ 222 -229 -139 25 165 -67 -112 -106 -75 22 -325 253 241 169 68 63 233 128 207 60 -21 -131 165 -123 123
4979A23k38R9J01j75l0R2J25o2J22j27j50L55l21j57L47n0N7j61J34j48O5m2J47
$$ 123 -115 -16 85 -90 -120 -28 97 35 157 30 -120 235 -86 -243 104 54 111 -50 84 -64 1 -41 106
5002A06j75Q7R3l99L05j82J56P1n2mJ43j29j51P9O1r0q6K18L0k72L7L19o4j29
$$ 106 -69 18 111 -288 17 -165 -9 62 10 6 149 20 -131 -52 9 -81 -167 51 81 -191 -154 165 101 -28
5026b8k08J03J2K98J4l04P1m1K39q6o7np5J24J88q9Pl65K73J3Nj54J33l8P8j87
$$ -28 -236 -133 -121 177 191 -113 -42 -83 156 70 3 -2 -77 47 235 146 153 -212 61 74 79 -75 58 20 98 -89
5052h9O6j16L2J39P0J0k60o7M22j58Rj44l4L03l81J08l1J27L18l27N7O4l2j32
$$ -89 -23 -139 -107 32 102 112 -148 -215 207 49 58 -86 -120 183 -198 -90 -121 6 324 -3 54 118 86 -46
5076d6M6Pj21K4j5J45j85M05m37J51J48j06J39p2n7p7J13J45j82O0j28J94m1m3
$$ -46 0 7 -114 -90 -105 40 -145 260 -177 -26 122 16 155 83 26 -51 62 207 25 85 -43 151 110 67
5100F7j61L29k90J98qj38K8n6J29J5l8j35J4J62p7q3MJ07j51J72l43K53j66J12
$$ 67 -94 235 -55 143 135 -3 25 -31 98 113 75 -60 -46 116 39 -44 -40 67 -84 88 -255 -2 -168 -56
5124e6N51l70J1k82K87M0k85J32n4J32j25J33L2k49K28m34N15j56r6J45L0k36
$$ -56 495 125 136 -146 141 181 -104 28 -26 106 -19 114 146 -103 125 -309 206 50 -46 99 129 -107
5146a07K2J51r0Q2m07L38N7J26j23k38K94N8r2J89j19r7O7j09k28L96l31j47K62
$$ -107 -85 66 -24 58 -349 -11 46 172 49 -189 105 163 71 260 141 44 111 2 -226 170 -161 -308 -46
$$ [...]
8191a23
##END NTUPLES=NMR FID
##END=
