##TITLE=1H_1-2025-Bay
 CDCl3
 8 sc, 
 10.1.2025
##JCAMPDX= 6.0         $$ Bruker NMR JCAMP-DX V2.0
##DATA TYPE= NMR FID
##DATA CLASS= NTUPLES
##ORIGIN= UXNMR, Bruker Analytische Messtechnik GmbH
##OWNER= root
$$ XWIN-NMR		Version 3.5
$$ Fri Jan 10 14:23:13 2025 Russian Standard Time (UT+4h)  she@DPX200
##.OBSERVE FREQUENCY= 200.1315
##.OBSERVE NUCLEUS= ^1H
##.DELAY= (6, 6)
##.ACQUISITION MODE= SIMULTANEOUS
##.ACQUISITION SCHEME= undefined
##.AVERAGES= 8
##.DIGITISER RES= 18
##SPECTROMETER/DATA SYSTEM= spect
##.PULSE SEQUENCE= zg30
##.SOLVENT NAME= CDCl3
##.SHIFT REFERENCE= (INTERNAL, CDCl3, 0, 15.7039)
##AUDIT TRAIL= $$ (NUMBER, WHEN, WHO, WHERE, WHAT)
$$ ##TITLE= Audit trail, XWIN-NMR		Version 3.5
$$ ##JCAMPDX= 5.01
$$ ##ORIGIN= Bruker BioSpin GmbH
$$ ##OWNER= she
$$ F:/spectra/data/she/nmr/H-F/1/audita.txt
$$ ##AUDIT TRAIL=  $$ (NUMBER, WHEN, WHO, WHERE, WHAT)
(   1,<2025-01-10 14:22:13.48 +0400>,<she>,<DPX200>,
      <created by zg, POWCHK disabled, PULCHK disabled
       configuration hash MD5:
       00 E9 B6 7A A2 85 ED C7 34 08 36 98 17 FE 4E 26
       data hash MD5: 16K
       9E BF 8F 44 96 F0 73 55 3C 32 65 5C A9 B0 0B EE>)
$$ ##END=
$$ 
$$ hash MD5
$$ CD D5 F8 0F F7 1D 8E D8 2A FC F2 26 43 8F AA 98
##$RELAX= 
##$RELAX= 
##$RELAX= 
##$RELAX= 
##$RELAX= 
##$RELAX= 
$$ Bruker specific parameters
$$ --------------------------
##$DU= <F:/spectra>
##$EXPNO= 1
##$NAME= <H-F>
##$PROCNO= 1
##$TYPE= <nmr>
##$USER= <she>
##$AMP= (0..31)
100 100 100 100 100 100 100 100 100 100 100 100 100 100 100 100 100 100 
100 100 100 100 100 100 100 100 100 100 100 100 100 100 
##$AQSEQ= 0
##$AQ_mod= 1
##$AUNM= <au_zg>
##$AUTOPOS= <>
##$BF1= 200.13
##$BF2= 200.13
##$BF3= 200.13
##$BF4= 200.13
##$BF5= 200.13
##$BF6= 200.13
##$BF7= 200.13
##$BF8= 200.13
##$BYTORDA= 1
##$CFDGTYP= 0
##$CFRGTYP= 5
##$CHEMSTR= <none>
##$CNST= (0..31)
1 1 145 1 1 1 1 1 1 1 1 1 1 1 1 1 1 1 1 1 1 1 1 1 1 1 1 1 1 1 1 1 
##$CPDPRG= <>
##$CPDPRG1= <>
##$CPDPRG2= <>
##$CPDPRG3= <>
##$CPDPRG4= <mlev>
##$CPDPRG5= <mlev>
##$CPDPRG6= <mlev>
##$CPDPRG7= <mlev>
##$CPDPRG8= <mlev>
##$CPDPRGB= <>
##$CPDPRGT= <>
##$D= (0..31)
0 1.2 0 0 0 0 0 0 0 0.06 0 0.03 0 0 0 0 0.0002 0 0 0 0 0 0 0 0 0 0 0 0 
0 0 0 
##$DATE= 1736504533
##$DBL= (0..7)
120 120 120 120 120 120 120 120 
##$DBP= (0..7)
150 150 150 150 150 150 150 150 
##$DBP07= 0
##$DBPNAM0= <>
##$DBPNAM1= <>
##$DBPNAM2= <>
##$DBPNAM3= <>
##$DBPNAM4= <>
##$DBPNAM5= <>
##$DBPNAM6= <>
##$DBPNAM7= <>
##$DBPOAL= (0..7)
0.5 0.5 0.5 0.5 0.5 0.5 0.5 0.5 
##$DBPOFFS= (0..7)
0 0 0 0 0 0 0 0 
##$DE= 6
##$DECBNUC= <off>
##$DECIM= 24
##$DECNUC= <off>
##$DECSTAT= 4
##$DIGMOD= 1
##$DIGTYP= 9
##$DL= (0..7)
0 120 120 120 120 120 120 120 
##$DP= (0..7)
150 150 150 150 150 150 150 150 
##$DP07= 0
##$DPNAME0= <>
##$DPNAME1= <>
##$DPNAME2= <>
##$DPNAME3= <>
##$DPNAME4= <>
##$DPNAME5= <>
##$DPNAME6= <>
##$DPNAME7= <>
##$DPOAL= (0..7)
0.5 0.5 0.5 0.5 0.5 0.5 0.5 0.5 
##$DPOFFS= (0..7)
0 0 0 0 0 0 0 0 
##$DQDMODE= 0
##$DR= 18
##$DS= 0
##$DSLIST= <SSSSSSSSSSSSSSS>
$$ [...]
##$SUBNAM2= <"">
##$SUBNAM3= <"">
##$SUBNAM4= <"">
##$SUBNAM5= <"">
##$SUBNAM6= <"">
##$SUBNAM7= <"">
##$SUBNAM8= <"">
##$SUBNAM9= <"">
##$SW= 24.0689530833862
##$SWIBOX= (0..15)
0 0 2 0 0 0 0 0 0 0 0 0 0 0 0 0 
##$SW_h= 4816.95568400771
##$TD= 16384
##$TD0= 1
##$TE= 0
##$TE2= 300
##$TE3= 300
##$TEG= 300
##$TL= (0..7)
0 120 120 120 120 120 120 120 
##$TP= (0..7)
150 150 150 150 150 150 150 150 
##$TP07= 0
##$TPNAME0= <>
##$TPNAME1= <>
##$TPNAME2= <>
##$TPNAME3= <>
##$TPNAME4= <>
##$TPNAME5= <>
##$TPNAME6= <>
##$TPNAME7= <>
##$TPOAL= (0..7)
0.5 0.5 0.5 0.5 0.5 0.5 0.5 0.5 
##$TPOFFS= (0..7)
0 0 0 0 0 0 0 0 
##$TUNHIN= 0
##$TUNHOUT= 0
##$TUNXOUT= 0
##$USERA1= <user>
##$USERA2= <user>
##$USERA3= <user>
##$USERA4= <user>
##$USERA5= <user>
##$V9= 5
##$VALIST= <valist>
##$VCLIST= <CCCCCCCCCCCCCCC>
##$VD= 0
##$VDLIST= <DDDDDDDDDDDDDDD>
##$VPLIST= <PPPPPPPPPPPPPPP>
##$VTLIST= <TTTTTTTTTTTTTTT>
##$WBST= 1024
##$WBSW= 4
##$XGAIN= (0..3)
0 0 0 0 
##$XL= 0
##$YL= 0
##$YMAX_a= 77936
##$YMIN_a= -171033
##$ZGOPTNS= <>
##$ZL1= 120
##$ZL2= 120
##$ZL3= 120
##$ZL4= 120
##$ABSF1= 10
##$ABSF2= 0
##$ABSG= 5
##$ABSL= 3
##$ALPHA= 0
##$AQORDER= 0
##$ASSFAC= 0
##$ASSFACI= 0
##$ASSFACX= 0
##$ASSWID= 0
##$AUNMP= <proc_1d>
##$AZFE= 0.1
##$AZFW= 0.1
##$BCFW= 1
##$BC_mod= 2
##$BYTORDP= 1
##$COROFFS= 0
##$CY= 11.3945322036743
##$DATMOD= 1
##$DC= 2
##$DFILT= <>
##$DTYPP= 0
##$F1P= 15.6554695791079
##$F2P= 12.8336369535428
##$FCOR= 0.5
##$FTSIZE= 0
##$FT_mod= 4
##$GAMMA= 1
##$GB= 0.15
##$INTBC= 1
##$INTSCL= 1
##$ISEN= 128
##$LB= 0.24
##$LEV0= 0
##$LPBIN= 0
##$MAXI= 10000
##$MC2= 0
##$MEAN= 0
##$ME_mod= 0
##$MI= 1.114404
##$NCOEF= 0
##$NC_proc= 0
##$NLEV= 6
##$NOISF1= 3.799351
##$NOISF2= 2.8
##$NSP= 1
##$NTH_PI= 0
##$NZP= 0
##$OFFSET= 15.70392
##$PC= 1
##$PHC0= -26576.24
##$PHC1= 16.38744
##$PH_mod= 1
##$PKNL= yes
##$PPARMOD= 0
##$PSCAL= 0
##$PSIGN= 0
##$REVERSE= no
##$SF= 200.130013532006
##$SI= 16384
##$SIGF1= 3
##$SIGF2= 2
##$SINO= 400
##$SIOLD= 16384
##$SREGLST= <1H.CDCl3>
##$SSB= 0
##$STSI= 0
##$STSR= 0
##$SW_p= 3612.71676300578
##$SYMM= 0
##$S_DEV= 0
##$TDeff= 0
##$TDoff= 0
##$TI= <>
##$TILT= no
##$TM1= 0
##$TM2= 0
##$TOPLEV= 0
##$USERP1= <user>
##$USERP2= <user>
##$USERP3= <user>
##$USERP4= <user>
##$USERP5= <user>
##$WDW= 1
##$XDIM= 8192
##$YMAX_p= 0
##$YMIN_p= 0
$$ End of Bruker specific parameters
$$ ---------------------------------
##NTUPLES= NMR FID
##VAR_NAME=  TIME,          FID/REAL,        FID/IMAG
##SYMBOL=    X,             R,               I
##VAR_TYPE=  INDEPENDENT,   DEPENDENT,       DEPENDENT
##VAR_FORM=  AFFN,          ASDF,            ASDF
##VAR_DIM=   8192,          8192,            8192
##UNITS=     SECONDS,       ARBITRARY UNITS, ARBITRARY UNITS
##FACTOR=    0.0002076,     1,               1
##FIRST=     0,             0,               0
##LAST=      1.7004516,     0,               0
##MIN=       0,             -171033,         0
##MAX=       1.7004516,     77936,           0
$$ Real data points
##PAGE= N=1
##DATA TABLE= (X++(R..R)), XYDATA
$$ [...]
1884B73l79L07m34K14J98k05m4J09k73O55l28n60N49m86M71j24J71o3r3k55L33
1905C6j52N75l93j48J53n3R2k07q4K07M0j98j4J60L0o9N2j11j82J24K12k12Q8
1928e4J46j98k80P22p52L14M59m17K65m39N37l96J16n4J12j7Q4k26O5M03k37n2
1950A01o9J02m31J84J61k20JL37K9j68Q6r0m70M85j76Q4J87k13R7R2o8m02L14
1973d7J12Kk39K3L11m48K86K58l01k23J01q5L45j00J2pJ48l97K74J44k04O7m6
1996a4J60k26JN50l86o0L07k97r8l4J46k25n6J78J11J25L2l99K09n9j67k20N10
2019H8n59N37J35l30K70k66J23L91q22J87O0j7L24j05l63K91J23qj0j15J63l66
2041b69M18q0%j75J82j2l50K86L61j72l08R0J93l2m16J24M41j33j7j57q2J16P5
$$ y = [273, -106, 201, -233, -19, 179, -26, -70, 39, -234, 421, 93, -467, 82, -404, 67, -57, 114, 51, -42, -297, 36, -116, 459, 66, -82, 71, 18, 110, -97, -181, 26, 66, -132, -146, 14, 44, -25, 27, -84, -266, -142, 70, -142, -54, 92, -106, -386, 336, -416, -102, 357, -60, 205, -234, 303, -93, 23, -31, 81, 64, 148, -78, -13, 390, 153, 101, 32, 134, -297, -113, 48, -172, -171, 166, 195, 27, 113, 23, -447, 38, -138, -54, 133, -80, 17, 109, 41, -361, -47, 65, 67, -172, -149, 162, -286, 0, 258, -43, -266, -165, -250, 95, -5, 7, 0, 148, -249, 25, 169, -35, 32, -14, 146, -80, -79, 471, 85, 25, 332, 35, -63, -97, 49, -176, -232, -54, 57, 182, 214, -185, 24, -35, -202, -422, 88, -471, 66, 201, -129, 141, -125, -2, 389, -433, -246, -186, -203, 121, 16, -347, -56, 67, 59, 49, -66, 97, -269, 149, 69, 69, -106, 76, 64, -286, 0, 361, 189, -119, -29, 164, 132, -284, -160, 281, 148, 131, -26, -108, 8, 83]
2064H3j03n5L7Nk01K54J4k08J34n8K48j53J28k15n0j37N71l90J35K35k91k53P1
2087a99L02k33K56k20K80k75J71m42J94M89n04J87q1j67P2J92N4j83K15R7q88
2108f83O84j6k18K73j4J34k23J20k47n8M10j28n8k23M02j19m0Q2J49n28J75L3
2130i3J11j19K68p1P8N0n21M25L72n18j29L96l27K06o7O8Q4k93K72l77K39j55
2152a01J8K17l01J27J87j88J79k64J07L8j81p2K47N2K22l51n7M71q6k12L22j50
2174B24n2k84k00K19L99l43J50p6L32k10k48J1K22k06j1O4J66l48L65j49l21K57
2196c9J21k9k64J66p2j5O9J47l04L73j51J34n3K2l99L04r8N7O9P1q3MK51l66J30
2221D5j9j56p2L60r8K61m58L12r6k9L11m00q9L9K15k90L29q4n15O4L89l14J21
$$ y = [83, -20, -75, -38, -33, -234, 20, 34, -174, -40, -98, 150, -3, 125, -90, -140, -277, 294, -96, 39, 274, -17, -270, -199, 103, -130, 126, -94, 186, -89, 82, -360, -166, 323, -181, 6, -75, -242, -170, 22, 76, -107, 108, 205, -683, 1, -15, -233, 40, 26, 160, -63, 57, -190, -248, 162, 34, -24, -247, 155, 36, -4, 78, 227, -301, -126, -93, 18, -101, 167, 96, 174, 224, -297, 128, 500, -18, -147, 249, -78, 128, 61, 129, 213, -80, 192, -185, 54, -101, -83, 134, -167, -40, 147, -41, 138, -126, -19, 19, -162, -234, 13, 65, 287, -64, -121, 350, 264, 52, 374, 224, 172, -112, -312, -93, 306, -37, 113, 37, 369, 159, -89, -78, 144, -62, -73, -9, 157, -191, 174, 25, -296, -39, 82, 53, -211, -45, -117, -132, -63, 84, -220, 153, 2, 136, 83, 105, -294, 10, -88, -31, 38, 109, 26, 30, 281, -85, 45, 26, -130, -202, 158, 60, 321, -137, 175, 79, 50, 361, -39, -128, -89, 126, -164, 165, 81, -434, -370, 19, -295, -174]
2244a74j94J58N9K09m1l09L03l42N02R4j11q1k09J62J73l15J89k22L23j21j65
2265a12R9M20m12m85P60l29k64L21M2M2J4j16K43k19R8L5J24l33L0K16k72p7j3
2288a88M05j92j19K55l55j32M71J35k72k55L88M7n2k46j17k9J32K86k72J67j1
2309D6J15j24l14L50q7N9M48o70OK80p3n9k44Q2J97N3k76k5L09L1m20J38J40M2
2333DL5%J2j12k99J01N8M26k15l0J14k66L27J6M0n4m4n0M6o2l70K94k3P7l73M98
2359A50J46j53l39q9J66J97k63P6L91l10R9l47L07k03M9j95K84J08j01K55J17
2380C45o6k46L63n08L02M0k88K02n47K73Lo6J07Kj65L08l1J57m22J39M1p7k75
2403d09L32k72L37N3J01l5k12J35p0k2j9JJ10J25l29j23J94M6j40M3J33j02K06
$$ y = [-174, -368, -210, -151, 58, 17, -292, 11, -331, 171, 265, 154, 73, -136, 26, 199, -116, 73, -149, 174, 53, -112, -13, 407, -5, -490, 270, -59, -323, -2, 40, 82, 96, -20, 223, 4, 102, 137, 261, -72, -42, 174, -98, -175, -188, 217, 25, -94, 161, -194, -326, 145, 280, 8, -247, 141, 188, 136, -110, -227, -256, -124, 162, -110, 57, 46, 161, 37, -277, 73, -14, 45, 493, -177, -171, 109, 36, -23, -267, -185, 12, 65, -211, -236, 73, 104, -316, -178, -38, 4, 39, 39, 51, -61, -360, -259, -201, 225, 10, -20, 94, -172, 155, 171, 211, 157, 113, 63, 109, 47, -323, -29, -52, 25, -348, 150, 296, 143, -196, -285, -119, 78, -185, -109, 282, -28, 71, -276, 31, -172, -123, -318, -34, 74, -27, 228, 345, 279, 33, 396, -112, 190, 230, -58, 144, -403, -130, -127, -193, -86, -84, -249, 59, 28, 185, -237, -98, -57, -134, -409, -77, -349, -12, 41, 142, 107, -105, 30, -40, -62, -81, -80, 30, 155, -174, -297, -103, -57, -197, -154, -21, -123, 83]
2426H3j21R6m4oM23m83k15M12k05n9K48j40k36J41K06L00j87m26K12n9n4J55m70
2449d29N87j97L17j58k92L16k59J1l0K85j24j79L23o6k41mL41j82J19k50L62j28
2471A22k67O7m2j42J03M73k67J30r9k28K34J60k60L72p73L02o1qL18l7O7k03J6
2494b3k6k1k07M06p2J19k7m31N11m68L16j19j87L87k67P2Q1k79K44K03L2J3jm70
2518b14K26O5k36M80p9l68J49k66M28K6k33L91m07L66l21k36M59q3kK32k65k36
2540a24L60m7k1j8ll35qJ61K02J17m93R5J8m7K95k76J49l18K05j28R4J54l20J39
2564a49j05L35j39J85l80K75K81j80k79L7J24Q6j58k30L31k48J10K41k73J34p5
2585g7j1J56k63P9N6J12P4k45J22j47R0K77l21J02qj86J08P4l39J09K31m7K7q2
$$ y = [83, -38, 58, 14, 8, 431, -52, -267, 145, -60, -119, 129, -11, -247, -106, 100, 400, 213, -213, -1, -60, -114, 41, -429, 158, -39, 278, 120, -172, 144, -115, -104, -134, 151, 27, -152, 171, 105, -136, -140, 201, 19, 138, -112, 250, 122, -145, -78, -120, -262, -159, 314, 47, 177, 78, -150, 84, 244, -16, 356, -417, -115, -176, -184, 134, 97, 164, -39, -23, -49, -70, -277, 129, 57, 176, 149, -282, 229, -239, 77, -42, -229, 158, -109, -37, 44, -235, 9, 212, 244, 257, 256, -214, 12, 77, -159, 321, 242, -126, 23, -243, 185, 211, -22, 369, -38, 328, 7, -229, 230, 147, 145, 377, 112, -124, 236, 189, 168, 150, 147, -188, -196, -35, 167, 284, -209, -114, -96, -143, 152, -124, 25, -293, -88, -216, -122, 32, -288, -149, -254, 81, -58, 127, -253, 22, 303, 123, -156, -119, 5, 91, -67, -297, 34, -214, -104, 137, -136, -2, -77, -88, 68, -195, -116, -60, 52, 126, -119, 3, -144, -54, 223, -98, 4, -4, -190, -82, -8, -347, -238, -7, -54, -27, -109]
2609a09L6j73K24J61l28N73k09l10K40k23K50l89k0K26j77J89L83n28L14l17M93
2630C06k10m2j39K08k15J2K4N72n05k25J12K78l43K08l05J84J8L8j13P4l12M43
2652F8k67m6N42n36L71k82P5n1NJ89j90J16r6N4J66j59Q9P4k20J39L08k23nl24
2676b03RM26k51J74j61N3k32K74j70p1J31j20L32Q1k95K43m05M53l83l3q1J57
2698g2J39j22J36k28J15l4R3n20L55L48l11K51j7l0R4j70k14N4j07P26p32M4J52
2721e0N8K83k30j25J90k20Q0M22k58k41J21J92j27j54QK8l7Q9N6m89L13p9L50
2744A80k74p5O4J35q7K98m70kM87k79l30N33k31j77K36J97J06l09K71k68J27l46
2766b14J21K69j47j43K62Q7l03K68l12P7Q9J8j9l46K52J80k36p4O4J19o0p5k7
$$ y = [-109, -73, -246, -22, 139, -189, 384, 175, -135, 105, -118, 132, -257, -277, -51, -228, -39, 344, -184, 130, -187, 306, 96, 54, -85, 123, -92, -80, -56, 516, 11, -214, -102, 176, -167, 41, -264, -80, -62, -24, -137, -63, -375, 68, -199, -245, 297, -239, 132, -150, -75, -126, -121, 68, -122, -6, -102, -48, 118, -41, 48, 122, -98, 41, 349, 126, 121, -203, -194, 232, -19, 155, -6, 47, -185, 89, -81, -152, -21, -141, 191, 272, -23, 220, -185, 268, -115, -148, -229, -72, 67, -55, 81, -147, -32, -66, 27, -493, -138, 210, -101, 150, 133, 103, 197, 27, -187, -133, -240, 486, -246, -202, -50, 8, 291, 61, -64, 126, -94, -14, 408, 150, -91, 30, 222, 95, -59, -51, -23, -60, 29, 85, -404, -91, -170, 180, -94, -169, -105, 30, -57, 241, -229, -231, 256, -23, -353, 180, -51, -228, 8, 205, 311, 2, 273, 5, 132, -214, -93, 176, 29, -114, 148, 235, -68, 200, -112, -35, 54, 72, 53, -293, -41, 139, -97, -171, -107, 12, -48, -123, -150]
2789a50J56j78L98J45n34PK27l40J78j2k16M69j7r1k44j16L25r4j86K4K87O0J7
2812A15k90l3M15j37q4Q6K70l10r6J33j90K81m30Q9M22J74l10K12k63O2r2l35
2834c11P54m23J91p0j89J07o8L60k96j03q0K49l02L13j71J88l87J83J0K94j30
2855A19J36l24q1k0j03J81M0KJ32J64R2l75Q3J68j70j35J22k67K32p7K57n6J4
2878A34N4k14j20J00mJ1j53K93k85K85J39j42j05J37j1k21Q5J58j39J45l75N0
2900a78L95j93k6J55k63p3J97PJ22k29j93J9M77j4J8K1q6j36K49j61k33J48J73
2923A96l26J66k6j37N6q1K9L6K61l61m5K4N37m56K23m2l47K66l67L09L02o3l46
2946a92L64J86m77J26P1l4j53O6l2J66J38j68j00L25k15n1j85J43N51n97m5J48
$$ y = [-150, 6, -172, 226, 371, -163, -156, 71, -269, -91, -103, -319, 150, 133, 42, -202, -318, 7, -87, -273, -249, 38, 98, 115, -175, -208, 207, 70, -14, 72, 342, 32, -64, 69, -121, 160, -270, -181, 241, 415, 105, 317, 54, 116, 24, -311, 443, 20, 211, 141, -48, 59, -9, 351, 55, -48, -128, 121, -181, 132, -39, 149, -238, -55, -45, 249, 119, 255, -69, -150, -170, -273, -92, -52, -50, 82, 246, 338, -37, 46, 214, 44, -91, 31, -236, -4, -81, 176, 120, 134, 188, -26, -146, -46, -50, -39, -192, 101, -184, 101, 240, 98, -7, 130, 119, -102, -17, 141, 2, 147, -228, -178, 217, 24, -2, 153, -110, -183, 14, 21, 143, -86, -279, -260, 217, 203, 221, 242, 156, 20, 269, 108, -125, 23, 196, -130, 36, 10, -127, -71, -152, -123, -87, 174, -187, -232, -208, 329, -127, 96, 54, -293, -27, -394, -85, 217, 154, -192, 172, 358, -119, 7, 78, 44, -109, -43, -75, 91, 229, 61, -39, 286, 71, 20, -165, -22, 529, -68, -113, 35]
2968C5J28m24j66N53j05j6Q6Mn0L1J76j89J18o5j19K6M8j04k6j73L22k25N6R3
2992A4o9K77m22K06j91R6K43J65l81j67J85P8j28L36j68R4l09L8k80O60l62J07
3014B2Q1k60J79M5OJ83j49l20J46k62L62j66K1k44L23omr9j40N34l23K57j51j16
3038h1K3L27j69j41qL4k78L89r6j01J79j17K6L17p6o6j80o8P0l9j96O8J47K03
3062A67k1k03j61O3L82K36m96K8J26l52o2K66m3j8J22M6m9P8q7J77J50k68j45
3085f4J41J90k57k03J86k44N24l97M95l81j22K57j01K31k1m48J04J20k1j0J58
3106A37j0L9l34N1j08K62J30k52J17J12o9o2M14m34j6K2L2J16m60M06J11J8j17
3129A05J33L2k34r7M4PK9K0Q8k50J9N0l10L80m0K79k5j52L2l2k95J76J95m46K62
$$ y = [35, 163, -261, -427, 126, 21, 5, 91, 95, 45, 76, 252, 63, 181, 116, -3, 23, 71, -33, -59, -232, 90, -135, -79, 14, -55, 222, -200, 6, -185, -89, 154, 319, -62, -229, -44, 34, -94, 242, 74, 168, -141, -103, -383, 277, -85, 22, 103, -157, 22, 67, 73, 256, 107, -213, -67, -329, 33, -133, -112, -356, -33, -39, -43, -142, -282, 252, -71, 186, 35, -81, -58, 269, 100, -41, -49, -15, -293, 96, 0, -101, 78, -39, -13, 304, 228, 162, -18, -86, -16, -55, -251, -183, -36, 167, 146, -57, -218, -155, 227, 463, -33, -5, 121, -231, -293, -27, -70, -88, 34, 80, 31, 109, 22, 199, 349, 81, -64, 77, 267, 10, -193, -7, -251, 273, -124, 371, -10, -132, 125, 24, 255, 234, -214, -110, 10, -11, -21, 137, 127, 166, -168, -117, -225, 37, 167, -85, 32, 144, 75, 13, 427, -7, -23, -1, 31, 147, -313, 93, 204, 222, 105, 238, 270, 36, -61, -17, -10, 19, 39, 127, -123, -104, -54, -364, 16, -24, 255, 230, 78, 110, 78, -217, -41, 154, -292, -30]
3154c0J68r2j74j17K59l63N47k52J46j39L67k19j59mO9K39j39o7k46L47j02O7
3176A06k0K1k22K97J08j83q1l56N50j76M7P8J3m41P6P6K88j10Rj35M2L0O8l1Q7
3201A41k09l62K49K28P9j43J52j98M38o01K52k55J90j49J92l24J73L23j42L41
3221C75l43j30J20J90k51M85m01p9rR1k24NL2J3N75n29J52q5J43l36R0L14k72
3244g4pK9J55Q0j19J76m80K47K43k75k0K4M0q4J51j19J4J81l83K30L83l02j40
3267e0O2K73l47L7K61l14n5k07N24j80L8J15m20j86O19j51J27O3m13L51q9r9N06
3290D65m21J13l79J27J95j35M71k51k22Om3J46K0n24R03o19L33l20L21P9k66q0
3312h1k25O12j54m44M28N8l46M05k83J73j90J53L25l89r2J75j12l00N47j32j01
$$ y = [-30, 138, 46, -128, -245, 14, -349, 198, -54, 92, -47, 320, 101, -58, -62, 7, 246, 107, 40, -206, 141, 39, 106, 86, 107, -115, 182, 290, 107, 26, -330, 220, 44, 91, 169, 182, -259, -183, -107, 181, 71, 80, -55, -13, 17, 85, 54, 141, -68, -430, -181, 47, 126, -17, 135, -63, 375, -226, 26, -229, -39, -188, 4, -320, -147, 176, 34, 375, 32, -98, 22, 212, -39, 446, 45, -34, -43, 48, -176, -171, -139, -126, 449, -80, 72, -13, 130, -206, -116, 198, -74, -81, -52, 103, 183, 64, 240, -240, 7, 250, -25, -45, -21, 19, -65, 86, -33, -19, 162, -221, 9, 392, 90, -50, 12, 285, -62, -25, 236, -78, -133, -340, 184, 4, 42, 157, -263, -449, 170, 19, 146, 209, -204, 147, 58, -41, 465, 44, 157, -222, -95, 100, -35, 436, 185, -37, -31, -74, 72, 92, -432, 471, -148, 185, -135, 186, 265, -1, -81, -306, 306, 152, -292, 136, 194, -152, 253, -30, 143, -47, 106, 431, 42, -50, 125, 13, -287, 260, 128, 27]
3333B7N3k61J49j80N31j81m1j73p7o4L1L87m13Q9J01J02l3r3J82o2j37j3J50n0
3357B4oL7k78L66J6p8P5p2j04Q8o8L90J6l54K7J05m01K96j82J54QP5k63J53o4
3382d0J33j66l99O33j1k06J25L2k08j16K63k62J33j66K94l62O37k38Q0m3k0j96
3404a03K38r8J21J7q1J33O5q1j43K4r6k39K3P1o4M00j98k7r4P0r0J03L47j85j76
3429f3QJ54k82K18k15M0q0j75L22K06l4k28lM2nM24m32K61r1k19L16R5m18Q5J89
3454A15l30K27P7rk05K96j00J51m7k44J63j38J14N2Q7J1j57l67K43M15m28j04
3476a78P3Q7Q5L6n7J00o5k57pJ84m5K52k23J9K60p49L73L12l06K2k45L34M25o21
3500a91K89j25J60kk65L73m67L45l14L64k32J5o1L71j52j32J60k38K69k97J54
$$ y = [27, 80, -181, -32, -212, 319, 138, 97, -76, -153, -217, -186, 201, -212, -123, -22, 80, 47, -46, 136, 74, -63, -76, 74, 24, 18, 55, -223, 143, 159, 81, 156, 84, -20, 68, 0, 390, 406, 52, 79, 184, -217, 79, -103, 51, 59, 134, -129, 24, -40, 93, -73, -472, 161, 150, -56, 69, 101, -107, -223, 40, -222, -89, -255, 39, -323, 314, 76, 156, 113, 93, -103, 135, 37, 158, 175, 94, 227, 292, 211, 68, 92, -4, -243, -220, -149, -213, 187, -11, -38, -132, -62, -152, -49, 298, 113, -63, -55, 99, -183, 35, -180, -140, -220, -395, -73, 133, 99, -129, -132, -90, -95, 329, -103, 158, 67, -152, 164, 259, -159, -74, 115, -215, 12, 89, 80, -125, 171, 71, 222, 175, -69, 94, -44, 70, 122, 209, 220, 63, -304, -61, 354, -74, -178, -105, -18, 67, 103, 46, 146, 81, -176, -183, 1, -44, 208, -15, 4, 264, -485, -112, 200, -106, -84, -329, 5, 430, -191, 98, -27, 133, 131, -134, 239, -228, 117, -197, 167, -65, -50, -111, 260, 108, -24, 136, -102, 167, -130, 24]
3521B4K56k10NJ29jQk93Q0K78n60P78n26p6K24j53j15N2P2J77n14J97K27K8j26
3545c9K6k08K52o8m2J3J36Q9k37K81k17J43j08P1k18J48L5L7k69q5R8l6J77J30
3569A09k25K04R6l23q6L04M02o53J86J3J44k89K39p8j02L88q2j2k65P3j40J72
3591G5k52J22J75J12n13J76L87o67L86l1J85l20rK81k04p1J63j52P0J42J45k65
3613f5Q8M3J03J08k87j44K62k46J76O7l89L41j7k57J83J79J65m76L12k60r8K40
3635B8J1j89p3K61j31K43j04j70K23j34J78K6n0J20l35M3J31J40m93K34l8J24
3657D5K94k61j80LQ9J8Jqj24K4K84l22P3P5K44l08R9q7M7K56m35l0L13K3j99L16
3683B50k56n2K12J42o51J57L84k4k39P7k00K93l09Q3J25Jr3P0j20J11J79K8k65
$$ y = [24, 280, 70, 75, 204, 203, 211, -82, -2, 276, -284, 494, -32, -108, 116, -37, -152, -100, -28, 149, -365, -168, 59, 87, -39, -13, -221, 31, -37, -79, -66, 70, 159, -78, 203, -14, 129, 21, 92, -126, 22, 57, 94, -175, -260, -162, -198, -21, 109, -116, 88, 184, -139, -225, 79, 481, -172, 14, 27, 171, -118, 121, 43, -59, 329, 247, 235, -30, 43, -97, 75, -177, -55, 120, 232, -281, -105, 282, -385, 1, -30, 155, -165, -174, 107, -97, -168, -5, -157, -87, 55, 200, -65, 23, 66, 169, 277, -10, -154, 108, -138, 38, 105, -284, 57, 40, -217, -34, 145, 310, -166, 146, -114, -212, 28, 39, -150, -223, 38, -93, 150, 46, -124, 99, -35, 143, 169, 119, 239, -96, -53, 78, 218, -275, -41, -79, 45, 339, 78, -102, -99, -10, 8, 9, 1, -123, -99, 185, -137, -64, 11, 255, -53, 46, -41, 6, 262, -173, -203, 110, 133, -66, 250, -6, -58, 154, 296, -355, -198, 186, 162, -77, 0, -200, 93, -216, -133, -8, -7, -100, -30, -150, -39, 140, 168, -97]
3706i7J5M25m20K79J62j94q0j12r1K32l42K39mq1K87k39j32K21k2M0J0k71J22
3729e3K0OlJ37k23K52k60L98k55m76N64r4O2J87n3q1j75L18l35K61k9l29M48k23
3753F4J46o42O37j8p0j44L72l81K0K64m89K86k2J69j80k26L26j07j84L27O2k24
3775a4p5K3K17m00O4j24K98m7O7L7l9J91k92K06j12R0j29K22j45j79J02LJ61m0
3799H5j72J43j97R1J11j01j01K49R4k46j9K14M9l52O0O3J23kk64R8K53k69J76
3822H6J9J9j34J71j76j60j32J37J60p5k3K41m07L5k9J25L0J89j85J43m4k54N50
3845B86k69r9K11q9M0R3J29l26M5p9l9J9p5J25J3J34j1l85K12j56K44J05l92M74
3869B10k42m7r6J25K97l55K03j21Q6L9j93J43mJ09k08j19J49p1J81K63o80K40
$$ y = [-97, -82, 343, -77, 202, 364, 170, 90, -22, -113, 119, -223, 16, 12, -69, 218, -21, -153, 68, 46, 86, 96, -175, -53, -33, -27, -30, 107, -116, 136, -124, 274, 19, -457, 107, 13, 75, 262, 209, 128, -47, 271, -64, 197, 168, -161, 287, 64, 210, -432, 205, 187, 117, -27, 345, -36, -16, 248, -241, 45, 23, 192, 12, -214, 112, 5, -179, 148, 210, -14, -89, -66, 151, -249, -185, -309, -11, -58, 9, 46, 7, 198, -94, 112, 0, 90, -39, 183, 38, -141, -39, -36, 125, 85, -87, 56, -141, -50, 61, -40, -141, 108, 202, -44, -63, 151, 200, -152, -92, -29, 94, 92, -172, -74, 179, -90, 86, 105, 124, -10, 161, -15, -175, -307, -170, -10, -85, -108, 133, -274, -239, -268, -143, -113, 76, -109, 34, -10, -264, 286, 17, -82, 129, 40, 80, 173, 302, -24, 21, -58, -97, -78, -153, -28, -15, 119, 108, -277, -65, -221, 23, 128, -264, 210, -32, -79, -175, -50, 247, -108, 95, -26, 60, 99, -94, 49, 45, 154, -54, -173, -24, -95, 86, 349, -331, -91]
3891i1M0j15M23k34m6j29L58J88m99k26N54n7j29K01k82M7j73J60k03K94m7k03
3913a69J60k25oL87j72n4J50J37q4j01k12j70J01L31j39L17k36J94j86k39N06
3934B90j74k82J20K50j12k24L25k38Q7l53M17Lj90K25j28K09j16P2j28J8p6k74
3956b79P2k5K81O6j75O8L81k46l5J72l77K63q4m17L31pJ62K5k66M7k25J86J64
3979H2R6k22k02M28l72K98J19k32J5r1K29k69M78j92q3j8k02L05n8l32K21J95
4001A93m08K07K2j46P5J59k39K97m3K1n3n9J40m03J59j7k01J87r5L0kJ70p1J26
4025D9M4J4l0k5p8O7L44o89K06JK21k29J44J55j35N8Ko6k21K50k04o9K00J14p0
4050E3o0l1J03j49m0L75k47l37K48m7q4r6L84J5k04J96j66J17k35Q4M26k00O3
$$ y = [-91, -51, -166, 257, 23, -23, -152, 206, 394, -105, -331, 223, 166, 37, 238, -44, 3, -170, -10, -213, 81, 34, -169, -9, -234, -240, 147, -25, -79, 71, 208, 124, 23, -189, -359, -258, 73, -66, 251, 15, 209, 23, -216, 290, 116, -166, -46, 204, 92, -132, 193, -45, 42, -311, 106, 109, -81, 144, 16, 225, 109, 181, 53, 71, -5, -279, -207, -232, 49, 115, -60, 8, 389, 143, 108, 280, -97, 166, 82, -335, -4, -11, 151, 176, -90, -43, -268, -82, 82, 178, -44, -246, 182, -190, 108, 227, -5, 10, -81, 148, -121, 357, 165, 82, 64, -138, 167, 109, -223, -2, 193, -215, -8, 14, -132, -57, 102, -137, 160, 117, 138, 85, 26, 166, -237, -78, -95, -296, -109, -204, -174, -176, -6, -77, 49, 93, 107, 77, 52, -26, 41, 385, -304, -98, -97, 124, -105, 39, 194, 59, 117, 119, 53, -168, 82, -122, -191, 9, 123, 53, -7, -38, 65, -84, -124, 251, 4, -333, -85, -132, -216, -312, 72, 87, -117, 79, -87, 30, -205, -121, 305, 105, 168]
4073A68k03p7K53p5K5k9j16J41K62l92j45J14K82l19N8J79o33N89m0J5P1k86O5
4096i3O7J00k46M12l9j68R5j62J66j48K68k01Jj25K58n9r3L9J61j82l04K50n1
4119e4L08m00M11m68J47J26k87K69j29Q3K1l5N6j05Q3N4l53N77l28l73M45M8j5
4142H1k9Q0m9J31k09L4j37N7R3N2m1J00k82KK36Mj49P9L45l11Ll15N5J43j53J80
4168@J19o7j71M51m92J49O7q3N8J3j28L52n08J51J59j8k56L45K4k7j01J08m44
4191b99J17L91n59M03j00K33L43l51k36N8L42l09j54L78k27N0M5j12M71o15K56
4212A25j47Q8O3j59J23k01P7K62l11p7k6M98l75K72Jn37K45n1L11J6j12M7P2j19
4236H5l44j48L03J80n6j10J58%j02J77L9j74J85j12j67N18n36j87N56l94J88o7
$$ y = [168, -35, -112, 141, 66, 91, 62, -54, 87, 349, -43, -188, -74, 208, -111, -53, 126, -507, 82, 42, 57, 128, -158, -93, -26, 74, -172, 240, 201, 33, 128, -34, 132, -16, 252, 51, 52, -73, 185, 126, 33, 72, 233, 51, -253, -3, -54, 254, -146, 265, -203, -56, 70, -217, 52, -77, 6, 27, -8, 48, -57, 26, 80, -273, 304, -24, -397, 48, 96, 81, 52, 132, 83, 214, 5, 39, -98, -41, 52, 104, 63, 163, -119, -117, 119, 123, -26, 53, 398, 87, 90, -225, -170, -27, -180, 0, 119, 52, -119, 332, -160, -11, 56, -27, 31, 44, -84, 268, -240, -89, 70, 52, -204, 141, 165, 138, 37, 145, -299, -182, 209, -350, 53, -47, 186, 529, 178, -58, 0, 342, 33, -121, 257, 30, 80, 125, 13, 484, -131, 125, -22, 66, 129, -30, 93, -108, -31, 231, -80, -157, -183, 315, -60, 212, 213, -324, -79, -130, 181, 197, 85, 132, 204, 85, -259, -407, -104, 76, 20, -90, 68, 68, -34, 143, 182, 8, 193, 81, -86, 432, -104, -291, 265, -129, 59, -8]
4258hj86J4R1Q4j28q0L02nJ57j45k59K93l36J02p5J56L15l61J6L5r2J22j2P3m14
4283c41M45K28l24K33j61m11L12O6j74M88k78Q1k08n9k9m0L44l64J25P4n3N2n6
4306e0pJ2K71jN3m43lj54M03l40K19k3j69K66j50K39j43o6Q0k5L51j90J3j94o5
4331a16J00k40%L39j60O5j96ML10k02K78k39K49M8J04n45P0L41l71J04k80J52
4353a85M27k7n28M24j23M3J7j02K53k04qk08j51J96O91m57j47j6K65r6j67r7K75
4376G5o8k02K03j1J83k05K33l03N5O6j15j47J27J11j02r5L90k56o0j09K26M9j81
4399a36J79j97J15J47j33K69k19r0L55l87J59l3Jj24K54j33r5j5L92j19j30J67
4421B27j69J14k44K88m09R8RJ46k66K12l28M19j5j56J4K14l67K41q8J48J50j87
$$ y = [-8, -194, -180, -89, -5, -133, -213, 89, 84, 241, 96, -163, 130, -206, -104, -179, -23, 292, -69, -53, -18, -110, 12, 0, 73, -341, 104, 332, 8, 241, 80, -331, -19, 47, -127, 361, 83, 164, -44, -103, -132, -172, 172, -192, -67, 7, -46, 6, -50, -57, -45, 226, 225, 278, -165, -168, -322, 81, -259, -40, -63, -232, 34, -116, 123, -20, -86, -6, -31, 320, 130, 143, -51, -116, -16, -256, -256, 83, -77, -12, -208, -204, 106, -96, 182, -57, 192, 240, 344, -201, -131, 210, -161, -57, -337, -185, 242, 215, -313, 111, -12, 31, 48, -54, 199, -5, -13, -221, -372, -176, 515, 58, -89, -105, 160, 64, -103, -200, 75, 7, -195, 8, -3, 180, -25, 208, -95, -40, 26, -89, -236, -109, 2, -100, -195, 195, -61, -121, -230, -4, 45, -136, 43, -154, -39, 108, -25, 244, 25, -65, 290, -97, 62, 29, 30, -94, 160, 27, -68, -83, 309, 190, 60, 227, 58, 172, -72, 216, -193, -95, -86, 60, -206, 6, -322, 97, 82, -74, -60, 154, -213, 28, -60, 88, 238, 51]
4443E1K9k93P1K36k28K37Q1p7n35L45J88j64J5J50q0j87M99k70PK38k05L1j09
4466C0J07l74L47J83k14J32m32L77k91P9r0J81j80M54k86L61k59J29j10j64L3
4487A3K2j00J10j43J42k29J03L6L60m29K88n33J38J97K28j20O8m15J69J50J23
4508A78k35l02N81j75l41K81L0l2n7J31LP2j08q4J38r8o3K8k34M31m75M38j97
4531i0j68M62l14L12k95R7J89%m48N49m60L42m3k24l5L86l00k4P8j61J28k15M76
4554B42j98J95k21m2j5K0j51R7K33j6r5J31J28m26J22o0j68O09n76J76p8m3J0
4577a26J92J2j93J50q6K7J76kk35Q0j3Rk3J04J28k45j1m6K12l09M0J39K14j36
4601E8j5j15q6k4K5j75K88K50n21K93n6K76j66J55m22M6J02M1J00M9J25k80J26
$$ y = [51, 80, -213, -142, 94, -134, 103, 184, 107, -428, -83, 105, -59, -44, 106, 26, -161, 338, 68, 75, 313, 108, 139, 30, 137, -237, 110, 293, 79, 211, -221, 156, -135, -56, -146, 35, -145, 309, 23, 384, 125, 254, 144, -20, 13, 35, -65, 45, -98, 44, -185, -82, -46, 314, -115, 173, -360, -222, -25, 203, 83, 151, -264, -95, 55, 178, -57, -359, 222, 47, -294, -13, 17, -15, -72, 59, 62, 134, 26, -58, 80, -18, -81, -53, -287, 144, -331, 107, -90, -258, 204, -110, 202, -93, 4, 193, 193, -255, 294, -166, 176, 133, -91, -126, 260, -40, -64, 14, -147, -19, -234, 242, 44, 239, 18, -24, -39, -19, -170, -73, 160, 144, 49, 180, 308, -118, 4, -56, -224, 385, -191, -15, -93, -136, -126, 66, 78, -115, 35, -51, -24, 152, 150, -85, -5, -18, -9, -32, 72, 200, -45, -56, -102, 110, -199, -159, -20, 194, 58, 43, -72, -158, -182, -157, -332, -44, 206, -315, -22, -78, 198, 32, 187, -235, -189, -87, -46, 54, 103, 228, -52, 74]
4624G4K4j70j18P6K25O8j12K5k16p2M41k49NJ18r3m8k2J58q0p2n2Q5J27P6l30
4649a32J71Ml13N17nl10r0j33J67N71m27K64m65L20k22L1M1j16J69L12m93K12
4671G3q2j0On1J44j13J69M9l07L6j57J06L86m56N68l30J12j28l24K87P2J29m56
4694b77j67M94o5J25J49k47m6K26L1k04L1l45J07J85j62L46m08R3k19K70J91J53
4716B61j37r8J5J81m9k34k01K87j31OJ66j4r3p2p1L35O9l23m4K00J22o9k14P6
4740c2K49o7l39M09M9l60J70o5J2j46k26M69J5j41J3N0k15K83k0m25J78j90N17
4763A88o18M91l37K44j35K82k71K43P8j59J46j39j41L83l27j0K02k38O5j76M73
4784B44Lj17p8J1l14N40j99Mj1m4q2J81j97o7O14n3k75j90Lj06L38l89P5N70m64
$$ y = [74, 98, -72, -190, -114, 111, 179, 67, 92, -124, -196, 245, -4, 1, 119, 26, -22, -44, 114, 34, -38, -90, -5, 122, 198, -132, 39, 43, -270, 247, 242, -68, -158, -291, -124, 447, 20, 284, -181, 139, -83, -52, -11, -127, 42, 354, -139, 73, -9, -19, -13, -64, 80, -33, 136, 185, -122, -86, -243, -137, 249, -207, 361, 31, 143, 15, -309, -22, 50, 179, -277, -444, 50, -15, 110, 259, 12, -34, 192, 223, 19, 50, -295, -188, -3, -165, 181, -227, -134, -353, -83, 108, 261, 124, 26, 41, 222, 173, -61, -262, 25, -106, -100, 66, 52, -41, -113, -184, 151, 220, -103, -147, 53, 175, 106, -108, -32, 217, 150, -189, 220, 269, -91, 79, 14, 26, -120, -346, 123, 138, -3, 10, 60, -155, 128, 108, -317, -139, -329, 188, -430, 61, -276, -32, -167, 115, -156, 87, 165, 6, 152, 13, -128, 255, -72, -82, 120, -118, -53, -229, 244, 247, 130, 52, 63, -251, 289, 90, 94, 83, 39, -43, 138, -59, -126, 488, 435, 160, -30, -27, -133, 205, -184, -109, 461, -3]
4809cJ16q6J08N7k91L3N7j19R0K47r7r9K11l67K09R9n17L09p6L5J97q1l8P1l7
4834B8l29L91o6L86m21l44L70k8J45k43K88k53L15k49L10l20o0J04j9l02L87k3
4856F7O6k51J84j6l16L19j45L03j08o2j94J43L69n19J37J29J1L7R5k81J2J96l0
4879A46l01J55K02l68R4P5k47K6O3l1r7nQ5o0K6n4L16j22m1J36m1o6N09n20L67
4904B47j72J51n7m42M60k57N97p45M99l85M8K35O6q8k28J06k13M59j03j81P3P7
4926A47m5k51K36J60k78L00j87L6j45k08K53j86J59Pr6J96K06o60L30L16j91j85
4948h6K47l80K37j62K31N09n19J47m63J68L56j19j24j59L08k67L35m88J91K54
4968B16k7j92j88K83O0l9m29K53J54k01M5M7k62J5M21j7J9k64L89k25k06k10K32
$$ y = [-3, 113, 27, 135, 192, -99, -66, -9, -128, -38, 209, 112, 13, 224, -143, 66, 165, -352, -43, -119, -84, 113, 32, -6, 65, 28, -301, 90, 24, 410, -11, -355, 15, -13, 132, -111, 177, -76, 239, -10, 300, -20, -80, 24, 5, -297, 90, 67, 133, -118, 66, 50, -266, 53, -92, 211, 103, 41, -153, -10, 359, -160, -23, 106, 117, 154, 249, -32, -20, 176, 146, -155, 0, 202, -166, -72, 3, -244, -218, -155, -186, -283, -288, -203, -263, -237, -291, 25, -97, -138, -2, -43, -109, 400, -120, 247, 75, 226, 169, -273, 187, -70, 527, -218, 281, -104, -56, 179, 245, 157, -71, 35, -178, 281, 178, -3, 70, 147, 102, -149, 87, 247, -31, 269, 82, 118, -27, -235, 18, -168, -9, -2, -98, 98, 304, -356, -26, 290, 99, -86, 161, -219, 18, -144, 87, 596, 77, 224, -239, -71, 285, 166, 42, -117, 191, -76, 259, -229, -38, 216, 189, -3, -191, 92, 152, 113, -316, -63, 91, -110, -65, -18, -280, -265, 156, 139, 158, -106, 283, 58, -148, -358, -126]
4991a26K27j46J67M1k03JJ06L8qj22K36l05K92r6m46L14m5J18%J16j48k09N36
5014C38k05k31J17j57M0N44k75k36J34l5k03P9L46j79j47J48K85m04J23j15K21
5035A88l05j97L21K24j58J13l09O49o39L78n8k27k23L9K36l3J0L21j45n6k31K12
5057A10q8m12M57L0k13L3J33l46L76m42N29J92l57Q2J09j56L9k47o2O19l93J04
5079I7j5m0k7j03L7J38j01J05n3k09L07M4M4nlj41k99L69M4l15J85J5P0n6P4n10
5105c48M78j36Q7m1q9J97j75N6n2Q2J68j51J58k88K7P9l34J66J11o9j2q5J23j7
5129f5K57j41j52o5J81k40K97l48K61N9N3j72N3o1K69j14R0J74n17r0M19j77p9
5152a08j77M55N3l7N2j08j69K17q8m34N88k85P2n8K96l59J07N2J92o28M27k33
$$ y = [-126, 101, -45, 122, 163, -40, -39, 67, 105, 97, -25, 211, -94, 198, 102, -344, -30, -75, 43, 43, 159, 11, -198, 338, 133, -98, 19, -138, -98, 446, 171, -65, 69, 34, -169, -90, 256, 77, -70, 78, 363, -41, 82, -33, 188, -117, -314, 7, 231, 73, 186, -123, 526, -113, 265, 207, -20, -243, -204, 32, -1, 9, 330, 185, 129, -102, 110, 22, -390, 67, 97, -116, -83, 50, -296, 80, -362, 167, 359, 2, 84, 193, 37, 76, -171, -233, 386, -7, 97, 82, 42, 15, -88, -51, 87, -14, 91, 38, -171, 136, 180, 224, 219, 216, 75, -224, 145, 189, -126, 59, 74, 144, 88, 162, -348, 130, -6, 81, 40, -49, 148, -27, 29, -23, 59, 227, 76, 234, -54, -27, 52, -282, -116, -5, -74, -86, -171, -48, -65, 192, 51, -101, -166, 15, -225, 72, -276, -15, 44, 97, -75, -22, -83, 186, 72, 162, 336, -181, -271, 148, -29, -108, -285, 170, 223, 186, 238, 130, -39, 178, 90, -344, 244, -41, 31, -27, 269, -90, 17, 69, 261, -367, 60, -173]
5174a73n3J18j13K96k31K02p0N68k22l50j07K36m2J32r2m43L6M12M5j26k5J56
5196A54j79Q8k75M0K80j81Q9o4J76k86L54k83R7K18k03J28j57M2Pj08On1Q3K66
5220B41j24Q0k30j06J26k30N0kJ88J15j37k80L19k8k95K12J2k63N74k86K19k26
5242g1j94Q3k81N29O0j69J10Kk04K2J2p3n6J79j30L34J3m96P0L93K8j11Q4k91
5266a57M9K21N8j88m7R9K22j16j12nL18l61j06K13l37QO1K8J88J76l62N7m1K07
5290G3k0j99K57j0L1j44k22K21l99L25J22k9j05J40J09l20K50k36J82N0j12k66
5312c02K94j14j59K92m4k87L51j08j74L90L5j19l08L90l07M36k7k78J95q0Nj57
5334g6l8J53k03J51Q0M3k28k3L51m88M10j24Q8j42M8jQJ6o7Q0j24j17M7K67R3
$$ y = [-173, -226, -108, -221, 75, -156, 46, -24, 544, 322, -28, -135, 101, 59, 191, 99, -344, -308, 104, 149, 23, -2, 154, -25, 63, -212, -172, 108, -73, 16, -48, 128, -158, 196, -87, 10, 228, 25, 153, -4, 38, 45, -63, -57, -108, -25, 241, 117, 197, -33, -139, -13, -243, -193, -195, -7, 108, -29, -309, 10, -18, -313, -101, -89, -352, 222, -64, 155, -71, -265, -182, -463, 66, 126, -43, 67, 69, -135, -113, -101, -174, -230, -51, -181, 153, 166, -330, -260, 133, 161, 50, 134, -157, -108, 113, 171, -17, -64, 35, 257, 141, 29, 24, 342, -19, -125, 88, -249, -241, -180, -152, 36, 212, -150, -93, -134, 73, 53, -146, 111, 101, 132, -12, -234, -13, -412, -87, 35, 6, -99, 41, 150, -170, 80, -156, 26, 76, -36, -302, -8, -122, -281, 11, -33, -320, 31, -77, -251, 139, 174, 55, -253, 137, -170, 266, 239, -39, 156, 76, 81, -76, -114, 39, -164, -13, 67, 110, -118, -141, 210, -278, 132, 8, 96, -46, 2, 1, 9, 25, -42, 38, -86, -203, -156, 111, 204]
5359B04j40j64J12m27L78l05M10o1M4m0J85r5M6k88N9K45j70L3K8P3l33K60p3
5382a9k30%J7K96k59K88k62L4j4J07k72N58k38k04M12k15j12K43m10J05L77j40
5404F2J19r4L9o08N79r1M7j29J81k92L44n13L50KNn8P7p5J50K13l56o8m2M6J15
5429Co7N2M3k58j73J69N5L8K3K99Jk06k36J58k06J02O3J5K29Mm10r8N91k88j1
5454a08K92m68N46k42R6L6k18l9j6K76j5m98M60p8O2L6k76K84J5Q5m90M17L01
5477D58p44N5M73j61k52N46j69M8k68j47N4k27O95l81k34KJ92j77L0M53j13J58
5499B91k89J36k86l4K47m7J16l6k81M74k61k19M57j46N5r4K7J33j14k04J86l6
5521G5M4l78K98O3l05L99j16l34L56K14q24M17M09k46rj21J03l1k02K69n28L72
$$ y = [204, 64, -100, 12, -415, -37, -342, 68, 7, 51, 11, 196, 101, 147, -141, -82, 163, -7, 26, 54, 127, -206, 54, -19, -249, -249, -232, 64, -195, 93, -169, -135, -149, -42, -314, 244, 6, -198, 214, -1, -113, 130, -280, -175, 202, 62, 181, 87, 126, -482, 97, 6, 53, -76, 105, -187, 157, -356, -6, -4, 1, -57, 20, -55, 95, 308, -48, -116, -158, -112, 3, -64, -12, 31, -227, -400, -231, -176, -138, -115, 184, 185, -21, -257, -99, -305, -203, -140, -125, 104, 108, -302, -400, 191, -97, -108, 184, -284, 262, 20, 116, 152, -66, -105, -121, 155, 140, -358, 102, 24, 86, 122, -154, 130, 145, 230, -260, 157, 458, -286, -231, 242, 81, -171, 375, 206, 254, -14, -161, -107, -334, 361, -20, -254, -252, -60, -237, -207, 246, 133, 291, 2, 138, -148, -182, 65, 18, 134, 98, -183, 291, 30, -189, 268, 122, 177, 83, 110, 243, 129, -75, 111, 75, 119, -259, 39, 102, -203, 196, 80, -254, 102, 316, -508, -91, 318, 72, 63, -58, 45, 14, -188, 81, -447, -75]
5543g5J70J87k95N0J81l41L64j25m93L07L14j44K31l49j3j50n4L26n1k07L19l74
5565b22J49j2J65k30K11K8j81n4J65J14k6k68J18m8J92L48m76J49k81K61m5%k31
5588a74n2L60j73p9J51o7M5k18J7j06L43P9j99J39j7K5j50J46j70J08j7L0m3j15
5612a37K73M1j32L5l36L04j1P2j74J71l36M52k66R1o3K81Q9l29lKJ08Q8n11K5
5636b66J18m0M45k75k95L55P7l25K61m0j53J10R7n64K50M12j38K23m14L52j6J17
5658B91l72j4K54r3l22J67J23p1J22k46K85l13N7P8N9L50l08k72L46k52L31m02
5680b02J58j19Q2o3L40j99k9l24L41K23l07J55r0K29J40n5m50J94J04p7o4q3K1
5703g5Lk25L83K5o3l18L62n3L1k22O2J31j88N0J61l26O0M45p9j11J10j85rj1J42
$$ y = [-75, 95, 282, -13, 37, 218, -123, 241, 116, -377, -70, 244, 100, 331, -18, -31, -181, -235, 91, 40, -167, 152, -222, -73, -85, 80, -150, 61, 89, -92, -146, 19, 133, 107, -161, -43, -91, 101, 449, -27, 122, -159, 102, 57, 57, -174, -226, 134, -39, -118, 33, -34, 11, -207, -190, -296, 47, 126, -73, 66, 49, 74, -76, 70, -100, 8, -9, 21, -22, -137, 136, 177, 45, 80, -256, 48, 37, 109, -65, 106, -230, 222, -44, 47, -16, 265, 354, 25, 22, 24, 132, 220, -291, -266, -148, -188, 257, -18, -313, 42, 119, -206, 55, 15, -138, -28, 69, -495, -245, 167, 29, 252, -162, 190, 174, 291, -81, -95, 159, 66, -256, -89, 34, -37, 85, -161, 124, -189, -132, -54, 5, 355, 47, -225, 121, -131, 200, -202, -44, -163, -81, -144, 196, -3, -32, -356, -15, 208, -99, 56, -34, 195, 335, 280, -170, 24, 128, 51, -13, -96, -75, -72, -297, 86, 111, 48, -270, 92, 39, 70, -152, -90, 41, -147, -97, 64, -262, -202, 243, 164, 53, 163, -22, -31, -42, 100]
5728A00J6M3J4o6q5K55k41P3L3j96%pj84K35l4J68k79K32o8J64N9l11L08p3K08
5753C64n37M08k73j07J92m1j11J61K00l94M18j48p3j91j28K11J84J04k63O6r0
5774d8J50j32J1L3j97o5M68j41R5j69j06M73n65J30K03K9j35k1K23J09l80NO6
5797C6R3Jk36O85l73o9l5k46K65l10K75J77k12j85K46N8m8k01J67l01L39l1L5
5820A30Q2j67k1n0k9M01j53r4P8k17n4K90j70Ok76J25J35k0j54P6NOj5L27l75
5845a34m5M42j13k88J0q7J67L61k67P2p3j61J34o4k3K54J6j35J4l41M01j72J01
5868F9k94J32L2J4R4l04K11l00M26l04J12J36N6j20J42k26o3M06k16j13L43n2
5890A81j84J82k56L26k26LJ4k5lM6j84L94k65K6k4l4r9J49N3j13J43rk80J47J29
$$ y = [100, 116, 159, 173, 107, 22, 277, 36, 109, 142, -54, -54, -61, -245, -10, -44, 124, -155, 77, 9, 173, 232, -79, 229, 156, 364, -173, 235, -38, -145, 47, 6, -105, 56, 256, -138, 280, 132, 59, -132, -260, -49, 135, 239, -24, 42, -48, 102, -30, -19, 14, -183, -248, 220, 79, 174, 5, -101, 372, -193, -63, 140, 169, 34, 13, 236, 345, -35, -30, 36, 129, 130, -106, 579, 206, 137, 102, -144, 121, -189, 86, 263, 51, -134, 112, 170, 122, -79, 88, -213, 126, 95, 130, 212, 45, 24, -26, -55, 346, 193, 99, 177, -40, -94, 196, 26, 32, -244, -119, 16, -4, -158, -82, -77, -71, -86, 241, -134, -179, 263, 150, -138, -128, -215, -48, 313, 46, 118, 45, -116, 18, -46, -69, 185, 201, 66, 80, -261, 140, -32, 69, -225, -93, -61, -47, 47, -257, -46, -346, 80, -224, -112, 24, 80, -40, 102, -124, -187, 219, 3, -110, 233, 181, -3, 179, -77, 249, 23, 26, 40, 15, 12, 58, -126, 268, 3, 29, 5, -29, -128, 21, 74, -39, 104, 95, -185, -38, 91]
5915I1k17K41j48j48J4P9J00K49l81J07J93m66M28j30j99L95n55M08m61L14J04
5936A8L59n16OJ96R7q3J61k95J73j54l97N65k37J6l49O34k06M51n33p1K55j05
5958a5J27k0k9N3k71J51p5R8Nk38l9J25J66oK64j80j12O0k86K34K7n4j30K68M0
5983A63m86K66K46j8k44j27L55k97o8J36k85L69J13J4o7n0oJ56p2j32K80k00l5
6006A1J41j12J42j20M61m97K5j7J3J48m10M35j87J18J47j55j48K17j98J46k0j
6028A39k59M67k85J99j32p5K13l3l88J62O4k83L09k43K55l59K3M44l00j5p0L16
6050A49N3k18j38j10J82j16k8K51k5j3k56J20M5K56k72k1K51k2Q3k92o5J9N92
6073D25o03J51J53J20l22J17J80k30L46l60K63m64J25K8K3J93j21M36p53K60J31
$$ y = [91, -126, 115, -33, -181, -167, -88, 12, 261, -120, -13, 180, -286, 142, 12, -187, 208, -347, 61, -400, -86, 18, 377, -139, -133, 63, 160, 77, 238, -57, 116, -38, -435, 130, -107, -91, -440, 194, -12, 439, -94, -165, 90, -15, 112, 92, 63, 116, -155, -4, -79, 19, 24, -214, -253, -128, 38, 32, 296, 116, 4, 64, -222, 12, 39, -15, -145, 123, 163, -323, -57, 189, 171, -73, -200, 155, -142, -210, -74, -359, 10, 123, 137, 70, 20, 14, 170, 98, -34, 246, 46, 11, 152, 40, 182, 62, 523, 26, 51, 34, 47, 195, -215, 220, 33, 151, 298, 143, -5, 212, 14, 160, 140, 139, -120, 347, 62, 261, 129, 54, 267, 234, -154, 8, 72, -211, 98, -145, 110, -249, -226, 218, -82, -97, -167, 149, 202, -16, -154, -264, -82, -198, -226, 25, 0, -13, -269, -149, -104, 152, -120, -141, 110, 88, 171, -121, -186, -167, 425, -178, -27, 126, 246, -76, 41, 221, -9, 337, -23, 240, -224, -99, -71, -48, 145, 24, 460, -293, -33, 98]
6094I8J90m31L75O3j89p4j39J83R7k47k97L02j4K20Q1k57mK9q1N60o48J50M3k33
6118b23M72m36J85L18j53j26J99k08J86j76M3p2j45L18j13k51K36k20M9p2J12
6139g7oj67J90j86K51J22k66J66k23K50k42R5R5K72j60k83M5l7L21k04j38L08
6161A26j37J28o3J24k04M7k3r2%P3j25K51R8q2k4k06K47k77K39jo0n62Q31n64
6185b56L22j67L26j12k11j42K80l3m24M77r4PK94K20m06L82o26J52J05j0LO3j67
6208a7K68k53J35j11j68N2l5P0J2J1P7j47m0K35K7j52k16K58K6O8j59MM9J29m25
6233c02O38l28m26M11k4K0L04l4l68LL59m67P47k58n68N69n15J30P7k0J9j05L04
6256A66m30J98M11k16n1O6M2j31n4j07m4O1Q2o4N9K23l08R0l6l0j55M87l80j68
$$ y = [98, 288, -143, 232, 295, 106, 32, -107, 76, 173, -74, -371, -69, -83, 137, 218, -39, -43, -14, -95, 465, -183, -33, 10, -223, 249, -187, -2, 316, 163, 37, 236, 28, 214, 38, 81, 9, -136, 182, 69, -182, 54, -166, -117, -189, -77, -83, -250, -60, -246, 5, 127, -139, 27, -196, 54, -188, -93, 2, 274, 114, -169, -124, -161, 160, -44, -182, 126, -11, 117, 54, 178, -26, 21, -2, -94, -94, -21, -146, 105, 203, 121, 97, -109, 138, -139, 100, 99, 39, -523, 308, -256, 66, -101, 225, 113, -98, -240, 40, 7, -417, 60, -34, -27, 267, 487, 81, 463, -163, -11, 94, 84, 87, 150, -17, 251, -2, 133, 22, -146, -94, -129, -59, -47, -36, 41, -106, -146, 89, 116, -36, -252, 6, 32, 100, -59, -55, -6, 123, -302, 336, 8, -418, -7, -31, -11, 293, 259, -109, -106, 253, -214, 533, 275, -293, 276, -239, -109, -32, -52, -33, -138, 166, -264, -66, 345, 129, 78, 144, 186, 55, 1, -106, -150, -89, -7, -71, -12, 211, -97, -7, -43, -73, -228, 259, -121, -289]
6280b89J20L09l51M09k67K80p7j90J42j02J36n65N81Nk28N0L30j28O5l5l87L48
6302A56M9m14M24K8j48n6O8P2j10p5K6J10J28j90j12P3P1r4o9L45j49j37L84l45
6326C5K5J55l18K44n5r4l98L07l0J40q7k01M83k68P4n0j03P1K9J00j62L18j44
6349G1j82J83j61M73n38N01J3o18M49j29m0O3j18l9K58l19Q5J54J7P4n05M24m13
6372b97N14n98P08l38j35N9K45k33O4Q9J03l37K81q5k02K45M3j22J18j95jL05
6394B31k56mN1K65l64K29K7j07j5j24Q5K9K4j24o2kJ10j30Q7r7m2M65o36K88m
6419g6JK25J5j3j94J38j67n2J66k0j07K79k55O2K56k68j26r2J98J30j55l1k35
6442c21M44N6j11l5j74K35O6K8k29J46o07N06J19j68P6J95m90J91M12j97k50o2
$$ y = [-289, -169, 140, -211, 198, -69, 211, 134, -56, 86, -16, 120, -445, 136, 141, -87, -37, 293, 165, 230, 195, -192, 156, 205, -209, 215, 243, 95, 39, 107, 179, 69, -6, 20, 130, 258, 68, -44, 29, 100, 6, -63, 282, 133, -4, 380, 35, 60, 215, -103, 141, 86, -8, -406, -99, -129, 11, -76, -277, 206, -62, 12, -38, -141, -70, -41, 59, -103, 215, 71, -111, 72, -89, 384, -154, 347, 360, -258, 191, 62, 22, 85, -33, -72, 186, -133, -48, 106, 123, 197, -308, 116, -297, 217, -381, 327, -11, -146, -87, 158, -75, -11, 78, 181, -156, 125, 40, -162, 83, 126, 4, 122, -73, -74, 231, -25, -29, 22, 287, -77, 152, 179, 72, 57, -67, 18, 47, 71, -53, -115, -117, -7, -137, -50, -147, -189, 276, -360, -72, -76, -75, 150, 165, 152, -42, 96, -71, -123, 43, 23, -84, 195, -60, 2, 258, -10, -136, -228, -30, 100, -55, -86, -321, 123, 179, 68, 33, -141, 94, 160, 188, -41, 105, -502, 4, 123, -45, 31, 226, -264, -73, 339, 142, -108, -170]
6464a70J40L00J35m53P4L5N5j49M0k3K18k31O9L2J26j05j90k0J91Q5o1kQ8K6j0
6489B00k63J63l24K19Q5k61J53j88M32j40j48K8N4J92k50L8J35j65m02N24j17
6510c5R2J03l64K13q6L02jm63L20J30k00J95l59L39k53O3K0j40K85J62m09J39
6532E3j51R5l5K37l29n3M20j43j11p1LN0L56l11n0K44j89J05m1R6j71k72K07O7
6556FN2r4R1j69J1j3j19N25k57J26k90L26n7l72N36m77K27j03m2J87j79j6l4q9
6580b24P68n66m8p3J22L94m07L28k84K03j24j57L30l1l40J67j00J16p9N8Q4Q5
6602B22l68p4L49k5L4o5K50l15N3K51n70N03j9k78J26j05m0k4Q2J71k9J22l44
6625i3j49M83k99PQ8j74J95k11L33p6q0J18K60k62j68J58O2l75K86k1j51O2l15
$$ y = [-170, -30, 270, 405, -48, 26, 61, 116, -33, 7, -16, 202, -29, 40, 72, 198, 93, -97, -117, 74, 159, 98, 96, 184, 210, 200, -63, 100, -224, -5, 80, -181, -28, -216, 216, 76, -72, -44, 10, 202, -48, -10, 125, -40, -442, 82, -35, 57, 160, -204, 9, -77, 225, 224, -239, 81, 211, 11, 206, -153, 186, -67, -4, 16, -124, 161, 323, -86, 53, -98, -3, -38, 199, -130, -183, 237, 94, -17, -88, -85, -35, 321, 10, -40, 204, 15, 120, 79, 175, 4, -268, -61, 6, 58, -36, 55, -114, -103, -116, -235, 290, 33, 159, -131, 195, 138, -234, 302, -175, 52, -51, -93, 94, -85, -101, -135, -224, 544, -22, -70, -143, -21, 373, -34, 294, 10, 213, 89, -68, 262, 231, -109, 58, -42, 74, -5, 53, 137, 222, -146, -220, 129, 104, 138, 73, 323, 8, 61, 312, -258, 245, 226, -52, 74, -31, -71, -95, -13, 158, 129, 251, -93, -242, 241, -58, -51, 37, -137, 58, -153, 180, 104, 24, 142, 402, 140, -28, 130, 192, -183, 103, 82, -69, -7, -322]
6648c22O93l71j28j62L84j83J9K43j32M5Kj12M2o3l9N1J21l32J65K35p4j90N3
6671e5J52j98L62l59L09l20k0J35p6j9r0K47k36K25q2K26n08K68K40m0k19K23
6693A65k98k4O58p02R3p5M1k8n7K85j93q4N13r9k11q6J28k31J18jK43j75O9L5
6717H4j55oN4K33m33J79J10J15n0k41P8j18K11O8j69J28k84J42J7j31J45K18l1
6740A64l18J27p3L27n32J48k29N93j73m09K12j0K14m81L59L6L8J14m27L45l5k35
6762b45O0k2O28n13J84K27l15J09j96K97k17l11J43L52J53m93Q3K57l16l1M40
6783B74l56K40m5r3P0j43O36k43j10P8l99J99k61L5j33J58j9n9J32r9L00k38M16
6806C40l93j99l4L30j49k59L31l9K10j53M5r6RJ05M5k23J96J18r8j80L7j44K63
$$ y = [-322, 371, 0, -128, -290, 94, -89, -70, 173, 41, 86, 88, -24, 18, -45, -84, -33, 88, -244, -79, 156, 82, -108, -55, 97, -101, 261, -98, 211, -109, -129, 6, -70, -89, -179, 68, -168, 57, -25, 201, -307, -39, 201, 161, -58, 165, -133, -157, 501, -201, -108, -183, -142, -170, -227, 58, -135, -219, 294, 195, -16, -102, 26, -205, -87, -88, 155, -20, 49, 84, -71, -77, -23, 210, -223, -44, 66, 181, 131, -110, -32, -150, 61, 129, -40, 88, -196, -54, -37, -168, -23, 195, 164, -154, -27, -100, 227, -305, -157, -386, 207, 34, -375, -163, -173, 41, -440, -81, -45, -7, 107, -320, 25, -10, -245, -185, -207, 421, -92, 92, 319, 4, 113, -83, 214, -3, -314, -171, 181, 334, -159, -76, 181, -135, -166, 274, -82, 158, 113, 20, 90, -53, 583, 340, 230, 308, -91, 108, -153, -118, -251, -93, -112, -171, -39, -138, 162, -76, 340, -53, -252, -286, 44, -105, -364, -33, -72, 138, -15, 30, -66, -57, 48, 93, -130, 66, 184, 86, -94, -57, -201, 62]
6829F2j7n7j71J78P4J46K90k51Q4l83J36Nj73L7N2K69l59M32k16L7m2J65k2K13
6853D89l25q7k91N0K30J20n2K4k19J4j22K27J08m56M21J04r4K13l22R8k36K15
6875A09L6j20J59j81k3K42o6o9l20J14j48J04L22k60j86L34k05J12J21r9K30k8
6897A78j18m1q4K03J49q5K42n87J46P7j76P2j72K08p5R2l01M55k94k2K94mO2j21
6921I8q4J24j76J64O6j54J08l19L10l87NK47L64k64k15l4J23K39k84JJ7J5Q0k04
6945a60P6J98P9k51J64m1k07K75n10J33J26O1J65K37n28K44Q5Q2k22P9Ql5J9k90
6969b13Q1L84j45k49J10m23L48p8M34k56q8K93j36k12L43k13L20m10J67l2j30
6990a05M61j11n54M73K28j86o42M31J44m42M78j20j56PK60l3K60o61M87k23J5
$$ y = [62, 45, -12, -183, -5, 69, 215, 505, 254, 338, -45, 91, 96, -77, -40, 12, 281, -78, 354, 138, 175, 133, 298, 276, 489, 164, 77, -214, -164, 66, 186, 134, 158, -61, -47, -169, 58, 166, -290, 131, 235, 141, 354, 32, 130, -106, 109, 145, 25, 184, 3, -20, 222, 156, 87, -233, -119, -267, -163, 159, -101, -287, 47, -158, -46, 75, -24, 206, 178, 60, 19, -65, 138, 287, 202, 444, -143, 3, 80, -96, -24, -196, 12, -63, 29, -272, 183, -111, -133, 161, 157, 219, 98, 14, 138, -38, 126, 192, 38, 146, -173, 137, -250, -245, 2, 366, 102, -113, -147, -24, 215, -69, -68, -51, -36, 44, -160, -84, 114, 193, -58, 106, 65, -142, 133, -377, -244, -118, -57, 108, 345, -183, 61, 146, 228, 6, 85, 93, 58, 77, -213, -132, 252, 107, -142, -32, -455, -107, -185, 249, -7, -95, 198, 62, -150, 193, -20, 300, -110, 57, 25, -105, 356, 245, -309, 164, 392, 206, -436, -5, 139, -303, 175, 55, -101, -94, 166, 133, 393, -268, 219, -4, 11]
7011A1K08J7k46M8j95J11K04m89L68j36J52M9l00K83j65j36L03K31n31K69j86
7032a30J00K27k07J5k00l7K93j98O8J31k77k32O52j54P8L4M3J18l95L78m62M1
7054a14m8Q4P1lP6p6k5K44m29L45j59J75k66J42l6L5J32j84O3K87l72j6J8J22
7078F6j75J84k74L53P4o16O11k23l8l59O77j78o07J78N12j58j70J0L06n36M92
7099A29j42j25M9Rj9J26j15J72k73k96O70P0j21K4k68K92l00J41J70Q1o30N24
7121A68j62j05L14j73j0pn9J42j2l40J62m5K04P6N6j24k27L57j54k2oK62o07J34
7145a78J96n5p0J55l28M70J0p4j60j00j9K40p3m04L93J2K46k40q2J67j10m0k8
7168g2J51j28k27L72j76J28j38J99k75J62m4K36j37j9K7n4k11K76L00l89Jk1J98
$$ y = [11, 219, 236, -10, 38, -157, -46, 158, -331, 37, -99, 53, 102, -198, 85, -80, -216, 87, 318, -213, 56, -130, -30, 197, -10, 5, -195, -232, 61, -137, -69, 62, -215, -447, 205, 51, 129, 163, 206, 324, -71, 307, -155, -114, -162, -78, -7, -10, 66, -10, -35, 209, -220, 125, -34, 141, -125, 17, -19, 16, 148, -36, 27, 314, -58, -74, -56, 66, -109, 75, -199, 154, 228, -388, 223, 0, -38, -397, 280, 102, -505, -327, 185, 27, -143, -133, 173, -363, 129, -13, -138, -89, -80, -99, 27, -88, 84, -189, -485, 185, 255, 134, 158, -110, 182, -118, 23, 193, 274, -356, 168, 6, -99, 215, 42, 32, 25, -34, 108, 96, -244, -82, -127, 77, 153, 209, 85, -142, 215, 61, 39, 33, 295, -312, -178, 18, -37, -107, 48, -280, 190, 200, 126, -34, -134, -153, 87, 14, -390, 3, 15, 261, 21, -61, 106, -4, -44, -72, 79, -49, -276, 96, -80, 48, -90, 109, -166, -4, -48, 188, 51, 32, 59, 5, -206, 70, 370, -19, -18, -39, 159]
7191A59l97J09J38J25r5r3O8o7Q6l00J59O4J35l4J47o8j11J06j25J39k70J9N5
7214e1q8J08k41K55J6J42lk37P2j85L08q2K12P9Ln85K24J1rM76l62J48O1k61j55
7239a44O3P0J10K12j39j27m6j53J37k22J66j14L1K27Jj12j45r6J50K11k66K27
7261D1J87l73lL84J5j22k11J17j02J95k79J9M10l55j2J81o4K6o9K9K55l62O5J92
7285A64j61J0j9J75k77J97N1l36K57P9n6j11K02j2q5r2j43M35m22n1J54j30l4
7308b05K10k91R6J37L12n19K34L12l63K9K8m8j2l0q2J65R6k68J37J8J10Q7l95
7331b42N53k14m33L92j65O8K65K4M9l06J26J2l9L5m0j78J79l48N46k98j94k52
7353d60M74Kr2J79k3n0J57j33J19k47J23J46k64p6L24m5j39L1K25k07k49K40j8
$$ y = [159, -238, -129, 9, 134, 39, -54, 14, -53, 33, -267, -108, -44, 91, 57, 204, 136, 25, 131, 6, 145, -125, -106, -51, -139, -31, -272, -17, -1, 141, 138, -99, -27, -212, 96, 14, 226, 305, 308, -277, -53, -42, -51, 425, 63, 211, 272, 11, -144, -81, -11, 99, 311, 172, 45, -1, -154, -17, -239, -73, -187, -156, 71, 72, -40, -185, -281, -131, 80, -186, 41, 228, -145, -148, 236, 251, 129, -82, 35, -67, 128, -151, -132, 278, -77, -89, 92, 28, 54, -15, 14, 269, -93, -28, 164, 3, 13, -6, 169, -108, 89, 140, -196, 61, 140, 84, -27, 175, 163, 78, -14, -157, 278, -144, -195, -41, -171, -205, 5, -286, -190, -53, 259, -260, -26, 286, -77, -48, -20, -68, -80, -110, -192, -27, 69, -199, -62, -44, 66, 153, -242, 311, 97, -336, 56, -109, -41, 224, 248, 297, -9, 117, 129, 90, 125, 85, -93, 86, -262, 284, -14, -208, -460, 14, 16, -76, 103, 80, 30, 187, 54, 173, -74, 49, 195, -69, -145, 179, 134, -5, 26, 251, 44, -205, 35, 17]
7376A7J48k47K72k34N4J29k69J98J78l43M22j63k03N1rK41n92J41J75L95r4Ml06
7399c5O4l14L21J50j46k67L78o7k42r3K21J23n3j77L21k18PJ42k73K17p5J03Q8
7422A75o8o6k21L66k33n0M32m35J63k26jj6L01m2l19K29k27J56J71J01m70K75
7444eJ60j76j62K06J45l46N0L94l76j19K83k38N63m39r0L48j74L3k59K54K27l66
7466h7K04J9l06j23L76k45M56j97n08K90M10k26l21K02n3R2j89L83l27r9N1J41
7488e7N5m2J15J69o03M21K15n3j45M5p4k11K03j77N1R7j00J50j51K48k51J95l39
7511b39L85j06J08N1j95K53l76j46M90k57k39M31j14l3Q6Q3j77J74Jj72o5J2L3
7534a2J01J64n01L91j79q6J84k77L72k36k3J19mJ34pm36M27o9O2k44J56O5j94
$$ y = [17, 165, -82, 190, -44, 10, 139, -130, 68, 246, -97, 325, 162, -41, 10, 1, 242, -350, -209, -34, 361, 267, 271, -35, 29, -285, 36, 186, 40, -227, 151, 84, -158, -251, -30, 93, 40, -137, 184, -34, -27, 115, -158, 59, -16, 87, 175, 107, 41, -180, 186, -47, -97, 335, -100, 63, -163, -164, -180, 121, 79, -240, -11, -238, -82, 89, 190, -280, -5, 155, -21, -183, 23, 168, -178, -128, 266, -110, -229, 54, -184, 379, -60, -150, 198, 24, 57, -202, 52, 279, -87, 117, 136, -170, -293, 83, -162, 294, 97, -411, -121, 289, 63, -258, -56, -109, -17, -206, 177, -150, -249, -198, -57, -2, -44, 71, 240, -363, 58, 273, 220, 75, 120, 46, -165, 38, -139, -88, 9, -91, 59, -92, 156, -95, 100, -239, 146, 40, 148, 199, 4, 257, -119, -265, 225, -32, -271, 160, 46, 13, 99, 182, 5, 179, 180, 8, -57, -45, -12, 89, 253, -248, 143, -36, -122, 62, -215, 157, -79, -102, 17, 13, 147, 140, -296, 131, 62, 124, -120, 36, 101, -93]
7557i3J1J47j69RL88m66J28R4J58m7%J5R7m45L50k9j50j65J82j85N84k80k53J26
7581GO1l23J66L84m31Q8J43j71j41k4K13K13m9k35j46L33K60m90K93J82l19j50
7603a36M61r0P9j0l61J57m14J36J68j36K3J00k04K49j19P4J31m12J07Q2K03r9
7625a1n73L67J69L20j90j86j0J1P1P6m7k58K49J7O7j78K69l85N01k36L5k86L83
7648A75k05j0N26m47p7k40M17P8l06l33N06l22L16j90J14j02N5L09k87K0J54k38
7670h7o7K46m06O36j93l86N0L94k17O0M18n77J41J28n1J14m02K43J04q2J3J61
7692B40j44j52j31L3K79l32L27j22o0J97l65K81k43J88J6j79L77j81l2J06L5l48
7714b10L95n7j77o7J75m9k20J30P2j27M8K06l85J91J27j72J73K81n62J52j02n5
$$ y = [-93, -82, 65, -104, -95, 293, -173, -45, 49, 207, 160, 160, 175, 272, -173, 177, 148, -2, -167, 15, -170, 414, 134, -119, 7, 68, -255, -89, 295, -136, -48, 95, -76, -217, -241, -28, 185, 136, -99, -245, 88, 348, -142, 151, 333, 14, -136, 325, 235, 314, 304, -57, 100, -314, -178, -10, -146, -123, -23, -227, 22, -97, -23, 108, -304, -197, -115, 88, -11, -584, -217, -48, 272, 82, -104, -114, -103, -32, 44, -3, -261, -12, 5, 72, -106, 163, -222, 279, 43, 78, -208, 175, -30, -40, 486, 39, -38, -278, 139, 217, -89, -422, 84, -238, 78, -112, 2, -100, -45, 264, -23, -3, 151, -87, -154, 92, -314, 322, 129, -257, -207, 187, -30, 30, 448, -129, 12, 140, 89, 203, -199, 44, 148, 66, 79, 240, 96, -56, -187, -154, 125, -207, 120, -2, -62, 135, -230, 51, -192, -4, 12, -167, 210, 29, -3, 103, 138, -210, 185, 128, -49, -116, 59, 10, -210, -80, -8, -135, -87, 119, -266, -75, 52, -120, 53, 334, -228, -76, -178, -233]
7736b33J44M0J20n6R3J24j03Ok20K21k51J49q5p2K94p4K94k64k39J75J9k02J76
7759E6j54j45J50Q9m6K4j67K20m7L15l94n4P6j83J59J17q5K1K95J31m28j1L2R
7783b0J61l42J79o7j67Q7K96k91k9L70j71Lq4kj39L6L26j66N9R3j28J1O1m0j25
7808h9O4J14n9Q8k23k1L36j86p8J18o0M7j35K03j63Q3j52J1r0Q5K47k48n1j57
7832c16j4L32R3q1J64k24n4l6O5J62j41M20nm59r5K92R8k49L10j84j42m4K09J00
7856B01j42Q7j94J16Ql04N8p0M10k02J38M4k48J85k34J27L84k96r4l45J11K49
7878a1J82k59J5J75k1o8j62J20n4K65k79k10J50K30K01k09k58K57j32j05L96j90
7900C3k34K95K1k10K42j47q7j4L48k26q7K57k14k22L84k6k99K13M07k90m53M23
$$ y = [-233, -89, -49, 71, 15, 108, 232, 129, 135, -85, 136, -115, 34, -51, -123, 171, 97, 391, 127, -112, 63, 82, -120, 56, -98, -243, -93, -4, -50, -26, -193, 27, -20, 295, -99, -153, -77, -260, -101, 16, -69, -48, 247, 378, -50, -61, -29, -20, 141, -201, -22, -89, -256, -169, 127, -164, -193, 177, 6, 9, -75, -77, -216, -180, 146, -20, 39, 132, 4, 15, 76, 36, -89, -25, 89, 30, 118, -105, -126, 210, 24, -54, 64, 4, 51, -84, 119, -44, 39, -113, -102, -192, -107, 140, -108, -159, -316, -330, 2, 95, 14, 178, -46, -100, -136, -71, 91, -50, 370, 365, -94, -189, 103, 201, -48, 262, 78, -64, -108, 101, 201, 59, 146, -48, 68, 76, -228, -170, -240, 170, -32, 106, 150, -98, 87, -147, -20, 364, 68, -26, -371, -260, -11, 171, -88, -73, 102, 81, 13, -149, -29, -83, 182, -97, -307, -157, 73, 274, 65, -193, 64, -68, -173, 223, 33, -201, 94, 115, -95, 147, 0, -87, -101, 247, 21, -66, 191, -23, -245, 139, 113, -186, 27, 434, 144, -309, 114]
7922A14J15j67j25K19k43J36Q5n0j01J85j74j88J1Nm4N1J63J81n02K78J85j52
7944a8j29K50l42J16K2N2j09J9L0J72O2l6l59J80J24k09K97m58J45K19M5k37P
7967a57J73J25j21K18o6k74L5J18P2J00n9j16k53K76j89N10n79K78jk24J08P4
7989D8r2J12k5j54n5M9L59l79K40j57j70rM71m15J28J46L64k86j80k74L88Ro0
8012E8j92p4L17p7j58M4O4J63k88J82j51L30k77N9K08j35P9L5j23m8Q6K4j40j9
8036c3PK26j71J16o8Q0l12M22k76j94M01j06K6j21o6K88j27j18J67j21M3J44l21
8059a14J01L01k77J27j62p8P7J27j45L64q63L68N43m07Jk17J77rk5p4j03M76j11
8082G7l23J64l9M6j76K07l1J61K59l82Q5R6k88j0O7K64L0j42J47k70%K20l98M98
$$ y = [114, 229, 62, -63, 156, -87, 49, 134, 84, -17, 168, -6, -194, -183, -178, -222, -171, -8, 173, -329, -51, 134, -18, -147, 103, -239, -123, -101, -49, -158, -139, -109, 63, 125, 89, -270, -90, 34, -175, 122, -336, -191, 28, 73, -164, -157, 16, 141, 20, 238, 172, -102, -67, 51, 123, 223, 164, 48, -205, 71, -118, 392, -187, 91, 90, -134, -26, 48, -44, 68, 43, -111, -166, -117, 242, -137, 103, -54, -224, -233, 238, -177, -49, 97, 461, 175, -5, -279, 109, 118, 58, -134, -208, 109, 32, -126, -82, -18, 145, -143, 39, -112, 218, -59, 0, 208, 73, 152, 187, 64, 16, 102, 126, -14, -33, -26, 200, 29, 145, 77, 157, -155, 267, -9, -203, 198, 92, 118, -3, -69, 219, 92, -26, 141, 20, 63, 207, -114, -13, 288, 11, 138, -24, -102, -25, 102, -43, 321, -542, -174, 369, -38, -37, -254, -77, -86, -111, -185, -288, 188, 77, -246, -82, -121, -75, -251, -44, -75, 86, 345, -37, 48, 144, -144, -154, -87, 177, 207, 65, 212, -58, -58, 162, -236, 262]
8106B62j74r0K53k62n0J96k37Ml1J06k4J51j15j25K10L5j81O6q3K6P2j00J42R1
8130A42o0r0m7L23l90kK70k37L85l15L40j2l65K19k34K79k44j57j92J8K70P3L4
8153HR3o4Ml43Q0J51J31j35rM4Qj60P6J99j4k71J06J22J28n7r5j63lL36j90j53
8179a71N35j88n5n6k12J71J73k53n3q0R1K18
$$ y = [262, 88, -2, 251, -11, -61, 135, -102, -98, -129, -23, -47, 104, -11, -136, 74, 109, -72, -6, -89, -63, 9, -91, 51, 142, 82, -8, -55, 268, -122, -124, 146, -91, 294, -21, 319, 307, -58, 161, -73, 206, -38, -195, -387, -369, -99, -26, 8, 101, 37, 41, -302, -222, -71, 60, -75, -84, -40, -32, -192, -116, 83, 69, -202, -96, 26, 154, 97, 2, -161, -164, 172, -18, -171, 364, 176, 121, 65, -147, 24, 197, -56, -109, -189, -98, 120]
8191A20
$$ Imaginary data points
##PAGE= N=2
##DATA TABLE= (X++(I..I)), XYDATA
0@%%%%%%%Qj6J6j6K4l2L2m0N6o7P5q8J04j26J50j74K01k30K65l04L44l89M40m97
31b64N61o28P02p86Q78r79J086j204J335j481J642j818K014k228K470k744L052
48A608l404L812m290M859n548O408p516Q997j1101J4357k0123L3447j24237o8302
62a71033P6719o8946J9018K2941j2889q846L7231j1680P965K0948j0859o968M1936
75f4463q506j7127L8958J4360m4411J7906L5496k1891k425L2769k0346j3991L3414
88b0257j047k3131K5119N966k5197J8631J7332k8065J1330L2169k5424j5548L4737
101F615j811j9539K2070M630k0352J4096R255j8494J3607J3685k6967M542K8085
114B9422k3240j3256L7485m778l3675K1393J7780k5977N409K1559j7272m833J7202
$$ y = [0, 0, 0, 0, 0, 0, 0, 0, 8, -8, 8, -8, 16, -16, 16, -24, 32, -35, 40, -48, 56, -70, 80, -94, 107, -123, 142, -162, 182, -207, 233, -264, 297, -331, 371, -415, 463, -516, 570, -634, 701, -780, 862, -956, 1058, -1170, 1300, -1444, 1608, -1796, 2016, -2274, 2585, -2963, 3445, -4071, 4926, -6175, 8182, -11941, 21506, -102731, -171033, -94314, -163260, -144242, -121301, -134190, -143036, -105805, -117485, -109520, -88572, -99431, -106399, -64463, -72969, -90096, -51138, -36778, -81189, -63283, -27787, -49678, -52103, -19334, -39680, -53671, -20257, -21304, -44435, -19316, -13350, -38547, -19916, -2584, -30649, -19319, 12850, -12574, -28122, 6615, 4804, -14735, 7335, 11965, -8387, 5709, 14964, -3530, 10077, 23762, -3205, 1337, 29422, 6182, -7074, 30411, 25633, -8042, 13351, 31131, 5154, 10563, 32122, 14850, 10017, 27219]
127B7219j0087l438J8105j2595j2390K2529m861k4295K0743J0749l0956L001K1287
140B5011k0981r655K2488j1580j7859J7841j567j9953J4420O073k2607Q083J4125
153C839k0300L40K0670j3726j0805K0267m213j5536J7358L204j8057J0279J0045
166C365j8186N399J5835j7479l970K1809j1249j4108K1463J917k0631J2434J1568
179H167j6648L075J4799j0878j852J3973q397m675J6930n419j1946J6787J332
192A5248j7902J1489J1699j9473R27J7885j3649r236J7305m081j4007J2057K319
205A0581j3867Q217O216j4398M822J0723j4054p03J6471r606j0142J6482j034
218I708j3731J1937N397j5016N645J0153j3714O87J3972j1786o124J5283n611
$$ y = [27219, 17132, 13694, 31799, 19204, 6814, 29343, 24482, 187, 20930, 31679, 723, 3724, 25011, 4030, -5625, 16863, 5283, -12576, 5265, 3698, -16255, -1835, 4238, -18369, -10286, 3839, -16461, -16121, 4549, -9177, -19982, 285, -3928, -19464, -2106, 1098, -16959, -6680, 3365, -14821, -9422, 6413, -11066, -15036, 6773, -4476, -18584, 2879, 4796, -15835, -3401, 8167, -8481, -5406, 9393, -1485, -3337, 10636, 2239, -2436, 14494, 9075, -2871, 13916, 15248, -2654, 8835, 20534, 1061, 1988, 19873, 6224, -3012, 14293, 10212, -3795, 8262, 10581, -3286, 4931, 11147, -3251, 1571, 12294, -1760, -2463, 14008, 4402, -5740, 10742, 9708, -4023, 7914, 13311, -1705, 3940, 14093, 379, 1066, 15038, 3252, -2872, 12411, 6800]
231F800j2423J3425K867j5964O975R024j2939P02J1131q968l438J1136o477o180
245d329J2588k550j1960J1808L686j4943O032J1342j3453k698J3392o643q718
258f446J1930j128j0276Q199J996j0431O597N390j1544K616J0225j0539l514J3329
272F404n065r792J1585R75j1457O796O290j0812K358Q297r584j272J0825p141
286a593o648J1986k355j1051Q944M570j1771L627P739r404l01R351p204l137J0158
301B911m736p049J0649j49j0982P558N965j1570K401R477q123m168J0351l625
315a090o818Q515k96p812O528K796q813M444O279r361N54J0034o852m963J0715
330C860j324q440P651K998q558M508N270p491J063P610o752k377R518m173o757
$$ y = [6800, -5623, 7802, 10669, -5295, 1680, 10704, -2235, -1533, 9598, 630, -2808, 8328, 1851, -4329, 8259, 5709, -6251, 5557, 9243, -5700, 332, 11674, -1779, -4477, 8915, 2272, -6446, 5484, 4356, -5920, 2279, 4275, -6156, 441, 5831, -5713, -3097, 7128, -3411, -6925, 6404, 1339, -8453, 3132, 4107, -7350, -554, 5736, -5076, -2718, 5579, -4005, -5277, 5548, -1593, -8241, 3745, 1390, -9661, -717, 3853, -7918, -4291, 3448, -5956, -6257, 3094, -4110, -7247, 2911, -1825, -8874, 1775, 1626, -9356, -1798, 4167, -7403, -5002, 4475, -3648, -7816, 2535, -1090, -7908, 607, 311, -7501, -973, 1823, -6990, -2546, 3733, -5628, -5074, 4960, -1892, -6855, 3860, 2536, -5904, 1747, 4745, -3813, 695, 5965, -1526, -463, 7147, 395, -1982, 7536, 3363, -3394]
345c394Q972J54q901N822M350q417J627O510o948j635Q060m692m487Q235k137
360C119p031O771K474r047M045O148q211p02Q514n582l629P340j936n672O269
375B870O50o709M381M061p846K096O503p110j400P973l813n661P637op162N132
391A596L146p413K509M853o375k22O287n164l132P110j867o503O310J613p855
406e107L761M412o799M10O231m813k493O523l061m109N826J5o203M885L190o974
422d306K199N591n720j360O875l433m028O200o33m989M657J613n925L094L778
437C613o051O27N945m953k628O631k141n135N457Q87n702K911L506n504J037M729
453C229m646j249N504l148l353O072q51n230M232K742n992J865N143n394p51N533
$$ y = [-3394, 5578, 5732, -3169, 2653, 7003, -1414, 213, 6723, -225, -1860, 6200, 1508, -2979, 5256, 3119, -3912, 2859, 5333, -3714, 331, 6479, -1732, -2434, 6080, 498, -3131, 4209, 2273, -3399, 2870, 3520, -3189, 1192, 5253, -2593, -497, 6006, -1104, -2504, 5469, 1656, -4005, 3632, 3626, -3536, 1596, 4742, -2671, -162, 4691, -1684, -1906, 4381, -783, -3915, 3195, 1328, -5175, 1135, 2748, -5107, -1346, 3066, -3733, -3323, 2908, -1905, -4398, 2125, -936, -5045, 781, 796, -5407, -522, 2668, -4306, -2107, 3484, -2236, -3596, 3279, -154, -4182, 2018, 1385, -3604, 1053, 2666, -3259, -165, 3613, -2438, -1811, 4134, -819, -3447, 3184, 1043, -4092, 1365, 2252, -3450, -539, 2967, -2537, -1500, 3229, -1417, -2666, 2838, -310, -3663, 2409, 1558, -3672, 560, 3302, -2690, -825, 4318, -1076, -1827, 3706]
469C706l397k644N556j359m175M631R17n418K837L422n398Q79M488m028j801N423
485C639j875m070M637K7m715L380K010m669J288L858m341j219N568l194l220N338
501B442q83m543L838J452m482J911K726m223K93M143l475j528M605j675l709M677
517A569Q3m546K632K852m461P04L795l279j341M187j745k895M148n79l709L396
533H11J106m165J356L692m067l87M387k943k254M048l84l231K786Q12m119K682
549A30K064m184J014L637l456j328M364j801k943L838K0l556K221K059l912R22
565i11K929l475l69L596k218j750L790j248l053L400O73l978K209K173l260l6
581a528L449k613j670L732j198k620L145J66l489K436J950l873Q47K894k991n83
$$ y = [3706, 309, -2335, 3221, 1862, -2313, 2318, 3235, -2183, 654, 4076, -1322, -443, 4045, 17, -1784, 3639, 1764, -2306, 2331, 2358, -2357, 1023, 3033, -1636, -348, 3510, -831, -2050, 3518, 324, -2896, 2442, 1559, -2984, 854, 2306, -2176, -265, 2461, -1762, -1469, 2674, -801, -2329, 2276, 601, -3108, 1569, 1652, -2894, -262, 2590, -1871, -1167, 2628, -651, -1992, 2195, 450, -2445, 1703, 1124, -2585, 811, 1917, -2248, -892, 2800, -1267, -1654, 2733, -210, -2464, 1584, 1200, -2031, 755, 1567, -2552, 130, 2194, -1990, -976, 2661, -795, -2123, 2241, 440, -2503, 1335, 1355, -2201, 20, 2079, -1833, -911, 2018, -1457, -1826, 1770, -448, -2198, 1592, 344, -2709, 691, 1364, -2614, -405, 1768, -1492, -1528, 1921, -692, -2362, 1370, 172, -2448, 697, 863, -2626, -190, 1760, -2113, -1266, 1628, -1363, -1946]
597a946L428j658k238K902l3k635K310J225l313J225K398l124K18K873k219j726
613b313L695p40k895K742R94l225J499K125l222Q40K291k224j114K960j110k256
629a953L102rl269K323J605l349R27K565l027j43K839j185k107K711l49k268J965
646C78Q64k616J197J579k418J50L050k167j610L043r05k420L071N9l231J802J678
663A504k742M55K010j870o30L073j674j530K535l43k180J870R33k313P91J828
679A717k348N6K669k095q56K628q48k106K690N20k871J332J756k412L04K044j592
696E88j145K421j322j632K153p7j700J057R40k180R72J379k010k33K116j729j261
713a663K418k78k310J994O53k635J153J508k059q9K001j448p96K217j049j483
$$ y = [-1946, 1482, -176, -2414, 488, 455, -2180, 130, 1355, -1958, -733, 1665, -1459, -1241, 1632, -587, -2313, 1382, 642, -2253, 489, 1483, -1742, -243, 1882, -1340, -500, 1791, -433, -1547, 1413, 303, -1953, 1149, 1140, -2129, 194, 1799, -1550, -623, 1942, -1085, -1228, 1611, 426, -1681, 1030, 681, -1587, 378, 1242, -1374, -177, 1402, -1016, -866, 2184, 17, -1593, 1450, 545, -1875, 1196, 1255, -1976, -174, 1504, -1238, -783, 1227, -643, -1273, 1800, 126, -1404, 1131, 788, -1392, 478, 1411, -902, -111, 1717, -631, -575, 2094, -1, -857, 1771, 923, -1183, 1507, 2027, -844, 488, 2244, -168, 136, 2180, 588, -557, 1864, 542, -1090, 1063, 986, -714, 343, 1283, -897, 75, 1454, -556, -789, 1327, -402, -1663, 755, 477, -1833, 161, 814, -1821, -668, 840, -1219, -1308, 693, -755, -1551, 666, -383, -1866]
729a866K045J22j827J246J169k477R92J641j817m44K268j072j785K085O6k335
745a989K030L13k048P17J457j716m52K141j108j347K314p55j453J985o8j650J246
762c83J291k392M53J822j318q38K336q45j196K029r4j585J208R74k093O91J435
779A495j411j17J439q65r54J765j64j562J442K07j738Q92J143k226P49J490j347
796B38o84K008j004j329J652N6j582P01J258j825K32R24r01m53J940r49j816J935
814D01m7j613J366O69j668N55J021j505J12J655j425p76J745l82j344J288O65
831G17j773M32J218j574k1J668j185l14J299p80p62J516J76j767J046P31j578
848i51L46J114j247j60J703o67j623K364j35j747J348N78j541K00J444j529r9
$$ y = [-1866, 179, 301, -1526, -280, 889, -1588, -596, 1045, -772, -1216, 1052, -20, -1805, 280, 346, -1989, 41, 354, -1694, -977, 480, -1236, -1688, 453, -655, -2002, 312, -443, -1896, 89, 21, -1629, -383, 908, -1484, -1031, 791, -527, -1365, 971, 126, -1070, 959, 865, -720, 488, 1462, -631, 60, 1495, 84, -33, 1406, 541, -413, 1352, 1188, -374, 1068, 1275, -463, 429, 1572, -654, 95, 1585, 238, -446, 1562, 558, -771, 881, 937, -645, 56, 1314, -511, -279, 645, -256, -709, 1231, 282, -1534, 401, 354, -1259, 107, 776, -892, -337, 684, -821, -709, 946, -479, -1255, 490, 108, -1236, 52, 717, -1056, -624, 594, -980, -1001, 667, -518, -832, 467, -313, -1075, 441, 617, -1150, -104, 627, -951, -605, 509, -738, -898, 805, 138, -1485, 879, 744, -1003, 345, 923, -618, -418, 1026, -503, -602]
865f02J999r33j121J441m22r28J155L42j539R09R28j629M62J276j468m38J776
882A208o39r23J181J23j495P24P22j667R74Q58j004n32J743j402m17J214l76j006
900g14J282k8j249O39Q75j350j42J284o97m83R91k47j223J408mj087N17Q06j311
919g33L29R33o45n62J098n06p10J426m38q18L69M95q23M62Q09j226p4J193p34
938a55n77J117j97r00R17K55j404O59N96q06J53J060o72n44J043j62j081J076
956C78m0r71P47O38j059j26Q72q49j64J292o38o76R03j04q01P78K98q20L63Q05
976H26j141J3J003p16m33Q09r7p94P35L63j088L66P15j030J56R45j030j09J274
995G67m77q58J009l65p84Q39L00r12M45M20o77J6Q62o48l07Q84l88q97J070J27
$$ y = [-602, 1397, 464, -657, 784, 362, -566, 589, 931, -608, 301, 1229, -400, 62, 1338, -130, -568, 1208, 569, -354, 827, 950, -545, 179, 901, -766, 208, 1066, 62, -470, 1273, -129, -546, 668, 292, -714, 568, 540, -709, -70, 805, -545, -687, 597, -100, -583, 408, 161, -1062, 346, 342, -745, -228, 578, -733, -404, 529, -116, -678, 420, -86, -796, 630, 192, -626, -257, 238, -585, -123, 686, -540, -614, 579, -155, -732, 385, 188, -712, 205, 460, -944, -285, 311, -495, -342, 718, 46, -498, 545, 383, -698, 378, 338, -633, 114, 752, -307, -433, 439, -410, -574, 718, 80, -596, 307, 203, -598, 180, 478, -342, 21, 826, -315, -302, 701, -15, -448, 361, 264, -530, 205, 568, -520, -154, 561, -469, -313, 632, -398, -507, 767, 290, -568, 441, 76, -708, 131, 431, -481, -36, 384, -293, -277, 585, -63, -370, 514, 126, -771, 299, 426]
1015D26j185M35O38o76n9J123j257L06O16m85n65J313k28r67R01J90m85k10Q73
1034G04j015J7Q42o03k34O82M06j635J082K82q87Q8J014j220n2R80p26j77J334
1053H82r96p10J133J60r58M10M48q81M81M69r11l1Q15l48j70N83K9j062P65N38
1073F46j038M50L49r83L38L61l94N2N54p6n16L13N0m60K75O90o77m30R33n72m35
1094e70R79r0r44R79J46j257P30N29q14j26R40q32J41N03l49n31P02L7p13P21
1114A81j52k78K17P42j019J49L18l1m88O92k16n93P42q5n03J63P80q49O6K10k10
1135a64j13O87j54m43N72k51n50L61P48j115M28M74n95l56Q40l39m15Q43m40l44
1155c26P09l9p27L40M88p47q1Q61l49m84O60rn69L45K98j022N10M67o45j4P57
$$ y = [426, -759, -324, 314, -362, -421, 702, -555, -249, 367, -118, -683, 630, 402, -565, 336, 526, 41, -169, 704, -311, -294, 548, -55, -289, 393, 799, -836, 246, 528, -359, -271, 743, -477, -529, 451, -275, -452, 882, -114, -824, 309, 469, -489, -79, 369, -512, -31, 438, -473, -504, 311, -37, -207, 376, 405, -657, 108, 646, -392, 58, 407, -576, -238, 123, -271, -219, 335, 259, -257, 56, 106, -354, -79, 611, -66, -496, 437, -135, -570, 409, 319, -625, 354, 500, -757, -27, 502, -312, -438, 502, -330, -189, 314, -35, -566, 136, 173, -540, 181, 29, -249, -32, 710, -309, -160, 158, 127, -361, 331, 115, -478, 264, 179, -324, -161, 619, -230, -164, 46, -164, -277, 410, 256, -187, 385, 134, -416, -55, 693, -422, 6, 480, -115, -471, 369, 30, -385, 458, 18, -326, 383, 344, -383, -43, 445, -302, -383, 478, 129, -355, 305, 296, -273, 72, 370, -652, -142, 325, -320, -334, 423]
1176D23o58k59P38l41j92M36K80n09R7K48n78L77O67o85k43N95n92o0L36K07l36
1197d9J86l13l67L55M35n78qL44m04K2N72k63l88K91L51o56O87J78q16L90M96
1218D65o55o8N78l08n10P30j39l56J24L94q31K98N99m14k80N36j49l56Q86p37
1238a93k78O62J02p02J74O36n03J85L39m34j27M73n93q0O70j28p34N80L91q46
1258d06J87N49k09l33Q38q41j19P92m6k35OJ05k60o6J78k46R7L14j66k18K7L4
1280a8q0J17K01n04j6M62j60k55N82m03m07N17k2k64K78J08j84J97J8k83L00O3
1302B47m7j78M86m31l03M56m38k6M24K34p10M89K44o71p5O12m31m1N02j23q00
1323e80O51K88p75L20N33m26j8K44l46J48M92o10j20M38o1k23L06n6o26P20J4
$$ y = [423, -235, -494, 244, -97, -289, 147, 427, -82, 15, 263, -315, 62, 729, 44, -199, 396, -196, -256, 80, 287, -49, 137, -176, -543, -188, 247, -331, -339, 5, -399, -377, 195, -68, -456, -165, 186, -470, 217, 395, -421, -31, 465, -190, -258, 320, 12, -498, 232, 93, -263, -139, 255, -576, -278, 321, -93, -373, 163, 14, -342, 544, -193, -471, 191, 293, -409, -235, 401, -102, 83, 422, -12, -139, 334, -259, -339, 331, 203, -531, 49, 440, -406, -219, 330, 121, -212, 626, -215, -334, 458, 412, 177, 183, 288, 28, -38, 140, -106, -9, 305, 139, -79, -52, -18, -98, 19, 220, -284, -300, 162, 2, -253, 329, -74, -481, 36, 14, -250, 28, 136, -48, 149, 167, -116, 184, 247, 200, 22, 508, 77, -226, 230, -208, -234, 190, 424, -286, 203, 447, -224, -299, 313, -118, -159, 343, 220, -580, 71, 359, -416, -96, 437, 11, -7, 237, -109, 39, 531, -79, -199, 239, 178, -45, 261, 205, -421, 299, 313]
1344C13k16l58N94k09l13L99Q1n57L58M5n06J0P35n78P6J88m41K80M59k58l15
1365b13J55p3j87J79M10l82J80j06M4j33O30n90K6O42p81j98O37r4p2k61N92m34
1387b9qJ97k02l00N34j4l19K34k7j72j11M51k51k31N34m28j08M58p0k73N36k02
1409A99n16N52o7m35L48J39l7j25J65k89L1J02j90mK54K77q07K97M88l27l06M50
1431A99K4m86K40N9o5L68p4p07O33L2l01J30K04l95OL1L17l45N17m72K70k55J67
1454I7n02N27L17n09j5K71j6m79M14r9m45O55j27k75M95k27j44q9K82l72J38L22
1476B19q8n81L03O83o90k3M18m39K39K38k84m20P19l53n0J80q1L8j76M17k00l57
1498b88N25o59L79J56l59L97K30k64n49N49k82L4l6M63m34J23K34k36k31L33k52
$$ y = [313, 97, -261, 333, 124, -189, 210, 291, -266, 92, 137, -369, -359, 376, -202, -126, 62, -379, -99, 360, 102, -213, -58, -131, -318, -139, 271, -111, 69, -37, 7, -126, 504, -86, -60, 582, -199, -397, 240, 146, 74, -187, 405, -29, -37, 160, -42, -342, 192, 178, -141, 93, 66, -106, -217, 234, -17, -248, 286, -142, -250, 208, 138, -135, 401, 199, -317, 235, 168, -267, 81, 220, 183, 58, 223, -66, -35, 67, -123, -127, 127, 404, -403, -106, 382, 55, -251, 199, 223, -263, -23, 36, -29, 339, 265, -442, 191, 223, -78, 52, 256, -139, -133, -102, 215, -130, 387, -85, 185, -70, 97, -405, 122, 439, -70, -85, 186, 170, -309, 105, 6, -439, 216, 89, -186, 309, 82, -62, -151, 131, -241, -103, 219, 131, -450, -147, 536, -154, -177, 241, -198, 41, 279, -5, -425, 294, -59, -109, 71, -10, 28, -148, 269, 69, -288, 237, -422, -43, 113, -246, 151, 381, 117, -432, 117, -165, -131, -167, 296, -138, -15, 219, -17, -248, 85, -167]
1519a67J07J88l35L29k6L17n61K14J23j22m09P51m02l3L22j36o94O86Oj42k18
1540b02P14q38M48k08J42j02N46m07m14K90M6m77N01J10l66M12k39Q7k64J58o4
1561a27j54L62m4k19K10j3j00P6mk83j68Q21k38j51K26k00k49M34k38p3PJ76l27
1584b76K09J62m0K49J4m51l77N73o8J18j43J24k66O9L25l30p8N65k95k16L40j30
1606G8j76n4J27L34k55j7l26L92n1j03l05L01l5k96O08q5j07J15J73k48j39O1
1628hK02o2j18j99m2N04j66n87Q77l22m24K86Q8l12K75J07n5l23K07J67m79L10
1650g4L49m23K27K76m17pK52o0k26k38K21j19N33j38o27N81L16l56o1l4l45L50
1672b0M76m08q5J28J41n21R9L39l4l92L46j22p5L66o7j32M72k85n14K80K22k33
$$ y = [-167, -60, 128, -207, 122, 96, 413, -148, 66, 189, 67, -342, 409, 7, -26, 296, 160, -534, 152, 158, 16, -202, 512, -326, 122, -86, 56, -46, 500, 93, -321, -31, 15, -462, 39, 149, -217, 195, -44, 43, -221, -63, -127, -281, 81, 37, -182, 28, 15, -85, -9, -13, -296, -464, 357, 119, -32, 194, -6, -255, 179, -59, -132, -125, 51, -276, -67, 95, 55, 304, 318, -133, -510, 63, -5, 113, -30, 94, -172, -103, 222, -108, -186, 379, 84, -132, 208, 78, -98, -152, -25, 309, 54, 37, -289, 103, 52, -51, -356, -55, -90, -386, 222, 137, 30, 145, 318, 70, -69, -8, 194, 132, 14, -185, -227, 277, 111, -476, 401, 79, -345, -59, 29, -283, -8, 99, 44, -279, -72, 95, -384, -74, 275, -148, 79, 355, -62, -69, 183, 123, -103, -341, -120, -239, 294, 156, -471, 110, 426, 70, 9, -25, -370, -20, 456, 48, -37, 91, 232, -289, -190, 149, 115, -277, 69, -53, -128, 238, 171, 39, 511, 226, -288, -8, 214, -19]
1694a9k51N31n61K72Q8J65l46L21j17J04k54J95j95j06L15l60L84n7K37k55R0
1715A81k82L1J07R8j26J5%j41Q5L11n02K3J16J58K0r8r1J17r3J22n5n75N66k09
1739b22K51p3K35k00Q9k95J02M99l77k78M04k12o7L92o6l38J11J99k39k66O86
1760C35j34l52K67l03O22j66p3j29pL15m31P3J91j22j37K99k6m87M02j09j02m45
1782e19M33M7j68L09j17K86m07K24j74P3K67m37j92R3L39n49O18l33N4K88j14
1803B1J62Mk50J15m4L19m81K3J16k06J93J85k34k26P8K90k46L08j75J79k68L47
1825B10nl99M73k90j11R6k41J62Q8N2q3K88K4m45O4J5o3j56L77p0l18J30M61l04
1849d5k9L96o57M36j41k8P2mk33L40j10j47K88l18L27k49J50o5k44K34J80K5k48
$$ y = [-19, -270, 261, -300, -28, 60, 225, -121, 200, 83, 187, -67, 128, -67, -173, 142, -218, 166, 109, 346, 91, 181, -101, -70, 37, 135, 9, 24, 24, -117, -32, 279, -223, -200, -84, 74, 94, -4, -95, 22, -71, 51, -4, -579, -13, -222, 29, -44, 191, -9, 80, -215, -113, 386, 9, -269, 135, -77, -144, 248, 182, -156, -45, 154, -85, -351, 335, 201, -151, 116, -187, 435, 269, 196, 67, 60, 375, -56, 17, 208, 86, -51, 248, 222, -265, 137, 28, -74, -519, -86, -39, -207, 102, -15, 271, -136, 88, -86, -13, 254, -183, -375, -282, 57, -492, 126, -207, -153, 135, 21, 183, 187, -63, 52, 8, 327, -154, -131, -15, -221, -28, 157, -77, -303, -225, 65, -181, 127, -48, 131, -137, 210, 205, -194, 279, -11, -122, -26, -267, -105, -17, 35, -48, 240, 264, -181, -117, -102, -165, -321, 56, -14, -332, -202, 259, -45, -74, 322, -335, 101, -40, -68, 4, 0, -233, 107, -3, -150, 138, -180, 147, -102, 48, -17, -261, -27, 153, 178, -70]
1872g0K94j30k74k50K37qL60j76j48L04l0j75j23K90P7j47O0Jj81L06k75K47j20
1895F9J27k16j09KJ85k26L18k82k21L70l69K91k54J25l5J95k43M24j42J01j88
1916g8j76L16J8j46L82k50k7Q8k75j48L71K26l85K47k24L1L6K53l06q3J61j02
1938g1j41M63m07J41K3J90j82j7K82k13l55M87Lm48J06J49K73m62R2K36l63K80
1960F6j04j42O8K20k09J31J05n16L49k64J70k28M71m6n6K28k95j58n9L72l67L71
1982A07J16k99j73J35J56j69k8K80k75L41k12K79Rl07k06L7L70k84P6J53j87L01
2004B20o7l81J92J08K71j46l48j70J07p0L56l19L40o2N6k43L58L00l12j23J20
2025A87l0p0j20J38k64J43m0k9J26J26O4k72J7o3L85m25M27m40K62j8o7Q6j0l38
$$ y = [-70, 224, 94, -180, -430, -193, -201, 159, -17, -165, 139, 109, -66, -189, 101, 178, 31, 91, 92, -89, 217, -58, 189, 69, 196, -20, -129, -127, 58, -168, 150, -132, -353, 17, -352, -61, -315, -190, -225, -30, -273, 151, 9, 110, -78, -254, 62, 80, -66, 316, 66, 39, 127, -148, -296, 75, 301, -84, 163, -61, -30, 6, 259, -47, -130, 31, -71, -212, 251, -156, -15, 8, 198, 16, -1, 281, 68, -287, 200, 203, -245, -139, 10, 283, -179, -87, 149, -214, 66, -38, -180, -112, 108, -101, 30, 135, -381, -32, -296, -126, -354, 117, 71, 15, 243, -52, -210, -269, 103, -264, 107, 223, -76, -249, -114, 42, -127, -155, 125, -150, 191, -21, 258, 267, -40, -246, -209, 161, -123, -47, 106, -81, 220, 153, -228, -36, 72, 343, 197, -151, -321, -214, -284, 72, -247, 93, 31, 87, -156, 202, 502, 190, 67, 187, 157, 87, -33, 105, -159, -16, -56, -85, 41, 167, 231, -41, -24, -87, 298, -127, 300, -140, 122, 104, 37, 123, 113, -225]
2049b25J17k33K78L24l20K26l61K32K51l68N5j92J36K46j29R0j36K64l38L45n69
2070c07M02n90N90k1l72M88l64n5M46pk49J77J35m03k2L78j27K5p6K81n23K0l3
2093b07Q0J27J19k27p1J16k95P22l79J05j14K24Q4j20N0m27M3J33o0M13l21J29
2115A24o8p7J02j11l98K83K38j80nJ68o3j14N3l18N18l55J85o3M3m0k42K93j00
2138a27j34K54j47L66r4pJ04l07k37J49L60K2p0K6J11j88J2n00J79J62K60m49
2160b55J56J09J91j47j53MK56k48n6K78k84M47k22J59m27N5L25m48K83l41M27
2181A09j78j14J19n6J47K5j3J01j92k03L61m0N6k92J78K75k34J18k37J70kR5n5
2204A38m3k31J07K07lj01j7Q5n9o9j56L53l03N1J91k16J97r9k13O7K4K92k07N1
$$ y = [-225, -108, -341, -63, 261, -59, 167, -194, 38, 289, -79, -24, -216, -80, 166, 37, 127, -9, 255, -83, 262, -307, 95, -495, 95, 74, -298, 190, -174, -229, 217, 210, -39, 138, 273, -130, -152, 226, 99, 124, 48, 329, -194, -174, -207, -127, 0, 119, -108, -179, -63, -358, 364, -15, 90, -24, 200, 284, 164, 214, -213, -170, -37, -97, 316, -5, 124, 56, -21, 81, -30, -428, -145, 93, -87, -92, 76, 13, -101, -48, -366, 152, -203, -18, -81, -38, -78, -320, -27, -127, -261, -7, -154, 212, 118, 111, 215, -92, -329, -180, 180, 202, 132, 158, 269, 81, 93, -407, -228, -66, 194, -255, -99, 10, 201, 54, -99, -95, 161, -87, -143, 135, -149, 298, 76, 235, -192, -137, 188, -260, 23, -318, 109, -69, -183, -64, -120, 27, 52, 39, 140, -52, -255, 106, 66, 122, -170, 8, 283, 49, 167, -70, 100, 98, 193, 138, 95, -136, -29, 178, 175, 74, 57, 142, 83, 14, -142, 211, -92, -41, 150, -66, 131, 32, -181, -114, -90, 202, -5, 46]
2228D6j74J92J31m28J90j79L47q3J10k42L92m08R6k24L27K1j41J80j84L01N0J9
2250C39l58J0l28N92j38m11N00K3l23%L61j39J48j53N3K9K1n05L00J1o3K1O8q7
2274b9%J12l6oj59P8M2J95m38L17K2l7l65K67J87N7k22%k55N4L38l02J78j18j3
2299a33N82n64J26j50K21K65l10J39j57m3l5J04l26L22j75M90k68qj6P1j42q8
2321i5j12K66j2J42l1k74K13Rj23J9M3q3kO9l97K94r7M5q9J46J59m61K40J16Q5
2346G0m77O33m41K19Q8j48K9Q5J24k66J49P6k97J33j67R1L36m84K33J64n9R7j46
2369D2k50K17K53l86n6J54j8K65j3j05K5k72k29K18J40j2rK32m82L03m2J62p1
2392F6j24K03j27J55Lq2j69J35J2k88l7j42N06qj34k59j73L67J02j62K97k92K23
$$ y = [46, -128, 64, 195, -233, -43, -222, 125, 42, 152, -90, 302, -106, -10, -234, 93, 114, -27, 153, -31, 270, 320, 339, -19, -9, -337, 255, 117, -294, 206, 229, -94, -94, 267, 128, 276, 123, 176, 205, 226, -279, 21, 32, -31, -10, 58, -29, -29, 83, 47, 41, -118, -40, 2, 197, -241, 76, 98, 61, -304, -37, 150, 207, -15, -15, -270, -216, 122, -180, -2, -120, -133, 449, -115, 11, -139, 82, 347, 37, 176, 19, -24, -59, 45, -281, 41, -134, 356, 88, 80, 64, 135, -7, -95, -207, 59, 47, 189, 158, -116, 97, 106, -17, 2, 45, -38, -40, 29, -368, -74, -171, -126, -215, -69, 90, -371, -131, -15, 70, -407, 226, -215, 4, 92, -56, -27, 58, 182, -84, 65, 141, -156, -23, -190, -99, 237, -247, -14, 150, 91, 188, 42, -208, 9, 262, -124, -180, -26, -44, 221, 208, 103, 128, -144, -373, -155, -15, -27, -36, 196, -286, 17, -25, 137, 66, -58, 145, 18, 173, 176, 94, -75, 60, 72, -216, -253, -395, 111, 103, -31, -290, -463, -96, 6, -156, 141, -151, 72]
2415G2m3k26L99Q1J3l96J09O8n03O61q0Kr0o3l20k28O66m1j37N9j05Q6j09P2J37
2440H4ok64L63r7n49K22K14k7Q3K01k15j54L53j70m14M02Nm6k40j80N94j72L15
2463C02k42r8q5J36K53k93J32n7r5N9r3q4q5L09j22Q2j00M9K29k18J93j72L03
2486C03k06K82m71J97j43JJ63J70o37N47o9j04JM9j44j46jl9M26K27k53m68M37
2509A22j72r8J67N2j97J4r3L33K4O6J0m6j90q4J9K81k83L74l27j09J79j71N4L5
2533d0J71j98Q7J43N0j59j34r0R3J16o3J26j33Mj88J33p3K26j10p4k11M82j40
2556A8j68M88l56K29l68R5j1n0K67O5m18l9J51J12p3P4l81L63j32k21N98k96j75
2579b28M21k72k02J11Q5P7k13L6L12j69L26p23N31j50r0J4J62N2Q4k8K18l3l13
$$ y = [72, 29, -197, 202, 283, 296, -100, 9, 77, -426, 235, 155, 157, 67, 4, -316, -544, 122, 81, -56, 3, -102, -16, -125, -53, 84, 78, -186, 177, 80, -469, -247, -33, -60, 23, 224, 9, -145, 208, 38, -376, 26, 31, -15, -255, -435, 159, -13, 302, 60, -38, -123, 13, 266, -27, 105, 48, -47, 12, -81, -165, -250, 59, -63, 19, -81, -32, 197, -21, 172, 0, 303, 97, 379, -92, 105, -38, -37, 126, 296, -341, 206, 137, 33, 34, 83, -61, -207, -208, -247, 179, 406, 153, -315, 122, -50, -148, 19, 71, -126, -112, -205, 128, 152, 218, 228, 182, -8, -92, -73, 208, -75, 299, -28, -137, 42, -129, -75, -40, 131, -67, 20, 163, 213, 54, -80, -170, -77, 39, -24, 102, -31, -27, -215, -82, -155, 71, -39, -113, -324, 158, 18, -150, 338, -18, 211, -157, -62, -73, -123, 144, 209, -209, -248, -97, 15, -58, 16, -365, -2, -134, -355, 243, -53, -228, 193, -79, -281, -170, -85, -8, -221, -185, 127, -42, 284, -439, 92, -58, -148, -134, 28, 80, 164, 136, 354, 321, 8]
2602Hj29L7J95L66o46M11j4k70K73l33k0J67n0LJ4o5p9N7n3N6m3n0J85k05N27
2627C42n03L63m13L68l13J55j93M3J58K16j87k01O7j2J11M7J31l93K39N0K62j71
2649A66l51J62k5k27n4L13j23j85P9J52R8K14l45J87m3j73N9J19Q0j27P5k06J88
2672C3P4J4l15l1J30j5O2N2o2K18k63J53J8j0p1j46K22Oq5K25j61L8o5M0k77P6
2698a40J9L06m39K04J8j24P4K88k88j05J3L61k03k71J09M50k31j03j9j69J65N8
2720b7p8J51J29J44k37n22M83J99k14q4Qj65M29k63jJ71l5k8l05M82l08m4J50
2743C5n8L5l80J81K50k00K32J7N0m27L39P6k15K12k55K98j67J76n22J42qK34R3
2766A38P2m56M56k74j46M03j65K74k14oo9K30m13K15r5K34k05L15j88P1l10L36
$$ y = [8, -121, -84, 111, 477, -169, 242, 228, -42, 231, -102, -122, 45, -5, -2, 12, -53, -132, -75, -128, -72, -115, -165, 20, -185, 342, -161, 202, -211, 157, -156, -1, -194, -151, 7, 223, 36, -165, -98, -110, 1, 48, 179, -214, 25, 75, 337, 166, -185, -23, -48, -275, -329, -16, -139, -324, -245, -93, 5, 219, -126, 61, 18, -155, -96, 23, 103, -24, 51, -155, 33, 107, 121, -194, -225, -95, -110, -48, 4, -58, 160, -103, 50, 68, 58, -13, -159, 63, 69, -16, 209, 48, 86, 21, 61, -216, -140, -121, 185, -254, -50, -32, -156, -82, 206, -82, -187, -174, 187, -16, -287, -178, 272, 41, -62, -81, -250, -85, -27, -105, 46, 175, 319, 82, -440, 43, 242, 28, -56, -48, -213, 216, -47, -48, 123, 88, 60, -245, 237, -71, -115, 35, -23, 12, -368, -187, 63, -137, 95, 112, 162, -265, 74, 150, -65, 147, -108, 190, 23, 199, -323, -181, -189, 45, 138, 210, -246, 210, -64, -210, 193, 28, 302, 88, 82, 13, 243, -170, 45, -50, 184, -21, 294, 106, 177, -133, 203]
2788B03k05j65O46o02J30M0r7R2j02l9J72j14J56j7n3k1k59L87j81O3j00j52M01
2811A83r1k25K05J10r6j8l54K65l8R0J29K05m23J64k02jN9J32Q3o43N61J0Jl76
2835b70M55j98J85j71nj38K82k22P3J1M5j66J57k7j88p0J13P9k23N46j41j22j47
2858a42K43m73K25M39k2n41L41Qp1K03l15j40L7K14J7J20j10j11K36k19L08l52
2880a05k97L14L8J47j31K57J12j92Qo7k40j55K86J83k53m0J7J42k82K91R6l10
2902a81K31P3J14N2k79N2ol3K4r2K74k61m4K25l59L57k4N0j67J68l02J70j0J15
2926A47L3P3j54l06l39P52n01j28K47J41L55q2k07l6k75P3M29m11L08N1l01L17
2948A86j56j17l4L68j57k23M2l0K42n6j7J40J60l75P5M1k63J8j5K48j03J75j32
$$ y = [203, -2, -167, 479, -123, 7, 47, -50, 42, -60, -99, 73, -41, 115, 98, 45, 24, -235, 152, -29, 34, -66, -218, 183, 92, -133, 72, 182, 86, 68, -286, -21, -59, 31, 160, 365, -58, 106, -96, -97, -38, 94, 177, -466, 95, 105, 106, -270, 185, -13, 172, 1, -4, -142, 140, -82, -9, 2, 47, -119, 38, 11, -177, -247, -134, -55, -278, 268, 127, 5, -142, 101, -372, -147, 292, 270, -271, 70, 78, 7, 210, -105, -245, -208, 6, 23, 143, 33, -78, 158, -61, 247, -105, -402, -88, -50, 97, -34, 223, 335, 143, 151, 84, -156, -311, -25, 158, -95, -135, -118, 24, -258, 33, 129, -181, 50, 123, 237, 289, 10, 62, 56, 23, 47, -45, 229, -32, -76, 149, -210, 147, 123, 173, 6, 174, -128, 42, 32, 147, 180, 253, 99, -207, -546, 206, -295, -423, -176, -35, 320, 238, 31, -5, -280, -207, 222, -189, 119, 170, -131, 186, 30, -87, -121, 247, 90, -133, -91, -121, 121, 65, 48, 188, 348, -27, 48, 89, -174, -156, -171, 77, -26, 149, 17]
2971A7j73K56j27J20n4k46P3P8K49o2l51R0j0P9J78k95K67o9J5P7k4o8R4j11l9
2996c6J32P0k57L26l23R8k18J49Q6m4lpJ39l10K77J4q6K59o8j04r0K34j39rJ4
3021A04j08L83l71O9j42j37J52N37l90k91j34L58j76P5N0L33j89j39K11j53l82
3042c40L67J81k69K72J23l82j65j2K22R4j16K41k11m9K87r5l11j3o7N17l34J62
3064A02j72P4L39K7n15j19M50j9l40M13l40K86l32J94n1r5J30n0L58m37N7J87
3086A47j53J12r7m6N6j53j83K04q7K75M04n92LK90n31M07J6o6m63M95Q1mJ12j90
3110C7J60r1Q9n80N14j84o8J85l67L37j35j08K95mj28P2j14K08j84J6j39K07m6
3133b8J83J30j94j11n2J64j44J59j71M0j94J01J39R3k46K03l48L02j57n2K09o2
$$ y = [17, -156, 100, -27, 93, 39, -207, -134, -56, 193, 131, -220, -130, -140, -61, 117, -178, 89, 20, 35, 112, 88, 20, 114, 3, -36, 96, 166, -91, 235, -88, 10, -208, -59, 27, -17, -20, -27, 112, -198, 79, 93, 7, 266, 198, 94, 4, 238, 99, 90, 104, -4, 379, 8, 77, -65, -202, -50, 487, 97, -194, -328, 30, -146, -71, -21, 312, 123, -16, 195, 42, -340, 27, 208, -61, 211, 334, -48, -213, -225, -3, 91, -25, 216, 5, -44, 243, 148, -163, -176, -243, 274, -60, 102, -70, 4, 343, 370, -145, -264, 186, 167, -173, 240, -100, 186, -146, 48, -3, -98, 32, -18, 340, -97, -40, 147, -6, 106, 9, -37, 19, -134, -317, -113, -200, 75, 479, -113, -110, 180, -351, 56, 72, 6, -457, 38, 119, 115, 227, 37, 197, 106, 195, -385, 129, -55, -123, 62, -305, 32, -103, -211, 84, 80, -48, 24, -90, 118, -66, -50, -189, 18, -28, 155, 285, 91, -20, -72, 92, -52, 107, -64, -24, -218, -117, 22, 115, -131, 72, -276, 26, -131, -183, 26, -36]
3155c6L72m23R3l7j45K83p1j25J64J81l98j29N02l26p5K66J5P5j74K7k88Q9m2
3178b02K57kk23R3J89J89l05K76n28K19q0K52K0k35K66j10L3k01P5K96k94J61
3200A46J04j79J40m58M57j53j16J69j00q1L18k27k08K18n8q2K07k82K96j95j2
3221i6Jj98K79j52J81J86r7j52J1j26K01n7pL31k57qM3k19rM0nK68k17N9k25J39
3247h6k39M04j30L41k11J57j21L7J4j51r4K07N2m99M10k26K32j72n7J27m1P7j06
3270g5m2Q7n0K87kj22J16k44l66L70q1L03k02O6k27J54m6J93o6J6p9k35K47j18
3294a16m8P1K11r2r7J71l40J09k14L70L70o06R0j60J88K70j36K60m79L4L6J19
3316A1Q2K11l73J64M4l85L49p0oN3k23J98j94M15r2k51J87J07k07j84L04nJ13
$$ y = [-36, 336, -87, 6, -31, -176, 107, 36, -89, 75, 256, -142, -271, 231, -95, -170, 96, 111, 186, 12, 39, -249, -160, -202, 55, 53, -170, -77, 112, 301, -4, 272, -256, -37, -117, 135, 155, -80, 186, 76, 109, -92, -17, 279, -15, 146, 250, 71, 211, -247, 210, 57, -59, 110, 10, -71, 247, 20, -188, 30, -28, -110, 97, -185, 111, -84, -96, -95, -293, -14, -166, 15, 201, 104, -48, -37, -163, 38, -19, -26, 305, 48, 40, 83, -136, -145, -105, -110, 158, -59, 0, -225, -86, -325, 79, -51, 290, 79, 236, 115, 152, 166, 15, -79, 128, 180, -319, 91, -135, 97, -75, -132, -5, -46, 31, -75, -117, -30, -80, 207, 205, 83, 199, -45, -411, -41, -122, 181, -21, 45, -182, -28, -74, 119, 53, 69, -10, -245, 2, -116, -164, -93, 118, 26, -71, 100, -240, -131, -345, 25, 395, -211, -121, -281, -93, 177, 41, 301, -178, -144, -108, 11, 93, 304, -69, 95, 139, -246, 103, 33, 27, 80, -143, 55, -139, 276, 184, -67, 120, 227, 20, -164, 140, 135, 248]
3339B48o8j75m4j70O4P5O8o9J3J27j00K06q2j7j25k2j56K31P4j43L78l08q2P4
3363cK27k5k57k77K65L2j67J84j57P0L7J55j37K78k39j79K11M9O5k76M13j55j59
3386d5M3j06J40K6K25o65P5L24K61k69k16M06l82L20l88L15J20k6j73k0j38P7
3408i6J28L8K64j83l34J15p8J6K51R2m47K32L5L5k72L01K27l78J17J82j49K96
3430C92l19l40o8M47j66K57k57kJ53K3j75J78m07J18qr3L53j91K14K36m33L82
3452B94j71J0q1J3KO6k24j63K27j50M1J0J92o5p2J29k5K7r2K99m22J35R3k45M13
3477B41l24K3K19k48L95l53M7Q8m45L89j66J34J39k67K27k37M06n02J67j88J87
3498f8L13j58k70L4k04K05J34Q2n2n3M9j49j8J6J09O1N8j98L27K5J79l38j68M1
$$ y = [248, 180, 5, -39, -209, -145, -70, -2, -71, -58, 69, -31, 175, 93, 76, -49, -71, -227, 4, 78, -65, 313, 5, -77, -3, 224, 199, -58, -335, -70, -38, -205, -21, -178, -108, -71, 84, -53, 225, -14, -193, 18, 67, 132, -144, 269, 114, -45, -2, -108, 32, 58, 283, -382, -307, 17, 278, 9, -207, 199, -183, 137, -251, 64, 184, 158, -15, -35, -173, -96, 32, 70, 334, 151, -183, -68, -146, -130, 121, 213, -234, -2, 33, 68, -204, 97, 324, -54, 63, 245, 96, 392, 73, -267, -335, 112, -54, 203, -54, -56, 97, 120, -55, 123, -284, -166, -174, -267, 86, -105, 109, 345, -88, 294, 123, 133, 52, 65, 67, 133, -91, -254, -27, -177, -136, -126, 66, 1, -71, 58, 33, 60, -32, 267, -155, -20, 73, -172, 241, -83, -60, 159, -89, 306, -47, 0, 88, -357, 32, -134, 0, 139, -128, 99, -138, 268, -234, -67, -255, -68, 245, 87, -183, -149, -353, -148, -14, 68, 16, -37, 12, -137, -155, -139, -30, 31, 89, -109, 218, 243, 422, 84, -84, -43]
3522d3K1J05r3O7o6n0L6J07J6m5o1P2o6m19L43j53mJ69K53m29J23M4o9k3J65k29
3548b29J15L61n71L87k45K09l6J93J7n76L61K8p7Q0j73K90k14J83kj3K31m61J15
3571b7kj30R4o8J32J50j87O7k6k6J20k67K94j77J42m79M47P3k11J19OJ75m24L93
3595A88Oq9j0J5j74K87m73L4L72o0k45K26K17k14K04j88j62m3l16L10L63l3j20
3618I5K6k13L47k36m76M67jj39J13J04j05K9P1k50J47J02j92j68N13m31R0J03
3640dJ10l81J28K03j3l4j84K09n78M74oq3J40J8Q8l33K01N5J16l21M01r0J7j34
3664aj26M5j52L07R6r3j21K7L03l62L59j00rQ5l40l8O9j34K83J44j32J29l1k19
3688a1K85k68k83M96n45M33Lj33J2K20k50k02L9J79J75l14K07j25j3J3N6o8j6
$$ y = [-43, -22, 83, -10, 57, -9, -59, -23, 84, 100, 55, -6, 66, 0, -419, -76, -229, -233, -64, 189, -240, -117, -73, -142, -165, 0, -229, -114, 247, -324, 63, -182, 27, -9, 184, 201, -375, -14, 14, -63, 17, -156, 134, -80, 103, 101, 88, 319, -142, -27, -29, -159, -65, -133, -1, 149, -38, 29, 3, -23, 97, -170, 124, -53, 89, -390, 57, 130, -81, 38, 44, 219, -205, 188, 194, 105, 95, 110, -64, 223, -250, -216, 156, 96, -149, 77, 294, 80, 284, 96, -66, -109, -425, -115, 248, 215, 95, 121, -92, 255, 19, -457, 10, 9, -130, -17, 87, -18, 11, 82, -168, -21, 81, -111, -279, 234, -197, -107, -4, 106, -275, -147, 56, 43, 9, -175, 34, -544, -70, -76, -159, -19, -1, 87, -246, -45, 10, 126, -195, 206, 116, 133, -1, -127, -82, -234, 73, 169, 76, -45, -18, 285, -77, 282, 182, 173, 258, -82, -120, -51, -185, 98, 242, 110, 239, 208, -11, 274, 6, -277, 219, -326, 107, 110, -23, -11, 209, -41, -243, -204, -25, 150, -164, 43, -82, -95, -82, -26, -94, -110]
3711a10J02J35K29k35K3J68n14L49j57q2k32K55j40L30j97m0K27k88M25p4m80
3732c06K53K1j43K06j05J70j28J37j30j18J56L2j35P0N5M7J33k94P5J50M3k09
3754b0K9j20J50o2j84K81j57m7L50k11l37P9M85N7k23j48K70q3j92j96Q2J84k11
3777b24M0J38M8M79l40j69j24M34l05J6R6m00M39K9o6J58j98j20r8K27O7j30j95
3800a98J55N5j83M94k5l37K43l53n4O7J36r9p7K78j25j82J34L21l48J45l4Q9n3
3823D9k95N04j14j63p6J94K02j30O7j72J87k21P9J85j41j16n07M73K63m28L3L69
3845B42J7m20L1K67k54N0j66M12j29q6q7K9m9j01L76l9q9J69k71J10P9O7j47j5
3869dk11J00J71k37J12K26k13N6jk35L06j08r7j04L39J9k27k41J50j40O10m6k77
$$ y = [-110, -8, 127, 356, 121, 144, 312, -202, 147, -10, -92, -324, -69, -209, 121, -76, -116, 111, -177, 248, 174, -306, -53, -32, -175, 31, -74, 96, -32, 105, -25, -143, 13, 45, -90, -20, 35, 82, 215, -79, -4, 146, 189, -20, 9, -111, 39, -23, -207, 74, -83, -130, 220, 9, -328, -249, 236, 293, 70, -78, 192, 109, -83, -279, -197, -13, -224, -184, -46, 2, 481, 141, -28, -152, 282, -23, -7, 89, -311, 128, 157, 91, 249, 51, -69, -167, 60, 127, -3, -198, -43, 12, -171, 323, 298, -39, 204, -149, -203, -136, 0, -99, -176, 102, -23, -205, -71, 250, -98, 47, 13, 102, 49, -246, 258, 144, -19, -95, 99, 301, 171, 238, 66, 253, 32, 111, 296, 155, 39, -468, 5, 268, -160, -127, 242, 259, -161, -130, 137, -117, -67, -233, 179, 50, -36, -123, -94, -143, -244, 132, 93, 4, 173, -98, 12, 91, 158, 11, -4, -215, -115, 56, -181, -69, 157, -56, 0, -1, -236, 70, -38, -135, -239, 100, 119, -108, -349, -199, -339, 271, 225, -52]
3892e2k1K08j16m33L06P9J18j32j1J32q7k76L1N27l62L9J5J0J7Q1om6%J80k81
3917h0J70j96J92Q0p6Q8L8j16P0k72p0K91k32j72L45j12j79M12k08j42M48k62
3939A7j62j19K03J61J94k36k54R8J82K87j92Q7l54J1M49j33l32K7k2P3J78j8k39
3962i4K53l89K31p3K62q0j51kN04o21M06R7l87K00j62r1L05k44J20J18m7j59j31
3985a35J86m56K52L70l39L9J75j14qO0K33k75k51J39l4l8J56j43J85k7J99j72
4007BK00K99m41k87L96k54j21j32J68L97j13O3l93J71J09m4j26K72R1k07J03j62
4029ir0l6K96j33J98r8l16k6K99j92J58k34K28p3jJ31l41J86O9k01M63L8k98L2
4053E0R0P6m24L54r8MJ3l98N57m97K40l8K87n7L0l3k97J12q4K07l49J87J79o4
$$ y = [-52, -73, 135, 19, -414, -108, -29, 89, -43, -54, 78, -9, -285, -254, 273, -89, -50, -35, -25, -8, 73, 67, 21, 21, 201, -80, 90, -106, 86, 166, 90, 178, 216, 100, 170, -102, -172, 119, -113, -285, 60, -52, -231, 181, -27, -169, 279, 17, -145, -264, -61, 100, 294, 58, -196, -98, 84, 371, 179, 266, -88, -77, 372, 239, -93, -66, -88, -15, 163, 145, -94, 159, -230, 1, -72, 190, 110, -41, -43, 461, -160, 246, 343, -44, 156, -6, -97, 208, -36, 84, 202, 155, -4, -135, 51, -405, -153, 217, -122, -83, 92, -22, -30, 30, 263, -12, -263, -124, -158, -196, -40, -183, 2, -25, 174, 2, 202, 501, 60, -227, 169, -85, -206, -338, -170, 227, 114, 177, -216, -45, 64, 20, -106, 166, 257, 50, 153, -9, -99, -135, 161, 28, 226, 128, -188, -214, 85, -107, 51, -183, 45, -28, -29, 102, -239, -53, 16, -185, 278, 316, 18, 50, 140, 216, -208, 146, 48, 52, 65, -333, 224, -273, -33, -71, 216, 159, 189, 156, -141, -29, -113, 94, -255, -68, 111, 47]
4077D7K87l04R9K06j22r4k14P7K63j89j88J04L22m3o46O47l09l2K57l11M24l78
4099i7J26n8K40j79j12j2N4j2J29k29J98j35J66j79K36j01j51K17j87J3m9J48
4121B6k48K12N9j48L97k18m2L06n74L11k22K00k20L53l66M8M08k16k33P1j43J20
4143a19L20j00j84K59l65J20J76J55j75l28J80K61l88J77J44r3J61j80k56K11
4163b4J04j7j56p0j92M14J63m19M21j81L8k96K74n1M8k11L65jl1J6m04K52k86
4186b44J77K18l46J57jK14m83L7M56k78k6l9p9L78l02K09j0j18J13K12j19%j05
4209B1l5p4O7q0K9J21j57K62l97L34j38l4J42k23K82j72P3j01j4J11j12K42N0
4232A97j54l4J10l46J51N0j16L88l36K69k72J56Q9k39J46k92K78k0k28pQ6r1K13
$$ y = [47, 334, 30, 129, 335, 213, 119, -95, -18, 245, 56, -132, -28, 294, 251, -395, 252, -57, -89, 168, -143, 281, -97, 29, -29, 211, 32, -80, -92, -38, -50, 79, -150, 48, -87, 79, -100, 136, 35, -116, 101, -86, -73, -122, 26, -222, -10, 49, -99, 298, 80, 38, 344, -230, 81, -141, 59, -161, 192, -174, -126, 282, 66, -167, -96, -239, -119, 201, 101, -83, 176, -189, -69, 107, 262, 87, -241, -61, 200, -188, -11, 133, 40, 201, 21, -235, -24, 80, 63, -93, -163, -355, 59, 222, -197, 224, 43, 81, -215, 59, 8, 56, -155, 210, 209, 178, 194, -210, 42, -244, -67, 151, -195, -38, -39, 175, -308, -271, 185, -93, -119, -158, -237, 141, -161, 48, 38, -80, 33, 245, 126, 126, 21, -14, -88, -21, -101, -72, 49, -108, 154, -243, 91, -47, -81, 61, -162, 120, -52, 21, -80, -94, 17, -95, 147, 197, 43, 9, 119, -227, -76, -26, -142, 246, -90, 179, -93, 63, 152, -87, 59, -233, 45, 25, -203, -210, -124, -215, -2]
4255bl04L2O38l34Q5j48r0L82R1n95K6L06j99q2J20J32o4L0j64J0M9o7J3K77n34
4280c92L35J12j54M09l09j28LJ7O5J80k59J30N5M8K8o4M8j37j52O90p10J83k59
4303b61J66J94Mk5J96o27L58J29k74J5J45K09o3j77lJ12j93k32L83k05M6Oj01
4326a98N8O7J99j17R2j62K28k81J79l45J41K28j08j72J19R6j92K91K02k87n4p4
4348i0j19J63Jlr0j41Q0K16k1j1K43r3m71M11J43o0L1k23M5J58J7m04j8L77k58
4373a17J08j24j56M48m53L80o0J97k17j45J5r2L80j07o0l7M6k94L42k24J61j44
4395a53j3M8R8k64J76P1R1L4j3J8j08j08J44j0K12j86KJ86k60l65O3l2L12j4R8
4420B7M6j88J91p2P8Q1l10K25k01M1J42k42N34j0j70J43l77kK77k72O2k36N37
$$ y = [-2, -306, -274, 364, 30, 115, -33, -123, 259, 350, -245, -219, 87, -112, -194, -74, 58, -6, 24, -140, -130, -81, -148, -135, 142, -392, -57, 55, -99, 310, 1, -127, -124, -107, -42, 138, -121, 9, 64, 112, 140, 76, 124, -13, -165, 525, -185, -2, -261, -95, 99, 103, 78, 274, -353, 5, 134, -140, -125, 20, 229, 166, -11, -14, 98, -95, -327, 56, -149, -103, -97, -198, -140, -73, 126, 9, 101, -61, 167, -114, 65, -280, -139, 89, -19, -191, -72, 24, -168, 123, 325, 38, -16, -90, -209, -46, -45, -48, -138, -279, -199, 17, -4, -15, 228, 135, -336, 75, 218, 158, 189, -34, 11, 169, 186, -218, -236, 141, -117, -9, -133, -289, 159, -294, 86, 26, 223, 6, -139, -124, -216, 164, 57, -3, -40, 6, -288, 54, -170, -9, -153, -166, -118, -20, -284, -108, -37, 54, 88, 75, 93, -15, -123, 21, 11, 223, 37, 39, 225, -35, -400, -337, -369, -57, -71, 27, 73, -115, 76, 4, 82, 163, -147, 78, -123, -82, 60, -182, 352, 342, 172, 315, -62, -64, 213, -59, 3, -233, 304]
4443C04n62L40J09m43K04j94K76J5K09N0m61K58jJ22j65k28L14l47K9O1K39%k78
4466a49M07j19j12j75K66j35j51J68J78m40p1L99j78j23L38K7j84J99j99q9l8
4487a81K35K00l81q4K51j20R6j02J22m5Mm1M0k95O03m36L92j10j20j04r0J61L29
4510C24m76Q7Q5J8m7p4J36p0O2J6J83k83R0M60l52P3k51J16l87J55J69J43j5q0
4534H2M8l26P8K64q0k19J12O5n8j54J86j57K99j29K28j20J9o0j85O70o96M49l42
4557b6j66M67k16j78J05k9P2m1l0p6K51m87N49k30K07k34oM70l95K2l5N3k03k5
4581a81j1K86n4M5N4j89j13J76j20K66q1K53k64k82K02J66o8q0k56J97M64m67
4603e7L4J04q9r2o9K11k35L28k99J08K85k06J66l81L42k62J86k67J78L52j91j13
$$ y = [304, -258, 82, 191, -252, -48, -242, 34, 49, 258, 308, -153, 105, 104, 226, 61, -167, 147, -200, -171, -110, 129, 129, -149, 258, 139, 27, -148, 118, -17, -168, 0, 178, -262, -333, 66, -112, -235, 103, 130, -54, 145, -54, -143, -181, 54, 254, -127, -211, 40, -80, 16, -86, 36, -9, -5, -46, -6, -301, 302, -134, 258, 148, 28, -76, -166, -5, 324, -152, -65, 20, 38, -9, -83, 53, -17, 45, 61, 244, -39, 51, 511, 159, 232, -19, 97, -290, -135, 34, 177, 162, 82, 130, -196, -118, 146, 66, -153, -41, 24, -34, -188, -2, -159, 140, 11, 239, 119, 138, 78, -107, 563, -133, 316, -26, -192, 275, 59, -119, -14, -43, 29, -12, -42, -118, 133, -354, 195, -35, 172, -62, -68, 402, 7, 29, -6, 47, -156, -181, -192, 94, 40, 85, 139, -50, -163, 13, -107, 159, 78, 331, 67, -215, -13, 153, 85, 5, -251, -54, 410, -57, -23, 81, -8, -100, -169, 42, -193, 135, -164, -56, 229, 23, 189, -192, 150, -112, 74, -193, -15, 337, 146, 33]
4625C3J73k85j19K45K35p68M89K10m4J9j27p7o1N2J79R1R9n94J44kJ56J6l61L63
4649F6k90K3J56K45j93M56n28K17r7J61k28K50j44q9J70m09L78p6j83O5K33k44
4671f1R3n8k06O51m00Mp1o7L66k44J91k40k12J35J70R7k91L37n3Rj13m3j97J84
4695a9M9K93n20KQ5k6M0P7l3qJ07m0J17j52j68R3J78r4K27k31Q7o5j29K12M6q9
4721C9l01K53m8P4J32k38O8J14k44K40J34k09rl7K77j42kL58j62m21l9L95p8L
4745A57l05N8rK24K2J21l78R7p2m9J59q6N6K61l22j43M72m14J00J95j03n0m2j6
4769f7R3J38l57K20j8r6J60k08k31K18K00n6J61k44J78l1j04J33n4O8J14j46J90
4792B61l55m9M18k10m2J22m36M49R6j49j58k81L55j91K11J07R5j32m17M1K74n2
$$ y = [33, 206, -79, -198, 47, 282, -486, 3, 213, 169, 188, 61, -16, -77, -25, 154, 245, 344, -250, -106, -108, 48, 64, -297, 66, -224, -201, -45, 200, 7, 463, -65, 152, 55, 216, -12, 238, 94, 5, 175, -234, 144, 68, -115, -50, 183, -61, 32, -26, -232, 419, 19, 23, -48, -115, 251, 7, 198, -42, -254, -119, 51, 148, -143, 194, 141, 150, 37, -6, -203, -19, 30, 323, -197, -195, -110, -136, -96, -19, -52, -60, 47, 7, 124, -28, -196, -103, 75, -19, 208, -23, 64, -1, -130, 82, 128, 39, -262, -9, -57, 17, 149, -89, -21, 93, -151, 89, 223, 14, 5, -32, 245, 103, 101, 459, 297, -124, -163, 232, 154, 157, -148, -90, -99, 125, 147, 268, -110, -13, -85, -134, 25, -61, -5, 256, -66, -209, 263, -151, -51, 144, 41, -9, -51, -67, 26, 164, -193, 27, 9, -87, 73, -135, -366, -148, 52, -4, 157, -87, 91, 60, -44, 89, 35, 103, 217, 71, 261, -94, -143, 275, 65, 23, 145, -291, 158, 254, 105, -53, -334, 21, -170, 41, 148, 243, 111, -306, -265, 9, -43]
4814d3J42rMj6r0j20r5L71R1o37L94m7j9J67J66l73J40J8J02m28J78L82j81m31
4838c34L40J43k96K23j5R0j84k85J84J91j96K94O8j71j27J76k30L5J52j70NL93
4860B86k97L3p7k83M26l06Q7P2L30l82k93Q1M25m38K86r6J64l99L89j51L32k11
4882b2PJ73l41K51r0j13j34L62l43K53r5J53j71R7j2k27M11q4k33O9j12k74N78
4905A03j56K12m2k2Km2J09n1N1j9l0K72j24l08M71m53J30j43Q8l8l9J34j70q6
4929a51K65j42J55k7j51J9L4j6R4j53J09l47L16j25J45J53j99J52l53M51l87K25
4951F7J42l35J26L18l39M18m17M9p5J50l7j54j41K60k12P4J4J51K92m59k1L77
4973B48k91J73k3j31lK6j24n2K71K4j83M6j08L15m6m11J36K32k62J98k02M69m08
$$ y = [-43, 99, 90, 94, 78, -12, -132, -227, 144, 235, -402, -8, -55, -74, 93, 259, -114, 26, 44, 146, -282, -104, 278, 97, -334, 6, 149, -147, 76, 61, 151, -33, -318, -134, 57, -139, 155, 223, 52, -75, 101, -129, -94, 58, -112, -107, 286, -11, 22, -55, -338, 88, -218, -131, -59, 271, -111, -404, -323, 102, -336, -50, -146, 18, -381, 8, -143, 189, -22, -15, 158, -183, 68, -22, -135, -269, 93, -250, 3, -92, 61, -110, -13, -25, -252, 159, 75, -158, -89, -201, -475, 103, -53, 159, 117, 95, 97, 55, 164, 113, 164, 145, 115, 387, 263, -45, 426, -27, 103, -40, 48, 10, -29, 105, -65, -151, 114, -28, 127, 100, -51, -32, 2, -14, 80, -73, 36, -311, 5, -120, 25, 178, -21, 131, -222, 229, -158, 67, 209, -126, 0, 318, -21, 397, -20, 29, -46, 104, 67, -87, -228, 32, -180, -106, -92, 59, 351, -108, -129, 248, -43, 130, 107, -24, -27, -1, -125, -177, 94, 118, -65, -19, -127, 188, 142, -269, -133, 99, -163, 35, -167, 302, -106]
4996a06J26J12m07oM00N2l64OM83m70j73M66k09K03k82L39j03Q4j05j07K9J8j74
5019a88K83k01J4J18j29k90L12J76P5k23n1L1J98j33j91K07k2nj2L21l10J98j44
5042C4K58j80Q3n19L31p8N01n58K56l55M44k11j31L51k15n4o8J86k51K89K2j30
5064Ej01j8m0K52j01j34P5K51j68J77k17J2j09K7L91j64k24O1J02N7Pl25r1M20
5088A45m28L41l5K5Kj68j40q6K08K8K38p7m2J75k84L40l37Q4J27J09m33L06m08
5111c10M74p6j35J33J71j83o8K86k15m15P36k24k51N3j97L17l24J97Q4K33k33
5132E3j09LK09n81Q22p55L88Pk6L8q6K34o9j97K52k0j38R9m81N32R5L5m79R2J42
5157F0L25l07k29j00J76ok19R8Q9j0L75l27j5n6K39j53J83o9J46K41o29J1J39
$$ y = [-106, 20, 132, -275, -281, 119, 171, -193, -187, 296, -174, -347, 119, -90, 113, -169, 170, 67, 151, 46, -61, -32, -14, -188, 95, -106, -92, 26, -103, -393, -81, 95, 170, -53, -104, -73, 125, -8, -199, 8, -14, -19, -31, 290, -20, 178, 34, 292, 112, 195, -324, 7, -71, 430, -128, 128, -227, 217, 6, -125, 226, 11, -43, -111, 75, -176, 113, 135, 5, -96, -114, -154, 98, -3, -137, -62, 189, 21, 198, -19, -7, -116, -89, 302, 138, -86, -25, 77, 134, 141, -184, -275, 145, -283, 58, 23, 48, 50, -118, -258, -344, -136, -108, 130, 53, 11, 186, -98, 242, -95, -11, 116, 225, -208, 98, -310, 164, 88, -47, 86, 257, 74, 6, 292, 77, -338, 398, 174, -77, -24, -221, 96, -228, -31, 53, 286, 53, -56, -53, 156, -425, 397, -358, 30, 37, 11, 49, -37, 197, 128, -69, 183, 163, 25, 124, -357, 175, 270, 305, -174, -82, 60, 385, 78, -151, -251, -75, -81, -300, -202, -113, -123, 252, -75, -90, -146, 93, -60, 123, 54, 200, 441, -188, -177, -38]
5180c8l5j95N25l45J84M4l46O4J16k5j33N3J21J65k81M5L23k66k6K90L6j88L05
5203C93o26l3J85j17L95n52K80Q6j42j52N13l84M45m66L28k06rR4n60N20L38k31
5225I9o2k09J99m05M40o5q5J77j37J19j31O6j45R3p6M3K24q9j67J99l7o5J83j51
5249A8J56m0k29k22K82J47j89q1K89j8k01J56l99P26j66l73J31P6j63J56j13o9
5271a26N31l96l4N6k19K14o6N1P2J51M9n28K32k16J11K71j38J29p5k1O8o4k18
5294a66o5J08Mk39N53j81k08M63r5k02K59Lm41N3M71j77J50m13jN7J22l86K83
5317d8J03k12m5O6j89L99Kl73J83P5J72l11J65l25L13J10J67k34J98l77K62lk27
5340a29m5K83r2J69k21L0P0jj37L3K4j14O8J79K04l2n45M13j73J39l05K80j54
$$ y = [-38, -73, -268, 257, -88, 96, 140, -206, -142, -26, -51, -184, -131, -10, 155, -126, -81, 242, -24, -50, 240, 276, 88, 393, -233, -266, -81, -198, 197, -355, -75, 11, -131, -283, 230, -154, 291, -175, 153, -53, -62, 32, -528, -8, 330, 99, 37, -172, 27, -378, 62, -3, -88, 89, -48, 71, -60, 6, -139, -46, -122, -79, 145, 56, -111, 88, 51, -14, 169, 18, 174, 134, -95, -317, -35, 112, -77, -158, 131, 113, -88, 68, -331, 395, 229, -144, -13, 63, -100, 56, -57, -126, 405, 9, -25, 31, -188, 26, -40, 11, 83, 234, 283, -245, -13, -229, -118, 153, 15, 144, 69, 48, 116, 52, -166, -231, -123, -119, -358, 195, 14, -194, 269, 174, -28, 231, 234, -207, -154, 317, 140, 290, -123, -124, -67, 55, -331, -48, 55, -157, -202, -136, -325, 74, 76, -297, -114, -39, 133, -178, -13, -338, -25, 85, 252, 18, 216, -161, 101, 98, -129, -174, 109, 17, 186, -35, -5, 65, 64, -73, -40, -16, -130, -62, 117, 321, 289, -256, 157, -16, 123, -182, 98, -56]
5363e6L1J0j39N25n02Pk27K69j87L27J49j75m4j74j71M95l6j3k01K32j4n9p2J00
5387G5k02oq9N40m22q8j41j8K48j84K04K8R4L0k59K4L77o0j79J28O4l97L17j7
5411F7K00m50l2K19r6J31P0j74J35R6j49n5L71m37J82r6J07RJ05K72o72K36n1
5434a2j45PN8J07M3l85N25l61J93J75m2k10J1L0K95m63K11p9J06p3k97J02R7K3
5458h4K04K86n74P5j2j79J11J80j81R3J72j47rQ2L5L0l19K20k5J81k30L13q8j70
5482c6J04N0K74n85L18l75L58j00kk12J33jK70k85J75l38K86k0k20J65K05j47
5504A7kJ75l05k5J16m17N94k9k40k32M52l0l03M58j27j51J96M8n3Q8l60K18p1
5527A7O9k70K17J37l42L38l20J37j49L88J1j37K5j1k80K32j91J87k11J85j4j24
$$ y = [-56, -25, -15, -154, 371, -131, -124, -351, -82, -269, 58, 207, 32, -12, -186, -357, 138, 102, 89, -112, 120, 106, 47, -25, 75, -127, -133, -222, 318, -104, -192, -333, -351, -103, -287, -83, -55, 39, 69, -190, -166, 211, 151, -28, 100, 164, -233, 84, 67, 267, -183, -215, 4, -92, 39, 109, -65, 70, 166, 17, -38, 333, -104, 78, -18, 89, 98, 203, 475, -197, 39, -12, -157, -150, -92, 15, 58, -327, 198, -163, 30, 205, 163, -47, -36, -6, 289, -174, 37, -42, 64, -9, -306, -204, -107, -84, 120, 406, -168, -93, -105, -284, -173, 7, -174, -81, 91, -56, -65, 17, 52, 82, -237, -17, -42, 139, -91, 222, 134, -36, 68, 118, 392, -193, 125, -250, 108, 8, 6, -206, -73, -74, 196, -89, 86, -252, 34, 14, -206, -41, 164, 17, 15, 190, -115, -140, -24, -441, 153, 124, -116, -348, 104, 74, -229, 229, 102, -49, 147, 195, 142, 230, -130, 88, 17, 86, -184, 33, 170, -172, 166, -154, -17, -166, 222, 233, 96, 121, 110, -170, 62, -129, 58, -153, 32, 18, -106]
5549a06lO8o2O5K24j80k65K00r5k2K89j17j9J47j29R2j61K11j13o9L47l46L21
5572B77k55K25j93n2j45J25j3o9O6j41J15L16k93M0J89j44P1l6k6P2k30J30PL9
5596G5n4j67J57k55J15j03J26K1l9l5J48N1j25j4L52n49L56P5J30j62J38m17K96
5619A20k8k32L69J09l66M5K79n18K39J47K40n42K06k69J37M1j14k04K90K34n5
5640A28k92J21J75j21M4J79k61O9j14M94m31l8J4p5J10j41O3p3J6J03M8l74K24
5663a32k15K48K99J1j14j26L8m29M78J24o05M58p4J36k69L51j33l2k63J89K9M1
5685A0k70K76P2j47M71m69j41K95k65O8L69L5j33l50K12j72j1L97l30R5J6k25
5707a97K85j90J70L24n20K33p4q9K02n2J10k01L07j77l49K96J29j28R4m7j6l42
$$ y = [-106, -109, -41, -103, -38, 186, 6, -259, -59, -154, -176, 113, -4, -23, 124, -5, 87, -74, 137, 24, -45, 302, -44, 277, 22, 247, 54, 2, -143, -18, -31, -100, -34, -175, -60, 256, -37, 3, 192, 48, 119, 83, 57, 129, -101, 29, 36, 75, 21, -146, 11, -244, -129, -232, -106, -85, -124, -159, -11, 40, -85, -99, 253, -296, 60, 135, 265, 103, 241, -176, 120, 92, -140, 229, 338, -28, 17, 296, -222, 17, 164, 404, -138, 68, -201, -64, -23, -137, -341, -51, 183, 128, -164, -43, 132, 11, 55, 234, -27, 42, -72, 422, -9, -47, -33, -108, 2, -139, -76, -149, -133, -30, 18, -356, -132, -347, -99, 200, 211, 97, -29, 9, -420, 58, 182, -423, 35, -39, 97, -172, 179, 46, 14, -249, -60, -31, 10, -260, 16, 88, -59, 412, -57, -198, 97, -168, -100, 269, 304, 171, -179, 33, -139, -150, 247, -83, 12, 28, -197, 88, -102, 68, 392, -128, 105, 31, -58, 144, 92, 202, 1, 308, 131, -218, 78, 207, 79, 173, 126, 110, -232]
5729b32L80k65L0Q4R4q5j84L87k44k91L13J5jK32k46Q4N1J96j09l41P0J05J66
5752B09K10l34Q5j62l0N2l69M01m2P1q9j93J38J8K58l54J20j77K75N2M8l42K55
5775A00J10l64N0o8L80k37k08K28j8K64J7m42J21K49Q7k35Q8k72J62J56M3j79
5797C2n5J24Q8j19l0J08k04Pn0K50l77L51m09M54M9j18j47P6J73j86J81l55N5
5820a02J35m35q8N89o9l08O3J02rJ95N2o18M17L1j62P7K95l36L08j9k00Q1J20
5843A19q7J34l50K14K18J00j41n5l17R1K58m85O82m07k35P84p10K25l80N8L69
5864H5R0L21l97J5k70K30j82J46R5l00P6M8K52n29J67M42m79K65k70J94o3J17
5886E3j67L23m52K94J85k65J89m26M63l78K26K2j64J17n8k91L22j86J16j04L74
$$ y = [-232, 148, -117, -87, -3, 91, 6, -178, 209, -35, -326, -13, 2, 1, 233, -13, 71, 122, 318, 209, -132, -62, 43, 209, 419, 85, 170, 8, -22, 30, -339, 62, 20, 91, 2, -191, -53, -35, 223, -131, -11, -188, 87, 139, 187, -155, 100, 210, -154, -104, -172, 208, -29, -237, -9, -27, 237, 254, -188, -67, 182, 269, 34, 122, -150, 12, 168, 211, 32, -23, 101, 189, 70, 40, 148, -56, -49, -99, 151, -226, 125, -284, 170, 219, 101, -46, 30, 203, 17, 198, -157, -102, 33, -402, -490, 99, 30, -278, -215, -113, -122, 73, 125, -493, -76, -45, -207, -130, 165, -171, 137, 118, -82, -1, 119, 32, 166, -184, 30, 248, 348, 207, 152, -165, -74, 184, -301, 381, -26, -261, 523, -187, 38, -342, -284, 85, 175, 496, 99, 114, -156, 74, -108, 38, 133, -167, -91, -43, 209, -320, -153, 289, -190, 75, -195, -1, -64, 53, -114, 209, -243, 51, 236, -29, 160, -266, 197, -181, 45, 67, -97, 20, -38, -329, -7, -193, -77, -181, 193]
5907A93j07k34M1k70J07kL09P0j15P2p2K38j29m39K40J82j89J10J23r7m04N67
5929A94j26lJ40l12m4J50L46m92J6K74j2j3m5j71j71K98jl7J4m5J20k52M7M89
5953C64m24NMk97L88J06K8l10j75N16l85M29m78J20L48k76J98l51K08J35j79J
5975b5L44k94nj19P8r5n7K24m5M7J48k54J72j34n8J89mk22J26j13M9O0k45j01
5999c34K21K40j51K69m08J29J7N2q9k92K44k40K25M1m16L02L76k64N5J6m34M80
6021C9q5j5NK35n2l26P4K18j92O9o0P4K03l69J02P3K30l03J73m4l9L37j46m37
6045b36L45j00M4Q0m04K42j1K10j80j25M42l42k07K98m5O0l56L0M95k44K94j18
$$ y = [193, 86, -148, -107, -377, -270, -272, 37, 107, -8, 64, -8, 230, 101, -338, -98, 84, -105, 5, 128, 31, -373, 194, 68, 65, 205, -107, -151, -1, 345, -147, -131, 143, 131, 118, 73, -98, -269, 29, 28, -9, 5, -40, 80, -172, -125, 364, -60, -55, -51, -348, 40, 146, 174, -136, -311, 205, -180, 249, -229, -109, 239, -37, 161, -190, 18, 153, -26, -25, 319, 25, 20, -99, -21, -116, -173, 51, 6, 53, 201, -53, 119, -15, -73, 116, 112, -110, 16, -97, -48, 12, -233, -334, -113, 127, -24, 245, -163, -34, -17, 35, -54, -346, -102, -342, -117, -76, -492, -190, 186, -78, -23, -7, -441, 39, -46, -61, -56, 179, 127, -199, -125, 93, -99, -30, -90, -16, 187, -182, -80, -7, 223, -80, 93, 49, 10, 347, 201, -236, 109, 9, 53, 133, -271, -29, -40, 170, -10, -135, 307, -35, -242, 56, 11, 71, -285, -255, 240, -4, 290, 172]
$$ [...]
8191B83
##END NTUPLES=NMR FID
##END=
