##TITLE=1H_1-2024
 CDCl3
 8 sc, 
 9.1.2024
##JCAMPDX= 6.0         $$ Bruker NMR JCAMP-DX V2.0
##DATA TYPE= NMR FID
##DATA CLASS= NTUPLES
##ORIGIN= UXNMR, Bruker Analytische Messtechnik GmbH
##OWNER= root
$$ XWIN-NMR		Version 3.5
$$ Tue Jan  9 14:40:24 2024 Russian Standard Time (UT+4h)  she@DPX200
##.OBSERVE FREQUENCY= 200.1313
##.OBSERVE NUCLEUS= ^1H
##.DELAY= (6, 6)
##.ACQUISITION MODE= SIMULTANEOUS
##.ACQUISITION SCHEME= undefined
##.AVERAGES= 8
##.DIGITISER RES= 18
##SPECTROMETER/DATA SYSTEM= spect
##.PULSE SEQUENCE= zg30
##.SOLVENT NAME= CDCl3
##.SHIFT REFERENCE= (INTERNAL, CDCl3, 0, 15.7039)
##AUDIT TRAIL= $$ (NUMBER, WHEN, WHO, WHERE, WHAT)
$$ ##TITLE= Audit trail, XWIN-NMR		Version 3.5
$$ ##JCAMPDX= 5.01
$$ ##ORIGIN= Bruker BioSpin GmbH
$$ ##OWNER= she
$$ F:/spectra/data/she/nmr/H-F/1/audita.txt
$$ ##AUDIT TRAIL=  $$ (NUMBER, WHEN, WHO, WHERE, WHAT)
(   1,<2024-01-09 14:39:14.31 +0400>,<she>,<DPX200>,
      <created by zg, POWCHK disabled, PULCHK disabled
       configuration hash MD5:
       00 E9 B6 7A A2 85 ED C7 34 08 36 98 17 FE 4E 26
       data hash MD5: 16K
       1D 55 6F 9A D2 EA 44 5F 0B 59 08 E6 C9 05 00 E3>)
$$ ##END=
$$ 
$$ hash MD5
$$ 14 3E D6 EB 1E 36 22 EF E2 D1 31 F7 71 8B 03 29
##$RELAX= 
##$RELAX= 
##$RELAX= 
##$RELAX= 
##$RELAX= 
##$RELAX= 
$$ Bruker specific parameters
$$ --------------------------
##$DU= <F:/spectra>
##$EXPNO= 1
##$NAME= <H-F>
##$PROCNO= 1
##$TYPE= <nmr>
##$USER= <she>
##$AMP= (0..31)
100 100 100 100 100 100 100 100 100 100 100 100 100 100 100 100 100 100 
100 100 100 100 100 100 100 100 100 100 100 100 100 100 
##$AQSEQ= 0
##$AQ_mod= 1
##$AUNM= <au_zg>
##$AUTOPOS= <>
##$BF1= 200.13
##$BF2= 200.13
##$BF3= 200.13
##$BF4= 200.13
##$BF5= 200.13
##$BF6= 200.13
##$BF7= 200.13
##$BF8= 200.13
##$BYTORDA= 1
##$CFDGTYP= 0
##$CFRGTYP= 5
##$CHEMSTR= <none>
##$CNST= (0..31)
1 1 145 1 1 1 1 1 1 1 1 1 1 1 1 1 1 1 1 1 1 1 1 1 1 1 1 1 1 1 1 1 
##$CPDPRG= <>
##$CPDPRG1= <>
##$CPDPRG2= <>
##$CPDPRG3= <>
##$CPDPRG4= <mlev>
##$CPDPRG5= <mlev>
##$CPDPRG6= <mlev>
##$CPDPRG7= <mlev>
##$CPDPRG8= <mlev>
##$CPDPRGB= <>
##$CPDPRGT= <>
##$D= (0..31)
0 1.2 0 0 0 0 0 0 0 0.06 0 0.03 0 0 0 0 0.0002 0 0 0 0 0 0 0 0 0 0 0 0 
0 0 0 
##$DATE= 1704796753
##$DBL= (0..7)
120 120 120 120 120 120 120 120 
##$DBP= (0..7)
150 150 150 150 150 150 150 150 
##$DBP07= 0
##$DBPNAM0= <>
##$DBPNAM1= <>
##$DBPNAM2= <>
##$DBPNAM3= <>
##$DBPNAM4= <>
##$DBPNAM5= <>
##$DBPNAM6= <>
##$DBPNAM7= <>
##$DBPOAL= (0..7)
0.5 0.5 0.5 0.5 0.5 0.5 0.5 0.5 
##$DBPOFFS= (0..7)
0 0 0 0 0 0 0 0 
##$DE= 6
##$DECBNUC= <off>
##$DECIM= 32
##$DECNUC= <off>
##$DECSTAT= 4
##$DIGMOD= 1
##$DIGTYP= 9
##$DL= (0..7)
0 120 120 120 120 120 120 120 
##$DP= (0..7)
150 150 150 150 150 150 150 150 
##$DP07= 0
##$DPNAME0= <>
##$DPNAME1= <>
##$DPNAME2= <>
##$DPNAME3= <>
##$DPNAME4= <>
##$DPNAME5= <>
##$DPNAME6= <>
##$DPNAME7= <>
##$DPOAL= (0..7)
0.5 0.5 0.5 0.5 0.5 0.5 0.5 0.5 
##$DPOFFS= (0..7)
0 0 0 0 0 0 0 0 
##$DQDMODE= 0
##$DR= 18
##$DS= 0
##$DSLIST= <SSSSSSSSSSSSSSS>
$$ [...]
##$SUBNAM2= <"">
##$SUBNAM3= <"">
##$SUBNAM4= <"">
##$SUBNAM5= <"">
##$SUBNAM6= <"">
##$SUBNAM7= <"">
##$SUBNAM8= <"">
##$SUBNAM9= <"">
##$SW= 18.0517328524113
##$SWIBOX= (0..15)
0 0 2 0 0 0 0 0 0 0 0 0 0 0 0 0 
##$SW_h= 3612.71676300578
##$TD= 16384
##$TD0= 1
##$TE= 0
##$TE2= 300
##$TE3= 300
##$TEG= 300
##$TL= (0..7)
0 120 120 120 120 120 120 120 
##$TP= (0..7)
150 150 150 150 150 150 150 150 
##$TP07= 0
##$TPNAME0= <>
##$TPNAME1= <>
##$TPNAME2= <>
##$TPNAME3= <>
##$TPNAME4= <>
##$TPNAME5= <>
##$TPNAME6= <>
##$TPNAME7= <>
##$TPOAL= (0..7)
0.5 0.5 0.5 0.5 0.5 0.5 0.5 0.5 
##$TPOFFS= (0..7)
0 0 0 0 0 0 0 0 
##$TUNHIN= 0
##$TUNHOUT= 0
##$TUNXOUT= 0
##$USERA1= <user>
##$USERA2= <user>
##$USERA3= <user>
##$USERA4= <user>
##$USERA5= <user>
##$V9= 5
##$VALIST= <valist>
##$VCLIST= <CCCCCCCCCCCCCCC>
##$VD= 0
##$VDLIST= <DDDDDDDDDDDDDDD>
##$VPLIST= <PPPPPPPPPPPPPPP>
##$VTLIST= <TTTTTTTTTTTTTTT>
##$WBST= 1024
##$WBSW= 4
##$XGAIN= (0..3)
0 0 0 0 
##$XL= 0
##$YL= 0
##$YMAX_a= 181534
##$YMIN_a= -220009
##$ZGOPTNS= <>
##$ZL1= 120
##$ZL2= 120
##$ZL3= 120
##$ZL4= 120
##$ABSF1= 10
##$ABSF2= 0
##$ABSG= 5
##$ABSL= 3
##$ALPHA= 0
##$AQORDER= 0
##$ASSFAC= 0
##$ASSFACI= 0
##$ASSFACX= 0
##$ASSWID= 0
##$AUNMP= <proc_1d>
##$AZFE= 0.1
##$AZFW= 0.1
##$BCFW= 1
##$BC_mod= 2
##$BYTORDP= 1
##$COROFFS= 0
##$CY= 11.3945322036743
##$DATMOD= 1
##$DC= 2
##$DFILT= <>
##$DTYPP= 0
##$F1P= 15.7292609196834
##$F2P= 12.9074282941183
##$FCOR= 0.5
##$FTSIZE= 0
##$FT_mod= 4
##$GAMMA= 1
##$GB= 0.15
##$INTBC= 1
##$INTSCL= 1
##$ISEN= 128
##$LB= 0.24
##$LEV0= 0
##$LPBIN= 0
##$MAXI= 10000
##$MC2= 0
##$MEAN= 0
##$ME_mod= 0
##$MI= 1.114404
##$NCOEF= 0
##$NC_proc= 0
##$NLEV= 6
##$NOISF1= 3.799351
##$NOISF2= 2.8
##$NSP= 1
##$NTH_PI= 0
##$NZP= 0
##$OFFSET= 15.70392
##$PC= 1
##$PHC0= -24590.54
##$PHC1= 10.85273
##$PH_mod= 1
##$PKNL= yes
##$PPARMOD= 0
##$PSCAL= 0
##$PSIGN= 0
##$REVERSE= no
##$SF= 200.130013532006
##$SI= 16384
##$SIGF1= 3
##$SIGF2= 2
##$SINO= 400
##$SIOLD= 16384
##$SREGLST= <1H.CDCl3>
##$SSB= 0
##$STSI= 0
##$STSR= 0
##$SW_p= 3612.71676300578
##$SYMM= 0
##$S_DEV= 0
##$TDeff= 0
##$TDoff= 0
##$TI= <>
##$TILT= no
##$TM1= 0
##$TM2= 0
##$TOPLEV= 0
##$USERP1= <user>
##$USERP2= <user>
##$USERP3= <user>
##$USERP4= <user>
##$USERP5= <user>
##$WDW= 1
##$XDIM= 8192
##$YMAX_p= 0
##$YMIN_p= 0
$$ End of Bruker specific parameters
$$ ---------------------------------
##NTUPLES= NMR FID
##VAR_NAME=  TIME,          FID/REAL,        FID/IMAG
##SYMBOL=    X,             R,               I
##VAR_TYPE=  INDEPENDENT,   DEPENDENT,       DEPENDENT
##VAR_FORM=  AFFN,          ASDF,            ASDF
##VAR_DIM=   8192,          8192,            8192
##UNITS=     SECONDS,       ARBITRARY UNITS, ARBITRARY UNITS
##FACTOR=    0.0002768,     1,               1
##FIRST=     0,             0,               0
##LAST=      2.2672688,     0,               0
##MIN=       0,             -220009,         0
##MAX=       2.2672688,     181534,          0
$$ Real data points
##PAGE= N=1
##DATA TABLE= (X++(R..R)), XYDATA
0@%%%%%%%%%%%%%%%%Nj3J6j6J6j6J6k1K9l2L3m1M8n3O1o9P7q7R9j09J21j36J52
$$ 0 0 0 0 0 0 0 0 0 0 0 0 0 0 0 0 0 5 -8 8 -8 8 -8 8 -13 16 -16 17 -24 24 -29 32 -37 40 -47 52 -57 64 -72 80
39H0j68J87k07K27k51K79l08L38l70M08m50M94n47O03o64P38q21R16j029J160
$$ 80 -88 99 -108 119 -132 147 -161 177 -193 215 -235 259 -288 315 -349 389 -432 484 -545 615
59F15j318J516j766K093k538L177m160N831r140J7831p7062j55088L32876L4271
$$ 615 -703 813 -953 1140 -1398 1779 -2381 3450 -5690 12141 -64921 -220009 112867 147138
73A47138k64246J17179J56230j87708o5339J99944j4621j95666Q8419J18422j69865
$$ 147138 -117108 71 156301 -31407 -96746 103198 88577 -107089 -18670 99752 -70113
84g0113j2413J74400r2482j17921J16978N9552p6317l0596O1919L6469p0836K261
$$ -70113 -82526 91874 -608 -118529 -1551 58001 -18316 -48912 13007 49476 -21360 -19099
96a9099Q5181n7164m8898Q5644j2683p4974M1098M2570n9414l6678Q1484J1832
$$ -19099 66082 8918 -39980 45664 32981 -41993 -895 41675 -17739 -54417 27067 38899
108C8899j18684M7800J10953j14703l1035J34611n6288p5515J04903P544r3080
$$ 38899 -79785 -31985 78968 -35735 -66770 67841 11553 -63962 40941 48485 -44595
119d4595L3740P1287n3319n7412P5712K0862r5986L2211O6865p1596p317N2133
$$ -44595 -10855 60432 7113 -50299 25413 46275 -49711 -17500 49365 -22231 -29548 22585
131B2585l1423l397J7599j5271J3534l844p509K8241k3495j9735M3815K165l8037
$$ 22585 -8838 -12235 5364 -9907 3627 -217 -7726 20515 -2980 -22715 21100 23265 -14772
144a4772j570L6925K313n3155K1868M9598o5895o770P4642n1148l0378O8831k9829
$$ -14772 -16342 20583 22896 -30259 -8391 41207 -24688 -31458 43184 -7964 -38342 30489 660
157F60m1069O0441J1519n7731O90N8435p704o0101L4119L9588n8435N511M3766
$$ 660 -40409 20032 31551 -26180 -25490 32945 25241 -34860 -741 38847 -19588 -14077 29689
170B9689m0332l795K8648k3547q8J4314n998r29j4273J4972K6590l7755p926M3753
$$ 29689 -10643 -14438 14210 -9337 -9425 4889 -1109 -2038 -16311 -1339 25251 -12504 -20430 23323
184B3323q249k5632O191J9287J339l1252J2715K7574m2574M257L8349m5415j823
$$ 23323 15074 -10558 -4367 14920 16259 -14993 -2278 25296 -17278 -13021 25328 -20087 -21910
197b1910M8447l7679k0454M5757J11l2012M009L3102m330l3272K6510J6624m1422
$$ -21910 26537 -11142 -31596 14161 14272 -17740 -13731 19371 15041 -18231 8279 24903 -16519
210a6519K0014K3512m2876J0541K5348l0590j369J6183n369n554q995J4610J0866
$$ -16519 3495 27007 -15869 -5328 20020 -10570 -11939 4244 -1125 -6679 -15674 -1064 9802
223I802k4309R110J6641j7051Q949P743j1770O945k381J767O286k2185J2103J7079
$$ 9802 -14507 -5397 11244 -5807 3142 10885 -885 6060 3679 5446 11732 -10453 1650 18729
237A8729l6301P414K7918k8888m571J9774p568k896K730M747p57q946K1035p04
$$ 18729 -17572 -10158 17760 -11128 -15699 4075 -3493 -6389 -3659 1088 331 -8615 12420 11716
251A1716l1130L0327J4968m2404J3201K3690k2511l242N698o86K031r973N081
$$ 11716 -19414 10913 25881 -16523 -3322 20368 -2143 -5385 313 -373 1658 -8315 -3234
264c234K752j1636J7535k684k2934K6910Q107k6224R083J1250r30l541j3686J6362
$$ -3234 -482 -12118 5417 2733 -20201 6709 14816 -11408 -2325 8925 7995 4454 -9232 7130
278G130R480k7527Q491J1796j7482R148J54j5296J4473L791j0582r46K485J6644
$$ 7130 16610 -10917 -2426 9370 -8112 1036 1190 -14106 367 4158 -6424 -7370 -4885 11759
292A1759q976k2138L0295P282l2261J5419J2204j6172O478j410o890P762k875
$$ 11759 2783 -19355 10940 18222 -14039 1380 13584 -2588 3890 2480 -4410 3352 477
305D77o52n888m650K1701j1385k1565K8900K229k2416J4013L587m582N748p566
$$ 477 -175 -6063 -10713 10988 -397 -21962 6938 9167 -13249 764 4351 -231 5517 -2049
319b049M742M790r611R259n444j0644J9915p790j6846J6321q65p192L789n991
$$ -2049 2693 7483 -2128 7131 1687 -8957 10958 3168 -13678 2643 1778 -5414 -1625 -7616
333g616Q896J589j2965J3408K03j0833J6355o139j1139J8216l779r675N521j860
$$ -7616 1280 2869 -10096 3312 3515 -7318 9037 2898 -8241 9975 6196 -3479 2042 182
347A82N783m980j1752J5660j867j3513J2919n384m609J5513j2267m620J6151n620
$$ 182 5965 985 -10767 4893 3026 -10487 2432 -2952 -7561 7952 -4315 -8935 7216 1596
361A596j890Q7l306J5067p882j3992J7251p83r180M745p399O610O829j7892N642
$$ 1596 -294 -207 -3513 11554 3672 -10320 6931 6148 -3032 1713 -5686 924 7753 -10139 -4497
376d497R483q772N397n598l802J8872r738j1887J5162M30k862k223o578J5042
$$ -4497 4986 -3786 1611 -3987 -7789 11083 1345 -10542 4620 5050 2188 -35 -6613 8429
390H429j417j7888J2520K833q203P129r345L98J5517j3025m774J0384k431M419
$$ 8429 7012 -10876 1644 4477 -3726 3403 -5942 -5544 9973 -3052 -7826 2558 127 4546
404D546n829p307J8532m349j4245J2339k17l914L379r325O754O175j3199N266
$$ 4546 -1283 -8590 9942 5593 -8652 3687 3470 -444 2935 -6390 364 6539 -6660 -1394
418a394J910n817J1446q284p689J8174n887q484R451k543K746J47r351J0473l49
$$ -1394 516 -5301 6145 -2139 -9828 8346 2459 -6025 3426 883 3629 3776 -5575 4898 4549
433D549r207R783p217m715J4268j0460m980J2196p055n0K891n659R920k626q815
$$ 4549 -4658 5125 -2092 -6807 7461 -2999 -7979 4217 -2838 -2888 3 -5656 4264 1638 -7177
448g177J2197k618l193R575j1654K21J3266j0239k377L724m936O962n980o164
$$ -7177 5020 2402 -791 8784 -2870 -2649 10617 378 -1999 1725 -3211 3751 -2229 -8393
462h393J4064p111p631J1004m664J905N198j3176P500J0592r117R51j525R27J1044
$$ -8393 5671 -1440 -9071 1933 -2731 -826 4372 -8804 -1304 9288 171 1122 -403 524 11568
477A1568j2553m215J4695r573n053O873n311N146k340j1847J2961L586q616L409
$$ 11568 -985 -5200 9495 -78 -5131 1742 -3569 1577 -763 -12610 351 3937 -4679 -1270
491a270n009N959J1555j5172J89J3400q304j28J671l360Q807q351q822J4262l277
$$ -1270 -6279 -320 11235 -3937 -3748 9652 1348 1220 2891 -469 8338 -13 -8835 5427 2150
506B150o116K484o763R114N050j5607O659O960p793N743k039j598J0875r545l876
$$ 2150 -3966 -1482 -8245 869 5919 -9688 -3029 3931 -3862 1881 -158 -1756 9119 -426 -4302
521d302J1397m998q55M84p492R953r55j1356Q919j062l916P025p768K336R688
$$ -4302 7095 2097 1242 1726 -5766 4187 3232 -8124 795 -267 -4183 2842 -4926 -2590 7098
536G098j2031J191Q807o623M841n46p454R084k219m647O152o670K502N723j1192
$$ 7098 -4933 -3742 5065 -1558 3283 2737 -4717 4367 2148 -2499 3653 -3017 -515 5208 -5984
551e984N461N498j0132O128j01n711J1325o424p695J1572k618k042L506o765O046
$$ -5984 -523 4975 -5157 971 870 -4841 6484 60 -7635 3937 1319 -723 2783 -3982 2064
566B064K693r535N728l41l329P289r249l89J3673j1745l647J1322m328J358l02
$$ 2064 4757 -4778 950 609 -2720 4569 -4680 -5069 8604 -3141 -6788 4534 206 1564 1262
581A262p309J0710Q90r855M878K94J426J783j1318O234Q165j2601K413M654m150
$$ 1262 -6047 4663 5553 -4302 576 870 2296 4079 -7239 -1005 7160 -5441 -3028 1626 -2524
596b524O631p232n596J5780m357r337Q021m17J585J047q844P069M617p443K137
$$ -2524 4107 -3125 -8721 7059 2702 -6635 1386 969 2554 3601 -5243 1826 6443 -1000 1137
611A137l102K071P480j4560N08J5322j1319l948P848m845M478k96q139R378K105
$$ 1137 -1965 106 7586 -6974 -6466 8856 -2463 -6411 1437 -3408 1070 774 -7365 2013 4118
626D118n360K943l696M759M499j1616M947N853r262L807j003n149J0176o109p537
$$ 4118 -1242 1701 -1995 2764 7263 -4353 594 6447 -2815 992 -11 -5160 5016 -1093 -8630
641h630J1571l016m257N332m945L181M947o647L480O45j378N453p552K86J0177
$$ -8630 2941 -75 -4332 1000 -3945 -764 4183 -2464 1016 1661 283 5736 -1816 -1530 8647
656H647j0228j071P950r296L624M269j1333N864N048p445K057q31J824M938q229
$$ 8647 -1581 -2652 5298 -3998 -374 3895 -7438 -1574 3474 -3971 -1914 -2745 -921 4017 -4212
671d212K672P209o905L448l93n857J1417l848j0746J0918m97o085M060n356L079
$$ -4212 -1540 5669 -1236 2212 1819 -4038 7379 3531 -7215 3703 3206 -2879 1181 -4175 -1096
686a096O198j0374J234O004k490J528n190J586J0995r443l741J0207m889P85K054
$$ -1096 5102 -5272 -4038 1966 -524 1004 -4186 -2600 8395 -1048 -4789 5418 529 1314 3368
701C368r032Q870L900j3565L959N412l185R87n778L012P454q815j98N317l213
$$ 3368 -5664 3206 7106 -6459 -2500 2912 -273 714 -5064 -2052 5402 -3413 -3611 1706 -1507
716a507N096l788n794J3167l181r777Q420o40j594L504q439L012P045q102J81
$$ -1507 3589 -199 -5993 7174 3993 -5784 2636 1996 402 3906 -4533 -1521 5524 -2578 -2397
731b397K139j162M322o696k71R855p861j288P187o302M491K984j0698O856M709
$$ -2397 -258 -1420 2902 -3794 -4065 5790 -2071 -3359 3828 -2474 2017 5001 -5697 1159 5868
746E868q228L246o85j328M628o298R71M785o571L536J006o397Q524j169p821Q571
$$ 5868 -2360 886 201 -1127 3501 -2797 -1826 2959 -3612 -76 930 -5467 3057 1888 -5933 2638
762B638j394l239O035o181R59O996p371N44L679m171M204l020m211Q226m051l051
$$ 2638 1244 -1995 4040 -2141 -1182 5814 -1557 -1013 2666 -1505 2699 -321 -4532 3694 -357 -3408
778c408M921m938L940L493j0934O613O267r410L079J618j986N477n742k369Q068
$$ -3408 1513 -3425 515 4008 -6926 -313 5954 -3456 -377 1241 -745 4732 -1010 -3379 4689
793D689m059j125R29m137P836k256r885R840J250o991M411k887J535O446r735
$$ 4689 630 -495 434 -3703 4133 1877 -8008 1832 3082 -3909 502 -2385 -850 5596 -4139
808d139J050Q304n155N8n74j578P963n841n585R115k450k296K174n685O192L279
$$ -4139 -3089 5215 60 118 -456 -2034 5929 88 -5497 3618 1168 -1128 1046 -4639 1553 4832
824D832j1491N343N433n979K485k247l07P472o679k510O931l218J201o91n293
$$ 4832 -6659 -1316 4117 -1862 623 -1624 -1931 5541 -1138 -3648 3283 65 1266 575 -4718
839d718Q995j388q910P577j51l579M630n468Q61P003p399O44M164l624L673k263
$$ -4718 4277 2889 -6021 1556 1405 -2174 2456 -3012 -2151 4852 -2547 -1903 2261 -1363 2310 47
855D7l464Q117m096l598O153m661J213M308q833L999M393p008L660j88l429O946
$$ 47 -3417 4700 604 -2994 3159 -1502 -289 4019 -4814 -815 3578 -3430 230 42 -3387 3559
871C559m080l299O997l629K88K379n434N827J430q252N725L98l571M984n890q10
$$ 3559 -521 -3820 3177 -452 -164 2215 -3219 2608 4038 -4214 1511 1909 -1662 3322 -2568 -3378
887c378Q547p126k293N717k916K322j247m318Q125j360n581N239j393J106L245
$$ -3378 5169 -1957 -4250 1467 -1449 873 -374 -4692 3433 2073 -3508 1731 338 1444 4689
902D689r013M140P470r661K96L314k430L962n152l491R440l311m418L808j817
$$ 4689 -4324 -184 7286 -2375 -2079 1235 -1195 2767 -2385 -5876 3564 253 -4165 -357 -2174
917b174M235N9p935P856L404p563L517q37nN697q709r05R056n650k610K181k542
$$ -2174 2061 2120 -5815 2041 5445 -2118 1399 562 557 6254 -2455 -3360 5696 46 -2564 -383 -2925
934b925N034k599n860P887o48l791L544l578L689M820r396L414O028o279K373
$$ -2925 2109 -490 -6350 1537 889 -2902 642 -2936 753 5573 -3823 -409 5619 -660 1713
949A713k12l221O187m213m441O582k892j390K054m582M828J633o838M835Q04l226
$$ 1713 1501 -1720 4467 254 -4187 2395 -497 -1887 167 -4415 413 2046 -4792 43 847 -2379
965b379O055m459j548Q146n789j453N165m379K246N48n678N189l86m389L977l719
$$ -2379 3676 -783 -2331 5815 26 -1427 3738 -641 1605 2153 -3525 1664 1278 -3111 866 -2853
981b853O80O136p946R75O554n427J995J055l736O883k447n601O914j393k505K772
$$ -2853 -2173 3963 -3983 -3008 3546 -1881 114 1169 -2567 4316 1869 -3732 3182 1789 -716 2056
997B056n095L685L626q393K420L187l091K992l958q64Q825o152l680P552k792
$$ 2056 -3039 646 4272 -4121 -1701 1486 -1605 1387 -2571 -3435 5390 -762 -4442 3110 318
1012C18L34J092n114N998J130p460L778J095j166K503o729K495P128p998n85M826
$$ 318 652 1744 -3370 2628 3758 -3702 76 1171 5 2508 -4221 -1726 5402 -2596 -3181 1645
1028A645k844L099k217l949Q352k144n643N418j298N50J714o692M493M135p432
$$ 1645 -1199 1900 -317 -4266 4086 1942 -3701 1717 419 969 2683 -4009 484 4619 -2813
1043b813K144J036j625M507n630j436Q035n010k055M837l551K914P77o123O203
$$ -2813 -669 367 -1258 3249 -2381 -3817 4218 -792 -2847 1990 -1561 1353 2130 -3993 2210
1058B210O29m713L766k399l7M584o712M61N498n305J234J407m049M964j374m032
$$ 2210 2839 -1874 1892 -507 -544 4040 -2672 -2211 3287 -2018 -784 623 -3426 1538 164 -3868
1074c868O211k138j619M444n166K125M705o397K058K199l901L866k733l183O345
$$ -3868 2343 205 -1414 3030 -2136 -11 4694 -1703 355 2554 -1347 2519 -214 -3397 2948
1089B948l728k100M232l846J885K192o294M636L311n285L099r05o62N607n844
$$ 2948 -780 -2880 1352 -2494 -609 1583 -4711 -75 3236 -2049 1050 145 -517 5090 -754
1104g54j337P057m745q95J893l811M570j267n983N951J99l381K677l541K839M760
$$ -754 -2091 4966 221 -674 1219 -2592 1978 711 -5272 679 878 -2503 174 -3367 -528 4232
1120D232p795K140N841m463R22k74k063O487m162m607O341j666j850Q72l918M794
$$ 4232 -3563 -1423 4418 -45 877 603 -1460 5027 865 -3742 2599 933 -917 -45 -3963 831
1136H31J424p420M170K471l189K890l080N97O827o227j768O197l172M34nl612
$$ 831 2255 -5165 -995 1476 -1713 1177 -1903 -1306 5521 -706 -2474 3723 551 985 980 -2632
1152b632N378j224n385M325p49r70K589n316L133M668p095J929L430l488L565
$$ -2632 2746 1522 -3863 462 -287 -1257 1332 -3984 -851 3817 -3278 -1349 2081 -1407 2158
1167B158j408l322O280k487k972L879k691J072J425n404L747J477n086L784j237
$$ 2158 750 -2572 3708 1221 -1751 2128 -563 509 1934 -3470 277 1754 -3332 452 -785
1182g85j921N818m562j577O176l578J19K685m178L641J144n455L683o9j748K770
$$ -785 -2706 3112 -1450 -3027 3149 -429 -310 2375 -1803 1838 2982 -2473 1210 1141 -607 2163
1198B163m668J023M882n950N31L360l922L649n32m847O730l20n023M008l88L46
$$ 2163 -2505 -1482 3400 -2550 -2019 1341 -2581 1068 536 -4311 2419 2099 -2924 1084 696 1042
1214A042J839n526K923L401n154J503m3j292M302m922k486Q024l717k931L741
$$ 1042 2881 -2645 278 3679 -1475 28 -15 -1307 2995 -1927 -4413 3611 -106 -3037 704
1229G04k290K984N27n686M692K476m589J680p87J087K965o462P52N735m804K98
$$ 704 -1586 1398 1925 -3761 931 3407 -1182 498 -289 798 3763 -2699 -1947 3788 -1016 -718
1245g18Q39k967N462k175n392O470K77l690K615j956K095K030n666K517L188l652
$$ -718 121 -2846 2616 441 -4951 1519 1796 -1894 721 -1235 860 2890 -2776 -259 2929 -723
1261g23K069k189j104O013m795k669N915l165q01K722l933L185J543n330L467
$$ -723 1346 -843 -1947 4066 -729 -3398 2517 -648 -1449 1273 -2660 525 2068 -3262 205
1276B05Q50j754K689l535P47M469m805N41K898m184L592r7m992M914m08l985L610
$$ 205 1055 -699 1990 -1545 -798 3671 -1134 -593 2305 -1879 1713 1616 -3376 1538 1130 -2855 755
1293G55j619m97L290m214J053L295l041J784o19j920N367k857l374N385k462j049
$$ 755 -864 -1361 1929 -2285 -1232 2063 -978 806 187 -1733 3634 777 -2597 2788 326 -723
1309g23K576m438K466K837o094J906K528k420J808k307o5N218l915j056L939k288
$$ -723 1853 -2585 -119 2718 -3376 -1470 1058 -1362 446 -1861 -1926 3292 -623 -1679 2260 -28
1325b8J995k61m613N667N34o444L502L04j437J826m294J390M296m458J0K181j197
$$ -28 1967 1706 -2907 2760 3294 -3150 352 656 -781 1045 -3249 -1859 2437 -2021 -2011 170 -1027
1342a027L189k549k334O930k580l182L887k082P72J520n560K841L246n401Q51
$$ -1027 2162 -387 -2721 4209 1629 -1553 2334 252 1024 2544 -3016 -175 3071 -2330 -1479
1357a479J071r07K618l541l30N047l058m59K297k601L672k67m973N021N87m309
$$ -1479 -408 -1315 1303 -2238 -2568 2479 -579 -1038 1259 -1342 2330 2063 -2910 2111 2698 -1611
1373a611K813j301n68K864m413N84L010l023J085Q2j713L935j964k309M895k268
$$ -1611 1202 -99 -667 2197 -2216 -1632 1378 -1645 -560 -478 -2191 1744 -220 -2529 2366 98
1389I8q06L348l927J653K906n010J616J769k711K207j788j594M036k641q11K563
$$ 98 -708 2640 -1287 366 3272 -1738 -122 1647 -1064 1143 -645 -2239 1797 -844 -1655 908
1405I08k880K509R01m602L975J441m288L065n46j344L823l436j109M076k493l11
$$ 908 -1972 537 1438 -3164 811 2252 -2036 1029 483 -861 2962 -474 -1583 2493 0 -311
1421c11P32k158L624j504l692M531p60k026K490l014J932L494n588J114L993l153
$$ -311 421 -1737 1887 383 -3309 1222 462 -1564 926 -2088 -156 3338 -2250 -1136 2857 -296
1437b96M20J93j157L691k521k754L854j470j19K47l329M379P65n684L620J700
$$ -296 124 317 -840 2851 330 -2424 1430 -40 -159 88 -3241 1138 1903 -3781 -161 1539
1453A539k643K094j942l9M524l822j504L808j390K96r14k064M279j647l548L518
$$ 1539 -1104 990 -952 -991 3533 -289 -1793 2015 625 921 7 -2057 2222 575 -2973 545
1469E45j205k50K101l911J992L676n026J064K722k107J925j380j538L908j828
$$ 545 -660 -910 1191 -2720 -728 2948 -2078 -1014 1708 -399 1526 146 -1392 2516 688
1484F88j560K063k196J634L42m061L524Q49m107L116o97j391L946k848j278M085
$$ 688 -872 1191 -1005 629 971 -3090 434 1283 -2824 292 -405 -1796 2150 -698 -1976 2109
1500B109j988m4J148k031K477l42k779K930j232j276K658l506P63L660m712M29
$$ 2109 121 77 1225 -806 1671 1329 -1450 1480 248 -1028 1630 -1876 -1113 2547 -2165 -1736
1516a736K977k534J664j12k486L970n07k316K154r42J100O62l905K618J871m250
$$ -1736 1241 -1293 371 259 -2227 1743 1236 -1080 1074 132 1232 1894 -2011 607 2478 -1772
1532a772J739M6j507L535l445k191N650k108j713J980j120K167j48l259L298J019
$$ -1772 -33 13 -1494 2041 -1404 -3595 2055 -53 -1766 214 -906 1261 1113 -2146 1152 2171
1548B171k500J403j748J053K798n338L52M503l475k11Q15j933L254j034l182L981
$$ 2171 -329 1074 -674 379 3177 -2161 -1809 2694 -781 -992 -177 -2110 1144 110 -3072 909
1564I09J55j679R95j551K597J170m565K234J866k639J760j724j194M448l412k140
$$ 909 1064 -615 380 -1171 1426 2596 -1969 265 2131 -508 1252 -472 -1666 2782 -630 -2770
1580b770M147j747q23J430k127K499N48k831K213o5n70J991k946Q80L438m266
$$ -2770 1377 -370 -1193 237 -1890 609 1157 -1674 539 474 -96 1895 -1051 -171 3267 -999
1596i99N26K163l019J730J27k921L062l3k450J986j044O03J456k864J701J736
$$ -999 -473 1690 -1329 401 528 -2393 669 636 -1814 172 -872 -269 1187 -1677 24 1760
1612A760k725J893o45j557L892k183k311L751j908r79J968k608J258K024l553
$$ 1760 -965 928 283 -1274 2618 435 -1876 1875 -33 -1012 956 -1652 -394 1630 -1923
1627a923J236J078r57J550k290L82L737l369o28K930k178J486J69l360L481L75
$$ -1923 -687 391 -566 984 -1306 -924 2813 -556 -1184 1746 -432 1054 1223 -2137 1344 1719
1643A719l646J957k6k94J162k790J056K909l252L83J134r26K322k031j683M744
$$ 1719 -1927 30 4 -290 872 -1918 -862 2047 -1205 -822 312 -614 1708 -323 -2006 2738
1659B738j820k394K470j358Q99R78l722J896K216l267Q10JJ41J917l113N6L572
$$ 2738 918 -1476 994 -364 535 1513 -2209 -313 1903 -1364 -554 -553 -412 1505 -1608 -1552 2020
1676B020k660k16J887j994K290j12l536L476K29k353J418o74L9J678l233R44K152
$$ 2020 -640 -856 1031 -963 1327 1215 -2321 1155 1384 -969 449 -225 -186 1492 -1741 -797 1355
1693A355k464J062o7j549L233j795j771L585j520n62K058k435J121J710l257J382
$$ 1355 -1109 -47 -114 -1663 1570 -225 -1996 1589 69 -493 1565 -870 251 1961 -1296 86
1709H6R23j749J619j577n68K753k391l19K109k324J738Q86l150K414R29k619K053
$$ 86 1009 -740 879 -698 -1266 1487 -904 -1223 886 -1438 300 1186 -1964 450 1379 -1240 813
1726H13m83p35K491k719j27K662k293J73N70k138K979r95k745L318n97j077J491
$$ 813 330 -405 2086 -633 -760 1902 -391 -218 352 -1786 1193 198 -2547 771 174 -903 588
1743E88k090J530K179l699J063K339j826P56r09q02L188k288j782K985j367l5
$$ 588 -1502 28 2207 -1492 -429 1910 84 840 -69 -871 2317 29 -1753 1232 -135 -170
1759a70L66k533K736J053l760K191J049j312J256j871O14K978l080l07K112j390
$$ -170 196 -2337 399 1452 -2308 -117 932 -380 876 -995 -381 2597 -483 -790 1322 -68
1775f8Q59n44j862L151q48k865K465n24j00J097k843J897K375l350P48J170r71
$$ -68 791 247 -1615 1536 688 -2177 288 -236 -336 761 -2082 -185 2190 -1160 -412 758 -213
1792b13J808j646j125L483j948j409J774j455J058L87k915K389Q71k807J841l42
$$ -213 1595 -51 -1176 2307 359 -1050 724 -731 327 714 -2201 188 1059 -1748 93 -249
1808b49n52K363k404m2K602k246N86Q83j892K209k13k518K461n43j235J593k111
$$ -249 -801 1562 -842 -884 1718 -528 58 941 -951 1258 1045 -1473 988 445 -790 803 -1308
1825a308O59K222k866O11J428j717J632p98j459L147r78j614J829j024P57Q96
$$ -1308 -649 1573 -1293 -682 746 -971 661 -137 -1596 1551 573 -1041 788 -236 521 1417
1841A417k970J646J652k935J228k20o80J991k139q49L253j590p09J300j340K111
$$ 1417 -1553 93 1745 -1190 38 -182 -862 1129 -1010 -1859 1394 -196 -905 395 -945 1166
1857A166l20k767K556P80k090J288j135P06J806l309L55K726k149K02n6j172K731
$$ 1166 846 -1921 635 1415 -675 613 -522 184 1990 -1319 -964 1762 -387 -185 -241 -1413 1318
1874A318j309k364L261m08j147J171j603J660J364l460J665J392j813J079j467
$$ 1318 9 -2355 906 498 -649 522 -1081 579 1943 -1517 148 1540 -273 806 -661
1889f61r8K657k449j135K753j578L22L18j848K351M02k801K202K22j036J639j928
$$ -661 -759 1898 -551 -1686 1067 -511 -189 129 -1719 632 1034 -1767 435 657 -379 1260 -668
1906f68L65K355k600K40J270j700J531o77j897K818p89j667J841j051J41J588
$$ -668 -303 2052 -548 -308 962 -738 793 116 -1781 1037 248 -1419 422 -629 -488 1100
1922A100k451J133J638k160J215j70j076K248j518r46K404j547j22R49k227J600
$$ 1100 -1351 -218 1420 -740 475 305 -771 1477 -41 -987 1417 -130 -252 697 -1530 70
1938G0R63k943J548P31j337J602j254j42K626k341j31J870j532J107q8k240K703
$$ 70 1033 -1910 -362 369 -968 634 -620 -762 1864 -477 -608 1262 -270 837 749 -1491 1212
1955A212k60k324J758n86k51J293k545R84K183k746O66J174r95J628j513r61L044
$$ 1212 952 -1372 386 -200 -451 842 -1703 -719 1464 -1282 -616 558 -437 1191 -322 -1283 1761
1972A761j396j069J386j001R98L75l169K247J092k401J016p3m80J935k328k16
$$ 1761 365 -704 682 -319 679 1054 -2115 132 1224 -1177 -161 -234 -714 1221 -1107 -1323
1988a323K740j789j08R25j071K107o26k575L121l38j899J545j314N22J730l213
$$ -1323 1417 -372 -480 445 -626 1481 855 -1720 1401 1063 -836 709 -605 -83 1647 -1566
2004a566O82K229k260P21o5r34K409j500j005K489j409J67J277k327J616J082
$$ -1566 -884 1345 -915 -194 -259 -1193 1216 -284 -1289 1200 -209 -42 1235 -1092 524 1606
2020A606k783J618K59j551J611j072p40K044j791o6J391j378J120M10k067K194
$$ 1606 -1177 441 700 -851 760 -312 -1052 992 -799 -865 526 -852 268 678 -1389 805
2036H05O5j724J870j141k72K065k348lK486k237K51N00j269J814p87j631K192
$$ 805 870 -854 1016 -125 -397 1668 -680 -683 1803 -434 -183 317 -952 862 75 -1556 636
2053F36q05l12J066j903J531J357k820J269J367j844J088p19q84K653j650j342
$$ 636 -169 -481 585 -1318 213 1570 -1250 19 1386 -458 630 -89 -973 1680 30 -1312
2069a312K093r77k6M02j763K330J17k632J976J15o61J214j889N55K631k610l35
$$ -1312 781 -196 -222 180 -1583 747 864 -1768 208 323 -338 876 -1013 -458 2173 -437 -772
2086g72J647p95M47n43j235K415o03j855J624p26M46O57k634J871J687k879J119
$$ -772 875 80 527 -16 -1251 1164 561 -1294 330 -396 50 707 -1927 -56 1631 -1248 -129
2103a29O72j054J567j100j090K856j479j046J338r98J180r4k343K243J23j791
$$ -129 543 -511 1056 -44 -1134 1722 243 -803 535 -463 717 623 -1720 523 646 -1145
2119a145J403q37j04J911k248K46K142j875M34Q82j431J675n88j512J804p86m40
$$ -1145 258 -579 -683 1228 -1020 -774 1368 -507 -73 809 -622 1053 465 -1047 757 -29 -469
2136d69J127j567P68J338k557J060R91j791J601m89j374K399q44j029J656r04
$$ -469 658 -909 -141 1197 -1360 -300 691 -1100 501 12 -1362 1037 193 -836 820 -84
2152h4L73Q08k102J346P45k001J169l24l77J781k202m22K644j920j79J112j242
$$ -84 289 1097 -1005 341 1086 -915 254 -70 -447 1334 -868 -1290 1354 -566 -745 367 -875
2169h75J628j22k202K022L41r90O21r45P54J342k648N05J666j709O92l35r23K340
$$ -875 753 631 -1571 451 792 -198 423 -522 232 1574 -1074 -569 1097 -612 80 -255 -1178 1162
2187A162j064j865K241k07p34Q07j372J603O92k370J281N78r52R89j207j85K266
$$ 1162 98 -1767 474 267 -467 340 -1032 571 1263 -1107 174 752 -200 789 -418 -603 1663
2204A663k348m57K007j436L75N84j850K060J19j969J614l05j58R18j499O43J720
$$ 1663 -685 -1142 865 -571 -196 388 -1462 598 717 -1252 362 57 -101 817 -682 -39 1681
2221A681k483Q01Q82j644J522o87j351K221r04j045J346q84L00J019j917J248
$$ 1681 -802 -1 881 -763 759 72 -1279 942 38 -1007 339 -545 -245 774 -1143 105
2237A05R33j677J092k81q25K131j432p84K078j692MJ126j916J355O19k354J393
$$ 105 1038 -639 453 172 -653 1478 46 -738 1340 -352 -348 778 -1138 217 836 -1518 -125
2254a25K85q27J112r83J20J719j756J24J123j189R25j0j805K344l67j731J552
$$ -125 160 -667 445 -538 -418 1301 -455 -331 792 -397 528 518 -1287 1057 690 -1041 511
2271E11o56k14J049k180J080J514j928O80L92p36J623j326p61K591j418o27J214
$$ 511 -145 -359 690 -1490 -410 1104 -824 -144 248 -488 1135 -191 -952 1639 221 -406 808
2288H08j180Q62L06k175J531P60j878R81k12k35J297j746J63J895j594L55O05
$$ 808 -372 490 796 -1379 152 912 -966 15 -197 -432 865 -881 -718 1177 -417 -62 543
2305E43j205J719o22j681K139j47j302J220j079O16J062k222M91J304j488O10
$$ 543 -662 1057 435 -1246 893 746 -556 664 -415 201 1263 -959 -468 836 -652 -42
2321d2k19o79J938j341o23J886j107j17R66j398J246N48j979J371j3r29J073r25
$$ -42 -261 -940 998 -343 -966 920 -187 -304 662 -736 510 1058 -921 450 437 -492 581 -344
2339c44q6J408j746K87R93j434R93J73j382J791k21j315J513p70k44J603j653
$$ -344 -430 978 -768 -481 512 -922 71 244 -1138 653 432 -883 630 -140 -384 1219 -434
2356d34K84J317j508N96J45j075J372q54j098J791q40k88J101j458R27J099k069
$$ -434 -150 1167 -341 255 400 -675 697 -157 -1255 536 -304 -592 509 -949 -22 1077 -992
2373i92R41R57j095R39q24j88J770j592o07J301j067M65k2j345J550L35j988J645
$$ -992 -51 906 -189 750 -74 -262 1508 -84 -691 610 -457 8 -14 -1359 191 526 -1462 183
2391A83o3l64R23j264L73J612j643oR17r09R42p08j047J855m74j304J311p93L51
$$ 183 120 -244 679 -585 -212 1400 -243 -249 668 -241 701 -7 -1054 801 327 -977 334 -459 -108
2410a08P39k088J289J412j918O07M07p14J248j194l71J820j046m30J010j257J096
$$ -108 631 -1457 -168 1244 -674 -67 340 -374 874 -320 -691 1129 83 -347 663 -594 502
2427E02K7j986J773J08j248J018o50j8J458j481K05J542j588M79J84j017J472
$$ 502 529 -1457 316 424 -824 194 -456 -474 984 -497 -292 1250 -338 141 325 -692 780
2444G80l36j294J708q45m90R56j222O30R21j709O90O64j000J001m19q67J708p02
$$ 780 444 -850 858 13 -477 479 -743 -113 808 -901 -211 453 -547 454 35 -832 876 174
2462A74n31J057r82N21N83j591J040L42j344J069m80o14J470j307j75J544j179
$$ 174 -357 700 -282 239 822 -769 271 613 -731 338 -142 -756 714 -593 -768 776 -403
2479d03K51L35q88J148N2j533J678j78o62P62r96N06J171k044M61R99j021N88
$$ -403 -152 183 -705 443 495 -1038 640 462 -200 562 -434 72 1243 -801 -340 659 -362 226
2497B26m83n31J572r41j017J760p11K7N39j235J145O56j762P82O12r21Q11r48
$$ 226 -257 -788 784 -157 -1174 586 -125 -98 441 -794 351 1007 -755 27 639 -282 529 -419
2515d19p4J537j454l60J236j097P78j74j059J559o8j460J424k26l13Q71j295L83
$$ -419 -493 1044 -410 -770 466 -631 147 -27 -1086 473 405 -1055 369 143 -170 701 -594 -211
2533b11J351j540L95M18r10R39o18o07J448p33o79J041p98N47M23j359J107O25
$$ -211 1140 -400 -5 413 -497 442 -176 -783 665 -68 -747 294 -504 43 466 -893 214 839
2551H39j592J116j8o20J189j142k44J259j089J82N16j104R33K04j629J220j28
$$ 839 -753 363 345 -275 914 -228 -472 787 -302 -120 396 -708 225 429 -1200 20 -108
2568a08o22J168q37R9J193j391M51Q17j003P58l63p46J368o62p75Q87m66J72N82
$$ -108 -730 438 -399 -300 893 -498 -47 770 -233 525 162 -584 784 122 -653 234 -232 -60 522
2587E22j490P18J088j593M53K59l17R43o02o78J575o03m98O08p84R72l7j630J326
$$ 522 -968 -250 838 -755 -302 -43 -360 583 -19 -697 878 275 -223 385 -399 573 536 -1094 232
2606B32K80j304Q24n90K95J043j530J08J333r91K09K74m13J018m51j054J317j81
$$ 232 512 -792 32 -558 -263 780 -750 -642 691 -300 -91 183 -230 788 337 -717 600 419
2624D19p86R47j064O95M75j739Q53O07q42L64n6k80J047q00n70J305o70L28J94
$$ 419 -367 580 -484 211 686 -1053 -200 407 -435 -71 -127 -407 640 -160 -730 575 -95 233 427
2643D27r14J084J05j431R46L0n57Q14j057N8J292j385k0Q91p46O02q1p68J207
$$ 427 -487 597 702 -729 217 247 -310 504 -553 -495 797 -588 -608 283 -463 139 58 -710 497
2662D97j27q29Q95l62j0P66j349N43R55j558O86J95r37J158o06p66J241o83j7
$$ 497 370 -459 436 74 64 830 -519 24 979 -579 107 302 -635 523 -83 -849 392 -291 -308
2681c08P97j272J056K64j126R44K53p01O78q49j26J440j271n37J091o66K00Q3
$$ -308 489 -783 273 537 -589 355 608 -93 585 -264 -390 1050 -221 -758 333 -333 -133 -50
2699e0j054J342P4j042R03l11R8N15r14O34R11j489J79Q03q26Q18m66q88J396
$$ -50 -1104 238 312 -730 173 -138 -40 475 -439 195 1106 -383 -204 599 -227 591 125 -763 633
2718F33m93r24P86l98N58J97j349J065N41j225O71O7l96J221j254j20J444j088
$$ 633 140 -784 2 -396 162 359 -990 75 616 -609 62 129 -267 954 -300 -420 1024 -64
2736f4j81Q19q94O44j02j152J240j72o34P01o28K39J051j433L38R17r19L14L46
$$ -64 -245 574 -320 324 222 -930 310 138 -496 205 -423 -184 867 -566 -228 689 -230 84 430
2755D30q87J156m94p39J020m63q9N57r36L52M16j045P97O2q52R61m05m80J248
$$ 430 -457 699 205 -534 486 23 -66 491 -445 -93 323 -722 75 137 -715 246 -159 -639 609
2774F09n58k52Q46q21L65L89r39P55L8q21N09l71J61N21j166K20J008j013K89
$$ 609 51 -201 645 -176 189 578 -361 394 432 -389 120 -251 -90 431 -735 -515 493 -520 -231
2793b31N01r36J106j3j074J228P8q66O49o33K43P00j232K88O21p93M42j50o88
$$ -231 270 -666 440 427 -647 581 659 -207 442 -191 52 752 -480 -192 429 -364 78 -72 -760
2812g60J388q20n66J086l04q1M22o56N83O22j357N97K43m93M61q37K7J294j389
$$ -760 628 -192 -758 328 24 -57 365 -291 292 914 -443 154 397 -96 365 -472 -445 849 -540
2831e40q3R70q80N74J1q68J260j06j026J070M3k95M69j004M16P96j116K34L33
$$ -540 -623 347 -533 41 52 -816 444 338 -688 382 425 130 599 -405 11 807 -309 -75 258
2850B58n98O79l14q99J452p10n02Q52n77J83N41j023P34M26q68P47l07k79R90
$$ 258 -340 339 25 -874 578 -132 -634 218 -359 -176 365 -658 76 502 -366 381 74 -205 785
2869G85j063L5Q52r79K68L25q85Q63O2j278J285j94o26Q10n09q1R17r44L40M47
$$ 785 -278 -243 609 -370 -102 223 -662 201 263 -1015 270 76 -550 260 -249 -330 587 -357 -17 430
2889D30o45P00l13o32J171n32p83R39n93j50P60j132N88O04q79L11ll6Q73q44
$$ 430 -215 485 172 -460 711 179 -604 335 -258 -408 352 -780 -192 412 -467 -156 -159 -195 678 -166
2909a66k71J135o33k1L64n32M60K43j246R24J48r89O54k80j94Q55r59J05J038
$$ -166 -437 698 65 44 408 -124 336 579 -667 257 405 -584 70 -210 -404 451 -508 -403 635
2928F35r13L85J2n13J108m68p02J077n17k84O45q01K61M57j023L69P09p75K27
$$ 635 -278 107 119 -394 714 246 -456 621 104 -180 465 -336 -75 382 -641 -272 437 -338 -111
2947a11j72j21J178r34k39P80m82L55K08q90Q15K24j157P06N3m75O90q24O5Q21
$$ -111 -283 -404 774 -160 -399 381 -101 254 462 -428 387 611 -546 160 213 -262 428 -396 -331 490
2967D90r59J21L88l75N65k76m73J143m45n69Q08o28Q8Q21j054J61Q42r17K62J27
$$ 490 -469 -348 40 -335 230 -46 -519 624 179 -390 418 -210 -122 699 -355 -194 648 -269 -7 120
2987A20n45O96n83m13J054n49J6L65n82N96M17j173Q73J98p62P06m20j97R76r04
$$ 120 -425 271 -312 -725 329 -220 -204 161 -421 175 592 -581 292 490 -272 434 14 -183 793 -111
3007a11l17Q25p41M03j68m84Q99l9r10Q63j92r4O99r52K64R91j115J04N03m10
$$ -111 -428 397 -344 59 -109 -593 306 267 -643 220 28 -66 633 -319 -55 936 -179 -75 428 18
3027A8L39m69l72R47n36m55O39m50K04M19j020Q29M06q69L61L03l78Q52q35k83
$$ 18 357 -112 -484 463 -73 -528 111 -339 -135 284 -736 93 499 -370 -9 294 -84 768 -67 -350
3047c50J015o31k12M20o83P18j50q12P19K70p95O53o10J72R05j241O02M97p51
$$ -350 665 34 -178 242 -441 277 127 -685 34 304 -491 162 -448 -276 629 -612 -10 487 -264
3066b64M15Rn57J030l32o83P47n72R9M05p26M66J55r37O41N16q09O54k67k49Q20
$$ -264 151 160 -397 633 301 -382 365 -207 -108 297 -429 37 192 -745 -104 412 -397 257 -10 -259 561
3087E61o11q6N68n23L87K9r16Q67K8p33N61k95q7O97j040K00R40j000L25K29m59
$$ 561 -50 -136 432 -91 296 325 -591 276 304 -429 132 -163 -250 447 -593 -393 547 -453 -128 101 -358
3108c58P99j71p69Q13o8l74O36p89L55M74j095L76M82p27O23l12m07R32m36m34
$$ -358 441 270 -499 314 246 -128 508 -281 74 548 -547 -171 311 -416 207 -105 -512 420 -16 -450
3128d50Q30k08k79L50o50N59K46q15O42O3n15O33o47j67J115j260K43O02n90K90
$$ -450 380 172 -107 243 -407 152 398 -417 225 288 -227 406 -241 -408 707 -553 -310 292 -298 -8
3148hJ36p22Q57rp14P40j86J67J33q03K71P67q21J03L12m92M74l65l18R75q03
$$ -8 128 -594 263 254 -460 280 94 261 394 -409 -138 629 -192 -89 223 -269 205 -160 -478 497 -306
3169c06j38P21o09M77J2p01P69K52p35M75j96k40Q62p38k36R04p85J35M12q53
$$ -306 -444 277 -332 145 157 -544 225 477 -258 217 21 -219 643 -95 -331 573 -212 -77 335 -518
3189e18O03L3o58P33k13k15N08n75K83M52n81J94M31p12N10m0o07R17n08o46Q58
$$ -518 85 118 -540 193 -20 -235 273 -302 -19 433 -148 46 477 -235 275 235 -372 545 37 -609 249
3210B49m73Q9M58q94N70M72q48L54L68n39Q19p09k16R00o93J96K23o00N05N4r56
$$ 249 -224 -135 323 -571 -1 471 -377 -23 345 -194 625 -84 -300 600 -93 103 326 -274 231 285 -671
3231f71Q48Q6o37M39l41J85P34j018P9P67n66K35m7l24R13n92o06J015k90m12
$$ -671 177 263 -374 65 -276 -91 643 -375 -296 471 -95 140 93 -231 682 90 -516 499 209 -203
3251b03L49m75L39N43j178L88M21n43M37k69k60J068p61j30P04m70L13M2o80P61
$$ -203 146 -329 10 553 -625 -237 184 -359 78 -191 -451 617 -144 -274 430 -40 273 315 -365 396
3271C96l5q58O18m1j39L47p77K87P22o57j54L65k94M27k03m51O67m7n27P29l49
$$ 396 361 -497 121 80 -59 288 -489 -202 520 -137 -291 74 -220 207 4 -447 220 173 -354 375 26
3292B6o0L19m72J07N38p56K26N1n24R02n63l53P61k56j5M59n48M45J32q01M62
$$ 26 -34 285 -187 -80 458 -298 -72 -21 -545 357 -206 -559 202 -54 -69 390 -158 287 419 -382 80
3313H0L37p06O15k79l86P53n25m0M09o20L23J60p01P83J02o01M41j1j60M25n09
$$ 80 417 -289 326 47 -339 414 -111 -151 258 -362 -39 121 -580 203 305 -296 145 134 -26 399 -110
3334a10%Q15o89j02K32l48N74m28o50J075m20l52N85n37L77K38r28O95L75o69
$$ -110 -110 705 16 -86 146 -202 372 -56 -706 369 -51 -403 182 -355 22 260 -668 27 402 -267
3354b67L69L5k24P12p30o7O29n41QJ17n72P25l1p18P18J8n21M65l42O9N76o89
$$ -267 102 137 -87 625 -105 -172 457 -84 -76 41 -531 194 163 -555 163 181 -340 125 -217 -148 428 -261
3376b61O6O96r42O62k56k28R42o40n24Q90n52J66J74n22K96J95n11K01K87m05
$$ -261 -195 501 -441 221 -35 -263 679 39 -485 405 -147 19 193 -329 -33 162 -349 -148 139 -266
3396b66N32m59k9P84o83j13O59n06J96J19o81N20J96p96P87m91j1N13o13J84M64
$$ -266 266 -193 -222 562 -121 -234 425 -81 115 234 -447 73 269 -527 260 -231 -242 271 -342 -158 306
3417C06o34L30J37m07N88j08n46N77j1l89N58o40K14L20q38N12L25m28L25l93
$$ 306 -328 2 139 -268 320 212 -334 243 232 -157 401 -239 -25 295 -543 -31 294 -134 191 -202
3437b02k34R97n64j72L68j31n2L39o26O30l3o23K39K01k42M18o13M3P52j039L69
$$ -202 -436 561 -3 -175 193 62 10 349 -277 353 320 -303 -64 137 -105 313 -300 -257 495 -544 -175
3458a75K30l80K85P3o10R42j35n70P24m69o8N69o19L86L84q01oJ79k20M09m83
$$ -175 55 -325 -40 33 -577 365 230 -340 384 -85 -153 416 -203 183 567 -234 -240 -61 -281 128 -355
3479c55k69R88m31l31N55m34L84J73p07M57L35m39M19l55L1M39p51J75M67o75
$$ -355 -624 364 -67 -398 157 -277 107 280 -427 30 365 -74 345 -10 21 460 -291 -116 351 -324
3499c24N7L04n94Q14l21l77M07O0j91N62m93J47K21l93O9M76n40L95j71l35O55
$$ -324 -267 37 -557 257 -64 -441 -34 26 -165 397 -96 51 272 -121 -52 424 -116 279 108 -227 428
3520D28m01m07O32n03nO20q45N25J91n71M00p6r7O43m87k18O15n43J29J28k96
$$ 428 27 -380 252 -251 -256 364 -481 44 235 -336 64 -12 -109 534 47 -171 444 -99 30 158 -138
3541a38L40J1o93N64J3n02M57k10j26M81m16R8M19m38L07M9m51O93l51n04O49
$$ -138 202 213 -480 84 97 -405 52 -158 -284 197 -219 -121 298 -140 167 216 -235 458 107 -397 252
3562B52l76J22K20l95K01L01p83K02M57k91L74l74l58R36m28k67O05m02K27o6
$$ 252 -124 -2 218 -177 24 325 -458 -256 201 -90 284 -90 -448 488 60 -207 398 -4 223 157
3582A57m55N52J64q82O76j62k23K75l02N2O65p47J01L35m71N28k2n77N98p3k41
$$ 157 -298 254 418 -464 212 50 -173 102 -200 -148 517 -230 -129 206 -265 263 241 -336 262 189 -52
3603e2K60j74K7K80o25J05M13o72M36O8n12O68m90j05O71n23J52J43j82J48J17
$$ -52 208 34 61 341 -284 -179 234 -438 -2 66 -446 222 -268 -373 298 -225 -73 70 -112 36 153
3624A53l58L37K45n03N21m78N0M09n28M4L28n23K79J59n43O54k27l71N70k74J31
$$ 153 -205 132 377 -126 395 -83 -33 376 -152 -108 220 -303 -24 135 -408 246 19 -352 218 -56 75
3645G5K21n01L23K61m48R2L09m66L10k00l26N17j61l45L61l79L83Q5n84N68R1
$$ 75 296 -205 118 379 -69 23 332 -134 176 -24 -350 167 6 -339 22 -357 26 111 -473 95 186
3666A86m34M25J2j91N86p56N6N53n12p6J96l05M46j26m81M18r4l61O18m64L56
$$ 186 -248 177 189 -2 584 -172 -116 437 -75 -151 45 -260 186 60 -421 -3 -97 -458 160 -304 52
3687E2M26o13J60L93m66L46k79j23L92k94k54L49rr6K42n89L65J19o07M76J30
$$ 52 478 -135 25 418 -48 298 19 -104 288 -6 -260 89 80 -16 226 -363 2 121 -486 -10 120
3708A20l26M37k16k81P70o84j60N74m36M04K12p13K77J03j82K19k64j03O19o57
$$ 120 -206 231 15 -266 504 -180 -340 234 -202 202 414 -299 -22 81 -101 118 -146 -249 370 -287
3728b87J90M10m97J96J64m47M49r6l37M53j16k10L00l45J99K42p62N95J12o84
$$ -287 -97 313 -184 12 176 -271 178 82 -255 198 82 -128 172 -173 26 268 -494 101 213 -471
3748d71M85j11j45M66l45r4K83l48L97Q6m05M60J07o36L28l8j37L64l57N6K79
$$ -471 14 -97 -242 224 -121 -215 68 -280 117 203 -202 258 365 -271 57 19 -118 246 -111 -55 224
3769B24l79O1J37k50L79k44l21O85j18m00L49j96J56J74m42M42J71p94M00J7k54
$$ 224 -155 -94 43 -207 172 -72 -393 292 174 -226 123 -73 83 257 -185 257 428 -366 34 51 -203
3790b03M18l66k75O00l22J47L16m22J13K81p01O47Q3n60M63k54o1L60n66K79K66
$$ -203 215 -151 -426 174 -148 -1 315 -107 6 287 -414 233 316 -244 219 -35 -96 264 -302 -23 243
3811B43m80J64O7l48M83P7n71M92q2k22M29m53J78K49l67J65J20j81K02k39k30
$$ 243 -237 -73 -6 -354 129 206 -365 127 45 -177 252 -201 -23 226 -141 24 144 -37 165 -74 -304
3832c04P69m91k91M75k80J95R1l70L40J12m67L60j58k9K72l15N1L62l50O1Jj73
$$ -304 465 -26 -317 158 -122 73 164 -206 134 246 -221 139 -19 -48 224 -91 -40 322 -28 33 34 -139
3854a39K54M4n74N21o5j70L16m08K38M0j49o9L36k68J10P9l79N61k18m49N31j40
$$ -139 115 159 -415 106 41 -129 187 -221 17 57 -92 -161 175 -93 17 96 -283 278 60 -389 142 2
3876Bj14K29l96K52K38n89N01K4n06L62k38J97L52l97j41N39j33q3J13n07M96
$$ 2 -112 117 -279 -27 211 -378 123 147 -359 3 -235 -38 314 -83 -224 315 182 99 212 -295 201
3897B01p2l87L41n7k77M21n64J57M90m88J94J54l07J68K37n68P58l28j82L16k27
$$ 201 129 -258 83 26 -251 170 -394 -237 253 -235 -41 113 -194 -26 211 -357 401 73 -109 207 -20
3918b0J9K09m00J61J92l03K09Rk30M84l73k18O00m80N9J72k00L28m4n83O31O5
$$ -20 -1 208 -192 -31 161 -142 67 76 -154 330 -43 -261 339 -141 -82 90 -110 218 174 -409 222 287
3940B87l82K98k43P7L84o23K8L31m95L79lm65O21j31k10J96j19J1K93m79K27K81
$$ 287 -95 203 -40 37 421 -202 -174 157 -338 41 38 -427 194 63 -147 49 -70 -59 234 -245 -18 263
3962B63l60P8K85n00L01k01k55O55k23k99M45l19p0L84n20M91K10n15K93k89L6
$$ 263 -97 -19 266 -234 67 -134 -389 266 43 -256 189 -130 -200 184 -336 155 365 -150 143 -146 -110
3983a10L13m41M5M08n05K31K09m88L67P5n14N02P7k97K52k86K79M7l23r7L26j67
$$ -110 203 -238 -193 215 -290 -59 150 -338 29 104 -410 92 169 -128 124 -162 117 164 -159 -256 70 -97
4005i7K82j69k63O13m12j01K37j73O1Q1k33J50J11k89K89m2j16J83l63M9M40l93
$$ -97 185 16 -247 366 -46 -147 90 -83 -22 59 -174 -24 87 -202 87 45 -71 112 -251 -202 238 -155
4027a55Q1J97k58J53J00n21P74k82k97M41l00N6J63m55J57K62l12J81R7m07M81
$$ -155 -74 123 -135 18 118 -403 371 89 -208 233 -67 -11 152 -303 -146 116 -196 -15 82 -325 156
4048A56p0l58N61j38k06M18m29J96Q5n16L56J62m97K54K2m5J92j73k09M89n87
$$ 156 86 -272 289 151 -55 363 -66 130 215 -301 55 217 -280 -26 -4 -49 143 -30 -239 250 -337
4069c37M35J63m26L62J93n02K52j75j75L20l53J81K36m24J11J87l41M42j94j99
$$ -337 98 261 -165 197 390 -112 140 -35 -210 110 -243 -62 174 -250 -139 48 -293 149 -45 -244
4089b44N47m90L0K94j84KK82m17K02K55m13J62J37k10K34l82k46O71m61p0L80
$$ -244 303 -187 -157 137 -47 -45 237 -180 22 277 -136 26 163 -47 187 -195 -441 230 -231 -301 79
4110G9k89L61j03l86O04j06l03L02j33L7K48m92J52K28m71L66Kl23N65l60k98
$$ 79 -210 151 48 -338 266 160 -143 159 26 63 311 -181 -29 199 -272 94 96 -227 338 -22 -320
4131c20N66j43k31J87l14K65J76l53J98J49m17L12q8k78N98j92l88M27l45P6J76
$$ -320 246 103 -128 59 -255 10 186 -167 31 180 -237 75 -13 -291 307 115 -273 154 -191 -115 61
4152F1k51L58J65n62L67j18o6L21m96J58L44m44J35J73m61O35k90m93L90J48r0
$$ 61 -190 168 333 -229 138 20 -46 275 -221 -63 281 -163 -28 145 -316 319 29 -464 -74 74 -16
4173a6M4p7j44L47l93P8M65l96J86j36j65O27l58k72L96j68K4Pk77K30K64n29
$$ -16 28 -49 -193 154 -239 -161 304 -92 94 -42 -207 420 62 -210 186 18 42 49 -228 2 266 -263
4195b63K88J64l55K88j38k11N06l32J1J81k23K06M4l35M33j49k81M02k57K8K68
$$ -263 25 189 -166 122 -16 -227 279 -53 -42 139 -84 122 166 -169 264 115 -166 236 -21 7 275
4216B75o10L49K80m83O0J81r5K68q5k17L59k86n7J96l00K05J57n14K84J58l35
$$ 275 -335 14 294 -189 -129 52 -43 225 140 -77 282 -4 -61 135 -165 40 197 -317 -33 125 -210
4237b10K89j36j66N30n90j41N51k90O9K50m42M86o5m13N46k10j00K61l62N7L61
$$ -210 79 -57 -223 307 -283 -424 127 -163 -94 156 -286 200 135 -278 268 58 -42 219 -143 -86 275
4258B75n69K47K05m48M15Jm37L39pj72J80j82K88j9r4M8K35m06K64m2k65K89j42
$$ 275 -294 -47 158 -290 125 126 -311 28 21 -151 29 -153 135 116 22 70 305 -101 163 121 -144 145 3
4281Cl30N97k33l92M96m11K98o6k92N24j09j56K95k52o3L83l90mL24l20J46l5
$$ 3 -327 270 37 -355 141 -270 28 -38 -330 194 85 -71 224 -28 -91 292 -98 -102 222 -98 48 13
4303A3l32N62j90n01O31l4k74J19j25J37K63n05K35J17l27M71k71j65L27q3m03
$$ 13 -319 243 53 -448 183 149 -125 -6 -131 6 269 -236 -1 116 -211 260 -11 -176 151 68 -335
4324c35M98m5j75J68m13K94J57n11N00j23j31L32l81K2O07o06l2M25l90L37j60
$$ -335 163 118 -57 111 -302 -8 149 -362 138 15 -116 216 -165 -143 464 -142 -174 251 -139 198 38
4345C8l20M69j97j60K52l04m4K78j40Q1J35l44J65K63l09J44J0lL21k60j93K57
$$ 38 -282 187 -10 -170 82 -222 -266 12 -128 -47 88 -256 -91 172 -137 7 17 14 335 75 -118 139
4367A39l99N13l8m02J60K34m02J81k13J13L67l59K7J35k46Q0L28l74L23j22l77
$$ 139 -260 253 215 -187 -27 207 -195 -14 -227 -114 253 -106 -79 56 -190 -110 218 -156 167 45 -332
4388c32N32k31k5J31k31N6K97l90J09K26m12M10j29k68M55j04k32K16j72L27%
$$ -332 200 -31 -56 75 -156 -100 197 -193 -84 142 -270 140 11 -257 198 94 -138 78 -94 233 233
4409B33n28L21J60n19N14k42m3J99k21j33N13k13j42J91j57Q6R6l47M97j92m4
$$ 233 -295 26 186 -333 181 -61 -104 95 -126 -259 254 41 -101 90 -67 19 115 -232 265 73 29
4430B9M0j29O9K43m35J91P6k39J46J6l32M94j32l00M23j46j56K73l03K63M1k40
$$ 29 69 -60 9 252 -183 8 84 -155 -9 7 -325 169 37 -263 160 14 -142 131 -172 91 132 -108
4452a08L1K24k12J58l3j32L16l00K4J14j82K3J12k77L13M9l98M26l3j96K67j54
$$ -108 -77 147 -65 93 60 -72 244 -56 -32 82 -100 -77 35 -242 71 120 -278 148 115 -81 186 32
4474C2j45M10m74J48J27k56P3J85n06N45k1j86J91l15L34j07m32L90J30k27L6
$$ 32 -113 297 -177 -29 98 -158 -85 100 -406 139 118 -68 123 -192 142 35 -397 -7 123 -104 -68
4495f8Q4j39M43j95l42K89j94L7J23k08K77l1m24K55l0q7M40o4j99K26k44rL57
$$ -68 16 -123 320 125 -217 72 -122 -85 38 -170 107 76 -348 -93 -123 -210 230 166 -33 193 -51 -60 297
4518B97m82K65K17n57L46j57j63K74p6l1K29m34L47J48l11J30p6m9L56k31k04
$$ 297 -185 80 297 -260 86 -71 -234 40 -36 -67 162 -272 75 223 -88 42 -34 -83 273 42 -162
4539a62K83j54L5J87j75J88N9m05K15P2j89N9j85K7M08m79O4M18l35j03L07k63
$$ -162 121 -33 2 189 14 202 261 -144 71 143 -46 13 -172 -145 263 -216 -152 266 -69 -172 135 -128
4561a28K61L4l92M43m9j11l2k07R8K58k59o7J36Nl3L0l73M62Q3k95J93r7R3j7
$$ -128 133 167 -225 218 169 58 26 -181 -83 175 -84 -151 -15 -10 -43 -13 -386 76 159 -136 57 -40 53 36
4585C6l25L52L6k12K68p4k62L73j77k01K74j5j61J81k73J76K71n12L93R2m92M85
$$ 36 -289 63 99 -113 155 81 -181 192 15 -186 88 73 -88 93 -180 -4 267 -245 148 240 -252 233
4607B33m25O0M00n08K02R2q3K01p3k40K51k02j46L39r5j76L11k17L9L20m67J79
$$ 233 -192 -132 268 -240 -38 54 -29 172 99 -141 110 -92 -238 101 6 -170 141 -76 -37 283 -184 -5
4629eJ38j74J80j18j91L20j94K5J93k82J08J29m54J99K12k72K52L4j88L87n03
$$ -5 133 -41 139 21 -170 150 -44 -19 174 -108 0 129 -325 -126 86 -186 66 100 -88 299 -204
4650b04P2L29k49k9J13j25J92o4k11M03j06k24K63l80P6L43l63J75K67k00j91
$$ -204 -132 197 -52 -81 32 -93 99 35 -176 227 121 -103 160 -220 -144 199 -164 11 278 78 -113
4671a13J94j86L36l35oL57k32M7rk97J89L09o10M28J0k64K92j59j32M01k68l2
$$ -113 81 -105 231 -104 -110 247 15 62 53 -244 -55 254 -356 72 82 -182 110 -49 -181 220 -48 -80
4693h0J70o3J34nl36L94L8l56L65k51m4K50n21K56K25m10K19j8l08N46l81k3L49
$$ -80 90 27 161 156 -180 214 252 -104 261 10 -34 216 -305 -49 176 -234 -15 -33 -341 205 -176 -199 150
4716A50pl21J88j3J00J57n65K67J39k84J00R1j42L18l37P4L12l26k8J32j72L25
$$ 150 143 -178 10 -3 97 254 -311 -44 95 -189 -89 2 -140 178 -159 -85 227 -99 -127 5 -167 158
4738A58j92l38O23l0k44O9p0j2O6L4j80L41j36j11Q4j70L21k47k12K96mJ5Q9m24
$$ 158 -34 -372 251 221 -23 46 -24 -36 30 64 -116 225 89 -22 62 -108 213 -34 -246 50 46 61 150 -274
4762b74L66J73n84M35K6k22J59m9j83K80l35N8K96k31P5R3l29K41K4l1N8p4J64
$$ -274 92 265 -319 116 142 -80 79 30 -153 127 -208 -150 146 -85 -10 83 -246 -5 19 -12 46 -28 136
4785A36q8q0J2K80k72mJ31j97K39k37o9K54k34p7K89k09LJ56l98M50P5j49k4J38
$$ 136 48 -32 -20 260 -12 -16 115 -82 157 -80 -149 105 -129 -206 83 -126 -123 33 -365 85 160 11 -13 125
4809A25m24N28k29j72J72m7J03R0r3J37j35l27L62M3k67J98j37N8K35k81P8M2
$$ 125 -299 229 0 -172 0 -47 56 146 53 190 55 -272 90 133 -134 64 -73 -15 220 -61 17 59
4831E9q0R8l6m1K10r1k87K54j28m5R1k45K09K70m20K13J29l10L80k00l4J53p2
$$ 59 -21 77 41 0 210 119 -168 86 -42 -87 4 -241 -32 238 -182 31 160 -150 230 30 -4 149 77
4854G7Q5n8j26K98k04m38M87k34J2J31j8r5J85j18j9K61k86R7m7k11K59L0l53
$$ 77 162 104 -22 276 72 -366 121 -113 -101 30 12 -83 102 -16 -35 226 -60 37 -10 -221 38 68 -285
4877b85L75k9j85K65j66j5J84j95J03J29k42J5J27j69J01j17j26J91j01K52j2
$$ -285 90 61 -124 141 -25 -40 144 -51 52 181 -61 -46 81 -88 13 -104 -230 -39 -140 112 100
4898A00l88L66M5k77K22P9l38L24l35j7K86j52p7L40k65O9J26k91K92l5j47J65
$$ 100 -288 78 123 -154 68 147 -191 133 -202 -219 67 -85 -162 178 -87 -18 108 -183 109 74 -73 92
4920I2j35LK89l51J58K06k39J6K1k32K03k20q2L21p5k1K20l06J77J43l81K90P9
$$ 92 -43 -40 249 -102 56 262 23 39 60 -172 31 -189 -271 50 -25 -46 174 -132 45 188 -193 97 176
4943A76l64K39J80l47L12k94p5J99j68J12n9oJ82j09m8O3N9O6M0l16J41J69k55
$$ 176 -188 51 231 -116 196 -98 -173 26 -142 -30 -89 -95 87 -22 -70 -7 52 118 158 -158 -17 152 -103
4966a03K08r1j76M46k46j22J75j61l4J39k20K32J63m11K55p5k78L24J47k14J27
$$ -103 105 14 -162 284 38 -84 91 -70 -104 35 -185 47 210 -201 54 -21 -299 25 172 -42 85
4987H5m7oJ90k59N0K03l09K29k46o6J98J5P4R0l12N6J31l76J45J97j04J71j83
$$ 85 38 32 222 -37 13 216 -93 136 -110 -176 22 37 111 201 -111 -55 76 -300 -155 42 -62 109 -74
5010g4l1K5p3kM24m46J73o7j79J14K60l43K91j07J5P4j17M8K29k47Q0k1K8J68
$$ -74 -105 -80 -153 -155 269 -177 -4 -71 -250 -136 124 -219 72 -35 -20 54 -63 -15 214 -33 47 26 54 222
5034B22j88r5J52rj92K49k08N6J80l55J55M5j52J34N3k24K90o7j97M29j69j97
$$ 222 34 -61 91 82 -110 139 -69 -13 167 -188 -33 12 -140 -6 47 -177 113 46 -151 278 109 -88
5056h8J66n7l4K3k27J78J75q9j01J50k60J72j8n8K10j57k0J32k01N3L22n39L18
$$ -88 78 21 -13 10 -217 -39 136 47 -54 96 -164 8 -10 -68 142 -15 -35 97 -104 -51 271 -268 50
5079E0M6j07J41k53J17n9J03k13K39k04O8J13l44L52N9k16K93l09J38L27m33J12
$$ 50 96 -11 130 -123 -6 -65 38 -175 64 -140 -72 41 -303 49 108 -108 185 -124 14 341 -92 20
5101B0K16k86PR6j74M00m43K2J79p7Q4j90K1Q6K45m92K54%j20K78j79k2K45j96
$$ 20 236 -50 -43 53 -121 279 -164 -142 37 -40 44 -146 -125 -39 206 -286 -32 -32 -152 126 -53 -75 170 -26
5125b6M9J52k37O2P4k03J58j59k59L99K7j67J83j07r1J42j55J44J41k14J74q1
$$ -26 23 175 -62 0 74 -129 29 -130 -389 10 37 -130 53 -54 -145 -3 -158 -14 127 -87 87 6
5147Fj05L11k07k13K11q1M9k9k14J68J72k19J96P0l43L39o7k1R6k49J05K19k30
$$ 6 -99 212 5 -208 3 -78 -29 -58 -272 -104 68 -151 45 115 -228 111 44 23 119 -130 -25 194 -36
5170c6J28j22j23M44k18j74K32k52J23P2k02J73J32l18K27j26l2J41j63J7K69
$$ -36 92 -30 -153 291 73 -101 131 -121 2 74 -128 45 177 -141 86 -40 -72 69 -94 -77 192
5191A92k27r3J75po9J34j85K73j29j52J27l9j01J99j76l6J27m8K5j2k1Q0j1j94
$$ 192 -35 -128 47 40 -29 105 -80 193 64 -88 39 0 -101 98 -78 -114 13 -35 -10 -22 -43 37 26 -168
5215a68K57n8k12K36k24J39K63k45k32K24j40K01j41j1L2J8P2J1j6P5p0j14J10
$$ -168 89 31 -181 55 -169 -30 233 -12 -244 -20 -160 41 -100 -111 -79 -61 11 22 6 81 11 -103 7
5238GQ5j86J61q6J02M7k07n7K97j91MK11k77J29J38j85k0K54k45l6M8J5J06j90
$$ 7 92 -94 67 -19 83 130 -77 -134 163 -28 -24 187 -90 39 177 -8 -28 226 -19 -55 -7 8 114 -76
5262g6J61j51L0J01M0j51K15j39j01K13j71n7K78l34L57j87o2N8L8j14J0K02l27
$$ -76 85 -66 -36 65 105 -46 169 30 -71 142 -29 -86 192 -142 215 28 -34 24 62 -52 -42 160 -167
5285a67J82P1j18L3j54J99P1l39J67k9j61K79r0q8K50k16R4J42j31K2J76k38J19
$$ -167 15 86 -32 1 -153 46 117 -222 -55 -84 -245 34 -56 -144 106 -110 -16 126 -5 17 193 -45 74
5308G4j56N1L6o5q1J30m4n3K28k67MJ01p5L06j61j21K36j80j3K9J10p1J16l26
$$ 74 -82 -31 5 -60 -141 -11 -55 -108 120 -147 -143 -42 -117 189 28 -93 143 -37 -50 -21 89 18 134 -192
5332a92J57J39q4m9K6K2L2r6L9K00j46j86J02q5K24ok39K63j02k8J11j65j4J13
$$ -192 -35 104 20 -29 -3 19 51 -45 -6 194 48 -138 -36 -121 103 97 -142 121 19 -9 102 -63 -77 36
5356C6j56l4K19k29L17j31j74L66l39j22L85j26Q7Rk91K70m2p7q0K04k37J52j3
$$ 36 -120 -154 65 -164 153 22 -152 214 -125 -247 138 12 99 108 -183 87 45 -32 -112 92 -145 7 -6
5379fM7l5n1k2K64j55Q9k46j05M31k75j13M19r9l73M27j72M8Q7k03J44M6j96N8
$$ -6 41 6 -45 -67 197 42 131 -115 -220 211 -64 -177 242 143 -230 197 25 73 160 -43 101 147 -49 9
5403IO3k62L38j61J9J54r5J8Q1j82p7J28j34J11l1m2J04k8q2L2kJ4J35j10N1q2
$$ 9 72 -190 148 -13 6 160 65 83 164 -18 -95 33 -101 10 -21 -63 41 13 -69 -37 -39 -25 110 0 51 -31
5429c1m6O5L39l22JM8m9J66l37m1L18m1o6j37j05K29P4j98L10j71j64J87j02O2
$$ -31 -77 -12 327 5 6 54 5 171 -166 -207 111 70 4 -133 -238 -9 65 -133 177 6 -158 29 -73 -11
5453a1J12k59P3M3o7K30j03r0K63j59q0J36k07K96o4k08K05j24k44J54MM2J9k
$$ -11 101 -158 -85 -42 -109 121 18 -72 191 32 -48 88 -119 177 113 -95 110 -14 -258 -104 -100 -58 -39 -41
5477d1M0J8Q6m3O9j05K6Q5k95K70k10o9L35l47J79J46m62K48J62k76L23j4k36
$$ -41 -1 17 103 60 129 24 50 135 -160 110 -100 -169 166 -181 -2 144 -318 -70 92 -184 139 125 -111
5500a11K54j58PJ58j25n5J93k66J80lK3%j40j5K33j59k4J85k05n6K32k82J02J58
$$ -111 143 -15 -8 150 25 -30 163 -103 77 74 97 97 -43 -58 175 16 -8 177 -28 -84 148 -134 -32 126
5524A26k05K83j62K1P5j16m4j9j34J87Q6k06P2J64j98P7j14J6J22q2M6n2j06L75
$$ 126 -79 204 42 63 138 22 -22 -41 -175 12 98 -108 -36 128 -70 7 -107 -91 31 -51 -5 -57 -163 212
5548B12p0k50R9k7P6M0j3l17L48j14r8J23l4m9K29k13P5J82m17K93m5p1O9k6N8
$$ 212 142 -108 -9 -36 40 80 67 -250 98 -16 -114 9 -25 -74 155 -58 17 199 -218 75 30 -41 28 2 60
5573F0J52l98K12J21k65K93k48k27L97l8l5P6o6j15J31o4O0Mq9P9p5J5K6m7q6
$$ 60 212 -186 26 147 -118 175 -73 -300 97 59 24 100 34 -81 50 -14 46 50 -39 40 -35 -20 6 -41 -127
5598a27J88j26j34L48k81J71o3j37J62N5j45K23J4j52J29n3l23L73k40RJ27j50
$$ -127 61 -65 -199 149 -132 39 -24 -161 1 56 -89 134 148 -4 125 72 -251 122 -118 -109 18 -132
5620a32J67op5O3o4R7jj79J60q1j21N7J12j16L69k98n3K40k04L8K66l74J22j45
$$ -132 35 29 -46 17 -47 50 49 -130 30 -51 -172 -115 -3 -119 250 -48 -101 139 -65 -27 239 -135 -13 -158
5644a58R5J11j49j02J51l9mJ58k33J37J94j22k7K08l23J17m3j06J55J09j38M2
$$ -158 -63 48 -101 -203 -52 -91 -95 63 -170 -33 161 39 12 220 -103 14 -29 -135 20 129 -9 33
5666C3n6j3J74k88J87k6j02J0q0J0K75k68j2K30j65Q8J72j81L3Pj92K33k6j62
$$ 33 -23 -36 138 -150 37 11 -91 -81 -161 -151 124 -144 -156 74 -91 -3 169 -12 21 28 -164 69 43 -119
5690a19K20k18K38R7m43K09J57k36K61k37j9K56k35j3J20k2N5o1p4R1R7k68o5
$$ -119 101 -117 121 218 -225 -16 141 -95 166 -71 -90 166 -69 -82 38 16 71 10 -64 27 124 -144 -209
5713b09R1J9K22j87PJ14q1p9J43j20k1K43k63K00j21j02N7J47k3M5q8OM5l53J73
$$ -209 -118 -99 123 -64 -57 57 -24 -103 40 -80 -101 142 -121 79 -42 -144 -87 60 37 82 -6 0 45 -308 -135
5738a35J66j34J12J22j71J06k28r3L80j80j30L74k20J24j41q1L3J77j02J87j46
$$ -135 31 -103 9 131 -40 66 -162 -255 125 -55 -185 189 -31 93 -48 -129 -96 81 -21 166 20
5759B0j42L19k98J85Pq9o0Qr9K41R4k60L02j48j85Q8J0j78L26k78L07k18p5J91
$$ 20 -122 197 -101 84 91 2 -58 -50 -149 92 186 -74 228 80 -105 -17 -7 -185 141 -137 170 -48 -123 68
5783F8l5l7j44J99l8j22q7K86L8m7m9J01l32L25j30LJ74j28j18L03l55K83j27
$$ 68 33 -4 -148 51 13 -109 -196 90 128 81 32 133 -199 126 -4 -1 173 45 -73 230 -125 158 31
5806C1j73J79k3R5j29j7P1J56j47l6L4m5l1J5j41Q0K23j58K18k93J06n8K5k33
$$ 31 -142 37 14 109 -20 -37 34 190 43 7 41 -4 -35 -20 -161 -81 142 -16 202 -91 15 -43 -18 -251
5830b51L48j29O2P2j14J12l7k29L15j07l9J35k68N6L82l87J19P0l90L20r1j04
$$ -251 97 -32 30 102 -12 100 63 -166 149 42 3 138 -130 -74 308 -79 40 110 -280 40 -51 -155
5852a55K03j69O9L0j03K3L10j95J74j48q4J13j72r3J01Q5K4J53k65K06p1j44J90
$$ -155 48 -121 -52 -22 -125 -102 208 13 187 39 -45 68 -104 -197 -96 -11 13 166 -99 107 36 -108 82
5875H2qk46J91R8k44J00J15n9P7j36J26j5j27K8j8J05o5j56J19m0J24q2J53Jq0
$$ 82 74 -172 19 117 -127 -27 88 29 106 -30 96 81 -46 -18 -36 69 4 -152 -33 -73 51 -31 122 123 43
5900D3Oj25rJ52j41P1rM6J83k98O2J36j84J6m8L6P7j36j1R1Q6r1j2J81J9j47J6
$$ 43 49 -76 -85 67 -74 -3 -12 34 217 -81 -19 117 -67 -51 -99 -63 14 -122 -133 -42 44 -47 -59 122 141 -6 10
5927A0n9J3J27k07R0j4J18jr9N5j02J61j47J52J6M8m38K72j45K18L9j87J07o5
$$ 10 -49 -36 91 -116 -26 -40 78 77 -22 33 -69 92 -55 97 113 161 -277 -5 -150 68 107 -80 27 -38
5951c8J41j86O9p5J88j47j35K18k3K3mK1k4J14j27J42j43k02J55R7j95J62Kj79
$$ -38 103 -83 -14 -89 99 -48 -183 35 12 35 31 52 28 142 15 157 14 -188 -33 64 -131 31 33 -146
5975a46K66j28j7J66k26J38j31K4L3O2j41J72k08MK81k14P3Qr1J65m0j23J21n
$$ -146 120 -8 -25 141 -85 53 -78 -54 -21 41 -100 72 -136 -132 149 -65 8 16 -75 90 50 -73 48 43
5999D3j32J84j87j57L89j90q7J63O7j59R4Q6L1k81K20j48P5p3K59k90N0q3J17
$$ 43 -89 95 -92 -249 140 -50 -137 26 93 -66 28 114 145 -136 84 -64 11 -62 197 -93 -43 -126 -9
6022ip9LJ02m4K0j07kJ2QJ45kj20M3O5J24j36j63J98j39J32m0o4Q1%q1J57j80
$$ -9 -88 -85 17 -27 -7 -114 -116 -104 -96 49 47 -73 -30 35 159 23 -140 58 -81 51 11 -53 28 28 -53 104 -76
6049g6m2J29L6J22j79l0J12r5k8M7L2r9nJ54r3j02J31j03J4Q4j85L82j94n1J52
$$ -76 -118 11 47 169 -10 -40 72 -23 -51 -4 28 -71 -76 78 -15 -117 14 -89 -75 9 -176 206 12 -39 113
6074A13n7o0m8lm7J45m4L4m9kL8r8J81j26K9o0K9J02J96j94m3N4j1m3p8J49m4
$$ 113 56 -4 -52 -55 -102 43 -1 33 -16 -18 20 -78 103 -23 6 -54 -25 77 273 79 36 90 79 36 -42 107 63
6101F3j62K9o9K98j32L3j5j63L22k37J1j19R0N6p3J5J73rj43K5n1q2L17k53j75
$$ 63 -99 -70 -139 159 27 60 45 -118 204 -33 -22 -141 -51 5 -68 -53 120 111 -32 -7 -58 -140 177 -76 -251
6126b51J92M0J33n4pj6q5q3J92r4J0J59j66j13k1J60M1k7j10J43lo3plj00K23
$$ -251 -59 -19 114 60 53 37 -48 -131 61 -33 -23 136 -30 -143 -164 -4 37 10 -100 43 40 -23 -30 -33 -133 90
6152I0k19J10J31j23J77n2k52L29j69p7J15p4j70L25o6lj03k39L52k63J55O7o0
$$ 90 -129 -19 112 -11 166 114 -138 191 22 -55 60 -14 -184 141 75 72 -31 -270 82 -181 -26 41 -19
6175a9j7K16k20O7r3j26J10K32j63J3N0r8M3K59l84J44q5r2K73M7k88K26j25J15
$$ -19 -36 180 -40 27 -66 -192 -82 150 -13 0 50 -48 -5 254 -130 14 -71 -163 110 157 -131 95 -30 85
6199H5j00o4J46j10J2m6Q9r5J68j88J29M3k13J20J34k78K95j44p7J01M3JNj42
$$ 85 -15 -79 67 -43 -31 -77 12 -83 85 -103 26 69 -144 -24 110 -168 127 -17 -94 7 50 51 56 -86
6223h6m7J55jR5o1q5J5J3RK6J46k77J26j16J53r6q2K83j68m8j32j6J19J61j17
$$ -86 -133 22 21 116 55 -30 -15 -2 7 33 179 -98 28 -88 65 -31 -113 170 2 -46 -178 -194 -75 86 -31
6248c1N2M7l7J59m4o5l02J18L1O8Kp5L3n0J62J48k59o1J43o9Q0j92O9m1l6J5J63
$$ -31 21 68 31 190 146 81 -221 -103 -72 -4 -2 -77 -44 -94 68 216 -43 -104 39 -30 50 -142 -73 -114 -150 -135 28
6275B8o4J13j41N1j25J39P5M5l08K52M4k61K25O7j32l9N3r4N7L9r6J53n0jor1
$$ 28 -36 77 -64 -13 -138 1 76 121 -187 65 109 -152 73 140 8 -31 22 -72 -15 24 -72 81 31 30 24 -67
6301f7O3RP6n3J02k45J38q9J16J80k01j54K41nq2m3j13J07k2q8J96k1j90M11k65
$$ -67 -4 5 81 28 130 -115 23 -66 50 230 29 -125 116 111 29 -14 -127 -20 -42 -130 66 45 -145 266 1
6326Aj14K04k05J03J09Ol3q8k97L87n0j40K58k72J74M8k78K48j3j27L7J6l0K57
$$ 1 -113 91 -114 -11 98 104 71 -17 -314 73 23 -117 141 -131 43 91 -187 61 48 -79 -42 -26 -56 201
6350B01k73q5K23J11j3j16q6r5J41k1O5qj66J0J74n0K9m3j4p4J18ojj36Q3J86
$$ 201 -72 -157 66 177 164 48 -38 -133 8 -13 52 44 -122 -112 62 12 41 -2 -16 -90 28 22 21 -115 -32 154
6376A54J6q9p8J6m9p1Q3J57j77l7K11j13P2j1r7J0j13L23k15o4j21K39n9M9K6
$$ 154 170 81 3 19 -30 -101 -18 139 -38 -75 136 23 95 84 -13 -3 -116 207 -8 -72 -193 46 -13 36 62
6401F2m0j19K33j22m9q6J3J86o0J6j27O4O4K6k23K55r6J53j88J05o6J10q0j48
$$ 62 22 -97 136 14 -35 -121 -108 78 18 34 -93 -29 35 61 -162 93 -3 150 -38 67 1 111 31 -117
6425a17J91j12m2n1k5K87j98k7K78k07p3K89k76j4J57k5R1m7j51J62j59P1J6n3
$$ -117 74 -38 -80 -131 -156 131 -67 -94 184 -23 -96 193 -83 -97 60 35 126 79 -72 90 -69 2 18 -35
6449c5MK04k27J6J55k57K68j82k61L13pJ2J54l03J70j09p0J25J84rP0k52J14n2
$$ -35 -31 173 -54 -38 117 -140 128 -54 -315 -2 -9 3 157 -146 24 -85 -155 -30 154 145 215 -37 77 25
6473B5J8k50L18j60j24L12m21M06n9k23M1M2n7K02p4j06K54n1r9J5p1J11j4j29
$$ 25 43 -207 111 -49 -173 139 -282 124 65 -158 -117 -75 -132 70 -4 -110 144 93 -6 9 -62 49 35 -94
6497i4J28j05j34K25r9K5qJ4J59J07l48K38N8k23J58q6j23J93j34j09J55j29K50
$$ -94 34 -71 -205 20 -79 -54 -62 -48 111 218 -130 108 166 -57 101 15 -108 85 -49 -158 -3 -132 118
6520A18Q5k55J76j13k11N3P7m9K69k60J88J45k41j0oj5j77K89j20O0j8j25R7K9
$$ 118 203 -52 124 11 -200 -147 -70 -119 150 -110 78 223 -18 -28 -34 -49 -226 63 -57 3 -15 -140 -43 -14
6544a4m1K56k88J39J04k20J31j01P5kj59J30n7O6M6j1j07o7J43j41R7R8j0j71
$$ -14 -55 201 -87 52 156 -64 67 -34 41 39 -120 10 -47 19 65 54 -53 -120 23 -118 -21 77 67 -104
6568a04K51r2m0QJ25j47j28J21J65j78J30j28P6j22L7j68K38k8p6Q8j58J33j2
$$ -104 147 55 15 23 148 1 -127 -6 159 -19 111 -17 59 -63 -26 -194 44 16 -60 28 -130 3 -9
6591ik88L22p6j53R1K8J42M7j60J6J48J8k95K40k79J85jl9L00l28Q9pq5N8plK8
$$ -9 -297 25 -51 -204 -113 -85 57 104 -56 -40 108 126 -169 71 -208 -23 -24 -63 237 -91 -2 -9 -94 -36 -43 -46 -18
6618a8L4j70J15J58K6k09J00O0J27j70o7Lp2J85j76J30J5j62M4P0m8Q4M9k60K81
$$ -18 16 -154 -39 119 145 -64 36 96 223 53 -14 -11 -83 102 -74 56 71 -91 -47 23 -25 59 108 -152 129
6643A29N1l12P0J50j99L36j31o1j40Q6O2J43k19N4j15Q9m5L7j3R8j02K1P1R0q1
$$ 129 180 -132 -62 88 -111 225 94 33 -107 -21 41 184 -35 19 -96 -7 -52 -15 -28 70 -32 -11 60 150 69
6668F9j51J16L5K7J8j01L2O0m6p0J30j27p0N9J02j30o9K93k49K2K16j94P9P8j58
$$ 69 -82 34 69 96 114 13 45 105 59 -11 119 -8 -78 -19 83 -47 -116 177 -72 -50 166 -28 51 129 -29
6693b9J38j28l4N7M1j34L3r8K58k09K7K47j75OJ25n5r0Q6p5Q0kl0lo1j55J92j9
$$ -29 109 -19 -53 4 45 -89 -56 -154 104 -105 -78 169 -6 0 125 70 -20 66 -9 71 69 39 36 -25 -180 12 -7
6720gk8K15l05J91l9k12L07j37N3p3P2j11n8J3J37J47l55J84O0j16O7P2r7K00
$$ -7 -35 180 -125 66 27 -185 122 -15 38 -35 37 -74 -132 -119 18 165 -190 -6 54 -62 5 77 -20 180
6744A80j24J09k39k13J51K25o5k60K87j07k3K55j16R0k4j49L5k73K89P3j14RJ47
$$ 180 56 165 -74 -287 -136 89 24 -236 51 -56 -79 176 60 150 126 -23 12 -261 28 101 -13 -4 143
6767A43j02j60K51j89K0P4l5m7J00KJ41l20K08m1j5J37j37q5m3J44j82J74o3K42
$$ 143 41 -119 132 -57 -37 37 2 -45 55 57 198 -122 86 45 30 167 30 -55 -98 46 -136 38 -25 217
6791B17%k70J34j84J2J10n7l6J04J14k81M15l86J28q1q3J57r2p5J05J52k27K32
$$ 217 217 -53 81 -103 -91 19 -38 -74 30 144 -137 278 -108 20 -61 -144 13 -79 -154 -49 103 -124 108
6814A08k19K21p4j02P9O5j04L9m7k24L93j3j85J70j76J93J5k98M4K04k05j3O2
$$ 108 -111 110 36 -66 13 78 -26 13 -34 -258 135 122 -63 107 -69 124 139 -159 -115 89 -116 -129 -67
6837f7J3J68j69O3K10k38j08K22r9J16j25r9K0J71j12R4K7j59L33l61k8K69j17
$$ -67 -54 114 -55 8 218 -20 -128 94 -5 111 -14 -113 -93 78 -34 60 87 -72 261 -100 -128 141 24
6860B4j50K31j09MP6k18J29n3%J37j36K35q6m6j3j38J23k1p1J20J15k26J00J62
$$ 24 -126 105 -4 0 76 -142 -13 -66 -66 71 -65 170 84 38 25 -113 10 -11 -82 38 153 -73 27 189
6884A89j68r4K61l20J54J6J14j24j28Q2R4N9l18K44mk43K17j72Q6K5m8J37q5p6
$$ 189 21 -73 188 -132 22 38 152 28 -100 -18 76 135 -183 61 57 -186 31 -141 -55 -30 -78 59 -26 -102
6908a02J67j54J28q7j7J47n0Q1J2k0k35M4K43k33K83k35j17K44j95K22j16n3R7
$$ -102 65 -89 39 -48 -65 82 32 113 125 105 -130 -86 157 -76 207 -28 -145 99 -96 126 10 -43 54
6931E4o5o6L9j33K50J50k48L8J32k17L7j38L5O4J55j57Q6R0j14mRM3K06j44k0
$$ 54 -11 -77 -38 -171 79 229 -19 19 151 -66 -29 -167 -132 -68 87 -70 16 106 -8 -12 -3 40 246 102 82
6956H2j61Q3M7M5j44J43j88j52L01k9L7K3p5j18K82k60J58O2j22J0j62K06J0j65
$$ 82 -79 4 51 96 -48 95 -93 -245 56 27 64 87 12 -106 176 -84 74 136 14 24 -138 68 78 -87
6980h7oJ52r5m9nN9l0K28k09M1M9j48J04M2n0P3j97J96O1m6j85J45o4m9j4P3J28
$$ -87 -93 59 -36 -85 -90 -31 -61 167 -42 -1 48 -100 4 46 -4 69 -128 68 129 83 -102 43 -21 -70 -84 -11 117
7007A17l00O1J27j15J30j48o0K35j70Q8P5k1j16J52j65K23K3o9J32m6l22J31j11
$$ 117 -183 -122 5 -110 20 -128 -188 47 -123 -35 40 19 -97 55 -110 113 136 67 199 153 -169 -38 -149
7030a49R3J51j28J54o1j16M8j43J04J25k38K23P5k04rJ03j39Q6P3Q7k36J89r1
$$ -149 -56 95 -33 121 60 -56 -8 -151 -47 78 -160 63 138 -66 -75 28 -111 -25 48 135 -101 88 -3
7053cj09M42n54K38K5P3q7j75J13J13k14L4M4J2J46o9j13R0j22K2J88j34p9L38
$$ -3 -112 330 -224 14 39 112 25 -150 -37 76 -138 -104 -60 -48 98 29 -84 6 -116 -94 94 -40 -119 219
7077B19k34r2K19j39J60n9n9j04J19o8K0m2Q5O7j32L1J57r9j44J06Q3L7k5o1k2
$$ 219 -15 -107 112 -27 133 74 15 -89 30 -38 -18 -60 25 92 -40 -9 148 49 -95 11 94 131 106 45 23
7102B3k14K28%k64K36M4j07J24r3p3K78k56J07J63l94K48l1k60M83l68R1Q6j46
$$ 23 -191 37 37 -227 9 53 -54 70 -23 -96 182 -74 33 196 -198 50 19 -241 242 -126 -35 51 -95
7125i5P1k7k0P5J51j67r9J53m7R9k38L9nJ25J0N9j79O3K51k34L1N8j33J01M8j7
$$ -95 -24 -51 -71 4 155 -12 -111 42 -5 94 -144 -105 -110 15 25 84 -95 -32 219 -15 16 74 -59 42 90 73
7151G3r1m0j4J32j01M9O5kJj63k9K05M9k08M5K8r1Q8k8l4J51mj42N1n4K29j16
$$ 73 -18 -58 -72 60 -41 8 73 71 72 -91 -120 85 134 -74 -29 -1 -92 -4 -32 -66 85 81 -61 -10 -64 165 49
7178D9j17P4r3Q9J0o0Jmj4J53J1k34K71o6m2L0n4l6k9J67j13qn4n1J36j45O0J9
$$ 49 -68 6 -87 2 12 -48 -47 -51 -65 88 99 -135 136 70 28 58 4 -32 -61 106 -7 -15 -69 -120 16 -129 -69 -50
7206e0L0J55j11j27J51j54K31lk05N7K8L4o1J61k92J37K1j47L31n26K43J56j90
$$ -50 -20 135 24 -103 48 -106 125 122 -83 -26 2 36 -25 136 -156 -19 2 -145 186 -340 -97 59 -131
7229a31R4N8Q4O6k58J70QO3j36J41k04N9O3j24K44j53m7P4o5kJ23l21R2K18j49
$$ -131 -37 21 105 171 -87 83 91 154 18 159 -45 14 77 -47 197 44 -3 71 6 4 127 -194 -102 116 -33
7254c3j5J59j11J13p6j65P3P9N8j90J32M1K6k13K30J19l43J93j54N3J56j21k62
$$ -33 -48 111 0 113 37 -128 -55 24 82 -108 24 65 91 -122 108 227 -116 77 -77 -24 132 11 -251
7277b51M09j43mQ5k34J88k2k47J2J58m9J55l5m6J21j17q4K21j21O3r8J9Q7q7m9
$$ -251 158 15 11 96 -138 50 28 -219 -207 -49 -98 57 22 -24 97 -20 -104 117 -4 59 -39 -20 67 -20 -69
7302f9Q7n8K6M8j99J41M8l1n5J83j98K51j66l7J87j03j65L33k69J16J09l23K91
$$ -69 18 -40 -14 34 -165 -24 24 -7 -62 121 -77 174 8 -29 158 55 -110 223 -46 70 179 -144 147
7325A47j15L9J4p4j9J4r8R3J23k18OJ65j29J54l9p1K15k65pm6J26L9j36p0L3J86
$$ 147 32 71 85 11 -8 6 -92 1 124 -94 -88 77 -52 102 63 -8 207 -58 -65 -111 15 54 -82 -152 -119 67
7351F7M4j28p6J83J3k96K74J18j27l6P0k01J40o3j26L28l66J51J03k43J31K45
$$ 67 111 -17 -93 90 103 -193 81 199 72 36 106 -95 45 -18 -144 184 -182 -31 72 -171 -40 205
7373B05k33Q2kj03M9o4LL8n5O9J32j22j68K55j86L16j91m4J4o4Q1R5l2k10K86
$$ 205 -28 54 52 -51 -2 -66 -63 -25 -80 -11 121 -1 -169 86 -100 216 25 -19 -5 -69 12 107 75 -135 151
7398A51j85mP0o0J48rl42K02o7O7K08o4Rk6j19j20K09k00J09J53m4j79p1N6R7
$$ 151 -34 -38 32 -28 120 111 -231 -29 -96 -29 179 115 124 98 -21 -141 68 -132 -23 130 86 -93 -164 -108 -11
7423a1m9nn8J46L8n4nJ6J15l38L61j21k74L86n8o6O8k20Q2K44k66K49j74pp8J02
$$ -11 -60 -65 -123 23 61 7 2 18 133 -205 156 35 -239 147 89 23 91 -129 -47 197 -69 180 6 -1 -79 23
7449B3j9J4jr9L18k40k1N6o8r6K12j81R0Rp6J56j33r5R9qo5J87p6J21m0r4P6j10
$$ 23 4 18 17 -82 236 -4 -25 31 -37 -133 79 -102 -12 -3 -79 77 -56 -151 -52 -60 -125 62 -14 107 67 -27 49 -61
7477f1J75r2j98K28K3r8k02J69n1K44l6k18J43l6P0l2K8j59J43j79J49jm2K6P7
$$ -61 114 22 -176 52 75 -23 -225 -56 -107 137 101 -117 26 -10 60 28 56 -103 40 -139 10 9 -33 -7 70
7502G0k23J35N4j09Q1lQ0j8j88J01m9J9J31j3j18L6q4J67J12j35j01K57k49j1
$$ 70 -153 -18 36 -73 8 5 85 67 -121 -20 -69 -50 81 68 -50 -14 -98 69 181 46 -55 202 -47 -58
7526e8J69p5R0Q3k67R9Rk12J50P1j4k6j13O5K00l10N9j31J64J39k52M4P6k9J20
$$ -58 111 36 126 209 -58 41 50 -162 -12 59 45 19 -94 -29 171 -139 -80 -211 -47 92 -160 -116 -40 -69 51
7551E1K0j41J78j36P9j9j44P7J82j86P4O2k37K01q6J29n3j28p9J69j41J74k1j14
$$ 51 71 -70 108 -28 51 32 -112 -35 147 -39 35 97 -140 61 -25 104 51 -77 -156 13 -128 46 25 -89
7575h9K37q9j92J74R5k99K14q0J2J0J11j4n7j76J8J33k55K20O2j76J02P9k2p8
$$ -89 148 59 -133 41 136 -163 51 -29 -17 -7 104 90 33 -143 -125 8 -247 -27 35 -141 -39 40 18 -60
7599f0R9m4Lj36J44J28j52j34K50MJ02p6j61Q8l5k0J49l1p4j3O9j92O0L0N4J41
$$ -60 39 -5 -2 -138 6 134 -18 -152 98 102 204 128 -33 55 20 0 149 118 44 31 100 -92 -32 -2 52 193
7625A93k69K34j65o8L10k33J08mj95R3Q3k43K41k16J43P1k7r7J50n3l7J48k52
$$ 193 -76 158 -7 -75 235 2 110 106 -89 4 87 -156 85 -131 12 83 56 -41 109 56 19 167 -85
7648h5L7N4j20M5n8O2Q2l1k10L05j19KK04j28p8J2M4R3k06J8K66j34j80K28k67
$$ -85 -48 6 -114 -69 -127 -65 17 -14 -224 81 -38 -36 168 40 -38 -26 18 111 -95 -77 189 55 -125 103 -164
7673a64K55O3k91J93o5k2L7l0j47J82J3j13J67O9r3o5j56K10j79J26q8L0q8L2
$$ -164 91 154 -137 56 -9 -31 6 -24 -171 11 24 -89 78 147 54 -11 -167 43 -136 -10 -98 -68 -156 -124
7697a24J96j65L20k56J92j04j26J87Oj97K4P2o9PQ1n2Q7o8J16j17j06R5R8j67
$$ -124 72 -93 227 -29 163 59 -67 120 126 -71 -47 25 -44 -37 44 -8 79 11 127 10 -96 -1 97 -70
7721g0J12o2q6J62Pj50K61j35ml9k0O6J03k25R7om2K9k6J42j60kJ09m3l8Q1l4
$$ -70 42 -20 -106 56 63 -87 174 39 35 -4 -24 42 145 -80 17 11 -31 -2 -28 114 -46 -48 61 18 -20 61 27
7748B7q5J48k04J6R8o6J33r1j91K14l7L6O6j2oP6j58J43q4M0j10M6j20K32j30
$$ 27 -58 90 -114 -98 0 -66 67 -24 -215 -1 -38 -2 64 52 46 122 -36 107 23 63 -47 -1 -121 111 -19
7773a9j96J70l7J62j55n1J68L7o6l4L8j43K03l1j85K11o1O7o5j54L3J47j29J84
$$ -19 -215 -45 -82 80 -75 -126 42 79 13 -21 17 -126 77 46 -139 72 11 78 13 -141 -108 39 -90 94
7797I4q3k6q7K8J27rn0n4R5o9J3J23Nj12o4J9J44k7j63K31j60K9M0j54K21Q6k95
$$ 94 11 -15 -102 -74 53 44 -6 -60 35 -34 -21 102 107 -5 -69 -50 94 67 -96 135 -25 4 44 -110 111 197 -98
7824i8Q5O1j39K21j48Lk4K30k80L68k73j6P0j35O5J10k05n1K07j72J64k6J3l0
$$ -98 -13 48 -91 130 -18 -15 -39 191 -89 279 6 -10 60 -75 -10 100 -105 -156 51 -121 43 17 30 0
7848@o5J19J67j88K8M0k29J77J31k09O2p0m1p8P3N9K37k44q2K53l75K04Q3Q1r4
$$ 0 -65 54 221 33 61 101 -128 49 180 -29 33 -37 -78 -156 -83 -24 213 -31 -113 140 -235 -31 52 133 39
7873C9j37M2N6k37K84lQ2r5j7j26J59J24k27J53k10O5J89j72Q6R7j09j1pk59L40
$$ 39 -98 -56 0 -237 47 44 126 31 14 -112 47 171 -56 97 -113 -48 141 -31 55 152 43 32 25 -234 106
7898A06J1o6K2n8n0J96k05O4p7M4J90j48M0Qo6L6o4J40q4J46k19k6J00j66J76
$$ 106 117 51 73 15 -35 161 -44 20 -57 -13 177 29 69 77 11 47 -17 123 39 185 -34 -60 40 -126 50
7923E0K1k54L95j66m0n4K4R9n3j00J38j1k57L42n9j07R0j07n0J36K0j59L81m52
$$ 50 71 -183 212 46 6 -48 -24 75 22 -78 60 49 -208 134 75 -32 58 -49 -99 37 57 -102 279 -173
7947a73n7K61r1J31j90j8J43kj0J26j63rK25k9j13r2j13L33k86j3K43q8P5K9j92
$$ -173 -230 31 -60 71 -119 -137 6 4 -6 120 -43 -52 173 144 31 -61 -174 159 -127 -140 103 15 90 119 -73
7972g3J62k03J73jr4P7Q7r9m8P9j5p2P9n2n9O4j19Q1Oj03J12J73k29J19R9k57
$$ -73 89 -114 59 58 -36 41 128 29 -19 60 45 -27 52 0 -59 5 -114 -33 -27 -130 -18 155 -74 45 144 -113
7998a13K82j89J89l12O6M4m7J94L0l64M10j63o2jK28j87q4R4k05L61j95q3J13
$$ -113 169 -20 169 -143 -77 -33 -80 114 144 -220 190 27 -35 -36 192 5 -79 15 -190 171 -24 -107 6
8021FJ31j98N2J5m4O5%j40J34j8R8j13O3O2m0k48M2J59N7o2j83M1J30L5j63J69
$$ 6 137 -61 -9 6 -38 27 27 -113 21 3 101 -12 51 113 73 -175 -133 26 83 21 -162 -121 9 44 -119 50
8047E0j55J92Pj43N3j01J26p6M0n5J74pk7l9j39P4O4j68J55j5P0qj53J55q9j63
$$ 50 -105 87 94 -49 4 -97 29 -47 -7 -62 112 105 78 39 -100 -26 38 -130 25 10 80 72 -81 74 -15 -178
8073a78K39j05j6L9j33L07j21q3l5J59k4n5j1K9k1O0j12j69J29N9J16j70P9J31
$$ -178 61 -44 -60 -21 -154 153 32 -51 -86 73 49 -6 -17 12 -9 51 -61 -230 -101 -42 74 -96 -17 114
8097A14j20K5K4n7K2K6PK5q3k47L48n4j86K45k35L7K24p8O8j66m2J88k21J79j5
$$ 114 -6 19 43 -14 8 34 41 66 -17 -264 84 30 -156 89 -146 -109 115 37 105 -61 -103 85 -136 43 28
8122B8k40K96p3j69K28J6j41J95l09J61RK4m3J37k18J16Jm3J13J2j87J45J7j20
$$ 28 -212 84 11 -158 70 86 -55 140 -169 -8 1 25 -18 119 -99 17 18 -25 88 100 -87 58 75 -45
8146d5J30k84K32N4j13M2m6n4P5J79q4j61K44j31Kk00J95P6j57LO0j68L78m40
$$ -45 85 -199 33 87 -26 16 -30 -84 -9 170 86 -75 169 38 40 -160 35 111 -46 -43 17 -151 227 -213
8170b13K53L9j26M4Q0j69J84q3j44K00j44j61L58j98rK16k11J30j29m6J06
$$ -213 40 79 -47 -3 77 -92 92 9 -135 65 -79 -240 118 -80 -89 127 -84 46 -83 -129 -23
8191b3
$$ Imaginary data points
##PAGE= N=2
##DATA TABLE= (X++(I..I)), XYDATA
0@%%%%%%%%%%%qJ6j6J6k2L0l2M0m8N6p2Q8j04J20j42J66j92K24k56K93l34L78
$$ 0 0 0 0 0 0 0 0 0 0 0 0 -8 8 -8 8 -14 16 -16 24 -24 32 -40 48 -56 64 -78 88 -104 120 -136 157 -177 201
33B01m30M86n47O16o92P73q62R64j075J191j319J462j616J783j966K167k390K634
$$ 201 -229 257 -290 326 -366 407 -455 509 -566 625 -694 768 -848 935 -1031 1136 -1254 1380
51A380k899L195l523L889m302M768n299N912o631P485q521R806j1445J3628j6696
$$ 1380 -1519 1676 -1847 2042 -2260 2508 -2791 3121 -3510 3975 -4546 5260 -6185 7443 -9253
66i253K1340k9280M6422j48349J32642J68012l38472P9141K01337j38863j09395
$$ -9253 12087 -17193 29229 -119120 13522 181534 -156938 -77797 123540 -15323 -124718
77a24718K14921K1031j91806M4366J69535j41373o7028J73434m7994j61693J10989
$$ -124718 90203 111234 -80572 -36206 133329 -8044 -75072 98362 50368 -111325 -336
88c36P6375j00379m4543O4609L2864n9772j9204Q9023k6632o7210Q0676K1718
$$ -336 76039 -24340 -68883 -4274 28590 -31182 -50386 38637 12005 -55205 25471 47189
100D7189q2908L3415N7262m9661l9716O4906K4414j04616R755J20387q8576q0977
$$ 47189 -35719 -2304 54958 5297 -34419 30487 54901 -49715 -39960 80427 -8149 -89126
112h9126J33283j4812j11392R0243M1408j00518K0831Q3908m2362o2326O5367
$$ -89126 44157 29345 -82047 8196 49604 -50914 -30083 53825 11463 -50863 14504
123A4504M3401q9504M007Q7234n8096l9487O6262j9901k8752K8730j2934r37Q386
$$ 14504 57905 -31599 -27592 59642 1546 -37941 28321 8420 -20332 8398 -4536 -5473 2913
136B913j5493J9044p174k6453L8558J1166m1541J077L5920N400m3593N351N5909
$$ 2913 -12580 6464 -710 -27163 11395 22561 -18980 -17903 18017 23417 -20176 -14825 41084
149D1084m4571l3248P6699k5211n9311O6126k324o0252M9540K3735o1039k699
$$ 41084 -3487 -36735 39964 14753 -44558 21568 19244 -41008 8532 32267 -28772 -31471
161c1471N6923j640n9074K0543N5431m8722j7880N7447k6906k4956L8985j4757
$$ -31471 25452 23812 -35262 -14719 40712 -8010 -25890 31557 4651 -20305 18680 3923
173C923j4185K1107q736o836m030L878K2820k8244j9851M5179j482l4412J1049
$$ 3923 -10262 10845 2109 -4727 -8757 -4879 17941 -10303 -30154 15025 13543 -20869 -9820
186i820K1186J206k2785L553L3762k7804j4892M5421k8030k4654N1166k2490l8517
$$ -9820 11366 12572 -10213 -6660 27102 -702 -15594 29827 1797 -22857 28309 5819 -32698
199c2698M3780O275m0464L359L0517j895l3011J5537L0175l5313L193L8792l4697
$$ -32698 11082 17357 -23107 -19748 10769 8874 -24137 -8600 21575 -13738 -10545 28247 -6450
212f450n172L8352k4501j2058K4638o901j0535l159O065J0977k3103l353K3018
$$ -6450 -11622 26730 2229 -9829 14809 7908 -2627 -5786 279 11256 -11847 -15200 7818
225G818j5690l055J5456j2474L429P440m173R174j1154J797K4070k6587o291L5682
$$ 7818 -7872 -10927 4529 -7945 -4516 2924 -1249 7925 -3229 -1432 22638 -3949 -10240 25442
239B5442k2181j8350K5527n834j1837M210K57J0q021J0140P677k8061J6775K8264
$$ 25442 3261 -15089 10438 4604 -7233 -3023 -2766 -2756 -10777 -637 7040 -21021 -4246 24018
253B4018l8934J417L6970k0783j0728J5992k093K06n783j415P976j1892N518N997
$$ 24018 -14916 -13499 23471 2688 -8040 7952 5859 6065 282 -1133 6843 -5049 469 6466
267F466k4202J4922J7084k9660K832K0201o662l773n872J0006J5618k3427K44
$$ 6466 -17736 -2814 14270 -15390 -12558 7643 981 -2792 -8664 1342 16960 -6467 -6223
280f223K2695j5998p31R740j6040Q265Q605j6247q60M307P316l373k2183K0168
$$ -6223 16472 474 -257 9483 -6557 1708 10313 -5934 -6794 -2487 4829 1456 -20727 -559
294e59J8153l4051O329K5222j7886L23Q821q628P518J576n542J82n115J3388k254
$$ -559 17594 -16457 -10128 15094 -2792 -2469 6352 -2276 5242 6818 1276 1458 -3657 9731 7477
309G477k6058K0487J2333k9324Q084J3026j1959M236j689q18R495q337L800M922
$$ 7477 -18581 1906 14239 -15085 -7001 6025 -5934 -1698 -3387 -4205 5290 -3047 753 5675
323E675j2039J4695K591k1082J4036P083j4654M293j725N66N342j4118O383Q185
$$ 5675 -6364 8331 10922 -10160 3876 10959 -3695 598 -1127 -561 4781 -9337 -2954 5231
337E231j5364J0043L792j6012J5389M406j5188P979L715j95P72j0843J0897O282
$$ 5231 -10133 -90 3702 -12310 3079 7485 -7703 276 3991 3796 4568 -6275 4622 10904
351A0904j7995Q326L581j1549J2143n154j2529J6785k282r321N237k821R099j95
$$ 10904 -7091 1235 4816 -6733 5410 256 -12273 4512 2230 -7091 -1854 -4675 4424 4229
365D229j6095J4641P666j4660N515k40l32R424j4619j279J5128j0350j514K806
$$ 4229 -11866 2775 10441 -4219 1296 1056 724 10148 -4471 -5750 9378 -972 -2486 320
379C20p700J3329k561j7632J5159N792j0209J652k844Q899M881j8359Q013J1771
$$ 320 -7380 5949 3388 -14244 915 6707 -3502 -1850 -4694 4205 9086 -9273 -1260 10511
393A0511j2998L583p06n464J4324q297j1351J3609j122k907l35p819J3461K788
$$ 10511 -2487 1096 390 -5074 9250 953 -10398 3211 2089 -818 -1153 -8972 4489 7277
407G277j8263J0675P625r510M245l626O56J0188j2271p33R103q887O208j020j2365
$$ 7277 -10986 -311 7314 -2196 2049 -1577 -921 9267 -3004 -3737 5366 -3521 2687 1667 -10698
422a0698J5007N92j5110R838K275l788M102p314O322O432j1576O656J927r625
$$ -10698 4309 4901 -10209 -371 1904 -1884 2218 -5096 1226 7658 -3918 2738 4665 -4960
436d960J2382l335j1778J3022k967p337O838n306L152K493j1867R119L606r410
$$ -4960 7422 4087 -7691 5331 2364 -4973 1865 -3441 -289 2204 -9663 -544 3062 -6348
450f348Q489l823n130J5909o129p687R613l420K022P40r343J0971n67j3789J0610
$$ -6348 2141 -1682 -6812 9097 2968 -4719 4894 1474 3496 4236 -5107 5864 5297 -8492 2118
465B118O11o847O268r060M45J3718j0264l883N500r71Q754n572q365J6377l072
$$ 2118 2729 -4118 2150 -6910 -6465 7253 -3011 -6894 -1394 -2365 6389 817 -7548 8829 5757
480E757j0624J0375j890j410K355j1159P617P321j3708Q42J289r16J0351j1371
$$ 5757 -4867 5508 3618 2208 4563 -6596 1021 8342 -5366 -4524 -3235 -4151 6200 -5171
494e171o426J7014n096n672P966k877M913j026j0181J3278K449j2409M193j341
$$ -5171 -11597 5417 321 -5351 2615 -262 4651 3625 -6556 6722 9171 -3238 955 -386
508c86J503P261j5073M41J2332r646l1L572n228Q141l743q020J3407q04n952N144
$$ -386 1117 8378 -6695 -6254 6078 -3568 -3599 -27 -5255 2886 -857 -8877 4530 3726 -2226 2918
524B918n020N207N023j3171N297N346q792N182k527m310J0619q605m868J2433
$$ 2918 -2102 3105 8128 -5043 254 5600 -3192 1990 -537 -4847 5772 -2833 -7701 4732
538D732n768j446M716p830O348L771q235O025j407k967P918q090p35R822r925
$$ 4732 -1036 -2482 2234 -5596 752 4523 -3712 2313 906 -2061 5857 -2233 -2968 6854 -3071
553c071P09O641q097O635J9j1430J0610K289q208N143l281J266O241r230K468
$$ -3071 -2362 4279 -3818 2817 2836 -8594 2016 4305 -3903 1240 -2041 -775 5466 -3764 -1296
568a296N926o806N135k813n790J2711o585r936J3680j715n536L404n926O143N655
$$ -1296 4630 -2176 2959 146 -5644 7067 482 -9454 4226 2511 -3025 379 -5547 596 6251
583F251j1672L418N552k787K846o839J090J1577j1044l297J0148n738J741r91
$$ 6251 -5421 -2003 3549 762 3608 -3231 -2141 9436 -1608 -4905 5243 -495 1246 255
597B55q375J2770P42j4616P965L537m143K918o342L574Q414q436R0L069j300O725
$$ 255 -8120 4650 5392 -9224 -1259 2278 -1865 1053 -5289 -1715 6699 -1737 -1647 1422 122 6847
613F847q229m740J6759p602j0919J1256k288k427L102q267N213N568q954J884
$$ 6847 -1382 -6122 10637 3035 -7884 3372 1084 -1343 1759 -6508 -1295 4273 -4681 -2797
627b797O86N77O566q667L74J1136q321n28N530o567O514j43j1249J0021J612r687
$$ -2797 -2111 -1534 5032 -3635 -3261 7875 -446 -974 4556 -2011 4503 4360 -6889 3132 4744 -4943
643d943N294j809j977O328o397l71M689l733M041j914l335J0839n539o106J1243
$$ -4943 351 -1458 -3435 2893 -3504 -3875 814 -2919 1122 -792 -4127 6712 1173 -4933 6310
658F310m950k724Q171r096O96Q692q732j170L205j886L763n942j840R425n884
$$ 6310 1360 -1364 6807 -2289 -1593 7099 -1633 -2803 402 -1484 2279 -3663 -5503 3922 -1962
673a962j569N283o006P046K475j2445R016N446r921L829j80j781P315q494k977
$$ -1962 -3531 1752 -4254 2792 5267 -7178 1838 7284 -2637 1192 1012 -769 6546 -1948 -4925
688d925R457l916k292r31j501R142n236q656J1858j087m925N572n728L609Q181
$$ -4925 4532 616 -1676 -2607 -4108 5034 -202 -8858 3000 1913 -3012 2560 -3168 441 8622
703H622j2617O48R953n139j519j534l48P763o853m680Q143l139k4R93o914R435
$$ 8622 -3995 -3347 6606 1467 -52 -1586 -1934 5829 -1024 -5704 2439 -700 -724 269 -6645 2790
719B790K193j3076Q065M946o238L862m093o22R455p278l521O343k645J849k732
$$ 2790 4983 -8093 -28 4918 -1320 2542 -1551 -2173 7282 4 -3517 2826 181 2030 -702
734g02m036R609m360p196R345l450j661O530q983K357R469r064N74M081l506M241
$$ -702 -4738 4871 511 -6685 2660 -790 -2451 4079 -4904 -2547 6922 -2142 -1568 2513 -993 3248
750C248k816k750O977n016j349N162o968L877L407j0056N844L577p351N447j932
$$ 3248 432 -2318 4659 -357 -1706 3456 -3512 365 3772 -6284 -440 3137 -4214 1233 -699
765f99l336Q726n026l275P211l760R36J360n513O799o6p128N576j655j501N531
$$ -699 -4035 4691 -335 -3610 3601 -159 777 2137 -3376 3423 3357 -3771 1805 150 -1351 4180
781D180q954J197J0020r517j128O516l800L143j576m960Q741j241n281M233k645
$$ 4180 -4774 -3577 6443 -3074 -4202 2314 -1486 1657 81 -4879 3862 2621 -2660 1573 -1072
796a072L487K007j0582O593O215j0308K520J882k717N815o395l252J0595m134
$$ -1072 2415 4422 -6160 433 6648 -3660 -1140 742 -1975 3840 -2555 -5807 4788 654
810F54m127L630j887N210j273q241Q649J417o592L766k493J345N989j0428R75
$$ 654 -3473 157 -1730 3480 2207 -6034 2615 4032 -2560 1206 -1287 58 6047 -4381 -3406
825c406R544p473o82K279k917O128l214n763Q293j279l192K924m423N401K692
$$ -3406 6138 -1335 -2017 262 -2655 3473 259 -5504 2789 1510 -1682 1242 -3181 2220 4912
840D912j0372N342M890p189L537j309k900P574n067l773P013l363Q9J616n032
$$ 4912 -5460 -118 4772 -2417 1120 -189 -3089 4485 -582 -4355 2658 -705 -616 1000 -4032
855d032O283L85p284O598n88l183O050o250l63P812o866j56M048n081M086p7o156
$$ -4032 2251 2636 -4648 1950 1362 -1821 4229 -2021 -2384 5428 -1438 -1594 2454 -2627 1459 1382 -4774
872d774O556q36l959M384l710J967M555q277K972N409o160L693q83m369Q655l548
$$ -4774 1782 946 -3013 1371 -2339 -372 4183 -4094 -1122 4287 -1873 1820 937 -3432 5223 1675
888A675o487P475j406k383J873m834N054K094q546M646K111k964M117n501K50
$$ 1675 -4812 2663 1257 -1126 747 -4087 967 3061 -5485 -839 1272 -1692 2425 -3076 -2826
903b826J0151p761l144P401k657J151j017n451P844q0q264M492K60q17K068p376
$$ -2826 7325 -436 -3580 3821 1164 2315 1298 -4153 3691 3611 -4653 -161 99 -718 1350 -6026
919f026M277O728r051J151M281k628N026m125m078J0566k788o264N178j289J041
$$ -6026 -1749 4979 -4072 -2921 1360 -1268 3758 -367 -4445 6121 3333 -2931 2247 958 1999
934A999M84o936N530K577p547K816l84r88N762p275q07R259n407j242M129l778
$$ 1999 2483 -4453 1077 3654 -3893 -1077 -1461 -2449 3313 -3962 -4769 4490 -917 -2159 1970 -1808
950a808M909k5o420O537L68m905L269k632P09L953p784J733M338n767L608l82
$$ -1808 3101 3076 -3344 3193 3561 -1344 1925 -707 2 3955 -3829 -2096 2242 -3525 83 -299
966b99m814P768k149m938O966j767j486L818m738K848L245o448L061K19k966N726
$$ -299 -5113 2655 506 -4432 2534 767 -719 3099 -1639 1209 4454 -1994 1067 1286 -1680 4046
982D046n465l343Q187m223k469M327l952L503J704p458N980K589n630L768j642
$$ 4046 -1419 -4762 3425 -798 -3267 1060 -2892 611 2315 -5143 837 3426 -2204 1564 -78
997g8j59N559p004o29O299m182L28j36l510P383l231o851Q058k07l893L260l362
$$ -78 -237 5322 -1682 -2311 3988 -194 134 -2 -3512 3871 640 -6211 1847 1640 -2253 1007 -2355
1014b355K483M132p588K093M654l521J831l268p42P953o075m456P570k454p35
$$ -2355 128 4260 -3328 -1235 3419 -102 1729 -1539 -2281 5672 -403 -4859 2711 257 -478
1029d78Q67m735N927J489q202N084J919k778K993m440J143O635o676q97M898l330
$$ -478 389 -4346 1581 3070 -5132 -48 1871 -907 2086 -2354 -1211 5424 -1252 -2149 2749 -581
1045e81K560j911m299P923k242o072O280j889j027K981n323L149M251o588K692
$$ -581 1979 68 -4231 3692 1450 -4622 1658 -231 -1258 1723 -3600 -451 3800 -2788 -96
1060i6J597k908M864l503k558O880l833k271M469m254K057J417n942M558J073
$$ -96 1501 -1407 3457 -46 -2604 4276 443 -1828 2641 -1613 444 1861 -4081 477 1550
1075A550n028M196k287j168O296m895r89N409l653J585J141m623N617l18n483
$$ 1550 -3478 718 -1569 -2737 3559 -1336 -2325 3084 -569 1016 2157 -2466 3151 2833 -2650
1090b650M792j518k150L977n551J063N517o339M33K682k851M535k292l729Q071
$$ -2650 2142 624 -1526 2451 -3100 -2037 3480 -2859 -2426 256 -2595 1940 -352 -4081 3990
1105C990k203l945M569k189J146K103o393L856L101o189J796n91j008M987o004
$$ 3990 1787 -2158 2411 222 1368 3471 -2922 934 4035 -2154 -358 -949 -1957 3030 -2974
1120b974j693Q103m212j994L323k266M326k87o198O282J264m656K229j752J372
$$ -2974 -4667 3436 -776 -2770 553 -1713 2613 2326 -3872 2410 3674 -982 1247 -505 867
1135H67L400p661J242N588n425Q03J98k201O266l504m780P479q48k842L168l054
$$ 867 4267 -3394 -2152 3436 -1989 -1186 -988 -3189 3077 -427 -5207 2272 1424 -1418 1750 -1304
1151a304L001K021o424L282K263l731K656k847q61O126o267j717O141l809M87
$$ -1304 1697 3718 -2706 576 2839 -892 1764 -1083 -1944 4182 -2085 -3802 2339 -1470 -983
1166i83J880m363M712Q25n290M478J81j846L044l977J105M292n792J277K142m027
$$ -983 897 -3466 1246 2071 -3219 1259 1440 -406 2638 -1339 -234 4058 -1734 -457 1685 -2342
1182b342M201j343n010O360j442l608M522k721L04L768m893J595L418l580K308
$$ -2342 1859 516 -4494 1866 424 -3184 1338 -1383 -1079 2689 -2204 -609 2809 -771 1537
1197A537j174j745N654m356k729N561l289K1K145n352M079K539p089L124K319
$$ 1537 363 -1382 4272 -84 -2813 2748 -541 -520 1625 -3727 352 2891 -4198 -1074 1245
1212A245k255K416l175M13N465m692p00L441k329K581j556m865P358j023o553
$$ 1245 -1010 1406 -1769 -1356 4109 -583 -1283 2158 -171 2410 854 -4011 3347 2324 -4229
1227d229M827n10q72K376n199K450M766n567M33K130q33L015m063j400O953l360
$$ -4229 598 88 -784 1592 -3607 -1157 3609 -1958 -1525 605 -228 2787 -1276 -2676 4277 917
1243I17k869L458k382K290Q58o718M956K759o231J931R64p67K849m209r0N331
$$ 917 -1952 1506 -876 1414 2272 -4446 510 3269 -2962 -1031 -67 -834 2015 -2194 -2284 3047
1259C047l670J68J104k328M796j720n105O283n31m073L709k550l3L695n181J002
$$ 3047 -623 -455 649 -1679 3117 1397 -3708 2575 2044 -2029 1680 -870 -903 2792 -2389 -1387
1275a387L424l549J469o33j582M965k955k426M951l089N73L107n215L178K708
$$ -1387 2037 -1512 -43 -676 -2258 2707 -248 -2674 2277 -812 -239 2868 -2347 831 3539
1290C539n715K686J013l006L145k760j413M562k928o96K002k670L664K7n061N121
$$ 3539 -2176 510 1523 -1483 1662 -1098 -2511 2051 -877 -1573 429 -2241 1423 1450 -3611 1510
1306A510M79l479L503k143k85M515n107p43M681l318k12r8j786M466k344l568
$$ 1510 1989 -1490 2013 -130 -415 4100 -1007 -1750 2931 -387 -599 -697 -2483 1983 -361 -3929
1322c929M819r14q45K179l956L553L200o622K350L732l424J268j469j339M819
$$ -3929 890 -24 -869 1310 -2646 907 4107 -2515 -165 3567 143 1411 -58 -1397 3422
1337C422l656k923L852j421M95n62l288N602j43n326M529O53j611K716l627P87
$$ 3422 -234 -3157 695 -726 -231 -793 -4081 1521 1378 -3948 581 1234 -377 2339 -1288 -501
1353e01N276n132j059L540k102J277j882k374M965k164l134L832j923P00K188
$$ -501 4775 -357 -1416 2124 22 1299 -583 -2957 2008 -156 -3290 542 -1381 -681 1507
1368A507m711L214L277n153K231J454k300K808j953j775M125k466j371K076k705
$$ 1507 -3204 10 3287 -1866 365 1819 -481 2327 374 -1401 2724 258 -1113 963 -1742
1383a742K458j23m239M290J43l414L664j645j004M482l777n01M160l085P44R55
$$ -1742 716 593 -3646 644 787 -2627 1037 -608 -1612 2870 -907 -1408 2752 -333 411 1366
1399A366k901L266n60k962K988j632l51K669m598J639L656n089J647K115l084
$$ 1366 -1535 1731 1171 -1791 1197 -435 -786 1883 -2715 -1076 2580 -2509 -862 1253 -1831
1414a831L144q34l098M819r73k422K206j345J587O02m537L549J467m330K395q46
$$ -1831 1313 479 -2619 2200 1227 -1195 1011 -334 1253 1855 -2682 867 2334 -1996 399 -447
1430d47j175M304m418j351N739k739j230J956j571K677n31l816M069M11k327J434
$$ -447 -1622 2682 -1736 -3087 2652 -87 -1317 639 -932 1745 1214 -2602 1467 1878 -449 985
1446I85k252J774K661o225J664L881m009P00O08j796M033k033l209M635j89j526
$$ 985 -1267 507 3168 -3057 -1393 2488 -1521 -821 -213 -2009 2024 -9 -3218 1417 1228 -298
1462b98R06j796L254N12m928L067J119l009K599k719n29M752m349j578M603k193
$$ -298 608 -1188 2066 2578 -2350 717 1836 -1173 1426 -1293 -1822 2930 -1419 -2997 1606 -587
1478e87l6J007k471L414m3k935K681l77n21K026l490J386K978n017J573J922l441
$$ -587 -623 384 -2087 1327 1284 -1651 1030 653 132 2158 -1332 54 3032 -1985 -412 1510 -1931
1495a931K651o13l227L966n54k276K523j414R51J702l307K110J288k841K730j526
$$ -1931 720 107 -3120 846 292 -1984 539 -875 76 1778 -1529 581 1869 -972 1758 232
1511B32j341M287l395k125M315k178p75J567l082K235J742l702J709Q61o34J658
$$ 232 -1109 3178 -217 -2342 1973 -205 -980 587 -2495 -260 1482 -2220 -511 350 -284 1374
1527A374k824R98L925m185K59K599k526K126j137l535M732j03m373K646m00j25
$$ 1374 -1450 -452 3473 -712 -453 2146 -380 1746 609 -2926 1806 1703 -2670 -24 -424 -549
1543e49J010k988J954K677l464R97N77n89L187l551j312N623k396k803K936j919
$$ -549 461 -2527 -573 2104 -1360 -363 214 -375 2812 -739 -2051 3572 1176 -1627 1309 -610
1559f10J218P24m056K655J621l373Q94r2O34K318m019P58M032l056K83R71k084
$$ -610 608 1332 -2724 -69 1552 -1821 -927 -1019 -385 1933 -2086 -1328 2704 -352 -69 902 -1182
1576a182L879j397l951M384j89l039J980j622Q96J565l369R40J771k033J690j075
$$ -1182 2697 1300 -2651 1733 1544 -1495 485 -1137 -241 1324 -2045 -1105 666 -1367 323 -752
1592g52o78M082k854j537M044k127k43K217l330J630J561l574J347M64j176K152
$$ -752 -1430 2652 -202 -1739 2305 178 -65 2152 -1178 452 2013 -1561 -214 250 -926 1226
1608A226k202o09L065k743N70J322k061K632K6l513L788J25k825K581j440n17
$$ 1226 -976 -1585 1480 -1263 -693 629 -1432 1200 1226 -2287 1501 1626 -1199 1382 -58 -575
1624e75K816l101m25K292j522M05m27j052L233j915k351M010j349o90K046k918
$$ -575 2241 -860 -1285 1007 -515 -110 -537 -1589 1644 -271 -2622 1388 39 -651 1395 -1523
1640a523K001K238m341J109K222j761J014j716m57L567k982j289K542j128J017
$$ -1523 478 2716 -1625 -516 1706 -55 959 -757 -1214 2353 -629 -1918 624 -504 513
1655E13n32k581L791K88m053L230J66j069J903k922O27L410l330k85J579q38J146
$$ 513 -19 -2600 1191 1479 -2574 656 822 -247 1656 -1266 -639 2771 -559 -844 735 -103 1043
1672A043j659j545M108j817k255K876j486N22J399l422J974K673l579J075J007
$$ 1043 -616 -2161 1947 130 -2125 751 -735 -213 1186 -2236 -262 2411 -1168 -93 914
1687I14j270J920k189n60L367k304o63J387j838J914j86l175L299j14k201K486
$$ 914 -356 1564 -625 -1185 2182 -122 -785 602 -1236 678 492 -2683 616 502 -1699 787
1703G87j153n98K640k312j85K719k324Q23L57j709K501j021j968K836j715m64
$$ 787 -366 -964 1676 -636 -821 1898 -426 397 754 -955 1546 525 -1443 1393 -322 -786
1719g86J932k964J113K261l256J256J033j754K198j034j378L296j395j174J823
$$ -786 1146 -1818 -705 1556 -1700 -444 589 -1165 1033 -1 -1379 1917 522 -652 1171
1734A171j557J185N58l267K327J267l047J354o03n11K529k808o54L818j970n96
$$ 1171 -386 799 1357 -1910 417 1684 -1363 -9 -612 -1123 1406 -1402 -2056 1762 -208 -804
1750h04J282j182K382p25k834L203O3j724J273j793Q88J924l784N84K642k326
$$ -804 478 -704 1678 953 -1881 1322 1385 -339 934 -859 29 1953 -1831 -1247 1395 -931
1766i31N28j92q90L163j892j837L236n57p00Q87k060K608O07l685J937J031j820
$$ -931 -403 -595 -1485 1678 -214 -2051 1185 628 -72 815 -1245 1363 1970 -1715 222 1253 -567
1783e67J205j775j7L140l102o82K736j467O46Q9j938L056l94k586K727o09l67
$$ -567 638 -1137 -1154 1986 -1116 -1798 938 -529 117 206 -1732 1324 930 -1656 1071 462 95
1800I5J336k532J026K030l172O24J328j739J589r34j526K985j210j300K215j382
$$ 95 1431 -1101 -75 1955 -1217 -593 735 -1004 585 -349 -1875 1110 -100 -1400 815 -567
1816e67P10J254k736J743R88j968J223l93j162K762k197q47K387j852M33P32k256
$$ -567 143 1397 -1339 404 1392 -576 647 254 -908 1854 -343 -1190 1197 -655 -222 510 -1746
1833a746K282L39k748K191j24p41J647k127N30K739k804J17J535j376J416q62
$$ -1746 536 875 -1873 318 194 -547 1100 -1027 -497 2242 -562 -445 1090 -286 1130 268
1849B68j953L005n24k547K003q92O52R51k955J714K109k910P22M66o98K187k020
$$ 268 -1685 1320 796 -1751 252 -640 12 963 -1992 -278 1831 -1079 -357 109 -589 1598 -422
1866d22r25L342j258j291J280j308J626j2l364K705R49k643J181o19L80K020k939
$$ -422 -1347 1995 737 -554 726 -582 1044 1032 -2332 373 1322 -1321 -140 -759 -379 1641 -1298
1883a298J9K888j907J50M82j115K454j079k322L060m33j557J203j674J038J382
$$ -1298 -1279 1609 -298 -148 334 -781 1673 594 -1728 1332 899 -658 545 -1129 -91 1291
1899A291l110J016J858k005J255m50r89K662j908p22K578j486J21Q18k199K073
$$ 1291 -1819 -803 1055 -950 305 -145 -1134 1528 -380 -1102 1476 -10 111 929 -1270 803
1915H03N84k631J632kj333J771j685l78K477k013P7J324j576J495J36k256K599
$$ 803 1387 -1244 388 386 -947 824 -861 -1239 1238 -775 -698 626 -950 545 681 -1575 1024
1932A024j35j537J815j490K02K123k949M74J616k029R88k97j279K517j125j603
$$ 1024 889 -648 1167 -323 -121 2002 -947 -473 1143 -886 102 -195 -1474 1043 -82 -1685
1948a685K587r01j47Q38j895J787J126l082J546J017j410J330j650m47K755k160
$$ -1685 902 1 -146 692 -1203 584 1710 -1372 174 1191 -219 1111 -539 -986 1769 -391
1964c91j011K015j134L68K05j957K934j20k497K059j71l04J579k552O65K627l006
$$ -391 -1402 613 -521 -153 52 -1905 1029 909 -1588 471 300 -4 1575 -977 -312 2315 -691
1981f91K58J275j343J280j079j419L063j143j678J793q64O23P38k481J933J159
$$ -691 -433 842 -501 779 -300 -1719 1344 201 -1477 316 -548 75 813 -1668 265 1424
1997A424k422J167L45q32J895j884n73K741j915o56J140j339J610m62j849K332
$$ 1424 -998 169 514 -318 1577 -307 -880 1861 -54 -710 430 -909 701 239 -1610 722
2013G22l95j495J781j372K63J990k532O78J958k160Q70L04j446J993o41j580J917
$$ 722 327 -1168 613 -759 -496 1494 -1038 -360 1598 -562 308 612 -834 1159 518 -1062 855
2030H55j092j64J176k098J230J173k518J471K15j263K092j199j040K870j555p77
$$ 855 -237 -401 775 -1323 -93 1080 -1438 33 248 -1015 1077 -122 -1162 1708 153 -624
2046f24J530j173O71M87k005J524M30j964J332r50K02J814k386q5K605k043K82
$$ -624 906 -267 404 891 -1114 410 840 -1124 208 -742 -540 1274 -1112 -1197 1408 -635 -353
2063c53P36j371K033m51j872K258j14j238J080j332J021J052l074J034J541j810
$$ -353 383 -988 1045 594 -1278 980 866 -372 708 -624 397 1449 -1625 -591 950 -860
2079h60J073m07j121K950j784j635K755q21l25O27j359J730N03k556J549L05q30
$$ -860 213 -194 -1315 1635 -149 -1784 971 150 -175 452 -907 823 1326 -1230 319 624 -206
2096b06J130j845L34K473l015k55K323j480N19J54j629K580m68j995K012m34m6
$$ -206 924 -921 -587 1886 -1129 -1384 939 -541 -22 132 -1497 1083 615 -1380 632 198 152
2113A52R79j990R74J461k444P74L80r72J519j252j070K660j304j011J751j306
$$ 152 1131 -859 115 1576 -868 -94 286 -686 833 -419 -1489 1171 -133 -1144 607 -699
2129f99Q34O11k052J621N16j282J365j131k99K102k196j84K021j777N46O45k091
$$ -699 135 746 -1306 315 831 -451 914 -217 -516 1586 -610 -794 1227 -550 -4 641 -1450
2146a450J858J04k055J743r8q58J504j481L56J758j902M13Q21j128J441q75j623
$$ -1450 408 512 -1543 200 102 -756 748 -733 -377 1381 -521 -108 713 -415 1026 151 -1472
2163a472K676p88j639J622q36K46J023k281J130J386j970R15j03k43J630j836
$$ -1472 1204 416 -1223 399 -437 -191 832 -1449 -319 1067 -903 12 -91 -334 1296 -540
2179e40m67K723j537m03R84j413J528q7k310J881N11j774R85p59M08J255k222
$$ -540 -1007 1716 179 -224 760 -653 875 788 -1522 359 870 -904 81 -678 -270 985 -1237
2196a237L57J934j313N27j80o97K240j388j586K463o54j081J200j430P80J185
$$ -1237 -880 1054 -259 268 88 -609 1631 243 -1343 1120 466 -615 585 -845 -65 1120
2212A120k389Q48J046j241R44q17k72J976j616l88J841j225L63O56j785J572L21
$$ 1120 -1269 -421 625 -616 328 -489 -761 1215 -401 -789 1052 -173 190 846 -939 633 954
2229I54k139J560j63p01J155j308K0J625j895N83P85j291J402l11j490K332m86
$$ 954 -1185 375 212 -489 666 -642 -622 1003 -892 -309 476 -815 587 276 -1214 1118 632
2246F32j101J548j319J07J480k051O33Q90j621J019l16r25J890j193j020J981
$$ 632 -469 1079 -240 -133 1347 -704 -71 819 -802 217 -99 -1024 866 -327 -1347 634
2262F34r01J2J071j733J362Q90k352J447M24j273J309j170l84J987j652n58J278
$$ 634 -267 -255 816 -917 445 1335 -1017 430 854 -419 890 -280 -664 1323 -329 -887 391
2279C91r32O79j75j484K366l66j690J696j77n52J330j874N42J734j938L54N59
$$ 391 -541 138 -37 -1521 845 479 -1211 485 308 -244 1086 -788 -246 1488 -450 -96 463
2296D63p91R21q61r31K362j304r61J619r81O01N81k100J643J017k296J220J53
$$ 463 -328 593 -268 -1199 1163 -141 -1102 517 -464 137 718 -1382 261 1278 -1018 202 355
2313C55o04J325j549j98K024j551r3O83j021J377m43j634K060m06j366J464r23
$$ 355 -249 1076 -473 -671 1353 -198 -291 392 -629 748 305 -1329 731 325 -1041 423 -500
2330e00J25J381k029O27J333j492Q79M7q42J523q73p60J646j203k18R79j596J023
$$ -500 -375 1006 -1023 -396 937 -555 324 371 -471 1052 179 -581 1065 -138 -356 623 -973 50
2348E0P59k168J196L54r86J257q50m92J916j230k74J398j295Q14L57j734J540
$$ 50 809 -1359 -163 191 -795 462 -388 -880 1036 -194 -468 930 -365 449 806 -928 612
2365F12R9j408J116p73l06J559j871R6J584j184J15M21p96J652o05j079J819o38
$$ 612 711 -697 419 -354 -660 899 -972 -876 708 -476 -361 60 -736 916 311 -768 1051 413
2383D13l22M97j212Q26R98k411J004Q12j300R03q36l81J981j184j045J696m34
$$ 413 91 588 -624 202 1200 -1211 -207 605 -695 208 -628 -1009 972 -212 -1257 439 5
2400EJ43L07j243J647K60k078J324L58j070P89j268K86J830j980j19J246q97P17
$$ 5 148 455 -788 859 1119 -959 365 723 -347 442 -826 -540 1290 -690 -809 437 -460 257
2418B57l53j039K127l54j476J525o31k8Q39j788R20J191j886O19K64q75J246j019
$$ 257 -96 -1135 992 638 -838 687 56 28 867 -921 -1 1190 -696 -77 187 -688 558 -461
2436d61o02J852j106k49J021r55Q42N30j786J337K33j241J199o17m89J571j396
$$ -461 -1063 789 -317 -566 455 -500 342 872 -914 423 656 -585 614 -3 -492 1079 -317
2453c17l12J402j106K57K39j080J283K4j490J707m16n51J157j404L77J286j613
$$ -317 -629 773 -333 -76 163 -917 366 390 -1100 607 191 -360 797 -607 -230 1056 -557
2470e57N08N71r80J035m82j031J856q91p87J180p59J48O72j569R10J048j461O32
$$ -557 -49 522 -458 577 95 -936 920 29 -758 422 -337 -189 483 -1086 -176 872 -589 43
2488D3J4m87J585j361n15J836j141k51N64p00J058j75j504J464j03r37O92p28
$$ 43 57 -430 1155 -206 -721 1115 -26 -277 287 -413 645 470 -1034 430 327 -610 82 -646
2506f46N23J050j626K32J354j249N14p1n69J700r60j061J545n37m37O41j201J004
$$ -646 -123 927 -699 -467 887 -362 152 81 -488 1212 252 -809 736 199 -238 403 -798 206
2524B06O29k021R87M80r09P82m34m36J791j220n90J468p92K16M36j376J370j24
$$ 206 835 -1186 -199 281 -628 154 -280 -716 1075 -145 -735 733 -59 157 593 -783 587 463
2542D63j294J061k23n64J101j120L6J351j573N66M30o60Q18j97q22J172l53m73
$$ 463 -831 230 7 -557 544 -576 -540 811 -762 -196 234 -426 392 195 -627 545 192 -281
2560b81R39q29L33P10j788R66M53j195O52p0n38J313r82n38J414o11k3M78r45
$$ -281 658 -171 162 872 -916 50 503 -692 -40 -110 -648 665 -317 -855 559 -52 -75 403 -542
2579e42R78K98j343J140j46n73J014j232j43J616j489j30R78o90K07J17j070J459
$$ -542 436 734 -609 531 385 -188 826 -406 -549 1067 -422 -552 426 -264 -57 60 -1010 449
2597D49k51r94J099l05J19N41j330O38J101j612M60N58p83R63j014p58J744q48
$$ 449 198 -796 303 -2 117 658 -672 -34 1067 -545 -85 473 -310 653 -361 -1119 625 -223
2615b23o37J040o12M05M18j315J258K62j129Q46l75O4R41j403p7J596j143m41
$$ -223 -860 180 -432 -27 391 -924 334 596 -533 313 -62 2 943 -460 -537 1059 -84 -525
2633e25P18p62Q35j70j121J401k21p75R46q67L88R49j408N74Q76j193N87k2o16
$$ -525 193 -569 266 96 -1025 376 155 -620 326 -541 -153 796 -612 -38 838 -355 232 210 -406
2652d06J174o70p84J083n94r0N31j002Q75K01j318J041L6m91R44p17j23J375j297
$$ -406 768 98 -686 397 -197 -287 244 -758 117 318 -1000 41 77 -414 530 -187 -310 1065 -232
$$ [...]
8191A67
##END NTUPLES=NMR FID
##END=
