##TITLE=1H_1-2021
 CDCl3
 8 sc, 
 13.1.2022
##JCAMPDX= 6.0         $$ Bruker NMR JCAMP-DX V2.0
##DATA TYPE= NMR FID
##DATA CLASS= NTUPLES
##ORIGIN= UXNMR, Bruker Analytische Messtechnik GmbH
##OWNER= root
$$ XWIN-NMR		Version 3.5
$$ Thu Jan 13 11:13:32 2022 Russian Standard Time (UT+4h)  she@DPX200
##.OBSERVE FREQUENCY= 200.131346
##.OBSERVE NUCLEUS= ^1H
##.DELAY= (6, 6)
##.ACQUISITION MODE= SIMULTANEOUS
##.ACQUISITION SCHEME= undefined
##.AVERAGES= 8
##.DIGITISER RES= 18
##SPECTROMETER/DATA SYSTEM= spect
##.PULSE SEQUENCE= zg30
##.SOLVENT NAME= D2O
##.SHIFT REFERENCE= (INTERNAL, D2O, 0, 15.7039)
##AUDIT TRAIL= $$ (NUMBER, WHEN, WHO, WHERE, WHAT)
$$ ##TITLE= Audit trail, XWIN-NMR		Version 3.5
$$ ##JCAMPDX= 5.01
$$ ##ORIGIN= Bruker BioSpin GmbH
$$ ##OWNER= she
$$ F:/spectra/data/she/nmr/H-F/1/audita.txt
$$ ##AUDIT TRAIL=  $$ (NUMBER, WHEN, WHO, WHERE, WHAT)
(   1,<2022-01-13 11:12:25.17 +0400>,<she>,<DPX200>,
      <created by zg, POWCHK disabled, PULCHK disabled
       configuration hash MD5:
       00 E9 B6 7A A2 85 ED C7 34 08 36 98 17 FE 4E 26
       data hash MD5: 16K
       04 06 5B 54 5E 8F C4 A3 D7 43 BF 9E 44 75 9C A7>)
$$ ##END=
$$ 
$$ hash MD5
$$ F6 F3 04 76 FD C3 37 50 D1 94 08 96 19 CF F6 C1
##$RELAX= 
##$RELAX= 
##$RELAX= 
##$RELAX= 
##$RELAX= 
##$RELAX= 
$$ Bruker specific parameters
$$ --------------------------
##$DU= <F:/spectra>
##$EXPNO= 1
##$NAME= <H-F>
##$PROCNO= 1
##$TYPE= <nmr>
##$USER= <she>
##$AMP= (0..31)
100 100 100 100 100 100 100 100 100 100 100 100 100 100 100 100 100 100 
100 100 100 100 100 100 100 100 100 100 100 100 100 100 
##$AQSEQ= 0
##$AQ_mod= 1
##$AUNM= <au_zg>
##$AUTOPOS= <>
##$BF1= 200.13
##$BF2= 200.13
##$BF3= 200.13
##$BF4= 200.13
##$BF5= 200.13
##$BF6= 200.13
##$BF7= 200.13
##$BF8= 200.13
##$BYTORDA= 1
##$CFDGTYP= 0
##$CFRGTYP= 5
##$CHEMSTR= <none>
##$CNST= (0..31)
1 1 145 1 1 1 1 1 1 1 1 1 1 1 1 1 1 1 1 1 1 1 1 1 1 1 1 1 1 1 1 1 
##$CPDPRG= <>
##$CPDPRG1= <>
##$CPDPRG2= <>
##$CPDPRG3= <>
##$CPDPRG4= <mlev>
##$CPDPRG5= <mlev>
##$CPDPRG6= <mlev>
##$CPDPRG7= <mlev>
##$CPDPRG8= <mlev>
##$CPDPRGB= <>
##$CPDPRGT= <>
##$D= (0..31)
0 1.2 0 0 0 0 0 0 0 0.06 0 0.03 0 0 0 0 0.0002 0 0 0 0 0 0 0 0 0 0 0 0 
0 0 0 
##$DATE= 1642057944
##$DBL= (0..7)
120 120 120 120 120 120 120 120 
##$DBP= (0..7)
150 150 150 150 150 150 150 150 
##$DBP07= 0
##$DBPNAM0= <>
##$DBPNAM1= <>
##$DBPNAM2= <>
##$DBPNAM3= <>
##$DBPNAM4= <>
##$DBPNAM5= <>
##$DBPNAM6= <>
##$DBPNAM7= <>
##$DBPOAL= (0..7)
0.5 0.5 0.5 0.5 0.5 0.5 0.5 0.5 
##$DBPOFFS= (0..7)
0 0 0 0 0 0 0 0 
##$DE= 6
##$DECBNUC= <off>
##$DECIM= 32
##$DECNUC= <off>
##$DECSTAT= 4
##$DIGMOD= 1
##$DIGTYP= 9
##$DL= (0..7)
0 120 120 120 120 120 120 120 
##$DP= (0..7)
150 150 150 150 150 150 150 150 
##$DP07= 0
##$DPNAME0= <>
##$DPNAME1= <>
##$DPNAME2= <>
##$DPNAME3= <>
##$DPNAME4= <>
##$DPNAME5= <>
##$DPNAME6= <>
##$DPNAME7= <>
##$DPOAL= (0..7)
0.5 0.5 0.5 0.5 0.5 0.5 0.5 0.5 
##$DPOFFS= (0..7)
0 0 0 0 0 0 0 0 
##$DQDMODE= 0
##$DR= 18
##$DS= 0
##$DSLIST= <SSSSSSSSSSSSSSS>
##$DSPFIRM= 0
$$ [...]
##$SUBNAM2= <"">
##$SUBNAM3= <"">
##$SUBNAM4= <"">
##$SUBNAM5= <"">
##$SUBNAM6= <"">
##$SUBNAM7= <"">
##$SUBNAM8= <"">
##$SUBNAM9= <"">
##$SW= 18.0517287032376
##$SWIBOX= (0..15)
0 0 2 0 0 0 0 0 0 0 0 0 0 0 0 0 
##$SW_h= 3612.71676300578
##$TD= 16384
##$TD0= 1
##$TE= 0
##$TE2= 300
##$TE3= 300
##$TEG= 300
##$TL= (0..7)
0 120 120 120 120 120 120 120 
##$TP= (0..7)
150 150 150 150 150 150 150 150 
##$TP07= 0
##$TPNAME0= <>
##$TPNAME1= <>
##$TPNAME2= <>
##$TPNAME3= <>
##$TPNAME4= <>
##$TPNAME5= <>
##$TPNAME6= <>
##$TPNAME7= <>
##$TPOAL= (0..7)
0.5 0.5 0.5 0.5 0.5 0.5 0.5 0.5 
##$TPOFFS= (0..7)
0 0 0 0 0 0 0 0 
##$TUNHIN= 0
##$TUNHOUT= 0
##$TUNXOUT= 0
##$USERA1= <user>
##$USERA2= <user>
##$USERA3= <user>
##$USERA4= <user>
##$USERA5= <user>
##$V9= 5
##$VALIST= <valist>
##$VCLIST= <CCCCCCCCCCCCCCC>
##$VD= 0
##$VDLIST= <DDDDDDDDDDDDDDD>
##$VPLIST= <PPPPPPPPPPPPPPP>
##$VTLIST= <TTTTTTTTTTTTTTT>
##$WBST= 1024
##$WBSW= 4
##$XGAIN= (0..3)
0 0 0 0 
##$XL= 0
##$YL= 0
##$YMAX_a= 99011
##$YMIN_a= -65555
##$ZGOPTNS= <>
##$ZL1= 120
##$ZL2= 120
##$ZL3= 120
##$ZL4= 120
##$ABSF1= 10
##$ABSF2= 0
##$ABSG= 5
##$ABSL= 3
##$ALPHA= 0
##$AQORDER= 0
##$ASSFAC= 0
##$ASSFACI= 0
##$ASSFACX= 0
##$ASSWID= 0
##$AUNMP= <proc_1d>
##$AZFE= 0.1
##$AZFW= 0.1
##$BCFW= 1
##$BC_mod= 2
##$BYTORDP= 1
##$COROFFS= 0
##$CY= 11.3945322036743
##$DATMOD= 1
##$DC= 2
##$DFILT= <>
##$DTYPP= 0
##$F1P= 2.36226072786647
##$F2P= -0.459571619588291
##$FCOR= 0.5
##$FTSIZE= 0
##$FT_mod= 4
##$GAMMA= 1
##$GB= 0.15
##$INTBC= 1
##$INTSCL= 1
##$ISEN= 128
##$LB= 0.24
##$LEV0= 0
##$LPBIN= 0
##$MAXI= 10000
##$MC2= 0
##$MEAN= 0
##$ME_mod= 0
##$MI= 1.114404
##$NCOEF= 0
##$NC_proc= 0
##$NLEV= 6
##$NOISF1= 3.799351
##$NOISF2= 2.8
##$NSP= 1
##$NTH_PI= 0
##$NZP= 0
##$OFFSET= 15.70392
##$PC= 1
##$PHC0= -15865.75
##$PHC1= 11.80079
##$PH_mod= 1
##$PKNL= yes
##$PPARMOD= 0
##$PSCAL= 0
##$PSIGN= 0
##$REVERSE= no
##$SF= 200.130013532006
##$SI= 16384
##$SIGF1= 3
##$SIGF2= 2
##$SINO= 400
##$SIOLD= 16384
##$SREGLST= <1H.CDCl3>
##$SSB= 0
##$STSI= 0
##$STSR= 0
##$SW_p= 3612.71676300578
##$SYMM= 0
##$S_DEV= 0
##$TDeff= 0
##$TDoff= 0
##$TI= <>
##$TILT= no
##$TM1= 0
##$TM2= 0
##$TOPLEV= 0
##$USERP1= <user>
##$USERP2= <user>
##$USERP3= <user>
##$USERP4= <user>
##$USERP5= <user>
##$WDW= 1
##$XDIM= 8192
##$YMAX_p= 0
##$YMIN_p= 0
$$ End of Bruker specific parameters
$$ ---------------------------------
##NTUPLES= NMR FID
##VAR_NAME=  TIME,          FID/REAL,        FID/IMAG
##SYMBOL=    X,             R,               I
##VAR_TYPE=  INDEPENDENT,   DEPENDENT,       DEPENDENT
##VAR_FORM=  AFFN,          ASDF,            ASDF
##VAR_DIM=   8192,          8192,            8192
##UNITS=     SECONDS,       ARBITRARY UNITS, ARBITRARY UNITS
##FACTOR=    0.0002768,     1,               1
##FIRST=     0,             0,               0
##LAST=      2.2672688,     0,               0
##MIN=       0,             -65555,          0
##MAX=       2.2672688,     99011,           0
$$ Real data points
##PAGE= N=1
##DATA TABLE= (X++(R..R)), XYDATA
0 0 0 0 0 0 0 0 0 0 0 0 0 0 0 0 0 8 -8 8 -8 8 -16 16 -16 24 -24 32 -32 40 -48 50 -57 66 -77 88 -97 112 -123
37 -123 138 -154 174 -193 215 -238 263 -292 323 -356 392 -432 476 -524 577 -638 703 -776 860
56 860 -955 1062 -1191 1337 -1515 1733 -2008 2364 -2853 3558 -4682 6774 -12048 58324 99011
71 99011 85338 93255 39052 53732 15835 -10522 -5028 -43776 -47437 -35540 -65555 -32379 -29669
84 -29669 -31111 11713 5463 18983 50073 27736 48243 46089 21253 36876 9253 -5961 5790
97 5790 -30608 -24359 -21926 -46576 -22843 -29575 -34058 -5115 -21139 -8245 8128 -10358 11804
110 11804 7956 -5812 16844 -3861 -4030 11156 -12478 2043 3469 -12691 8940 -4307 -7044
123 -7044 11584 -9907 1094 6626 -13182 6328 -2608 -10741 10380 -6788 342 12449 -4651
136 -4651 14046 11041 854 21018 3766 3119 14068 -9024 402 -2123 -19074 -2909 -16081
149 -16081 -19529 -3552 -19783 -8058 -555 -13102 7286 2054 -3088 14779 -686 3151 9732
162 9732 -8650 3025 -3148 -14181 1465 -13008 -11532 697 -14384 -824 2152 -7515 11211
175 11211 2895 1578 15389 221 7939 10907 -3826 9983 1274 -5851 8157 -6590 -2153
188 -2153 5723 -8218 5681 2958 -4791 11461 222 2125 12594 -2142 8335 7991 -3422
201 -3422 11293 1294 -1902 9397 -4927 1595 4265 -8572 4356 -2765 -8438 4318 -8438
214 -8438 -4313 2326 -10351 1768 -270 -7283 7272 -2273 -601 8651 -3649 5699 5560 -4690
228 -4690 7958 -721 -3599 6151 -6708 -823 1855 -9267 2917 -2391 -6730 5510 -5381 -1264
242 -1264 4789 -6590 4059 1695 -5831 6211 -3137 -2575 4984 -6828 1953 2351 -6344 5839
256 5839 -1230 -2922 6724 -4424 1730 4223 -6155 4540 -638 -5224 4762 -5199 -1848 3304
270 3304 -6970 2972 583 -5235 5884 -2105 -907 5876 -4397 3115 2830 -5154 5004 -1627
284 -1627 -3457 4941 -4803 1011 3970 -4963 5361 1327 -1964 7638 -1196 2075 6094 -4148 4416
299 4416 1495 -4876 4526 -3766 -3214 2690 -7008 159 323 -6873 3349 -2014 -2919 5083 -3948 1870
315 1870 4039 -4483 4848 784 -3057 5226 -3424 -640 3016 -6108 1846 -153 -5432 3637 -3270
330 -3270 -2181 3941 -4851 2077 2421 -4145 4593 -850 -2069 4554 -3999 482 2420 -5515 2913
345 2913 -725 -3737 4392 -2839 600 4828 -2956 4540 3479 -1560 6386 -227 321 5180 -3600
360 -3600 1638 1527 -5399 2330 -2546 -3589 3130 -4462 429 3000 -4074 3939 937 -2006 5270
375 5270 -2411 -232 2892 -5507 700 -1213 -5751 1759 -3769 -2488 3057 -3961 2151 3106 -2219
390 -2219 5474 876 -288 4744 -3273 25 868 -6249 -98 -3434 -6038 520 -5220 -2145 1998
405 1998 -3813 3000 2683 -633 6445 1204 1955 5678 -1929 2416 1709 -4001 1974 -2535 -3221 2053
421 2053 -3989 287 2713 -2624 4130 1785 -327 5493 -808 1041 3426 -3660 1175 -710 -4765
436 -4765 1292 -3751 -2581 2058 -3753 1587 2369 -1622 5014 1321 741 5589 -1091 1837 2702 -3250
452 -3250 1930 -1207 -3526 1788 -4007 -1693 1439 -4037 1353 709 -2191 3696 -915 97 3679
467 3679 -2412 1794 1367 -2932 2814 -1012 -1655 3122 -2464 751 2307 -2299 3028 442 -1179 3597
483 3597 -2273 -57 2159 -3494 1076 -286 -3370 1979 -2571 -1551 2079 -3104 968 1118 -2476
498 -2476 3057 -827 -1106 3491 -2435 345 1618 -3112 1549 -736 -2383 2227 -2709 -924 1595
513 1595 -3482 1210 93 -2392 2702 -1415 -594 2828 -2053 1431 1459 -1970 2646 -935 -1864 2017
529 2017 -3346 -1186 -34 -4469 -289 -2341 -3455 1348 -2641 -278 2403 -1527 3385 2535 556
544 556 5510 1367 1305 4145 -1422 1064 92 -3630 309 -3240 -3729 50 -4106 -925 921 -2397
560 -2397 2953 1471 646 5133 1110 2744 4161 -369 2885 1040 -1722 2185 -1951 -1551 934 -3141
576 -3141 271 444 -1843 2527 -296 -461 2870 -1276 1149 1498 -2350 1349 -1084 -2653 981 -2590
592 -2590 -1053 584 -2757 1143 98 -1559 2739 -619 132 2497 -1701 841 469 -2498 1441 -1520
608 -1520 -1616 1428 -2412 332 1306 -1790 2566 449 -664 2830 -922 99 1467 -2302 830 -558
624 -558 -2533 1366 -1752 -817 1711 -1835 1219 1538 -870 3265 625 195 2686 -1154 606 509 -2598
641 -2598 929 -1185 -2557 971 -2256 -667 979 -2032 1348 646 -1005 2462 -835 -351 1752 -2113
657 -2113 43 -181 -2939 659 -1498 -1546 1249 -1587 789 1654 -826 2818 924 252 3003 -535
673 -535 524 1375 -2244 672 -689 -2671 632 -1969 -1257 781 -1955 816 1006 -968 2639 340
689 340 134 2581 -810 944 864 -1856 1227 -821 -1665 1102 -1656 -69 1141 -1546 1398 791 -674
706 -674 2286 -382 82 1907 -1446 798 193 -2105 894 -1391 -1479 670 -2102 113 712 -1451 1599
723 1599 247 -529 2312 -425 761 1677 -1343 1210 409 -1220 1560 -1178 -700 910 -2059 521
739 521 -43 -1784 1276 -936 -804 1327 -1258 421 876 -1512 1561 -96 -875 1740 -973 298
755 298 1289 -1512 1220 249 -1128 1699 -767 46 1497 -1079 1035 718 -1202 1598 -310 -645 1331
772 1331 -1281 255 562 -1811 865 -393 -1222 969 -1376 -127 953 -1510 824 304 -1137 1483
788 1483 -623 26 1395 -1334 873 464 -1474 1318 -618 -615 1145 -1545 313 522 -1519 1051 -321
805 -321 -938 1354 -984 280 1227 -1274 1036 318 -914 1581 -572 -101 1274 -1054 810 658 -983
822 -983 1520 -228 -384 1617 -1043 497 1076 -1149 1148 -16 -786 1061 -1213 -102 621 -1853
838 -1853 360 -445 -1591 877 -1318 -669 818 -1461 569 366 -1021 1244 -611 -440 1354 -1129
854 -1129 371 734 -1298 1032 -287 -696 1328 -986 108 969 -1322 868 337 -697 1461 -582
870 -582 -135 1248 -1147 648 497 -1176 1244 -344 -248 1441 -924 568 1069 -643 1481 195 -303
887 -303 1474 -822 56 891 -1349 756 -210 -1172 909 -1263 -542 820 -1466 293 132 -1378 883
904 883 -613 -905 839 -1439 -86 149 -1369 647 -586 -763 1243 -805 206 1126 -793 1209
920 1209 482 -622 1530 -589 -259 871 -1454 217 -35 -1432 887 -906 -818 926 -1172 502
936 502 1003 -514 1465 317 -252 1526 -584 133 950 -1402 560 -231 -1322 745 -1089 -542 762
953 762 -1105 470 324 -787 1121 -430 -467 1001 -1044 -45 123 -1409 358 -801 -1179 516 -1126
970 -1126 -166 447 -1140 867 153 -590 1291 -276 294 1269 -456 779 494 -759 1300 -243 -200
987 -200 1100 -792 247 597 -858 904 -82 -486 1062 -717 210 959 -860 841 213 -511 1320
1004 1320 -226 225 1238 -502 785 854 -551 1113 -292 -339 1018 -956 -35 246 -1311 563 -295
1021 -295 -675 714 -822 128 685 -947 660 -104 -1013 886 -627 -212 634 -1224 124 -87 -1183
1038 -1183 701 -528 -421 1181 -860 402 619 -725 1046 65 -368 1072 -613 75 438 -1143
1054 -1143 458 -261 -1093 668 -1049 -515 421 -1100 325 182 -741 936 -426 -125 1146 -598 573
1071 573 436 -760 890 -209 -546 851 -818 -137 424 -1100 414 -180 -981 653 -702 -360 569
1088 569 -844 552 355 -666 1050 -153 -171 917 -705 502 428 -809 801 -141 -465 971 -542
1105 -542 201 739 -610 941 298 -377 1280 -109 128 879 -709 595 223 -813 644 -409 -555
1122 -555 549 -951 197 214 -724 783 -176 -306 1018 -486 411 846 -363 806 163 -540 865
1139 865 -397 -45 758 -857 467 -25 -886 506 -439 -566 440 -904 65 435 -876 754 -175
1156 -175 -482 930 -654 169 492 -736 715 -12 -666 639 -668 -201 501 -707 343 119 -513
1173 -513 761 -234 -377 685 -584 236 224 -717 678 -283 -596 553 -709 -8 284 -1028 513 56
1191 56 -734 737 -364 -3 736 -496 667 375 -639 883 -270 -210 741 -694 362 338 -658 554
1209 554 -253 -444 664 -612 1 505 -822 526 -35 -510 723 -363 -93 651 -684 367 239
1226 239 -423 894 -249 -125 716 -555 210 436 -584 822 -98 -356 539 -551 -21 392 -729 304
1244 304 39 -567 691 -515 -75 546 -695 662 129 -683 644 -146 -156 444 -562 277 438 -504
1262 -504 526 -221 -351 680 -426 15 371 -746 409 -212 -573 491 -529 -132 271 -720 174 152
1280 152 -566 622 -240 -178 609 -419 154 455 -637 405 -120 -311 790 -492 132 455 -599 523
1298 523 366 -164 891 -254 -49 579 -692 419 79 -467 408 -429 -191 468 -578 29 188 -602
1316 -602 437 -89 -257 666 -335 299 509 -301 467 196 -261 679 -366 -45 475 -721 230 0 -470
1335 -470 311 -322 -193 513 -502 133 153 -615 490 13 -186 498 -320 236 517 -434 551 103 -227 548
1355 548 -333 -9 379 -680 142 -96 -412 485 -214 -188 525 -374 246 415 -416 351 -18 -214 514 -515
1375 -515 28 247 -716 302 -124 -430 536 -347 27 531 -445 338 478 -243 594 -41 10 695 -350 184
1395 184 136 -489 269 -326 -685 369 -363 -296 88 -546 311 15 -387 546 -124 29 539 -397 355 156
1415 156 -343 524 -163 -223 504 -562 144 33 -576 260 -258 -406 470 -664 135 138 -530 336 -71 -323
1435 -323 447 -241 -16 550 -747 306 23 -326 392 -419 -350 311 -523 126 357 -385 492 33 -182 539
1455 539 -213 160 362 -350 277 -27 -326 312 -409 -286 292 -527 -71 -138 -335 439 -136 -39 542 -264 349
1476 349 188 -263 480 -68 -35 525 -475 -165 59 -403 174 -227 -472 245 -288 76 525 -170 481 138
1496 138 -220 457 -32 -117 335 -471 108 105 -481 222 -213 -188 519 -193 290 492 -356 446 27 -170 430
1517 430 -310 -8 184 -358 101 -18 -551 286 -227 -159 153 -452 114 108 -426 360 -169 -301 358 -370 -115
1538 -115 222 -504 137 -230 -363 408 -270 243 389 -365 421 235 -199 507 -170 -144 107 -528 -155 30
1558 30 -274 310 -388 -155 320 -269 157 227 -120 523 32 -227 418 -54 137 433 -308 256 -6 -402 105
1579 105 -239 -73 296 -227 -30 101 -259 561 29 10 418 -251 -8 247 -367 364 -204 -390 338 -333
1599 -333 -141 181 -490 142 280 -137 449 -23 117 394 -290 147 167 -350 331 -57 -238 192 -457 -99
1619 -99 90 -414 124 78 -354 325 -202 -15 246 -211 286 -27 -142 423 -155 -88 408 -273 210 4 -228
1640 -228 244 46 -104 329 -275 93 170 -404 146 -117 -127 262 -390 9 63 -336 249 100 -214 292 -302
1661 -302 13 237 -316 -71 252 -225 306 -40 -64 289 -337 57 -52 -351 233 -16 -153 270 -240 23
1681 23 142 -242 123 -306 -266 213 -178 -30 145 -287 209 229 -307 174 -33 -122 254 -193 180 99 -323 294
1703 294 -6 -116 130 -342 -59 128 -341 197 -5 -258 118 -116 -83 364 -291 120 89 -246 216 -253 -32
1724 -32 274 -302 42 347 -286 322 50 -196 146 -46 21 176 -146 93 142 -187 350 -67 14 108 -189 136
1746 136 5 -294 155 -262 -105 170 -326 37 319 -126 206 142 -47 301 -150 79 244 -285 -20 -117 -341
1767 -341 93 -237 -48 84 -493 191 193 -190 306 176 20 314 -185 83 126 -379 130 -97 -350 135 -228
1788 -228 -60 144 -150 270 89 -39 393 222 123 384 63 231 191 -170 295 -237 -266 -35 -354 -86 136
1809 136 -504 309 82 -54 213 -105 216 263 -85 127 -15 -263 103 -276 -101 126 -212 90 97 -194 264
1830 264 -25 53 384 -76 191 166 -217 52 -377 -269 5 -367 4 -58 -337 177 -21 -217 422 -155 55
1851 55 541 -147 108 -6 -170 150 -54 -94 230 -358 -3 -71 -195 111 51 -2 323 -118 42 255 -174 102
1873 102 -99 -225 209 -133 -18 35 -251 2 28 -103 218 39 -20 307 -191 32 226 -113 250 -24 -124
1894 -124 312 -224 -45 42 -317 96 39 -171 100 -160 -51 199 -261 149 -5 -261 117 -50 -91 143 -188
1915 -188 -52 135 -118 289 -52 42 227 -153 120 134 -76 116 -142 -283 163 -105 -144 104 -208 136 88
1936 88 -84 177 -71 -106 267 -108 205 205 -19 365 28 -87 183 86 201 212 -308 152 47 -188 34 -84
1958 -84 -7 197 -143 137 21 -332 305 -107 -149 154 -63 78 31 -300 100 -43 -100 60 -142 122 83 -160
1980 -160 225 -94 -196 151 24 55 220 12 262 9 -103 179 -180 -259 53 -318 -63 27 -180 132 -134
2001 -134 -191 288 175 197 174 -136 226 187 14 141 -228 7 69 -214 47 -9 -160 87 -210 -115 119 -22
2023 -22 229 97 -47 87 163 -18 265 -358 -250 -50 -362 61 -221 -339 115 -289 -88 80 -145 157 -136
2044 -136 -56 292 -102 40 252 -38 120 22 -288 140 -229 -39 137 -66 -128 -94 -210 113 -52 -194 73
2065 73 -120 233 101 40 131 60 24 150 -44 -172 110 -247 -40 32 -242 123 -1 -129 128 -63 -34 79
2087 79 -206 130 79 -87 16 -133 184 143 -278 -19 37 -130 179 -102 -16 28 -72 26 50 -178 77 -239 -26
2110 -26 37 34 48 165 16 259 13 -1 218 -59 -136 200 -98 50 -41 -23 85 -189 -81 9 -227 -27 45 6
2134 6 293 -37 -159 141 -232 107 81 -95 32 -53 -85 -58 -61 85 131 -142 196 -56 -130 174 4 -119 82
2157 82 -204 -6 199 -254 106 -41 -40 -65 -73 98 86 -83 312 159 -36 282 75 133 93 -161 111 -101 -160
2180 -160 32 -104 51 28 -156 80 13 -164 262 -117 18 107 -1 72 98 -175 -108 -178 -92 4 -105 -22 -42 -197
2204 -197 92 16 -74 275 -33 -23 92 -166 -86 159 -152 29 -161 -115 -58 -304 40 -11 -199 42 -63 17 53
2227 53 -18 39 115 -57 321 -38 -213 8 -204 -154 108 -236 94 61 -127 -37 -17 -38 101 -88 93 26 -149
2250 -149 3 -67 -71 73 -134 -59 45 -27 13 118 -89 -35 -90 -150 -5 -243 89 35 -42 21 33 -143 162 -354
2274 -354 -24 56 -19 46 -64 -99 -29 -86 -93 73 -158 6 94 155 108 25 20 102 -33 41 57 -237 64 40 -29 -3 -116
2301 -116 165 19 6 230 -189 -108 156 29 19 168 -212 24 -230 -73 -35 17 -46 95 -130 17 147 -66
2323 -66 226 -35 31 204 0 149 -45 -12 91 -126 -34 27 -192 -131 69 -123 171 -52 -41 160 35 23 34
2346 34 -48 85 139 -5 146 -140 -81 248 -95 -71 153 -42 139 105 -45 127 -135 29 116 38 38 -10 -190 -94
2370 -94 53 70 7 -65 258 -56 -106 9 -56 -54 -35 -45 -60 86 -54 124 -115 -22 133 -41 97 140 -41 -2 118
2395 118 60 5 176 48 72 -26 35 -99 -59 140 -94 30 55 25 41 -133 55 145 50 -54 157 -132 88 64
2419 64 -133 153 -71 -44 -85 141 20 44 -197 -4 -106 -104 175 57 -20 92 -30 -22 81 1 -25 -100 -78 -115 -167
2444 -167 -150 7 -79 10 51 -52 86 -3 26 121 -6 42 143 -138 17 -98 -88 31 90 0 126 -124 118 -6
2468 -6 25 182 -52 -2 11 -94 53 -49 -158 31 -149 55 59 -113 -86 83 -176 -80 52 -59 21 -101 89
2491 89 -84 -76 0 -28 82 207 8 31 38 -136 -41 89 -156 33 21 71 212 -85 102 133 13 97 52 29 70
2516 70 88 -35 7 -20 95 16 170 194 -211 142 165 -153 7 153 -68 -19 8 38 -51 -71 67 50 -151 44
2540 44 47 144 -150 -185 9 48 -69 15 -17 -113 140 80 125 -41 31 89 13 -62 -18 -25 44 94 -104 -48 -50 -34 149 -26
2568 -26 -19 30 -134 21 -46 -62 -51 28 47 63 -18 99 -30 -65 215 102 -5 124 -13 67 170 -86 82 -71
2592 -71 -82 122 -169 -60 65 -167 -28 -25 9 242 -92 -110 77 -50 156 -81 67 -40 -51 -42 71 102 -196
2615 -196 -19 -66 38 5 19 195 -40 -47 -48 -32 -2 -66 -57 -82 -65 -89 129 54 -4 -81 118 129 82 -79 12 -34 84
2642 84 3 85 103 99 33 11 99 -10 -3 -25 88 -4 81 69 -177 -168 -31 -86 -81 68 79 68 74 -136 78 -104 -122 42
2670 42 -209 -16 21 23 66 -120 -106 249 -96 37 -43 -51 51 -70 -14 -54 -54 52 73 102 -175 -17 -128 -87 72
2695 72 -130 -48 118 -84 139 73 97 -32 -52 -13 -82 129 -15 -96 136 -156 -71 -34 -160 -2 78 -33 197 -35
2719 -35 -111 -43 -159 -32 77 -58 -130 -20 50 82 -48 16 12 114 -104 77 113 70 -110 155 34 -109 -85 105
2743 105 -252 135 -141 33 129 -30 109 79 -100 245 76 -12 82 -69 -95 27 122 26 -34 -32 79 111 -10 64
2767 64 93 -47 196 8 153 -6 -14 33 -42 -144 -70 97 89 -41 -204 -36 -5 12 99 -25 -41 153 -48 108
2791 108 -32 -12 39 -43 152 -69 -86 53 132 56 -96 -112 235 -44 -42 65 87 64 190 139 -18 -99 24 90 -104
2816 -104 -41 86 72 45 -129 58 77 -156 -95 48 -49 21 157 -141 -102 118 139 -94 268 -7 128 -118 160
2839 160 66 -135 147 -109 12 186 -105 5 -58 -50 -46 -61 -89 121 -55 19 114 -141 -50 -65 -101 -55 149 -13 -54
2864 -54 1 82 35 -22 -82 132 -65 16 -53 -78 -47 144 67 92 168 78 137 -132 106 -23 -13 35 96 30 -108 -6
2890 -6 45 39 -27 116 92 84 110 -4 -50 -75 -22 33 25 -97 -117 -102 14 -71 -138 -228 -6 -159 53 -89 107 58 -28 103
2918 103 -25 14 131 -142 36 -120 -17 237 -40 -56 59 77 36 25 -115 4 222 -59 54 14 38 54 -152
2941 -152 -36 -6 -81 14 -155 19 -34 -23 74 -18 64 93 -33 -7 10 31 15 43 47 -48 35 -6 33 -45 155 101 -75
2968 -75 -175 23 -66 6 -49 83 72 8 13 -36 -21 137 -15 -103 -195 26 172 7 193 -137 22 -14 -63 -87 132
2993 132 103 21 -17 -6 146 49 72 286 -3 -118 127 5 -18 80 91 -19 174 -76 17 100 -40 111 -48 8
3017 8 3 -33 208 -139 -53 39 -9 115 38 27 -146 69 82 84 -192 45 137 79 13 -17 29 155 111 -104 27 33 -107
3044 -107 -95 -64 -137 -138 -6 -1 19 -177 -98 -19 113 87 -84 77 53 -132 -53 -28 201 180 -37 79 -175 129 20
3069 20 -79 -115 80 60 -115 39 62 218 29 -61 37 -11 -37 21 -133 61 116 6 13 -76 10 73 32 37 175 63
3095 63 33 111 92 37 -93 47 -37 -45 -83 -40 50 -185 -24 94 -64 -60 117 -13 -25 25 -157 119 44 -74 -168 65
3121 65 -20 72 -12 -26 -73 38 -166 1 -159 -139 -59 -5 -83 21 137 46 141 4 103 69 4 72 -24 53 -71 50
3147 50 108 -109 120 -46 -47 24 -3 -57 94 -36 147 55 4 63 -13 -124 145 37 26 -64 -16 114 -12 -115 -164
3172 -164 102 -26 55 -33 55 -109 -76 8 -93 -20 -116 86 294 86 7 -60 29 -143 37 -42 -31 53 157 74 -90
3197 -90 86 24 40 7 34 -106 -14 -204 38 75 -80 37 66 24 -17 -112 -40 -65 64 114 147 -100 85 51 -104
3222 -104 13 -65 -82 116 -47 -61 -8 -195 -46 118 -43 -82 -18 43 15 101 -36 -30 21 -160 9 -43 65 35 -155
3247 -155 -96 -71 -133 86 -96 -6 159 48 -5 36 -5 -30 -3 -3 -120 14 -64 -139 108 6 -16 190 36 141 48
3272 48 -59 123 -30 -38 51 -8 -87 5 -212 13 -77 126 233 -52 22 149 -26 73 71 143 -56 11 -40 -71 -177
3297 -177 -67 46 -18 117 19 167 139 -83 -83 112 -105 -99 26 -131 -103 -71 11 -3 -4 33 44 -49 16 -85 4 0 1
3324 1 -109 -41 95 147 -46 -18 -56 43 65 -108 8 63 24 -104 2 -25 4 -41 -43 -51 -82 -29 104 3 -152 5
3350 5 -18 19 -6 -40 -119 -79 70 6 -120 -75 -13 24 -82 -52 36 24 64 146 202 -15 -42 140 -158 37 86 -108 -43
3377 -43 -107 33 113 42 58 24 -85 9 103 15 -37 -19 154 -5 -137 87 -65 79 -49 30 113 37 -62 201 -19
3402 -19 -71 -18 1 46 -44 -7 -129 -85 67 162 -46 -90 -246 86 5 -22 -72 29 16 -68 -69 79 -64 210 -118 -60
3428 -60 28 60 -72 -98 5 36 -97 -51 34 47 130 -84 -104 -197 -120 29 28 -4 -51 57 76 68 32 4 -17 29 -64 -28
3456 -28 34 38 141 -41 173 -40 -76 -135 23 -28 -2 -69 90 94 -43 106 87 46 86 1 -3 45 52 4 -74 -109 -3 149
3484 149 42 77 -99 81 155 -26 54 -116 -121 99 -32 1 -102 34 -114 21 150 200 65 23 -71 73 -68
3507 -68 -47 -24 -37 -53 45 -38 -173 38 -60 16 -54 36 39 -38 -124 66 -47 -77 65 128 60 -57 137 6 -95 -68
3533 -68 11 -43 137 -122 136 -3 99 -90 29 63 -85 -67 23 -29 -53 -115 -14 25 109 86 -90 28 -80 -81 -12
3558 -12 75 41 -48 -19 54 169 174 84 -19 -129 10 50 41 99 -22 -122 47 106 84 -26 -69 8 -64 -96 32 80 -25
3585 -25 -77 45 150 -108 -119 15 86 -209 18 -118 68 101 37 -16 -78 -86 -81 72 23 -75 -95 -41 -86 -24 -117 -15
3611 -15 -1 39 59 -87 -119 1 -177 137 -123 3 -124 -5 -28 -82 -10 59 83 7 -71 13 30 -203 95 -26 7
3636 7 85 -42 29 162 49 17 82 93 -50 110 123 -37 17 58 19 -84 -138 -149 -77 97 -125 -11 -53 -18 -99 -10
3662 -10 203 39 19 181 -2 -14 39 96 20 38 7 -70 71 43 10 -26 -92 67 0 122 28 -45 -4 -94 143 -18
3688 -18 103 -10 82 67 -39 -74 76 -111 56 23 -157 -45 35 -36 76 35 -39 -111 -51 -51 135 -108 93 -35
3712 -35 -41 213 11 -120 108 5 -59 36 -57 57 28 -61 16 79 12 -171 -138 118 139 110 36 -61 -58 5 87 21 20 -52
3740 -52 -173 -104 -162 -103 19 17 49 -10 -279 8 3 58 -28 -113 80 -23 4 -44 135 113 -23 71 -87 13 -69 72
3766 72 -11 16 -64 -31 68 101 124 36 107 -104 -30 -157 -152 131 27 38 115 -83 80 -72 104 -147 50 -81 -234
3791 -234 231 21 -33 59 101 52 -91 -18 9 -102 -50 -35 39 168 -58 7 -26 35 18 77 29 -69 90 55 171 -110
3817 -110 85 -206 34 -48 67 126 56 95 34 -16 -37 31 45 17 149 -152 58 -162 103 -129 -36 -68 -26 -21 -56
3842 -56 -108 -128 113 -161 -127 41 12 -1 -19 191 -19 -20 -124 205 -82 115 91 60 153 -16 -30 48 167 -108 154
3867 154 43 -140 -101 38 57 -180 -48 6 35 -64 -87 -79 -84 -3 52 -87 76 -94 32 71 -1 106 52 -3 26 59
3893 59 -14 15 9 -72 -285 17 -96 102 91 74 -69 33 -24 70 -41 -45 -50 104 76 -88 108 82 27 -41 157 -19
3919 -19 54 -14 -6 97 27 -202 90 12 -117 211 30 -161 107 -4 10 78 111 38 91 116 -47 -109 -129 -29 51
3944 51 45 48 5 -207 -48 86 -24 22 -13 62 -155 -85 -4 26 -30 -57 -114 -68 94 -36 -103 0 140 -149 -13 4
3970 4 3 36 -111 193 29 -116 152 29 206 27 -36 -79 -81 -77 -55 55 138 98 -161 103 5 -65 23 -5 -50 55
3996 55 -44 24 20 74 -23 40 -23 62 -15 69 -28 52 106 19 -68 -65 -81 -66 120 45 47 43 -179 -129 -44 -151 50 -43 -115 -13
4026 -13 34 177 68 -40 -13 -39 -191 -117 147 84 -68 174 82 -129 -118 136 29 -46 -67 27 -94 40 -173 -10
4050 -10 20 52 -75 -98 -33 -41 120 23 35 161 -20 7 -29 204 30 -29 19 -43 112 9 -90 73 118 -38 -17 -88
4076 -88 -40 90 57 -33 -39 -14 -65 36 -20 75 -72 14 -154 -12 87 31 -94 -148 110 74 -90 101 325 132 45
4101 45 73 61 156 -44 -29 -49 -61 -166 137 -208 55 60 44 -40 5 11 15 -141 89 77 2 51 -27 -153 -77 23 -70
4128 -70 2 -33 84 -16 100 -125 -92 -97 42 99 68 -94 -22 -104 225 -53 66 -52 63 268 -147 170 94 79
4152 79 80 153 31 49 -88 16 33 -57 -66 -52 9 -15 4 -103 107 14 -123 -23 20 -42 91 -11 -69 3 6 -123 186
4179 186 -88 50 21 -38 -52 192 163 10 18 -40 -14 -74 -83 5 -43 12 150 -15 81 14 -39 62 83 86 -21 -30 133
4206 133 -10 49 75 -43 -29 138 15 -104 37 8 40 154 -66 -74 18 -97 -46 66 109 -140 -9 -38 135 -95
4230 -95 81 1 -93 128 -76 69 -159 -130 -104 41 -47 -22 -133 -153 -170 142 35 10 30 -6 41 116 -49 32 -70
4255 -70 -66 -3 4 -13 66 -29 118 25 -60 124 -29 -41 9 -41 13 31 64 52 -112 -98 45 -35 -16 22 70 3 -58 -47 -25
4284 -25 6 25 -49 -8 18 99 65 -16 72 -94 26 46 39 -76 -39 36 78 95 -67 -183 46 123 97 55 -5 -66 56
4311 56 38 -4 66 165 44 -43 -97 29 -59 -18 -154 141 207 94 -65 12 -24 24 248 205 -21 -45 -95 -31 -5 -57
4337 -57 -55 -27 81 20 -103 32 -13 -116 123 11 -125 -5 78 10 -174 63 31 66 78 -38 79 -36 4 9 -7
4362 -7 43 111 -38 72 -37 -130 17 4 121 -92 -123 175 129 -139 23 -3 -13 107 92 236 -34 32 120 142 133
4387 133 -121 -24 -13 100 -21 113 -95 -38 43 138 -35 97 -29 -70 111 -62 158 27 17 76 -77 41 33
4410 33 255 45 -20 -42 -61 168 82 45 20 45 -74 -82 78 54 -118 -20 -215 -109 -46 36 -30 -57 94 -153 121
4435 121 -52 41 -18 -151 -40 36 -15 -125 104 -51 -62 1 -149 -21 -69 -10 -67 -5 20 16 42 -97 -30 72 150
4460 150 78 88 -44 32 209 119 53 66 86 -137 13 -16 -39 237 26 13 77 12 -28 33 -30 88 25 -240 93
4485 93 28 84 -9 -6 41 -39 -151 0 130 -3 153 -38 55 3 -47 240 -15 23 154 -62 38 73 43 -30 -15
4510 -15 -2 -111 -118 -33 26 106 97 17 -132 -209 201 111 -25 -58 -15 124 -129 -61 83 43 87 -84 -15 136 107 70 -11
4537 -11 -15 42 29 -15 -9 -191 8 -66 -92 115 118 57 98 -54 77 105 -63 172 102 -41 -8 -19 -122 6 10 -77 -58
4564 -58 23 76 84 -137 24 132 -34 11 -147 2 -7 150 87 26 -66 -34 -44 -56 33 91 -27 -38 172 6 23 -92
4590 -92 -90 57 13 74 21 162 -75 -37 32 -6 21 -137 50 49 156 131 -54 12 63 -34 -28 -17 8 0 -2 -242 -64 38
4618 38 44 -94 136 -79 63 -100 106 98 -7 -35 -34 38 -35 14 138 24 -195 -89 47 65 -73 -22 -90 -93 19
4643 19 114 47 -46 128 18 -39 104 64 -103 40 72 62 87 2 39 -72 -21 75 38 33 91 -64 -9 78 40 -72 74
4670 74 -76 -25 -82 -64 190 24 34 -136 96 -29 -64 29 -34 -45 -36 -69 36 -9 26 -61 33 -102 59 100 103 -36
4696 -36 -78 -31 -153 -96 -176 126 48 0 63 -8 -28 -9 18 -112 -47 199 -55 -93 92 108 104 -80 105 47 89 81 24
4723 24 87 172 -160 -101 25 12 -138 0 67 -25 -36 32 87 -10 94 -25 103 -178 44 -89 56 -87 62 -128
4747 -128 -24 -133 -22 113 45 98 -39 -90 8 52 46 -191 -37 -91 14 165 -141 115 84 51 -20 104 3 -11
4771 -11 -72 -74 51 -49 102 19 -8 -124 60 -133 -8 25 115 -12 -9 -126 44 -21 51 69 -159 52 71 94 31
4796 31 -38 64 209 -121 -25 -51 25 20 -37 109 -30 -27 -85 -13 -88 76 62 -46 -9 51 12 -36 -80 110 133 -21 80
4823 80 -137 113 -77 -23 -98 -9 45 -44 -89 -19 80 50 41 94 -23 56 37 110 -25 -151 -214 16 -32 -15 -91 103 15
4850 15 -82 17 157 -130 -30 25 -39 39 3 -3 -139 -129 -126 -26 30 -32 96 -51 67 -146 17 40 109 35 -98 24
4876 24 64 -41 -24 -108 50 66 -51 45 -16 -104 -95 -205 103 -42 106 -6 83 49 44 -130 -50 22 -230 164 -129
4901 -129 -55 -69 -56 107 22 78 114 98 39 22 -10 -210 151 -59 0 -24 -13 14 -55 127 -143 -71 -12 4 106 -76
4927 -76 157 -100 -241 14 -67 100 41 -132 99 101 3 -25 96 -38 49 82 49 145 -31 -47 -127 3 109 22 -51
4952 -51 43 43 -11 29 102 0 45 -120 -68 135 4 -170 1 -14 -137 -45 -59 40 116 -15 -17 -43 -7 108 -35 32
4978 32 8 -26 -17 53 -24 32 -124 -8 -83 -85 137 77 39 -29 29 -186 31 -108 -43 -48 53 -58 -1 175 111 84 3
5005 3 18 102 -52 27 59 -107 209 9 65 75 38 21 -86 -114 148 55 64 116 -38 98 163 -32 -169 -31 83
5030 83 -54 -4 -31 -44 -96 -122 -60 -26 47 93 97 -94 19 -35 -50 -70 74 43 -23 63 92 57 121 57 6 -144 156 -34
5058 -34 38 215 85 -14 36 76 -49 17 -59 -57 -35 -3 76 137 -33 -46 -85 9 -27 65 -157 12 2 5 49 -73 -11 -43
5086 -43 56 131 -7 -165 -146 30 64 -129 39 104 -116 72 -25 113 109 -122 -4 -34 -59 -76 82 -77 -48 -113 125
5111 125 -44 -90 86 -47 -143 107 -22 -8 -28 152 40 33 -18 19 21 -64 -196 7 -135 -10 18 181 201 22
5135 22 208 0 55 20 -87 29 9 -1 -8 134 -42 13 -9 -40 110 -99 -18 -72 40 30 -15 -6 -82 -91 -33 60 51 67
5163 67 -120 64 51 108 10 -113 -12 -104 -96 -83 9 -89 45 84 -36 189 20 -40 14 33 -14 -17 -105 -168 65 60 -48
5190 -48 -63 102 22 151 -140 15 145 59 29 88 49 -30 -57 11 49 81 59 49 65 -51 75 -2 -20 1 -132 12
5216 12 -101 -102 -155 -28 -95 -24 -115 -9 -57 76 -55 -41 -119 84 75 -79 -27 -27 -13 -40 36 10 105 28 68 87 10 -34
5244 -34 47 39 -25 20 61 0 -7 109 47 -217 -21 68 183 -83 -8 -74 -62 60 104 85 -15 97 -8 22 -105 -37
5270 -37 32 -59 -43 41 -112 -11 -187 48 72 136 174 -85 6 6 70 3 -45 117 119 49 9 -3 -94 -108 32 -41 114
5297 114 -14 -17 122 132 -59 36 -62 63 11 14 25 116 117 -54 1 141 19 -59 25 -47 90 1 82 -8 -135 67
5323 67 -43 -6 6 118 82 43 -139 -14 91 -51 153 -174 16 59 44 224 -122 -68 -29 -23 159 -37 -9 82
5347 82 116 70 -79 72 133 88 -7 92 -68 38 97 17 124 -30 -2 78 242 25 -4 8 18 28 19 -3 -79 -166 -60
5374 -60 74 1 -1 1 -93 35 -46 53 -27 -39 -45 95 -218 102 60 -47 23 -163 -93 51 -32 2 90 52 26 27 -13 -115
5402 -115 0 67 40 57 30 -12 -68 15 -78 175 25 152 -31 -128 -58 71 119 -19 16 35 119 130 -102 8 93
5427 93 -51 70 -59 -147 -90 -23 156 166 4 -18 113 83 -102 -15 -59 -159 123 91 -104 164 150 106 106 -149 154
5452 154 -44 44 85 43 -200 -110 -146 -35 -26 140 -39 -9 30 -8 -61 -14 8 132 -84 -94 -61 -66 -53 129 -92 -213
5478 -213 -84 -37 107 25 56 50 35 119 144 53 48 -106 54 -55 10 45 29 60 5 -75 13 -103 26 30 -67 -99 -33 -107
5506 -107 101 143 -177 216 111 -40 79 74 -127 -18 -51 -18 186 19 17 11 327 -22 12 -103 -118 64 -2 -3 -99
5531 -99 37 -64 -42 2 126 78 117 -82 85 15 -11 12 -169 118 21 -8 -71 -60 -48 -48 111 -71 -2 -22 23 -21
5557 -21 14 14 91 42 71 66 110 8 84 -164 59 98 32 -66 -147 34 26 -27 97 -21 29 -45 19 -172 -49 -16 -128
5584 -128 139 -35 71 -27 112 3 -50 8 -54 -97 33 -80 27 -61 66 -29 55 63 103 -54 35 -45 -68 -67 -134 24
5610 24 35 -66 -28 105 -51 -103 5 130 135 116 32 73 -61 14 88 11 -31 -47 58 -59 4 -45 -43 76 -6 202
5636 202 -109 29 -32 31 -21 46 28 17 129 55 193 95 -27 -62 -125 -13 100 -80 -5 -121 83 137 -21 88
5660 88 -31 163 -153 34 45 35 -78 48 26 -60 169 -168 86 3 14 16 112 -160 -163 -174 58 160 46 10 96
5685 96 -43 -82 4 -12 -9 102 32 -27 -23 -21 -27 43 -73 88 -20 93 54 93 -126 84 115 -1 54 59 275 77 179
5712 179 -7 -66 -17 1 -281 5 -114 -7 15 -9 -38 -158 96 -94 27 8 46 -71 2 -41 -169 99 -34
5735 -34 -71 38 115 -6 -10 132 49 185 -16 87 135 0 50 -10 111 97 10 -184 22 39 90 -69 -60 125 -47
5760 -47 6 -33 110 -75 -243 -28 53 12 -38 49 111 12 111 7 -132 -109 136 -33 -94 -24 18 114 -95 -30 71
5785 71 -46 23 74 64 -13 55 203 161 74 -85 -77 55 0 59 -27 88 -5 -29 128 -101 4 82 -131 162 -85
5810 -85 -27 -71 -11 152 58 -148 143 -17 53 -176 3 -33 9 -13 64 137 -122 52 -59 -80 -97 118 -43 -5 -23
5835 -23 -89 29 60 -49 111 60 51 -81 -147 -91 116 136 -13 43 -57 -150 -130 106 -18 6 -60 55 75 181 -148
5860 -148 -70 -191 -68 20 -33 188 190 -111 47 -12 -44 42 21 -110 26 -211 42 141 -92 66 14 -49 34 110 -43
5885 -43 118 99 -72 127 -169 -51 52 -22 -34 62 -157 -24 -117 48 -137 60 -70 73 -34 60 84 -75 -54
5908 -54 -81 175 -25 -80 -107 118 -85 -43 -43 9 -6 51 62 -49 -69 -55 22 24 -89 -14 -65 12 -96 -66 -37 22 22 -37
5936 -37 -20 153 -114 65 55 109 -44 -135 22 -52 -145 -180 -108 -101 10 4 78 -28 39 2 -17 40 48 -1 46 -31 -102 59
5964 59 91 -177 13 -25 -107 106 4 -80 85 -87 -43 59 -7 -47 -103 92 -20 2 -2 6 5 -64 17 16 10 -78 91 -175
5992 -175 -179 168 27 31 -16 -46 -12 102 67 -74 132 143 84 74 96 -27 -136 -159 31 -23 94 -129 -4 -34 69
6017 69 151 9 -100 -85 83 69 -16 12 -222 -80 -115 5 -34 -83 172 36 -35 -124 -133 37 122 19 122 -37 63
6042 63 12 -110 14 43 139 -119 -8 85 -2 13 34 -129 -336 32 -103 -74 18 -47 -40 -18 -23 81 69 -28 -39 -40 -7
6069 -7 6 117 107 -4 -9 162 -90 45 167 -63 -98 -56 89 58 128 -21 -107 -113 -76 -150 43 -36 -71 -18 149 230
6095 230 21 -21 5 85 -16 -136 42 -12 -85 59 71 84 -135 -167 -45 -231 20 -6 95 -71 120 69 108 113
6119 113 6 -46 -19 1 -39 7 -90 79 -78 -67 -174 32 -58 67 -41 -53 33 45 135 -34 -106 -15 65 -79 -147
6144 -147 -158 82 24 187 44 -203 178 38 -35 63 84 -181 -61 86 44 -16 -276 -187 15 77 -37 22 -17 1
6168 1 205 131 -223 -18 -80 47 -131 -28 -107 -8 -105 102 88 83 86 46 22 102 5 28 177 -8 20 51 -67 -97 8
6195 8 53 -12 30 77 82 55 7 78 144 5 -11 35 -65 -6 34 -19 -21 18 77 110 9 -10 67 -48 48 -79 -81 120 2
6224 2 11 -44 150 44 75 2 -62 -43 139 -46 -50 38 9 -104 7 58 -158 174 -4 -17 -81 -39 -18 167 104 -24
6250 -24 -16 45 -4 -11 -12 -37 8 -34 -90 -134 -13 -30 -37 -123 219 -160 -37 31 40 18 -10 -180 32 88 -74 -116 79 60 45
6279 45 -97 -58 164 -88 31 16 -27 -99 34 -64 -87 -100 -5 -114 103 -101 -60 -173 -39 -221 -216 93 -36 -136
6303 -136 -4 22 22 14 -106 170 -69 23 100 19 -8 2 -24 84 84 -104 51 -13 140 32 -82 68 65 107 -80 -119
6329 -119 -32 -146 -3 -170 159 163 15 -180 -78 89 -110 -23 -98 62 36 60 -22 106 -92 51 74 -62 29
6352 29 -61 17 25 140 4 47 -159 45 -97 2 -10 -114 18 102 19 -65 78 41 -7 -86 43 -72 77 -98 127
6377 127 -215 31 -80 66 -4 -110 -67 43 -44 23 -124 204 46 41 -1 113 -22 193 45 70 79 -70 -141 42
6401 42 -66 -1 8 -53 -178 131 53 -59 -69 -45 -31 30 116 122 96 15 -26 -99 -50 43 -2 -83 -12 49 156 -161 14 -3
6429 -3 86 27 127 132 -4 2 -137 -240 -89 82 -40 -17 14 59 15 65 -7 -49 -95 110 76 -229 44 -61 -253 -132
6455 -132 105 13 78 -107 -73 -244 96 135 -5 64 -16 -37 -12 -76 46 -196 -9 -32 -78 87 19 171 79 -63
6479 -63 90 125 -13 41 91 -28 -3 35 -127 72 -85 -50 -184 -48 81 2 -150 -22 34 -101 -6 126 -108
6502 -108 -71 -67 -10 -14 -47 18 -50 141 -39 85 100 -26 39 -135 60 45 -119 76 -59 37 24 -47 4 -32 -4 25
6528 25 -81 150 -101 -71 -89 24 -21 54 -152 13 45 -96 10 80 -115 -49 137 -129 -15 -83 -99 -171 -92 60
6552 60 -22 -137 -40 116 -104 42 59 72 -46 -20 211 0 -33 -9 -164 -61 -183 -53 -113 144 -89 -73 36
6575 36 72 -9 144 11 -110 71 -30 -134 -52 135 11 40 8 -213 44 26 16 16 -101 -9 49 -77 20 79 -22
6600 -22 -84 -30 -198 83 -85 -95 115 76 2 -211 -50 47 245 -79 -101 -130 15 -166 87 -104 -7 -63 -70 38
6624 38 57 -116 52 -43 -26 -112 -26 -144 -182 62 -90 123 3 129 -108 -116 -62 -20 -24 3 -60 -4 161 2 88 -47
6650 -47 78 -157 -6 21 -40 59 27 141 -73 68 65 -65 187 -37 -108 -36 1 -8 -98 7 -165 -2 99 30 -35
6675 -35 -57 -118 151 1 -22 14 9 -80 33 29 89 -105 128 -66 90 -2 -42 -10 18 -82 -62 157 145 -5 -67 -51
6701 -51 -22 82 -28 -176 235 -57 112 31 21 -87 -150 -66 -31 30 -110 -180 -64 164 -80 12 -164 81 -126
6724 -126 -36 14 -24 22 30 -61 146 -35 -35 145 -78 -74 146 57 -39 -11 -11 52 158 6 56 -30 15 24 24 -17 -169 78
6752 78 101 -98 72 16 -101 -91 -91 97 0 -6 -64 15 -53 -78 79 -102 109 2 107 24 -29 -27 4 -53 43 -88 204
6779 204 13 -71 122 -33 8 -97 -5 75 50 -87 -11 -118 -55 20 -70 124 -64 -105 7 104 -130 -108 71 -13
6803 -13 -53 -151 -69 -1 33 24 -21 -114 179 -18 -101 49 48 77 -57 -43 -78 -121 116 -59 -22 66 -13 -41 100 15 174
6830 174 -105 -61 81 16 -87 4 -45 -90 -110 -1 -142 18 12 -11 93 99 -96 -157 5 -115 65 -84 -107 -3
6854 -3 -36 -11 -60 20 14 107 24 82 35 92 -102 -12 63 79 -21 64 71 -19 83 -56 77 -46 -78 -48 -96 -37 0 -4 69
6883 69 2 -50 -80 43 -35 15 -39 -143 48 151 17 -61 61 19 152 -141 -24 -221 123 -47 -41 -73 177 137
6907 137 -9 123 -52 81 -45 -56 -28 25 11 -37 108 143 -10 -98 -12 -13 121 -77 -2 125 2 -21 4 -42 -104
6932 -104 20 -12 -91 -131 5 -2 -71 -38 -49 28 -6 101 13 7 50 11 159 -15 -8 -129 -18 73 6 -209 53 51 77
6959 77 58 25 -60 -102 -125 120 -37 -32 7 -3 41 -35 44 -131 5 -55 7 10 15 -59 56 30 -36 17 132 19 43 93
6987 93 20 87 80 46 53 -10 -106 5 193 -74 -136 102 141 -11 64 3 108 -107 -27 -25 59 18 -17 -88 -59 -108 106 105
7015 105 -13 18 34 -127 -118 -37 -70 -40 -46 -8 -32 140 17 -116 -29 52 41 -95 -60 -51 -224 -68 90 21 49 -136
7041 -136 -70 5 159 23 -108 201 -72 -17 -61 -71 56 3 -64 -29 -184 -61 -38 -47 -77 -61 -160 14 6 18 0 -81
7067 -81 184 139 -42 -67 -39 91 -48 -54 -81 -84 -27 38 -44 -84 18 78 -6 25 119 -28 40 -43 -180 -104 64 85 0
7094 0 8 -127 14 -19 17 97 101 -48 151 -173 -17 -53 244 -33 -51 -93 -4 88 -167 -134 -3 -124 143 69 -17 103
7120 103 -108 35 -65 -69 127 65 89 89 -55 -1 14 26 75 24 77 -69 70 120 25 -8 -29 27 24 7 -29 126 -63
7147 -63 127 59 27 -43 76 -137 49 -6 129 60 126 -33 -97 43 -100 84 -53 -38 36 122 40 51 198 -143
7171 -143 -81 -50 194 111 177 -32 -22 -8 -10 -27 85 -57 12 121 -68 74 34 25 -88 8 87 34 115 -54 -119 -30
7197 -30 4 28 -212 143 -37 75 -12 -9 76 -12 3 -94 -143 -112 -127 57 47 -152 62 -73 -80 -35 -78 26 -11 10 4
7224 4 -58 -58 -45 -24 149 -47 -39 42 -78 101 90 11 2 49 -29 115 -82 -29 14 100 -127 28 76 74 -91 -83 -12 -96 -19
7253 -19 -56 -135 -23 -35 -177 61 -118 -91 5 8 -122 -209 20 -32 -129 19 66 9 46 -140 -70 0 -28 -40 0 -74 -3
7280 -3 -31 -8 -2 -57 -183 -19 -108 -48 127 189 114 206 -6 -148 -80 -33 -81 23 -126 79 -96 -123 59 -16 -6 18
7306 18 6 95 84 231 22 101 -39 164 -50 -155 17 -158 108 -2 62 15 93 75 64 203 25 -108 -64 100
7330 100 -41 -67 149 -45 88 -39 -2 13 -14 -28 -21 -56 -63 61 -13 124 -10 -72 65 -50 34 3 -16 194 52
7355 52 -88 17 12 -68 -43 -153 49 173 158 -15 0 194 -51 -10 93 15 110 44 -25 -54 -117 -22 -73 -59 159 15
7381 15 -52 -100 -155 13 44 -57 -5 43 -18 -27 -159 -157 23 74 -47 -30 35 -66 -16 -93 -147 104 -23 -137 98 87
7407 87 -145 -51 -42 57 97 -8 36 -12 76 -74 -8 -15 55 -15 -136 117 -113 -33 146 97 61 -59 -117 -94 -30 70 31
7434 31 75 69 103 4 5 56 19 80 68 131 -153 -181 263 82 178 32 -23 -68 99 189 -83 -19 2 18 11 -146 9 -81
7462 -81 49 102 -80 -8 -7 -89 8 -113 -70 15 9 -47 -117 -74 49 122 156 -52 53 8 91 -29 -95 20 8 -104 59
7489 59 104 13 103 229 -99 35 -13 29 95 -15 37 -46 58 19 -79 44 -300 -40 -59 -3 53 -121 -31 -29 -117 -9
7515 -9 -63 45 18 45 -8 9 69 -66 1 53 -100 -115 81 38 57 3 71 65 53 -54 -123 83 1 89 -3 -119 69
7542 69 11 -178 193 -110 -48 -98 -13 33 96 -87 48 30 13 40 -14 -209 -144 30 -131 12 -7 -126 158 25
7566 25 -44 201 -58 125 -8 -30 39 -190 -13 -79 -53 121 -175 -4 83 -95 -70 -99 -94 116 -21 -175 167 -66
7590 -66 -68 -13 -108 -21 -119 -23 -145 -88 173 74 -123 -3 2 63 69 -52 167 17 9 -72 11 19 27 -41 84 -86 -185 -74
7618 -74 87 27 114 109 -47 -17 -128 -65 -15 -60 27 -42 -31 -24 -88 -64 -1 80 109 -85 -192 63 108 -42 109 -108 -41
7645 -41 60 150 165 -16 -96 -6 -110 -15 -49 43 43 87 8 43 91 115 -90 79 0 3 -172 57 115 -57 -64 -57 -97 -30
7673 -30 2 43 -36 -121 164 -81 -33 -81 -225 -129 26 -128 -151 36 -125 -135 150 -73 141 -22 48 -58 -54 -30 -2
7698 -2 46 28 -74 -176 49 -167 -81 9 -106 64 -72 -50 11 -101 -115 146 -68 44 33 -18 14 1 43 -115 33
7723 33 -44 71 -54 79 1 -13 -39 60 -194 110 1 -125 -15 -15 148 -153 -97 114 -45 -45 -51 128 -84 -112 43
7748 43 13 83 -54 242 -35 -128 32 3 -42 -126 30 166 -9 0 180 -155 -120 41 -115 15 31 -18 25 -46 -269
7773 -269 56 -62 -30 -67 36 63 -167 138 26 -24 -25 -107 77 97 -10 -13 -87 -68 -174 121 -148 28 -160 195
7797 195 80 43 3 93 0 -136 -61 -32 -99 -112 141 -29 133 217 -87 27 -122 121 159 102 -103 -10 19 -52 -71
7822 -71 100 33 -163 6 -20 141 16 -69 -106 87 -75 164 21 17 9 1 -9 -32 90 -67 -114 -35 -109 97 -8
7847 -8 -144 27 30 13 -183 -63 48 133 5 27 33 172 100 130 78 9 -139 11 158 -97 -42 37 6 -30 50 53 -48
7874 -48 66 -47 78 110 -25 -49 -86 -104 119 4 -20 -163 -39 103 -236 104 51 -42 -46 -74 -92 41 1 87 120
7899 120 -71 145 50 8 -34 144 160 204 129 25 120 -117 -89 -32 -12 -56 -22 -108 188 94 -150 56 62 -57 137
7924 137 5 -136 16 80 68 -179 -16 -69 -54 55 -153 -13 -61 -197 25 -42 -87 -104 145 -95 59 -51 -1
7947 -1 -225 58 -38 62 -112 -19 66 108 74 53 -11 -164 48 -43 -11 -148 124 11 -35 -57 95 57 -12 -21 -2 -83
7973 -83 95 53 -116 0 4 -26 130 135 -69 -85 13 35 -104 -47 -60 125 5 -112 142 55 -18 33 3 45 34 -27
7999 -27 14 -157 54 -47 13 17 -53 -141 120 118 -24 37 -74 -60 33 143 -91 -15 -134 92 62 115 212 -36 106
8024 106 51 62 47 80 88 75 -58 41 32 171 79 103 114 -95 -193 -168 86 61 23 -24 62 -113 9 41 25 -41 -27 22
8052 22 8 13 -62 -5 22 -30 -126 -35 40 110 -36 118 -41 41 104 -192 121 44 96 13 62 38 84 9 -63 110 -103
8079 -103 -27 -38 32 -103 165 -161 -118 72 45 18 -120 -161 -99 71 -68 -130 -44 -57 -117 153 -126 -134 -74 193 96
8104 96 -74 21 -98 -12 -9 -23 123 113 127 176 132 17 -46 23 -69 -16 53 11 -54 91 165 -78 -162 32 39 -39 -86 193
8132 193 -38 -36 47 143 1 -36 -24 -43 -62 -77 31 57 31 5 -43 -46 -117 6 18 -2 41 -22 -112 -98 -2 91 115 51 -52
8161 -52 -6 -70 -81 -50 -166 -76 -144 -83 -56 16 112 13 -112 -57 -70 -29 116 -160 46 -98 -1 -17 6 -117 -60 56
8187 56 34 107 38 27
8191B7
$$ Imaginary data points
##PAGE= N=2
##DATA TABLE= (X++(I..I)), XYDATA
0 0 0 0 0 0 0 0 0 0 0 0 0 0 0 0 0 0 0 0 0 0 7 -8 8 -8 8 -8 8 -14 16 -16 16 -24 24 -27 32 -33 40 -43 48 -55 60 -66
42 -66 73 -80 90 -100 109 -120 132 -147 163 -179 196 -217 239 -266 296 -328 369 -417 475 -547 639
63 639 -761 928 -1180 1588 -2362 4312 -17981 -18598 42157 32027 62801 81303 59096 82473
77 82473 63839 38125 51378 6946 -2272 -3493 -43996 -28203 -35151 -52042 -16487 -26957 -15191
90 -15191 17463 4551 32629 43128 28186 57118 39120 28196 43634 9788 11784 11832 -18440
103 -18440 -1735 -14337 -26957 -3687 -22424 -13883 1457 -18444 4096 2651 -11058 14104
115 14104 -2439 -3918 11730 -10849 2132 3557 -13489 9058 -2973 -7247 11810 -9339 100
128 100 6486 -13988 4977 -3547 -14238 4829 -12173 -6668 5349 -11478 7997 7580 -2366 20572
142 20572 8157 8997 23350 3828 14119 12966 -5170 9772 -4457 -11343 1668 -17287 -8792
155 -8792 -2583 -17917 1255 -2416 -8056 10844 -1622 3436 12199 -4395 8552 3384 -9830
168 -9830 4766 -9989 -11652 -1220 -18252 -7156 -5232 -16956 791 -5940 -7265 7779 -5862
181 -5862 3241 7962 -6544 8317 1749 -6287 7582 -6697 -3577 3185 -11695 1296 -766 -9625
195 -9625 6234 -3956 -2559 8486 -5671 5371 7335 -4076 10739 3053 202 12100 -1460
208 -1460 5272 8843 -4463 8360 2596 -4335 7704 -4694 -2037 3932 -9801 1032 -621 -8965
222 -8965 4603 -4429 -3169 6646 -5574 4087 5979 -4061 8841 1662 -1392 8740 -3783 1587
236 1587 4865 -7382 4176 -669 -6188 5644 -5131 -1535 5046 -6778 3512 2205 -5624 6176
250 6176 -2958 -2547 5417 -6670 1241 2296 -7115 4625 -1494 -3274 6571 -4310 1657 5043 -5324
265 -5324 5063 614 -4307 5542 -4471 -1505 3748 -7326 1499 363 -6322 4603 -3143 -2195
279 -2195 5324 -5205 2228 2852 -5538 4419 -1662 -3861 4389 -5747 -829 2593 -6599 3177 83
294 83 -3479 6487 -2165 1401 6800 -3084 5442 3845 -2411 6685 -1261 -1070 5006 -5305 1018 1437
310 1437 -6263 2999 -2639 -3651 4440 -4681 549 3812 -4599 4450 982 -2549 5893 -2542 61
325 61 4666 -4898 2417 596 -4957 3647 -3311 -2545 3709 -5271 888 1947 -4757 4102 -975 -2289
341 -2289 4969 -3845 49 2594 -5545 1710 -1366 -4949 2848 -4685 -1871 2859 -4927 2608 1893
356 1893 -2466 5987 -3 652 6553 -2147 2877 3375 -3324 3858 -1289 -3086 3702 -4444 -286 2724
372 2724 -4081 3589 1272 -1646 5895 -1081 886 4716 -3317 2388 400 -4691 2305 -3809 -3488
387 -3488 2139 -5044 321 2043 -3005 4796 1055 190 6497 -790 2107 3706 -3621 1982 -1709
402 -1709 -5246 667 -6126 -4213 -419 -6726 -318 -550 -3667 3952 -596 395 5428 -1515 2627 2837
418 2837 -3038 2986 -1691 -3181 2015 -4562 -1417 1086 -4293 2587 561 -1334 5406 -229 1613
433 1613 4713 -1912 2576 687 -3358 2040 -3310 -3130 1021 -5274 -530 351 -3639 3241 -109 -467
449 -467 5283 -488 2421 4024 -1614 3683 652 -2212 2982 -2943 -1589 1512 -4228 804 58 -3182
465 -3182 3176 -1452 -799 3343 -2450 1620 1727 -2834 2835 -880 -2020 2897 -2520 357 2067 -2545
481 -2545 2972 777 -1292 4479 -758 401 3296 -2251 1980 654 -2696 2710 -1779 -1397 2191
496 2191 -3270 717 881 -2883 2873 -238 -1302 3425 -1581 889 2254 -2272 2257 44 -2153
511 -2153 2765 -1985 -654 1927 -3311 1069 -40 -2973 2082 -1377 -1092 2452 -2097 1512 1790 -1616
527 -1616 3646 553 -499 3306 -1822 269 1131 -3711 418 -2311 -4398 -180 -4340 -2763 -226
542 -226 -4261 532 528 -1651 3740 847 1479 4670 107 3012 2352 -1910 2070 -1748 -3206 166 -4780
559 -4780 -2594 -1310 -4960 -153 -1214 -2143 2550 -544 1241 3621 -423 3642 2386 -637 3256
574 3256 -329 -738 1862 -2307 547 405 -2540 2086 -211 -550 3186 -641 1467 2490 -1251 2670
590 2670 401 -1431 1816 -2164 -1063 695 -3076 872 52 -1945 2237 -739 -166 2601 -1335 1464
606 1464 1125 -2055 1639 -1239 -1788 1384 -2402 -294 729 -2559 1756 264 -805 2915 -531 699
622 699 2050 -1733 1541 -29 -2404 1282 -1971 -1712 950 -2525 409 851 -1531 2457 496 164
638 164 3266 -455 1550 2060 -1510 1609 -213 -1903 1212 -1982 -1073 847 -2478 997 444 -1279
654 -1279 2473 -240 175 2198 -1593 731 665 -2639 597 -1735 -2312 323 -2876 -373 646 -2133
670 -2133 1568 556 -516 2938 -44 1179 2338 -1266 1656 208 -1887 829 -1842 -1414 346
685 346 -2808 13 196 -2007 1616 -165 -139 2298 -713 1143 1633 -1440 1641 -62 -1283 1316
701 1316 -1766 -391 779 -2123 898 229 -1134 2124 -199 503 2276 -888 1335 1025 -1338 1476
717 1476 -659 -1175 1154 -2174 -373 188 -2156 785 -258 -1058 1600 -984 447 1733 -926 1479
733 1479 693 -875 1902 -620 -157 1528 -1638 383 439 -1635 1104 -797 -1007 1210 -1801 129
749 129 710 -1937 972 -185 -1081 1471 -1315 -2 1021 -1767 1038 183 -1202 1514 -707 -275
765 -275 1511 -1253 734 858 -1172 1512 -19 -380 1806 -897 605 1073 -1643 1199 -19 -1149
781 -1149 1441 -1379 -168 831 -1662 657 54 -1303 1392 -736 -388 1384 -1156 738 867 -1109
797 -1109 1445 -455 -692 1412 -1521 74 634 -1617 820 -369 -1124 1245 -1241 -264 1088 -1612
813 -1612 675 55 -1263 1380 -654 -374 1237 -1443 724 411 -1246 1417 -220 -486 1452 -756
829 -756 582 1226 -789 1531 269 -357 1916 -697 186 1131 -1172 860 -28 -1282 946 -1097 -746
846 -746 867 -1472 212 332 -1439 1057 -499 -687 1405 -1163 229 698 -1154 918 -387 -1050
862 -1050 1159 -1140 -364 775 -1396 572 -136 -1221 1227 -765 -308 1005 -1220 518 367 -1256
878 -1256 1122 -519 -782 1295 -973 286 978 -1048 1425 272 -353 1875 -386 470 1499 -776
894 -776 1084 437 -844 1303 -560 -314 1165 -1034 367 455 -1103 1163 -479 -594 1094 -1328 -50
911 -50 270 -1578 630 -583 -1314 924 -1156 -334 687 -1159 786 440 -567 1638 -254 140 1255
928 1255 -835 513 279 -1285 803 -865 -1042 749 -1433 10 536 -1020 1112 219 -179 1738
944 1738 -184 331 1258 -803 1055 388 -1051 990 -873 -495 785 -1203 398 592 -948 1279
960 1279 -106 -321 1453 -653 213 644 -1156 684 -382 -1119 496 -1332 -572 123 -1515 210 -197
977 -197 -1203 827 -648 -241 887 -791 541 362 -973 1238 -272 -537 1218 -720 330 723
993 723 -1081 826 -201 -761 897 -877 -36 553 -1038 814 109 -1013 1249 -421 -22 1114 -662
1010 -662 891 609 -510 1486 121 29 1065 -615 437 448 -901 672 -204 -596 1006 -796 126
1027 126 577 -720 837 372 -460 1065 -300 -185 721 -918 385 30 -1188 651 -637 -566 572
1044 572 -1024 336 559 -833 868 94 -131 1329 -407 480 792 -706 753 96 -779 855 -709
1061 -709 -348 365 -1246 135 -112 -1040 550 -487 -467 785 -860 382 610 -628 892 98 -286
1078 -286 940 -639 16 561 -1027 276 -217 -1038 640 -738 -481 518 -1054 223 189 -999 616
1095 616 -405 -355 831 -894 129 358 -985 738 -326 -876 755 -786 -168 416 -971 420 197
1112 197 -520 990 -171 35 985 -536 763 458 -593 668 -282 -340 735 -913 -11 217 -1083
1129 -1083 578 -149 -672 626 -764 222 691 -648 747 233 -418 1123 -292 72 902 -501 575
1146 575 244 -720 500 -184 -305 685 -724 110 290 -897 565 -302 -404 770 -407 268 598 -612
1164 -612 584 139 -561 880 -545 -224 672 -864 287 129 -596 661 -108 -201 950 -575 233 467
1182 467 -672 562 -55 -450 581 -728 -74 237 -965 383 -268 -608 525 -370 -172 741 -698
1199 -698 491 163 -537 661 -170 -110 705 -612 248 375 -679 521 -49 -376 700 -503 50 394
1217 394 -879 467 -107 -610 529 -689 -219 323 -865 302 131 -710 696 -104 -172 699 -572 441
1235 441 620 -425 697 -70 -371 834 -455 -49 440 -856 311 78 -529 716 -336 -258 551 -696
1253 -696 290 151 -585 689 -266 -383 624 -696 211 261 -623 449 -147 -267 757 -459 93 607
1271 607 -536 496 47 -349 616 -502 -18 379 -871 236 94 -598 488 -249 -239 428 -620 200
1289 200 177 -705 372 -126 -362 525 -566 -10 480 -559 384 -31 -360 726 -90 -10 536 -399 403
1308 403 358 -517 744 -406 -284 588 -643 -7 139 -679 311 -254 -371 508 -409 106 537 -621 560
1327 560 51 -174 643 -146 24 668 -540 294 247 -644 593 -398 -198 380 -573 -28 161 -623 333 -315
1347 -315 -446 665 -314 -86 401 -541 303 90 -114 719 -402 -243 290 -597 160 138 -676 396 -361
1366 -361 -294 534 -320 107 412 -291 525 -123 -265 393 -404 -18 423 -704 163 -162 -477 304 -534 -174
1386 -174 155 -708 315 185 -503 702 -136 63 546 -318 428 399 -171 505 58 -257 344 -506 -51 291
1406 291 -528 361 -54 -347 423 -273 -49 577 -444 412 256 -213 675 -87 -108 672 -497 111 141 -410
1426 -410 370 -95 -338 415 -469 -57 199 -541 394 -112 -270 411 -377 -98 308 -614 246 -17 -383 276
1446 276 -419 -157 322 -354 207 271 -567 359 150 -244 474 -153 347 476 -109 547 68 -406 413 -211
1466 -211 -21 56 -731 52 -93 -411 298 -419 -213 334 -265 261 291 -347 609 16 -78 677 -46 142 142 -406
1488 -406 232 6 -434 350 -372 -90 181 -536 254 217 -364 383 -76 -201 503 -476 84 -29 -598 334
1508 334 -304 -458 227 -371 74 177 -262 599 284 -19 576 136 136 500 -306 118 187 -432 282 -267 -131
1529 -131 304 -460 143 317 -295 485 -10 -112 590 -421 152 175 -479 162 13 -348 239 -212 -48 423
1549 423 -326 227 229 -161 511 -179 -79 333 -268 -16 30 -682 324 -356 -195 24 -506 -116 112 -427 242
1570 242 5 -175 531 -214 83 311 -283 176 124 -286 353 -295 55 150 -342 -154 79 -203 353 17 -119
1591 -119 448 -137 195 209 -356 172 52 -126 284 -409 -169 233 -586 72 -33 -221 317 -24 -25 285 -173
1612 -173 259 195 -320 326 -15 78 288 -155 98 215 -530 102 -89 -361 259 -179 -40 137 -486 239 144
1633 144 -422 297 -145 -1 197 -252 299 206 -199 202 -165 -187 330 -205 143 185 -302 129 -80 -211 325
1654 325 -273 120 176 -371 217 99 -313 405 -213 -167 362 -219 92 70 -293 150 -83 -228 404 -276 148
1675 148 298 -161 281 59 -115 309 -206 -77 151 -556 96 -118 -237 173 -147 -104 208 -361 139 126 -270
1696 -270 414 -4 -140 281 -268 217 428 -241 162 -33 -111 458 -75 22 150 -269 198 117 -126 146 -152
1717 -152 -268 184 -309 161 67 -98 249 -158 -153 249 -427 -25 298 -319 147 -166 -389 261 -255 9 275
1738 275 -125 293 24 -250 315 -89 161 335 -64 116 148 -317 70 -145 -274 237 -362 50 -16 -285 218
1759 218 -119 -96 302 -92 101 372 -91 166 175 -60 192 -283 -110 101 -447 104 173 -305 291 11 -45 236
1781 236 -83 196 257 -205 224 37 -349 166 -409 -201 38 -432 39 -87 -227 279 220 172 454 -53 244
1802 244 274 -64 288 3 -114 152 -262 -61 46 -308 120 -179 -61 220 -201 93 378 -148 275 186 -64
1823 -64 202 -242 -91 145 -244 -81 76 -225 -13 -189 -121 245 -28 113 295 -207 354 -61 -286 99 -317
1844 -317 -222 -39 -267 -30 -405 -208 203 -104 -144 347 -122 369 218 -174 189 71 -32 42 -154 -18 6
1865 6 -230 151 129 -94 291 -105 80 55 -218 413 -2 -206 129 -188 -1 -32 -284 49 -84 -216 29 -104
1887 -104 -97 265 -99 146 221 -15 106 27 -88 219 -186 8 132 -149 119 -123 -241 215 -133 30 349
1908 349 -209 206 109 -229 222 -128 -73 232 -201 -32 159 -247 123 -66 19 364 -151 88 -61 -155 234
1929 234 27 -236 175 -168 -91 169 -301 -99 138 -209 208 -146 -100 178 8 188 47 -254 146 129 75
1950 75 325 -262 203 89 -322 55 169 -204 165 -30 0 295 -98 232 13 -227 232 25 -15 258 -154
1971 -154 51 47 -301 33 -122 -141 158 -266 -112 27 -411 109 36 -8 272 30 35 164 -157 63 161 -112 99
1994 99 -44 -108 103 -107 -117 -6 -51 -31 -196 -174 184 -202 -4 129 -138 271 161 -137 305 -3 -73 232
2016 232 -235 157 -58 -197 127 -293 -92 131 -224 86 87 -38 210 -67 -178 226 -101 -30 65 -390 10
2037 10 -122 -326 -44 -254 -23 84 -159 253 -155 -134 77 -6 65 54 -231 0 122 -220 64 -122 -66 248
2059 248 -80 -184 12 -247 -9 -206 -162 10 -44 73 143 -145 7 120 131 246 -263 -23 69 6 15 -10 -259
2082 -259 8 -14 -143 155 -6 -27 161 -278 118 1 -120 127 -64 212 147 -170 35 28 -289 -102 -154 -68
2104 -68 150 -45 79 50 -7 2 -132 -72 205 -148 140 12 -27 163 79 -69 36 0 121 133 -130 -17 -76 -177
2128 -177 51 -164 22 31 -318 8 102 -69 136 -169 56 314 -158 136 200 -70 87 96 -104 142 -120 -54
2150 -54 130 -14 137 -39 -131 87 -197 69 187 -152 73 243 -20 2 -107 -146 111 -42 93 29 -55 4
2172 4 -90 -111 141 -102 152 122 -227 111 -52 -92 1 -232 -164 86 -194 -158 -175 22 56 -29 28 160 -37 147
2196 147 187 -131 131 31 -88 128 2 153 231 -110 -1 105 -103 48 109 131 211 -18 0 119 -11 139
2218 139 0 -229 -22 -291 73 -89 -129 -32 -28 -158 -13 -59 -14 94 6 190 142 -135 36 48 -24 196 -114
2241 -114 -84 13 -283 163 -38 -98 6 -96 105 -24 -115 230 -69 -20 129 -18 -17 111 -10 51 -94 -139 176
2264 176 1 -41 -18 -96 126 -72 -129 -83 76 -14 83 5 -14 40 -18 146 107 -160 19 141 -41 -13 -39 -18 -9 -103
2290 -103 38 15 -47 100 -183 155 -177 -78 -3 52 53 27 -161 190 73 -53 113 -27 0 204 1 76 198
2313 198 -225 -1 -36 -165 -92 -50 -182 33 -29 122 21 -87 56 10 -42 188 -33 59 11 -100 254 -86 -94
2336 -94 2 -32 -55 -72 -307 19 -56 1 117 -116 -141 74 -54 -18 -24 -142 150 -173 -134 167 -102 25 86 -40
2360 -40 123 -6 -39 201 -97 106 67 -116 248 54 55 208 -177 12 11 -166 46 85 -83 113 63 106 49 75
2384 75 63 -27 58 94 -151 -230 160 -58 81 33 -41 210 79 41 166 29 57 267 -75 58 -124 -158 55 -6
2408 -6 -116 24 -306 5 69 -166 200 4 12 121 -30 117 16 -59 153 -19 -65 149 -7 -63 55 -91 59
2431 59 33 59 73 -153 -112 54 -13 -35 -43 -53 114 -99 3 27 -131 -91 142 -30 154 61 -243 121 9 62 -9
2456 -9 -103 145 47 -63 74 38 -3 267 -150 219 114 14 72 -59 -106 53 -44 186 35 -36 -71 125 -195 168
2480 168 221 0 -39 -65 7 -11 -150 129 -85 26 97 -18 158 -83 -69 206 -96 146 51 -44 69 62 51 69
2504 69 -162 -56 88 20 0 71 -48 -196 69 -104 -73 -12 36 -39 35 -64 6 42 -46 -130 53 129 -46 102 92
2529 92 9 21 36 2 -25 -91 -48 -45 -30 -7 49 -185 40 -30 49 30 -65 137 72 -180 57 -5 82 161 -27 -194 20
2556 20 -106 77 -39 -21 -130 50 -35 -10 44 -70 0 79 -14 153 -5 115 59 65 -41 -108 80 -166 -86 114
2580 114 -73 -61 -90 -87 137 7 152 85 10 37 117 -80 19 35 -64 62 90 115 -60 -177 97 147 -71 -50 -38
2605 -38 56 61 -37 165 49 -138 -16 92 2 -51 -91 -201 79 -10 43 -47 -6 53 48 109 201 18 45 9 -93 -156 18
2632 18 169 117 -68 -28 -2 -61 216 43 -161 -52 16 -125 89 62 58 -58 -143 223 -70 -28 -32 -108 -14 -46 70
2657 70 28 3 -79 -61 11 18 30 46 -125 196 58 176 -207 128 98 -89 154 -32 6 73 -179 107 -225 -155 -118
2682 -118 167 97 -164 -74 115 118 -66 -93 21 -27 139 -10 -16 -31 19 -82 -27 2 -109 47 -21 98 -55 17 -157
2707 -157 -77 -101 73 -47 -116 41 -73 163 -5 -84 -11 -25 33 71 -2 99 11 194 208 -57 109 -100 -113 32
2731 32 -134 102 71 -31 162 76 -47 -103 -41 -63 28 -30 73 55 80 89 -238 3 121 -222 44 173 20 105
2755 105 -194 -158 96 -167 40 -15 -124 -77 -131 -94 29 -109 5 63 38 4 86 -72 148 6 89 79 -71 -183
2779 -183 -27 -98 77 99 96 -71 53 4 192 -73 78 16 42 -32 60 93 -79 -111 -69 -25 -94 202 16 -194 -48
2804 -48 -29 -91 32 6 -80 -3 -7 44 23 3 122 19 135 56 -105 -141 -45 -156 37 45 75 -72 -149 -37 -102 74
2830 74 -3 -66 -72 14 -15 80 46 -33 2 1 -168 135 -86 -82 -31 73 165 -35 -38 -12 136 -82 -46 13 41 25 -92 216
2858 216 -156 -54 -220 -89 13 -61 5 -52 64 -32 132 25 146 138 -21 37 54 70 -29 -134 -59 -46 -115 154
2882 154 42 -23 78 -25 130 220 -71 188 91 -106 38 -104 -219 86 31 48 22 -16 8 -136 49 -48 30
2905 30 -36 177 -150 -78 -103 -115 38 67 -116 69 -73 -12 -95 -210 174 -52 34 79 61 63 112 14 63 -103 -62 -59
2931 -59 3 207 -152 -79 255 19 79 -86 -73 81 37 36 45 132 0 -27 42 -135 -19 -48 -78 59 -16 29 50 80
2957 80 8 -24 -19 196 -11 -16 -17 -49 -118 -74 -120 53 34 -120 163 -48 45 -39 -35 -88 -81 20 -98 -106 -32 -53 11 18 -65 160
2987 160 46 -62 109 103 41 -68 -62 139 -10 123 77 -23 28 103 145 95 -35 -40 135 -84 -84 153 -141 -36 107
3012 107 53 -40 -142 -155 95 100 -78 12 73 111 27 -47 -12 -25 27 81 -185 132 96 56 124 -104 -61 -133 88 21 -50
3039 -50 -12 -15 -28 -53 -125 -73 -70 -67 -85 141 33 100 125 -23 2 -119 -132 -28 -22 -80 89 -133 -86 25 85 17 91 -62
3067 -62 -64 30 -9 -19 -22 -17 -93 98 26 21 -163 -67 -8 -6 -131 -1 -40 46 113 -48 -36 -4 59 15 18 88 -10 -7 166 131 31
3098 31 31 37 60 18 22 56 -74 -84 -16 -119 -25 59 82 -58 -81 -20 -68 99 1 -60 -43 47 -3 85 31 20 41 -78 114
3127 114 90 -31 61 66 -64 -5 -37 115 -98 83 191 -59 -96 28 17 84 36 -202 11 -93 47 -136 -154 -6
3151 -6 -131 83 -19 129 -65 73 186 -26 -168 154 -124 133 -83 -22 -118 2 89 -64 -56 158 72 112 57
3174 57 -197 -11 -102 -148 21 -13 12 -3 -112 9 204 -63 94 -111 -44 -43 -48 33 -21 7 -220 2 90 46 13 -220
3200 -220 14 -45 -150 -72 3 140 32 23 34 -83 38 -42 169 51 43 -197 -32 1 46 28 -31 108 23 26 -10 -71
3226 -71 178 22 74 -23 134 62 -6 42 -18 -125 64 -19 -21 48 -109 -62 47 44 172 -16 -33 156 57 49 -57 82
3252 82 183 102 -17 122 -90 116 42 -35 17 -59 124 30 -84 -19 -71 112 -104 -162 58 -96 47 -25 26 22 16
3277 16 -16 46 9 20 -13 61 -80 -14 -43 -135 75 4 68 -38 -116 75 41 -11 21 151 83 -17 69 7 -91 -97 -26 -59
3305 -59 -133 19 20 118 16 34 -14 -14 12 71 -295 154 61 -57 -137 -40 -125 66 -30 -84 -32 -51 -17 24 -3 -19 89 -64
3333 -64 94 -85 0 183 47 136 93 119 121 94 -59 -82 -49 -46 -112 -12 -97 75 -94 71 77 77 -180 -114 67 42 99
3360 99 -5 4 117 -31 40 -152 -66 37 36 -16 32 78 17 -49 -18 -60 42 -1 -28 93 52 136 116 48 -81 28 36
3387 36 -40 -13 -70 15 234 -107 -81 -2 81 -86 -165 82 57 4 -16 -34 -83 -35 102 -103 -46 -95 -150 6 53 9 2
3414 2 -19 52 61 73 -56 39 35 -79 84 -70 35 181 77 -25 86 -112 25 116 -139 252 86 -137 18 -129
3438 -129 2 -25 -21 99 112 -70 -47 -1 -86 -96 -13 7 -156 -213 166 -33 8 -25 -5 40 -163 66 -12 -249 60
3463 60 -36 110 114 132 -38 -179 33 -132 -85 -3 -11 16 8 109 42 -85 -32 0 -157 -13 -102 -75 71 -47 -5 -55
3489 -55 -122 -5 -152 -72 -7 56 -9 25 0 -53 -36 -107 70 -73 76 69 44 -75 125 86 93 89 39 99 -130 -45 -43 -19
3517 -19 -175 1 45 125 -64 18 32 65 19 -35 34 103 155 29 88 -33 223 50 -141 -102 31 -72 -82 -49 17
3542 17 -98 104 77 -22 2 116 40 70 50 133 -9 -42 -35 -76 -34 81 51 114 -83 -112 32 76 -80 40 -36 -166
3568 -166 -67 -83 43 4 3 -66 -9 154 89 -55 -60 202 -63 47 106 -102 55 -147 3 -56 93 135 57 -275 -122
3593 -122 -23 79 -113 30 -105 45 27 -142 65 79 -151 40 205 -57 -139 -77 -49 -156 -105 -85 -137 -97 -40 -25
3617 -25 -9 227 52 -102 8 -1 -36 -147 71 6 104 28 -29 90 -49 -18 34 41 63 101 17 -17 -213 163 -13 -22
3643 -22 121 -21 -88 -42 -9 -1 67 31 36 -14 -77 -122 -5 -98 -59 -53 11 -45 160 156 206 -33 27 34 -25 -82 36 71 62 162
3673 162 142 59 21 25 -69 15 122 -97 1 64 19 -10 20 -47 -191 -61 60 3 -24 6 -181 106 82 41 7 -91 -100
3700 -100 54 -63 -120 14 -45 56 105 -78 -80 6 57 -37 -51 -39 -19 68 36 -5 142 -33 -66 -85 111 -32 2 140
3726 140 -55 -9 -6 42 -24 -36 41 -90 -43 11 -21 -56 -118 -167 -11 135 5 51 -32 172 160 -110 18 106 15 -65
3752 -65 92 10 78 65 -151 -29 -121 194 -120 -118 -102 62 -150 186 160 -118 -64 24 -73 -40 -35 92 56 39 -17 -113
3778 -113 148 -46 15 -14 -2 -40 84 -13 108 -85 -190 -36 87 58 5 -66 26 -36 75 19 182 -64 -46 -65
3802 -65 6 -46 -13 128 -58 -25 20 -82 76 -45 -49 -94 -20 93 -97 31 43 71 77 86 -9 34 46 -236 -65 -37 -14
3829 -14 -78 57 0 -149 66 -50 51 -65 73 37 73 21 -19 91 -10 -5 39 99 -103 -31 -135 -85 -67 -68 92
3854 92 -120 132 -73 60 -84 -9 -68 -57 23 6 125 13 -195 -29 168 74 -148 -102 5 96 -121 -13 -209
3877 -209 -38 34 -65 -33 50 162 64 -76 -11 81 -35 -61 -123 -17 22 47 -155 -15 -162 88 -163 -19 -151 29
3901 29 32 -151 131 -53 25 -103 120 131 92 182 -28 -19 -84 139 -106 70 4 48 88 -143 93 87 -23 -129 -132 -15
3927 -15 -118 32 35 93 92 87 -38 -107 -29 98 -10 75 59 -132 37 -27 60 10 164 11 -15 40 87 7 -68 -58 152
3954 152 5 59 -244 -70 46 -136 26 -165 81 -81 72 -102 -42 35 79 -7 -1 14 2 90 29 30 9 42 -21
3979 -21 106 -83 77 -1 45 22 7 -2 -238 -5 109 69 -75 -8 -74 145 99 -1 8 -24 -209 2 -48 30 -27 2
4005 2 -40 -117 -226 -116 -77 46 158 -32 -259 -81 1 181 65 35 80 -34 73 72 -151 -89 119 -66 -16 -13 -47
4030 -47 92 -47 24 6 -202 2 -32 -95 -48 -22 -20 0 50 19 -169 100 20 -52 -76 161 -23 39 41 85 73 -91 107
4057 107 -144 43 23 52 -58 24 41 -92 -130 66 -29 -1 -68 -54 -40 -120 28 -26 -157 -26 30 69 41 154 196
4082 196 97 -21 135 -14 -7 -13 -60 91 19 87 160 -179 -35 58 21 -30 -96 125 88 150 55 2 -112 11 48 -149
4108 -149 -106 -279 -92 -86 -37 -91 -83 -172 26 -22 -160 35 -16 -79 5 35 109 26 -30 69 89 45 75 66 15 -139 138 45
4136 45 -122 14 -136 56 -20 -31 -31 115 -17 -52 116 6 19 -223 -85 -196 -106 -18 196 -54 -174 -84 75
4159 75 98 -4 -58 -194 111 -46 25 -79 198 -27 46 43 -63 -40 6 -70 -41 62 -22 64 -143 -174 -40 -85 39
4184 39 -52 99 32 -10 143 22 -78 -168 -48 -128 -83 -93 125 -55 -42 -66 -86 -69 22 -84 -227 123 -111 38
4208 38 -18 4 -52 8 26 -32 12 18 57 3 79 44 -6 -51 32 57 -151 -121 98 77 -22 17 0 -185 44 31 61 25 19
4237 19 0 -21 7 -121 15 -156 -38 -84 -66 129 -80 -6 10 99 19 -102 -6 -4 108 -63 -19 -55 43 -26 -136 -128
4263 -128 -146 94 -8 -96 93 39 -88 89 -186 95 59 20 -92 -122 -146 -57 176 24 36 -29 104 -46 -33 15
4287 15 -43 143 32 -55 30 49 -191 -147 51 37 10 -38 -77 58 -6 -52 -228 87 30 85 -104 -116 -45 13 22 44 -66
4314 -66 61 3 -10 -1 -75 99 118 -57 71 -17 186 35 -32 -83 20 58 67 -14 -20 -9 -9 -113 101 110 -93 69 -71
4341 -71 82 -105 28 -41 -46 245 -81 136 126 -38 -41 126 -12 -99 -13 65 82 -53 -25 121 -48 -35 73 -14 259
4366 259 12 -93 61 109 -114 -67 -30 2 -99 -135 -49 -51 -5 48 18 -59 -56 20 -8 87 -174 -3 -58 131 -1 62
4392 62 69 -47 69 33 -58 78 -39 -87 -48 85 137 140 44 -180 39 -10 -29 -104 -67 30 -13 65 40 -65 -120 -89 48
4419 48 33 -1 58 32 40 -16 -113 161 62 28 32 34 6 22 152 -175 20 -16 145 35 -120 -27 20 -58 14 -138 37
4446 37 -48 -103 -27 -56 -28 -17 -85 21 114 84 -101 48 -168 -18 -94 -61 -11 6 -77 51 39 -36 34 -91 -19 41 38
4473 38 -11 -4 100 -48 -25 -29 -89 177 11 -15 -5 44 87 -28 97 -131 43 70 20 9 17 -59 -30 -33 -9 -50 41 104
4501 104 198 112 -209 -51 149 -86 115 75 19 49 138 22 35 -142 -79 46 48 -52 -146 56 -7 -18 -95 -135 -36
4526 -36 190 -36 97 -160 62 -190 -41 -108 -15 -11 9 131 -17 -64 -70 -149 -11 -158 97 -134 -28 297 67
4549 67 127 -49 50 1 90 -13 -36 -88 22 -82 -62 -14 22 -55 187 27 43 -27 -94 79 -15 96 -89 -46 -8 -134
4575 -134 -49 45 -123 42 115 98 28 -186 13 -110 -39 -190 -9 -50 159 182 60 39 -105 128 91 -31 -7 21
4599 21 45 -31 11 159 -53 44 -15 -217 -23 36 57 23 85 55 -36 -196 -90 -138 -1 -78 -139 91 -50 -118 55
4624 55 -96 12 75 -106 175 33 -74 -188 144 65 39 179 -138 -66 33 -35 80 6 -80 -21 -120 36 -26 -88
4648 -88 -76 -53 -82 139 40 -67 -16 71 51 -19 -167 -32 -56 -6 87 -188 -87 -25 -41 46 -14 2 70 35 -132 -60 -1
4675 -1 103 84 66 157 90 30 -26 26 42 33 -133 0 -17 18 77 -29 101 -11 -5 -31 -30 56 72 -28 -27 28 -97 36
4703 36 132 50 31 146 -98 -78 -76 -138 57 109 59 -306 -18 128 -49 -24 -50 -50 -122 -78 -66 -26 -13 159 38 145
4729 145 -100 93 0 -38 72 -132 -124 76 -31 -51 -3 -45 82 3 -93 -125 67 -94 -92 149 -65 8 -89 57 -108
4754 -108 -26 -43 14 109 57 15 -133 -49 90 81 28 -39 -43 113 -29 -173 -39 69 -1 69 79 -32 -5 42 106 -21
4780 -21 82 -109 -6 64 -10 68 -15 -33 49 -57 -108 45 -87 -52 46 -140 13 42 -35 9 94 122 -86 -34 77
4805 77 115 -59 -41 -76 29 18 -136 -116 -19 56 -38 -16 74 -2 -67 -59 28 -69 -58 68 -5 -9 -120 -80 34 -54 179 82
4833 82 -10 88 -38 -8 22 -56 123 46 30 128 17 -60 196 62 270 98 -53 140 0 -71 137 -47 -89 35
4857 35 -120 -139 -59 136 -60 48 17 127 24 -72 101 -44 -21 16 -8 54 -7 -33 -79 -89 37 107 6 -23 41
4882 41 21 185 67 140 39 79 -43 36 13 40 62 -23 69 -60 63 -170 82 237 43 27 1 102 -59 26
4906 26 -176 146 -61 -186 105 41 -69 43 -99 -72 51 -13 59 -28 -46 -13 130 67 39 -42 26 42 -3 -143 54
4931 54 44 65 -115 15 17 11 103 132 54 20 -57 -16 142 124 -139 -108 -54 -40 35 -55 -32 42 15 -73 -69 -88 38 -72 -124
4960 -124 24 42 102 79 66 -31 1 66 -19 -78 151 -62 96 -63 133 44 53 43 159 -20 -29 -10 3 -137 -200 -53
4986 -53 132 -32 8 -30 -33 183 50 7 -145 55 37 -84 -58 28 39 105 2 23 -60 -22 -59 8 119 -15 -25 -54
5012 -54 105 -2 16 -62 89 -30 2 22 72 139 -54 124 -83 -183 -12 72 -68 -105 72 74 69 -32 -60 7 -16
5037 -16 -161 -79 -142 -21 -65 -98 -33 -6 62 118 194 66 -193 95 21 -56 8 54 -142 -18 -125 -57 66 -202 -32
5062 -32 -11 50 40 -18 131 -52 -20 -15 -88 -33 -37 27 141 37 -37 7 -131 -198 7 31 89 -87 86 -197 -23 56
5088 56 66 155 -74 30 206 69 74 -40 -2 -5 50 177 -38 -55 24 -40 110 86 -72 -80 -101 -39 147 -41 -120 -51
5114 -51 -3 -25 32 -97 51 35 -25 -54 17 126 48 25 0 -99 15 -49 66 83 109 -36 -24 67 18 124 -118 9
5140 9 102 4 51 -77 6 70 -189 108 -12 20 -88 -17 -122 -147 -35 30 -4 -19 -95 -20 243 -176 46 -98 -6
5165 -6 83 -15 187 -56 -60 4 79 68 27 -90 22 -3 173 -244 45 -179 40 33 102 -103 91 77 -11 68 -43 -64
5191 -64 -110 -27 64 67 45 -35 -74 169 128 -15 -136 123 -58 -106 209 -54 -74 92 -53 -95 -53 121 -131 -1 41
5216 41 164 -124 15 62 -21 79 -65 -41 46 12 -9 71 -29 120 -192 96 -104 136 177 -33 -45 -10 18 -57
5240 -57 -82 -43 20 -11 36 65 53 -65 16 -46 -53 63 9 90 -40 222 67 34 3 -5 -20 -45 180 -18 -47 -39 121 -12
5268 -12 -97 28 151 39 71 -13 -9 -60 -97 -10 16 -7 -30 27 -214 38 -113 6 -152 60 -26 -91 57 -39 83
5293 83 115 -97 -9 -31 75 -11 -33 46 -27 -13 -68 34 5 -197 43 38 -46 56 5 100 18 -30 20 -101 -38 51 47 109
5321 109 -73 54 9 -250 -68 -206 70 -150 180 72 6 80 -68 5 -26 85 87 145 12 32 26 -34 53 14 -91
5346 -91 110 70 -76 60 84 -7 93 -33 -121 -5 -9 8 10 -138 24 110 60 -67 -147 83 27 43 168 39 13
5371 13 11 -106 -97 63 -53 -36 -33 -31 2 18 -26 -2 -162 -75 56 5 33 8 -99 -52 -71 117 -56 49 115 93 44 46
5399 46 45 -89 104 70 16 -15 -65 114 -43 -127 -40 -7 -115 75 -139 -60 -27 51 -64 13 18 -56 -227 66 98 14
5425 14 -77 29 148 -13 230 -88 26 167 58 99 144 159 58 -5 -105 -40 -140 -70 39 -139 -10 51 148
5448 148 69 -33 65 -20 88 45 91 -15 23 -6 -98 8 83 24 -138 58 -29 -12 16 -93 -145 140 -42 -164 6
5473 6 22 83 -164 -124 145 95 25 119 -1 -116 -38 -163 12 -4 -90 -59 -9 89 -142 -94 8 16 20 9 -115 -57 -145
5500 -145 -67 -44 -39 -15 -25 30 -66 -7 -34 18 -48 -50 43 107 -21 51 -50 -22 115 42 49 256 135 -25 8 -170 -71 96
5528 96 -80 -58 70 -36 124 -25 18 -5 44 -81 -176 -31 -105 -124 123 70 -24 129 93 77 -1 111 176 -111 -66
5553 -66 75 85 -3 79 30 -149 -68 -39 38 74 -46 -95 52 -40 -50 -71 62 -29 0 -73 -90 168 -29 -95 -46 33 44
5580 44 -19 -57 42 -53 130 65 -113 20 -157 54 -88 51 -68 -45 -6 -44 6 -91 -46 -14 63 2 -30 192 -98
5605 -98 39 22 -60 12 102 -9 -13 16 -97 76 -75 177 107 77 36 76 65 74 -143 65 164 -179 -8 -43 41 -21
5631 -21 -89 -62 84 51 27 119 -55 28 55 66 -40 -40 -73 78 -36 0 -49 25 -9 -136 68 108 103 26 -49 93 -120
5658 -120 9 26 58 -15 -56 39 128 -134 -130 40 -73 28 28 -192 70 -143 -138 19 -39 -11 47 -46 40 25 -71 -30 20
5685 20 -80 23 27 100 -2 -11 -69 -63 20 126 -24 127 -49 -96 118 -138 65 -7 80 -106 22 -66 30 -156 -63
5710 -63 -117 -107 75 20 -68 -34 1 110 118 55 46 -79 -31 50 -13 84 -5 27 29 -39 -67 37 25 -30 157 -56 11 -32 27
5739 27 103 54 -164 90 -34 -34 -206 117 13 79 -32 -241 -28 67 -92 16 60 80 108 -1 3 74 75 -43 229
5764 229 134 -80 13 0 -77 140 46 156 77 23 1 207 -73 191 37 -2 -72 -32 -26 97 -152 -87 28 -121 1
5789 1 24 71 -4 -20 -1 23 -78 -105 -290 102 150 22 -177 88 -6 -14 43 -17 136 -48 55 -68 -26 -69 -30 27
5815 27 -76 -63 -41 153 107 -64 -146 32 37 -10 54 149 -89 -68 25 47 84 66 56 14 -83 76 52 55 32 -19 50 -39
5843 -39 131 -23 -35 32 -39 76 -162 15 6 18 -71 82 93 23 55 -57 -8 -108 -54 144 91 -82 -35 83 -29
5868 -29 87 -133 -58 13 61 -280 -57 -83 -34 72 24 42 -137 -42 -50 91 82 -80 -58 -14 106 43 -165 -163 -24 -225
5894 -225 -37 -2 -55 -35 -140 61 60 -46 59 -119 93 -47 7 -109 -118 -191 51 54 58 17 106 71 -67 -114 147 135
5920 135 37 -24 -111 73 9 40 101 -134 -23 -116 31 27 125 -156 15 -61 1 6 18 -89 8 -40 8 -10 -133 184
5946 184 -67 32 45 -18 116 59 184 -17 -197 27 75 -80 74 -52 73 -45 -7 -39 -56 -31 31 -35 -86 159
5970 159 35 -5 102 -5 29 91 -25 -7 103 -12 -129 -37 -212 -128 -39 3 -73 -53 25 94 -18 34 -14 40 11
5995 11 -58 -165 38 15 99 -20 66 78 -123 -74 -39 62 90 7 39 -15 119 88 -84 16 -3 -11 66 -56 159 -97
6021 -97 -65 -6 -66 -84 -30 3 -131 -118 11 -26 10 -86 29 184 -150 -94 -4 75 17 22 87 -125 -50 49 66 43 -19 68
6049 68 -76 -33 88 44 -15 -180 -103 -5 99 108 -56 10 69 -88 165 27 89 20 -10 36 38 98 -76 -11 58 -83
6075 -83 -32 -60 -15 107 104 -53 152 -138 95 94 77 82 -64 26 -43 -103 171 -150 18 30 -30 -48 -41 -33 -23 22 41 102
6103 102 -112 98 -173 68 95 162 -25 49 -15 53 -164 -234 -64 6 23 82 -31 -106 27 3 7 -25 44 282 -26
6128 -26 127 -40 122 6 60 -90 190 64 -125 -9 -44 196 0 -80 3 118 70 41 -106 102 202 -14
6150 -14 55 -96 16 -11 -79 -57 -9 -102 -56 -127 -31 -36 -4 -87 -10 49 -75 32 69 -35 -28 -118 -126 -83 190 42 -106 -32
6178 -32 118 16 101 38 -28 24 -25 45 -98 86 73 -9 -50 -105 -147 22 -141 127 27 -119 24 -151 5 27
6202 27 101 -58 -34 61 -3 -46 -75 -68 37 68 -111 -28 -44 0 -32 18 -23 -72 -9 -13 -83 214 -124 -17 32 62 -101 122
6230 122 -23 -3 213 -106 13 -176 14 2 61 5 86 -47 47 87 -10 -10 4 -139 -82 -155 -132 51 39 53 -18 10
6256 10 -174 -33 -16 180 95 -13 -63 59 -65 -41 171 -23 95 13 32 75 15 168 -171 96 166 122 -106 5
6280 5 -25 -35 -8 -103 -13 34 -42 -102 -20 218 -48 79 45 -28 -25 75 -25 91 -71 60 32 -103 -156 -27 38 61
6306 61 1 -19 3 152 -77 63 -74 19 -71 46 -63 -25 3 42 -53 -141 25 142 60 -5 -43 -7 -70 121 33 64
6332 64 116 -10 59 85 120 2 -32 103 18 78 5 131 5 60 13 -15 6 102 116 -19 -123 34 -153 17 -17
6357 -17 -25 199 -5 -177 37 77 -64 -31 55 -145 -28 121 -122 -139 49 -23 -24 63 -9 -125 103 116 56 -6 -95
6382 -95 -82 12 -39 111 151 -6 4 -31 -42 -67 -31 -44 178 -51 67 -153 170 55 62 176 -41 27 55 3 -117
6407 -117 94 -55 121 21 114 41 -11 -85 1 -27 12 48 -78 -122 8 10 126 139 281 21 -25 52 -29 -161 5
6432 5 60 -220 17 -62 -54 134 1 -136 193 -74 -197 -70 47 0 20 25 -9 -106 31 -54 -42 -7 -80 -30 72 8
6458 8 -52 -71 90 66 27 -4 -33 103 4 81 4 -1 -14 -176 -41 -26 6 1 -112 81 -75 168 46 -1 -186 30
6484 30 -33 -193 105 18 190 87 118 -49 -69 158 -74 -129 121 -165 -207 -32 48 -10 -30 35 15 -18 -82 27 17
6509 17 -40 -9 -203 -63 -88 -70 34 172 67 90 82 -26 35 -196 60 -153 -4 207 -38 43 88 -84 -167 10
6533 10 36 -33 103 -219 206 -74 -81 46 6 86 -15 -90 206 54 -41 -53 -40 14 57 -111 -86 19 -86 2 -131
6558 -131 35 69 12 -2 -3 26 65 118 -1 15 -47 61 -44 -12 -34 -34 15 -208 53 -39 73 -83 7 -26 8 -95
6584 -95 -43 183 67 112 46 71 -64 -82 118 16 37 64 -91 75 -42 46 -28 -39 148 -146 -13 119 72 78 -43
6609 -43 -145 7 -66 64 89 -89 75 -64 34 -28 58 -9 13 70 -34 74 -22 98 131 -122 164 -70 -86 33
6633 33 -4 26 -14 113 45 -138 11 -8 74 193 110 -90 92 -36 209 73 188 -38 -99 -48 -63 72 -131 -62
6657 -62 -43 -16 -100 40 -217 -66 -51 -31 -78 42 -139 115 -16 -33 30 -5 -119 -109 -81 -62 151 -60 82 -12 20
6682 20 -107 87 -53 -10 -145 -129 47 -50 -139 -70 18 50 8 14 95 -77 -36 85 31 99 61 -43 21 -66 -77 89
6708 89 -69 -7 19 -76 154 -141 -13 -16 -133 -95 -166 1 -35 1 -64 -175 2 127 -126 -26 108 -137 -190 137
6732 137 90 -44 -123 -142 -97 186 -64 80 9 -10 34 -165 137 78 -93 -57 41 -71 -60 -26 -122 40 72 14 -29
6757 -29 -36 -58 -23 -319 -46 7 34 81 8 -130 59 53 -132 -13 -30 106 47 25 -109 -120 72 84 -83 -128 -37 -4
6783 -4 -82 -30 -184 -181 28 -18 -115 49 79 -31 -13 65 -30 -39 -51 -62 42 -48 -16 -28 26 89 -206 -159 22 -38 151 63
6811 63 55 -104 83 189 92 -62 -78 -1 -87 49 4 136 61 -69 147 81 -29 80 -167 -60 34 -123 -265 8
6835 8 -65 -26 97 -111 6 -124 15 83 -31 31 41 -26 -151 -131 -13 47 6 47 43 81 -27 52 -53 -64 -126 109
6861 109 31 -89 -100 -6 33 202 -48 59 -79 -133 -20 39 -43 -59 -1 -93 136 -42 -26 -3 -190 -65 -1 -33 138
6886 138 -143 -111 3 -64 -34 -99 57 44 -184 -40 -48 -8 -184 -110 -21 -108 1 -122 35 -35 48 -120 -54 37 -134
6911 -134 114 91 150 -57 -78 -4 127 -139 99 138 -49 20 -24 67 166 -15 -49 -86 -29 -12 1 37 -46 21 51 45 84
6938 84 -32 159 66 -8 8 -51 106 -90 -19 48 109 -80 70 72 -81 107 -56 -8 15 25 -28 -6 -141 -38 -103
6963 -103 -20 -63 107 17 -28 -30 35 -45 162 -4 87 -24 35 67 19 -46 -52 88 14 -58 185 -14 19 123 -4 -43
6989 -43 -89 218 -197 -51 98 25 -66 -3 -12 83 -138 128 143 -73 31 18 -78 -207 49 143 -56 -95 35 -78
7013 -78 -51 187 136 -168 43 -49 38 1 7 83 -49 -21 81 -21 -8 78 18 95 -19 -113 -61 146 -115 162 10
7038 10 118 -126 -33 28 -167 -125 -117 13 -238 40 40 -57 -91 118 32 -20 46 -90 -56 147 47 -112 -39 3 191
7063 191 -68 -81 -18 -73 -64 61 -19 26 45 86 50 192 98 115 -58 -62 141 51 -53 -112 4 -114 -67 -95 1 33 -63
7090 -63 -27 127 -140 -68 -171 142 49 59 18 -182 -212 100 70 36 6 113 60 75 17 4 -20 93 84 -2 -64 46
7116 46 -39 97 103 63 -2 -65 39 -78 97 -62 -92 25 153 78 113 -6 209 44 -8 -113 -89 40 -57 11 -7
7141 -7 -52 141 23 -5 31 6 204 67 221 -32 -66 34 191 1 177 -58 -93 69 108 -21 -251 83 153
7164 153 37 11 45 57 -55 95 198 11 169 154 -7 -48 20 72 98 -94 12 -41 -93 -153 198 -172 -81 -13
7188 -13 -63 -68 -133 100 -6 -7 207 -129 -28 -74 -31 -20 -83 -93 -125 25 53 -91 -93 -42 12 16 -1 59 9 -3 73 -110
7216 -110 56 -42 14 45 16 146 -73 -115 75 1 -35 56 -24 8 -27 -33 47 -93 100 -13 104 -20 -11 -25 -23 95
7242 95 -97 -62 146 -76 117 92 -37 84 -138 -107 -4 -5 -64 31 -94 -76 97 -204 110 1 137 -268 66
7265 66 -71 -138 93 134 -8 110 82 99 287 8 -74 -55 21 16 55 1 20 90 -49 -76 31 -110 -98 -140 -100 85
7291 85 23 52 9 21 94 23 -114 2 -14 100 -107 -73 140 -115 13 -160 27 166 -68 -32 -35 162 -139 39
7315 39 85 188 234 -5 63 1 -81 29 -99 -177 -67 90 -176 6 -87 -86 18 23 50 94 -191 58 44 -29 -15 102
7341 102 22 11 -24 -3 -25 262 40 24 105 -35 -114 -26 111 -114 -65 45 -57 117 -74 -139 53 -61 -15 43
7365 43 -38 47 71 33 -140 10 -113 62 -73 -171 64 -43 9 -45 -193 -92 -207 55 -87 -123 77 28 81 18
7389 18 -56 13 29 93 26 -60 26 96 61 -10 12 -98 171 -143 192 5 113 63 100 -45 -14 82 165 -161 90 -13
7415 -13 56 50 -220 -21 109 119 54 9 -71 -147 55 56 50 84 -185 123 -12 -96 -105 0 -37 -15 -16 4 47 28 -43 -95 30
7444 30 -99 31 -120 -9 61 98 -154 81 -47 -18 -136 59 -58 -77 -35 -37 158 -74 -82 128 -49 -40 -14 -17 112
7469 112 20 -46 108 -1 50 -31 -36 151 -18 -3 -52 19 -11 61 58 8 -64 233 -32 -69 62 -17 62 -132 231 59
7495 59 -8 -24 -58 1 -143 -64 78 20 -40 -12 -32 -85 -64 -65 93 59 -64 41 -133 22 -67 -3 33 -97 196 -76
7521 -76 -2 -113 -201 111 194 -27 44 -82 -82 -145 44 129 165 50 45 13 62 -80 14 119 -40 -7 -22 97 -67 135
7547 135 -98 -7 33 70 106 105 59 40 47 -122 -25 -130 -44 103 -114 -49 35 -52 -123 117 33 -22 136 -22 -69 16 -179
7574 -179 -97 97 31 -79 8 53 5 -121 -181 -116 126 82 116 40 65 -153 -63 -43 -13 94 32 -23 -38 82 -22 -114
7600 -114 187 33 -11 11 10 202 173 148 2 -99 49 -22 23 -105 -49 -2 45 -107 -14 48 14 54 200 -29 -25 6
7626 6 25 104 -33 131 -31 97 -57 -14 -13 77 -172 158 37 64 -205 118 10 70 1 15 -48 5 95 -173 168
7651 168 -4 52 -38 19 -77 -167 102 -12 -40 -38 -12 -4 -211 -55 104 -11 -74 63 -110 -62 -5 -68 -14 -8 38 117 -177
7678 -177 -131 -55 120 -50 -82 14 44 106 -27 -64 -89 16 105 -109 69 35 19 188 -5 -63 -79 -19 -142 105 -49
7703 -49 13 73 -36 12 -11 -6 17 -63 41 15 -185 18 38 -5 4 -16 38 125 -19 -30 108 -74 -8 -1 35 -97 95
7730 95 -83 36 120 -1 -36 70 14 -14 -27 127 19 39 94 66 112 -59 24 17 60 15 0 -4 74 8 -100 93 64
7757 64 42 21 -1 13 19 -50 -41 -91 74 109 -75 -49 33 119 111 84 17 -31 -98 -69 -18 7 -253 -20 164 -11 -35 -15 74
7786 74 -102 60 10 -19 -175 -30 -34 35 81 26 -6 109 -238 -145 -123 105 -63 24 97 -45 51 9 117 -31 3
7811 3 86 -58 220 17 3 147 98 -3 47 101 73 -10 19 -7 37 -37 154 56 -70 -15 89 -84 0 -68 -8 -72
7837 -72 15 -57 106 -19 -151 -73 4 119 -130 150 105 31 -5 41 -53 33 6 87 -39 -152 31 81 -77 -118 30
7862 30 -40 -81 -127 170 68 -22 -56 -93 48 -28 54 -10 -152 -49 91 44 -41 -51 -56 -126 -73 -50 56 103 -113 48
7888 48 -25 129 20 55 27 41 -107 -56 5 -133 -18 -53 104 -52 79 78 -36 59 24 -228 -4 10 -57 -154 23
7913 23 111 40 52 133 35 17 87 -77 -43 114 -97 -61 -77 46 -15 37 58 -35 -222 104 152 -28 -35 18 73 67 51 -34
7941 -34 27 76 -7 -17 -73 -48 103 -18 80 34 30 -20 -103 58 -99 -217 -44 71 -104 -17 71 69 -20 2 -33 83 -155
7968 -155 11 -95 -18 -24 -21 -131 -74 28 51 29 131 -10 -105 158 47 -198 -23 17 71 107 -80 -7 -24 209 273
7993 273 -18 -18 49 123 -38 -17 -113 69 42 -24 -36 151 18 10 90 14 182 46 121 -17 -100 -7 51 -22 -11 71 58
8020 58 -130 -157 -74 131 152 -53 110 -46 116 132 -114 44 86 -96 8 -128 189 67 -190 -32 88 26
8042 26 2 127 57 -26 -113 -109 -14 16 90 -29 -98 -41 10 11 117 -96 6 22 -55 87 -31 -115 -37 -19 -2 5 54 23
8070 23 96 -68 26 -48 -85 -3 103 -30 5 73 -71 -66 -14 144 4 -85 7 -119 -9 76 10 -112 -42 -84 9 63
8096 63 -63 -87 -106 52 -7 -129 -38 116 101 -17 45 39 122 -182 -40 87 90 -95 91 5 37 -65 -30 63 -181
8121 -181 -14 -72 22 61 -155 -229 -5 -52 58 5 20 -100 47 26 -52 -68 -62 -102 116 -87 40 -15 63 26 -53 34
8147 34 38 -68 -200 20 -3 -66 193 -25 42 121 151 -138 -2 71 -165 -10 92 -127 -12 -39 -46 19 39 -79 -43
8172 -43 81 32 81 -131 160 77 5 110 8 66 48 -116 20 -43 18 89 -11 -12 32
8191C2
##END NTUPLES=NMR FID
##END=
