##TITLE=1H_09-2025
 200.13MHz, CDCl3,
 24 sc
 
 15.1.2025
##JCAMPDX= 6.0         $$ Bruker NMR JCAMP-DX V2.0
##DATA TYPE= NMR FID
##DATA CLASS= NTUPLES
##ORIGIN= UXNMR, Bruker Analytische Messtechnik GmbH
##OWNER= pz
$$ XWIN-NMR		Version 3.5
$$ Wed Jan 15 14:03:16 2025 Russian Standard Time (UT+4h)  she@DPX200
##.OBSERVE FREQUENCY= 200.1312
##.OBSERVE NUCLEUS= ^1H
##.DELAY= (6, 6)
##.ACQUISITION MODE= SIMULTANEOUS
##.ACQUISITION SCHEME= undefined
##.AVERAGES= 8
##.DIGITISER RES= 18
##SPECTROMETER/DATA SYSTEM= spect
##.PULSE SEQUENCE= zg30
##.SOLVENT NAME= D2O
##.SHIFT REFERENCE= (INTERNAL, D2O, 0, 14.3821)
##AUDIT TRAIL= $$ (NUMBER, WHEN, WHO, WHERE, WHAT)
$$ ##TITLE= Audit trail, XWIN-NMR		Version 3.5
$$ ##JCAMPDX= 5.01
$$ ##ORIGIN= Bruker BioSpin GmbH
$$ ##OWNER= she
$$ F:/spectra/data/she/nmr/H-C/1/audita.txt
$$ ##AUDIT TRAIL=  $$ (NUMBER, WHEN, WHO, WHERE, WHAT)
(   1,<2025-01-15 14:01:51.31 +0400>,<she>,<DPX200>,
      <created by zg, POWCHK disabled, PULCHK disabled
       configuration hash MD5:
       00 E9 B6 7A A2 85 ED C7 34 08 36 98 17 FE 4E 26
       data hash MD5: 16K
       D3 C8 DD A3 77 A1 0B 20 D0 DA 43 0D 43 9C C0 39>)
$$ ##END=
$$ 
$$ hash MD5
$$ CE 37 03 B8 B6 12 D4 B4 1D 9A 63 FC 8F 25 FF E5
##$RELAX= 
##$RELAX= 
##$RELAX= 
##$RELAX= 
##$RELAX= 
##$RELAX= 
$$ Bruker specific parameters
$$ --------------------------
##$DU= <F:/spectra>
##$EXPNO= 1
##$NAME= <H-C>
##$PROCNO= 1
##$TYPE= <nmr>
##$USER= <she>
##$AMP= (0..31)
100 100 100 100 100 100 100 100 100 100 100 100 100 100 100 100 100 100 
100 100 100 100 100 100 100 100 100 100 100 100 100 100 
##$AQSEQ= 0
##$AQ_mod= 1
##$AUNM= <au_zg>
##$AUTOPOS= <>
##$BF1= 200.13
##$BF2= 200.13
##$BF3= 200.13
##$BF4= 200.13
##$BF5= 200.13
##$BF6= 200.13
##$BF7= 200.13
##$BF8= 200.13
##$BYTORDA= 1
##$CFDGTYP= 0
##$CFRGTYP= 5
##$CHEMSTR= <none>
##$CNST= (0..31)
1 1 145 1 1 1 1 1 1 1 1 1 1 1 1 1 1 1 1 1 1 1 1 1 1 1 1 1 1 1 1 1 
##$CPDPRG= <>
##$CPDPRG1= <>
##$CPDPRG2= <>
##$CPDPRG3= <>
##$CPDPRG4= <mlev>
##$CPDPRG5= <mlev>
##$CPDPRG6= <mlev>
##$CPDPRG7= <mlev>
##$CPDPRG8= <mlev>
##$CPDPRGB= <>
##$CPDPRGT= <>
##$D= (0..31)
0 0.7 0 0 0 0 0 0 0 0 0 0.03 0 0 0 0 0 0 0 0 0 0 0 0 0 0 0 0 0 0 0 0 
##$DATE= 1736935310
##$DBL= (0..7)
120 120 120 120 120 120 120 120 
##$DBP= (0..7)
150 150 150 150 150 150 150 150 
##$DBP07= 0
##$DBPNAM0= <>
##$DBPNAM1= <>
##$DBPNAM2= <>
##$DBPNAM3= <>
##$DBPNAM4= <>
##$DBPNAM5= <>
##$DBPNAM6= <>
##$DBPNAM7= <>
##$DBPOAL= (0..7)
0.5 0.5 0.5 0.5 0.5 0.5 0.5 0.5 
##$DBPOFFS= (0..7)
0 0 0 0 0 0 0 0 
##$DE= 6
##$DECBNUC= <off>
##$DECIM= 32
##$DECNUC= <off>
##$DECSTAT= 4
##$DIGMOD= 1
##$DIGTYP= 9
##$DL= (0..7)
0 120 120 120 120 120 120 120 
##$DP= (0..7)
150 150 150 150 150 150 150 150 
##$DP07= 0
##$DPNAME0= <>
##$DPNAME1= <>
##$DPNAME2= <>
##$DPNAME3= <>
##$DPNAME4= <>
##$DPNAME5= <>
##$DPNAME6= <>
##$DPNAME7= <>
##$DPOAL= (0..7)
0.5 0.5 0.5 0.5 0.5 0.5 0.5 0.5 
##$DPOFFS= (0..7)
0 0 0 0 0 0 0 0 
##$DQDMODE= 0
##$DR= 18
##$DS= 0
##$DSLIST= <SSSSSSSSSSSSSSS>
$$ [...]
##$SUBNAM0= <"">
##$SUBNAM1= <"">
##$SUBNAM2= <"">
##$SUBNAM3= <"">
##$SUBNAM4= <"">
##$SUBNAM5= <"">
##$SUBNAM6= <"">
##$SUBNAM7= <"">
##$SUBNAM8= <"">
##$SUBNAM9= <"">
##$SW= 18.0517418723606
##$SWIBOX= (0..15)
0 0 2 0 0 0 0 0 0 0 0 0 0 0 0 0 
##$SW_h= 3612.71676300578
##$TD= 16384
##$TD0= 1
##$TE= 0
##$TE2= 300
##$TE3= 300
##$TEG= 300
##$TL= (0..7)
0 120 120 120 120 120 120 120 
##$TP= (0..7)
150 150 150 150 150 150 150 150 
##$TP07= 0
##$TPNAME0= <>
##$TPNAME1= <>
##$TPNAME2= <>
##$TPNAME3= <>
##$TPNAME4= <>
##$TPNAME5= <>
##$TPNAME6= <>
##$TPNAME7= <>
##$TPOAL= (0..7)
0.5 0.5 0.5 0.5 0.5 0.5 0.5 0.5 
##$TPOFFS= (0..7)
0 0 0 0 0 0 0 0 
##$TUNHIN= 0
##$TUNHOUT= 0
##$TUNXOUT= 0
##$USERA1= <user>
##$USERA2= <user>
##$USERA3= <user>
##$USERA4= <user>
##$USERA5= <user>
##$V9= 5
##$VALIST= <valist>
##$VCLIST= <CCCCCCCCCCCCCCC>
##$VD= 0
##$VDLIST= <DDDDDDDDDDDDDDD>
##$VPLIST= <PPPPPPPPPPPPPPP>
##$VTLIST= <TTTTTTTTTTTTTTT>
##$WBST= 1024
##$WBSW= 4
##$XGAIN= (0..3)
0 0 0 0 
##$XL= 0
##$YL= 0
##$YMAX_a= 837892
##$YMIN_a= -888309
##$ZGOPTNS= <>
##$ZL1= 120
##$ZL2= 120
##$ZL3= 120
##$ZL4= 120
##$ABSF1= 10
##$ABSF2= 0
##$ABSG= 5
##$ABSL= 3
##$ALPHA= 0
##$AQORDER= 0
##$ASSFAC= 0
##$ASSFACI= 0
##$ASSFACX= 0
##$ASSWID= 0
##$AUNMP= <proc_1d>
##$AZFE= 0.1
##$AZFW= 0.1
##$BCFW= 1
##$BC_mod= 2
##$BYTORDP= 1
##$COROFFS= 0
##$CY= -3
##$DATMOD= 1
##$DC= 2
##$DFILT= <>
##$DTYPP= 0
##$F1P= 0
##$F2P= 0
##$FCOR= 0.5
##$FTSIZE= 0
##$FT_mod= 4
##$GAMMA= 1
##$GB= 0.15
##$INTBC= 1
##$INTSCL= 1
##$ISEN= 128
##$LB= 0.25
##$LEV0= 0
##$LPBIN= 0
##$MAXI= 10000
##$MC2= 0
##$MEAN= 0
##$ME_mod= 0
##$MI= 1.114404
##$NCOEF= 0
##$NC_proc= 0
##$NLEV= 6
##$NOISF1= 3.799351
##$NOISF2= 2.8
##$NSP= 1
##$NTH_PI= 0
##$NZP= 0
##$OFFSET= 14.38212
##$PC= 1
##$PHC0= 252.6883
##$PHC1= 8.792204
##$PH_mod= 1
##$PKNL= yes
##$PPARMOD= 0
##$PSCAL= 0
##$PSIGN= 0
##$REVERSE= no
##$SF= 200.129724274929
##$SI= 16384
##$SIGF1= 3
##$SIGF2= 2
##$SINO= 400
##$SIOLD= 16384
##$SREGLST= <1H.CDCl3>
##$SSB= 0
##$STSI= 0
##$STSR= 0
##$SW_p= 3205.1282051282
##$SYMM= 0
##$S_DEV= 0
##$TDeff= 0
##$TDoff= 0
##$TI= <>
##$TILT= no
##$TM1= 0
##$TM2= 0
##$TOPLEV= 0
##$USERP1= <user>
##$USERP2= <user>
##$USERP3= <user>
##$USERP4= <user>
##$USERP5= <user>
##$WDW= 1
##$XDIM= 8192
##$YMAX_p= 0
##$YMIN_p= 0
$$ End of Bruker specific parameters
$$ ---------------------------------
##NTUPLES= NMR FID
##VAR_NAME=  TIME,          FID/REAL,        FID/IMAG
##SYMBOL=    X,             R,               I
##VAR_TYPE=  INDEPENDENT,   DEPENDENT,       DEPENDENT
##VAR_FORM=  AFFN,          ASDF,            ASDF
##VAR_DIM=   8192,          8192,            8192
##UNITS=     SECONDS,       ARBITRARY UNITS, ARBITRARY UNITS
##FACTOR=    0.0002768,     1,               1
##FIRST=     0,             0,               0
##LAST=      2.2672688,     0,               0
##MIN=       0,             -888309,         0
##MAX=       2.2672688,     837892,          0
$$ Real data points
##PAGE= N=1
##DATA TABLE= (X++(R..R)), XYDATA
0@%%%%%%%%%%Qj6QqJ6j6J8k6L6m4M8n3O6q1R2j04J24j44J61j82K10k42K70l01
34a60L39l80M25m74N26n86O54p21P96q84R75j071J179j299J430j573J731j910
52a003K111k332K581k868L199l583M036m582N256o106P208q704J0847j4129J9700
67A1631l0795O0425k75368o54202J110874O15327j014589k89232J019395K4627
77E78093j102748n3754R48638m0553p69533J96815O45069l37877n37881L96561
87g7170M81247k83575l14968K11373J81996k65349k20999K90749L02498k72739
97C3063k76042L08839J96016m03967j47025M89356J32362n56373j38085N62244
107B00388K7489o27364J50281P64880k39822p56577L55016O48237m87904n17341
$$ plain form
0 0 0 0 0 0 0 0 0 0 0 0 8 -8 0 -8 8 -8 10 -16 20 -24 24 -29 37 -44 48 -56 68 -76 85 -97 113 -129 141 -160
34 -160 179 -201 224 -250 276 -310 344 -377 419 -465 510 -561 618 -681 749 -824 907 -1003
52 -1003 1108 -1224 1357 -1511 1688 -1895 2141 -2441 2815 -3291 3917 -4787 6060 -8069 11631
67 11631 -19164 41261 -234107 -888309 222565 837892 -176697 -465929 553466 578093
77 578093 -524655 -578409 370229 329676 -439857 -243042 402027 64150 -473731 -77170
87 -77170 404077 120502 -194466 16907 198903 -66446 -287445 3304 305802 33063
97 33063 -242979 65860 261876 -142091 -289116 200240 332602 -223771 -361856 200388
107 200388 227877 -399487 -249206 515674 275852 -480725 -125709 522528 34624 -482717
117d82717N95855M11503o67793l85280O05944K65628n61493q1265O06550j2020
127B94912n76873O6902M66536r9582l17324J28030K09186j61548k30952J04170
137a16543K50074l5392j97318P4873J83310j29058j96956J53263K21814j56400
147E1667k49436J52757K17327k50706k04623L77058K03474m28088j17150M58199
157B10479N187m58711J01401M56885j66833m47587J88583L83791k61170l26938
167c14913L47454K80678l85238k06387L67610J02808l27097j0563L01694j0142
177A45904k66847k242K29108l52k00696L6858J96418p3976k05326O1847J77815
188I8511n0330j57975N2877J68560p9588k01662J30317K40997j61396k06275K15811
$$ plain form
117 -482717 113138 524641 -143152 -528432 77512 343140 -218353 -299618 306932 294912
127 294912 -281961 -215059 251477 151895 -165429 -37399 171787 10239 -220713 -116543
137 -116543 133531 98139 -99179 -24306 159004 29946 -167010 -13747 208067 51667
147 51667 -197769 -45012 172315 -78391 -283014 94044 297518 -130570 -247720 210479
157 210479 215666 -243045 -141644 315241 148408 -299179 -110596 273195 12025 -314913
167 -314913 32541 313219 -72019 -278406 89204 192012 -135085 -145648 156046 145904
177 145904 -120943 -123185 105923 105571 -95125 -58267 138151 64175 -141151 -79304 98511
188 98511 48181 -109794 -56917 111643 32055 -169607 -39290 201707 40311 -165964 49847
199D9847J43492k74358j03125K89822O5159k94641l7946K85797k0100k97051Q9663
210a03441L13140j34641k69196J86500K02854k19128j38877K22361R3115k10600
220e7913p7247J85952N2247j82262j9210J92095o060j82559K8354J51075m0205
231D4267j18121L9957J09310l0131j26650K4729J45862m0604j49459P8607J40120
242A17887j14000j24714J26467J05322j29255r1919J39954Q4366j64614o6458
252a16964J94964L2665k08919J5660J95985o3245j70779Q9241J41502r4329j20207
263a04426R9671J11777j10018r9902J29448P6080j47052m4649J41911J1339j24871
274f0692M722J05366p86r4423j568J04808j608j18517J7945J18513m4829j07475
$$ plain form
199 49847 193339 -81019 -184144 105678 170837 -123804 -161750 124047 103947 -193104 -103441
210 -103441 209699 75058 -194138 -7638 195216 -23912 -162789 59572 152687 -57913
220 -57913 -135160 50792 103039 -79223 -98433 93662 87602 -94957 -66603 84472 44267
231 44267 -73854 -33897 75413 45282 -81368 -56639 89223 48619 -100840 -22233 117887
242 117887 3887 -120827 5640 110962 -18293 -110212 29742 114108 -50506 -116964
252 -116964 78000 110665 -98254 -82594 113391 50146 -120633 -31392 110110 15781 -104426
263 -104426 -4755 107022 -2996 -102898 26550 102630 -44422 -89071 52840 64179 -60692
274 -60692 -55970 49396 48610 -45813 -47381 57427 55819 -62698 -44753 73760 28931 -78544
286g8544N9343Q9555o2610q0247O0801Q6608o4336q9370Q8007Q3639j18643o4306
298i0103J34362K9963j33395j074J20654j5672j09749K2292J12256k7325j15062
309g2853M7767J10693q0075r3805J00926O5686j04179l8757R1520K2967p9555
320b9665j9281Q3119K1991r2715j4738R7599r291r3407L2033P9050l9281o3074
332d7660L3711N7008k4798o1465K9765O9127m8488p2401O7191N6174p8100l4572
344e4508P7508K1020o8211j4934O9954K0044p7744j4232Q6659j0196r7109L2118
356b9631Q2307n1753o0927N9538M6748m7855l4743M9418M0490n4486m1035O2749
368B0820K3270p8149q941O7676j1308n3418J8203M6550l151l7858J364M9738m871
$$ plain form
286 -78544 -19201 70354 7744 -72503 -11702 74906 10570 -78800 9207 92846 -25797 -90103
298 -90103 44259 74222 -59173 -60247 60407 44735 -65014 -42722 69534 42209 -72853
309 -72853 -25086 85607 5532 -88273 12653 78339 -25840 -64597 26923 49890 -29665
320 -29665 -48946 34173 56164 -36551 -51289 46310 37019 -56388 -24355 54695 15414 -47660
332 -47660 -13949 43059 18261 -43204 -13439 55688 7200 -65201 1990 58164 -19936 -54508
344 -54508 23000 44020 -24191 -39125 30829 50873 -26871 -41103 45556 35360 -61749 -29631
356 -29631 52676 923 -60004 -466 46282 -1573 -36316 13102 53592 -894 -41929 20820
368 20820 44090 -34059 -43000 24676 13368 -40050 -21847 24703 21552 -16306 -14942 34796 29925
381B9925o1120J7526N7641l9648n2263M0898L5203l6502k4820L8081L5071l9275
393G17l9959N1910L3355o9532j6775P3624j0186o9485K4732N8015k0391m0005
405b3980K3077M0130k7981n0068L2360M5095m8442l3871N2441J1140m7652N188
417b2563M3659O991k4090j1735K1837Q444m2604j0505M9150j948m9648J2413L8492
430A7893j4241k2386K1556L5809j3745m8411J1109M3200l6180m0612N5333K3049
442C2374o5906q943N8497M950l2643J4652L8976j3175n3045M255M8163j8963m2648
455c3456L2403K1413m8142j2665M0234J4406q668k155P565Q208j7885j9948K7912
468I222J9896l3116j5097K1717j532j8731M706K8874J2197l5007k2057L6427L84
$$ plain form
381 29925 -31195 -13669 43972 4324 -47939 -7041 28162 -8340 -33160 4921 39992 717
393 717 -39242 12668 46023 -23509 -40284 33340 23154 -46331 -21599 36416 16025 -23980
405 -23980 -903 39227 11246 -38822 -6462 38633 -9809 -43680 8761 19901 -27751 -22563
417 -22563 21096 28087 3997 -7738 14099 22543 -20061 -30566 18584 16636 -33012 -20599 17893
430 17893 3652 -18734 2822 38631 24886 -23525 -12416 30784 -5396 -46008 9325 32374
442 32374 -33532 -42475 16022 20972 -11671 2981 41957 28782 -24263 -20008 28155 9192 -33456
455 -33456 -1053 20360 -27782 -40447 -213 14193 5525 3370 10935 19143 1258 -18690 9222
468 9222 29118 -3998 -19095 2622 1090 -17641 -12935 15939 28136 -6871 -28928 7499 7883
481G883m7444K6366N5779l6508m1708M2238K5188l3493n236M1355P268n4508k7643
494d0463L9483L560m5617K0902N0316l0096l3785L5174K4570j0980K392R988k336
507B3108j9674k6413P168K5008j0180j5079J1498J289j3788J90J8283K5329m953
520B1786l2945P664K1473l4534j0787N6337K003n3802O598L5292k1108k4410L2438
533F005L1973l2177m1343K7848K7311m2493o840O0897l590n4345J5999L4888k0637
546C496j3186K1851O734j9024j9923L923J8019k230o613J6036K914j5479j456
559d938K770P000J2652j5620j6552J8233p209l1059K6294L7396k4209j5771K7860
572A6847J366l0013k17L2928J926l9640m424L5278j7865l7103M0658L4023m3098
$$ plain form
481 7883 -39561 -13195 42584 6076 -35632 6606 31794 -1699 -6935 34420 41688 -12820 -40463
494 -40463 -980 2580 -43037 -22135 28181 -1915 -35700 -526 24044 13064 15456 25444 23108
507 23108 3434 -22979 -15811 9197 -983 -16062 -4564 -3275 -17063 -16873 1410 26739 21786
520 21786 -11159 -3495 17978 -16556 -27343 28994 30997 -22805 -16207 19085 -2023 -26433 6005
533 6005 37978 5801 -35542 -7694 19617 -22876 -29716 31181 27591 -26754 -10755 24133 3496
546 3496 -9690 12161 18895 -129 -20052 -16129 1890 -340 -6953 9083 11997 -3482 -4938
559 -4938 -2168 4832 17484 1864 -14688 3545 -3664 -34723 -8429 28967 4758 -11013 16847
572 16847 18213 -11800 -12017 20911 22837 -16803 -21227 14051 -3814 -40917 -259 33764 -9334
585i334j3859L9819m504k7827J5746K3167j0472k0249O18J4456n314j3207J4703
598C743Q989k0358m736P015p382Q253J0750j2156O515J6231k0242p702K9997K44
612A9161k4726P543J3164j7553k0203J1468K1732j4247k1881K8319J7412l8741
624a8552L60M7754j2486l6040K4510J8236l1392r727K4838O091j9454o948J8499
637E689K617k3782N800K5048j4595j5195J8334m96j3230J1707M567o837R161j403
651G385j3384Q083O043j3715j824J0624j181j0198l168J5089O246k0190L412K8402
665B1624j5858k6637K8510J2716l5322K14K9723j0452k0417J2806J6058r618j5276
678a1929J2373J6906j8905j3460K4309K24k7798J1856J9132j7467l651J5362n500
$$ plain form
585 -9334 -23193 16626 12122 -15705 41 23208 12736 -7513 -6895 7561 2247 -10960 3743
598 3743 12732 -7626 -12362 -5347 -12729 -4476 6274 -5882 633 16864 -3378 -11080 18917 19161
612 19161 -5565 1978 15142 -2411 -22614 -11146 10586 -3661 -25542 2777 20189 -18552
624 -18552 -18192 29562 17076 -18964 5546 23782 -7610 -17337 7501 13592 -5862 -12810 5689
637 5689 8306 -15476 -9676 15372 777 -14418 3916 3420 -9810 1897 6464 -373 8788 7385
651 7385 -5999 2084 8127 -5588 -7412 3212 2031 -8167 -11335 3754 10000 -10190 -6778 21624
665 21624 5766 -20871 7639 20355 -14967 -14753 14970 4518 -15899 -3093 12965 3347 -11929
678 -11929 444 17350 -1555 -15015 9294 9518 -18280 -6424 12708 -4759 -8410 6952 1452
691A452n530P090K00R13J609o292j889J112k482L036l88k539Q008m641j3687J6996
707B968J1493k1487L655K1687j7730j7932J9835Q294j5502j990J1731Q41j4931
720i068k619K1700J910k2164R593J6437k3396q589K4916j683j5360R454N016j0192
734d045j096N132M784J547p129L45L478r683m45J1525m253j468P215j0088l629
749g810J5186m782p613J5582j923j9989L851J0759n079k371O010N501n922j2293
763a0893Q696J6022j3215p407J9554p101k4494J2675J4046j2707L07J1402l602
776C283p322Q20O441N817o898m115Q063q164j2314J2941N827j0116O361M842j0794
791e328L870O827n500M687N354j1111l703L996l573L59L423J440L353n885n966
$$ plain form
691 1452 -4078 3012 3212 4125 5734 -558 -2447 -1335 -3817 -781 -1169 -3708 4300 -341 -14028 2968
707 2968 14461 -7026 -3371 18316 586 -17346 2489 10783 -4719 -6709 5022 5863 -9068
720 -9068 -11687 10013 11923 -10241 -648 15789 -7607 -16196 8720 7037 -8323 1131 6147 -4045
734 -4045 -5141 -9 4775 6322 -807 -462 3016 -6667 -7112 4413 160 -1308 5907 -4181 -7810
749 -7810 7376 2594 -5019 10563 8640 -11349 -7498 3261 -1818 -4189 1821 7322 1400 -10893
763 -10893 -2197 13825 610 -6797 12757 5656 -18838 -6163 7883 -4824 -4517 6885 3283
776 3283 -4039 -3219 3222 9039 2141 -1974 6089 -2075 -14389 -1448 4379 -5737 624 5466 -5328
791 -5328 -1458 5369 -131 4556 9910 -1201 -4904 -908 -4481 -4122 -699 741 4094 -1791 -7757
806g757J1776K331j2607J0228R632j9046m274J4716m825o239Q574K707n737l744
820d265m2P627j87p852Q231L181j5719K222J3885p571k211J1221n344p734N425
835H67j193j859M871l012k729J940m081J432O301k144K175N178r127p93R810q565
851i29m331J1886n472j1590Q140L130o319M360M537n29m63m060L224N650q490
866a256j455J0626q650j0163J2304Q0r792Q042M847p876K206L342j925K819k80
881B869j820L632m663l904P230l445o247P954j494q490Q518L326q701N751N661
896F177q174J761N790l833j06O04k389J970l544l729P697k263r108Q956L516j0935
912g610N519R998q448p73Q138m109k897L753j398n33j974m874M262j59o839P251
$$ plain form
806 -7757 4019 6350 -6257 3971 13603 -5443 -9717 4999 174 -6065 2509 5216 -521 -4265
820 -4265 -4307 3320 3133 -4719 3512 6693 -9026 -6804 7081 -490 -2701 8520 3176 -4558 867
835 867 -326 -2185 2686 -326 -3055 -1115 -5196 -3764 2537 393 2568 7746 -1381 -2174 7636 -929
851 -929 -5260 6626 1154 -10436 -2296 834 -5485 -1125 3412 2883 2420 -1640 1584 7234 -1256
866 -1256 -2711 7915 -735 -10898 1406 1486 -8306 -264 4583 -3293 -1087 2255 330 3149 2869
881 2869 1049 4681 18 -3886 3344 -101 -6348 1606 112 -8378 140 3466 -5235 516 6177
896 6177 -1997 -236 5554 1721 1615 2219 -170 1800 -1744 -5473 2224 -39 -9147 -191 3325 -7610
912 -7610 -2091 7907 -541 -1314 6824 2715 -182 3571 2173 1640 -334 -5208 -946 -1105 -7944 -693
928f93M908r847L515Q654q949M95J0373n048m699N372l722m075L314k46M36M20
944B08m001K655K421n933M939P775r810j822R653p506m616J1579j448p877M151
959C68N25m567K229J688J815J112o084J202N311o976R59J1415p275p595R323k988
975D62q947Q657L476p169K360K498l048J688J364K433K967o201j795N693o952
990b514m832J1487l025j0302Q564K138r900P040Q120n473J44L381k992j341n71
1005g6J257M250n782m582O957m357p862J1024M064j0991M780O373r709N65J0042
1020E953k616k175K677j535j469j614n2N379l281p443O478k09j1192Q397Q611
1035E909j0109R63J0129o687l578R320n5m103Q71j093j999k872k582O642N11q158
$$ plain form
928 -693 4215 -5632 -2117 6537 -2412 -1917 8456 3408 -1291 4081 359 -3716 -402 -648 -212 208
944 208 -3793 -1138 1283 -4650 289 8064 -1746 -3568 6085 -1421 -6037 5542 4094 -3783 368
959 368 893 -3674 -1445 243 2058 3170 -2914 -1712 3599 -3377 -2418 8997 1722 -5873 3450 462
975 462 -8485 172 3648 -3521 -1161 1337 -1711 -23 1341 3774 6741 540 -1255 4438 -2514
990 -2514 -7346 4141 1116 -9186 -622 1516 -8384 -1344 6776 1303 1447 4828 1836 495 -76
1005 -76 1181 5431 -351 -4933 2024 -2333 -10195 829 4893 -6098 -1318 5055 -4654 -4089 5953
1020 5953 3337 1162 3839 2304 835 -779 -831 4548 1267 -6176 302 93 -11099 -2702 5909
1035 5909 -4200 -3237 6892 205 -3373 5947 5892 1789 2660 1567 -432 -3304 -5886 756 1267 -6891
1051f891N963N593j0815K693J2327p903m425R586l685q001N607K571m000J221
1065a59J176J55j630l157N143L007r124K619Q087j0934l002J3679l652q425R711
1080C494K537r705K318N366k511j987r8J536k23o492L366P763p917k053J1057
1095F451m888q904J0662J882j0520N374M997p935p2N077j670q46N43J392J956
1110C499n723J05P789o500n915J0799j769j1517Q842O424j0970K179R423m675
1124A991m086N009P14k994k972J366M065n970l975R881r71j0338R382O305j1110
1139c703K034R216p745m407P223j684l812K450P84j7j471n71N486j597n851O739
1155C074R85j1108M065Q705r590j304J1403n090o515Q200K065n483N54K201m32
$$ plain form
1051 -6891 -928 4665 -6150 -3457 8870 967 -3458 6128 2443 -5558 49 2620 -1380 -159
1065 -159 1017 1172 -458 -3615 1528 4535 -4589 -1970 6117 -4817 -7819 5860 2208 -6217 3494
1080 3494 6031 -3674 -1356 4010 1499 -488 -586 950 727 -5765 -2399 5364 -2553 -4606 6451
1095 6451 1563 -7341 3321 5203 -5317 57 5054 -2881 -2953 2124 454 -392 151 1543 3499
1110 3499 -2224 -2119 5670 -830 -6745 4054 2285 -9232 -390 6034 -4936 -2757 6666 1991
1124 1991 -2095 2914 3628 634 -2338 -972 3093 -2877 -6852 3029 2058 -8280 1102 7407 -3703
1139 -3703 -1669 7547 -198 -4605 2618 934 -2878 -428 356 339 -1132 -1703 3783 2186 -3665 3074
1155 3074 4059 -7049 -2984 5721 -3869 -5173 6230 1140 -5375 2825 4890 -593 -39 2162 1730
1170A730m385k875O465J318q574N695P920j0741j271J2025n028o955Q414j50q235
1185d647K017L419k167M21J023K065l52m776L284M895o992k32Q051p679o101J0088
1201B317r35p048P888L393p895R35M624k398j321M99K008p46o213J285P390o000
1217b217k351J1132l042r956P885M275r352K325N973n019l287K517O99K27q84
1232a075J331L910m857l163P190j333o899P362K040j0045L282N601o250O11P259
1247D964l491l088K459k50r51k47k8L441k990m902O329J592p987O378O492r379
1263a658j540P950m890m099N605L90l757r2M71J883k56j619N382O53p796K785
1279e88N679q025j11P844n762m368O611j247l513M865J171k500N79m89L60L01
$$ plain form
1170 1730 -2655 -5530 935 2253 -6321 -626 7294 -3447 -4718 7307 2279 -4676 3738 3588 -4647
1185 -4647 -2630 789 -1378 -957 66 2131 1779 -2997 287 5182 -1810 -2042 6009 -1670 -7771 2317
1201 2317 1382 -5666 2222 5615 -2280 -1345 3279 881 -440 59 2067 1321 -4892 -3607 3783 -2217
1217 -2217 -4568 6564 3522 -6434 1451 5726 -3626 -1301 4672 -347 -3634 -1117 -418 -191 -1075
1232 -1075 256 4166 -691 -3854 3336 2003 -4896 2466 4506 -5539 -2257 3344 -2906 -2295 4964
1247 4964 1473 -1615 844 594 -357 -604 -632 2809 -181 -5083 1246 2838 -5149 1229 7721 -1658
1263 -1658 -3198 4752 -138 -4237 1368 1758 -1999 -2091 -1620 263 7 -1612 3770 4423 -3373 -588
1279 -588 5091 -2934 -3045 4799 -963 -5331 1280 33 -3480 1385 2556 56 635 146 506 807
1295H07k699K456K863o550M18O921n952k252Q983k445o919N819J401n576J729
1310i96K489j400m09j275J683K399m438J063O031n180m311P558j868o710O506
1325A142J375n879K556K875l229J249J819j344J048j566q71K829l156k601N666
1340A913j970m840O702J329o781M526M105o677N41M557l520j781J682n38J04o00
1356a248r84M918j382m499N663R02p388L552M721o753p4N095l205j340L106k41
1372H43k54L54j657J081m4l150L140J604m875K534L463n564J389N943m514k022
1388a729M719l202l354L532J41r39J177q69J082J97k765L045L391o304O05M637
1404C364n588k372O894j209m185M139M99l144J896O67j44P75k806m6K626l763
$$ plain form
1295 807 -1892 564 3427 -3123 -2705 4216 -1736 -3988 4995 2550 -4369 1450 2851 -2725 -996
1310 -996 1493 93 -316 -1591 92 2491 -1947 -884 5147 -33 -4344 3214 1346 -5364 1142
1325 1142 2517 -3362 -806 2069 -1160 89 1908 564 1612 46 -825 2004 -1152 -3753 1913
1340 1913 -57 -4897 1805 3134 -3647 879 4984 -1693 -1152 3405 -115 -1896 -214 -752 -648 -1248
1356 -1248 -2232 2686 1304 -3195 2468 3370 -4018 -466 4255 -2498 -2572 2523 -682 -2022 1084 843
1372 843 589 943 -714 367 323 -2827 313 1917 -2958 -424 3039 -2525 -1136 4807 293 -1729
1388 -1729 2990 -212 -3566 -34 107 -832 345 -524 558 755 -2010 1035 4426 -1878 -1273 3364
1404 3364 -2224 -4596 2298 1089 -3096 1043 1542 -1602 294 961 817 1592 -1214 -1260 1366 -2397
1420b397K38N679l407k390N255k661m318N548O15m276K904O90l659J075J329j64
1436F1J699j085n28J660l437j207N429k336l920N344l92o285M506M261m192N11
1452H9K889k678j058M94L22J803k124j717L390k464l466N864J834n505L507K302
1468C482n994R29M092k755m05K614k606o60N89m11K251j06k216K764o74n102M259
1485E1K922n367K052L819n678r32N347j642j643L226r16j650n46n64K273K52l087
1502b083K457J824n694J508N710m031j161N409l224l637L107M17k199J960r2p94
1518e23L31j612K005K129k634O64L102n024r10N248l063k940N249j206m546L429
1534c01J660k050J681J028j174o03j683Q89K006l121j28M629l276l575O132k94
$$ plain form
1420 -2397 -2159 3520 113 -2277 2978 317 -4001 1547 2162 -2114 790 1480 -2179 -1104 225 61
1436 61 1760 675 147 1807 -1630 -2837 2592 256 -3664 1680 1288 -4997 -491 3770 -422 89
1452 89 2978 300 -758 -264 58 1861 -263 -1980 1410 -1054 -4520 1344 3178 -2327 1180 3482
1468 3482 -2512 -1583 2509 -246 -651 1963 -643 -1303 -714 -1125 1126 1020 -1196 1568 894 -4208 51
1485 51 2973 -2394 -342 3477 -2201 -3133 2214 572 -1071 2155 1239 -411 -957 -1521 752 1004 -2083
1502 -2083 374 2198 -3496 -1988 3722 -309 -1470 3939 715 -2922 185 602 -1597 363 271 -523
1518 -523 -192 -1804 201 2330 -304 360 3462 -1562 -2472 2776 -287 -3227 2022 816 -3730 -301
1534 -301 1359 -691 990 2018 844 241 -1442 -553 1453 -1668 -1796 2833 -443 -4018 2114 1820
1550A820m657M508J950n131N46J904j838J33M47k30P82j453n3L550j602j897M061
1567B840j069n113M087J408n493K568L165m267m5L470j132l68J237k20M00j942
1583d74j518L080j524k996M514R46n551L175M259m793j34M625l047k028K070p85
1599a81m92k02l60J818k86k533L626J334m635K668K632n005q2M145l426j803L973
1616A191r00k427K589K42n70M66k78R05k97l100K119K028m814J086M666m154j477
1633b725N677j097l709L057N21k960N25R35n38l92q47J513J578l073J478L159
1649C102k961j991M755j939l834L756K51l632J886J496k050J006R37l71J052j578
1665a15m41K258k881r08L898j951l231M694M19m476L119K423l795M18K239j749
$$ plain form
1550 1820 -2837 1671 3621 -1510 -964 940 -898 -765 -318 -548 234 -1219 -1272 2278 676 -1221 2840
1567 2840 1771 -3342 745 2153 -3340 -772 2393 -1874 -1919 1551 419 51 1288 1068 1468 -474
1583 -474 -1992 1088 -436 -3432 1082 2028 -3523 -348 3911 -882 -1016 3609 562 -1466 604 -181
1599 -181 -673 -875 -1235 583 297 -2236 1390 2724 -1911 757 3389 -1616 -1698 2447 -979 -2782 1191
1616 1191 291 -2136 453 695 125 591 313 1218 921 -2179 -60 1968 -2846 -1760 2906 -1248 -2725
1633 -2725 2952 1855 -1854 1203 1724 -1236 -711 224 -314 -706 -1553 -40 1538 -1535 -57 3102
1649 3102 141 -1850 2905 966 -2868 888 1139 -2493 -607 889 -1161 -155 782 411 1463 -115
1665 -115 -556 1702 -1179 -2087 1811 -140 -3371 1323 1742 -2734 385 2808 -987 -569 1670 -79
1681g9q55N81K35N93j375o61K963j194k585M416N21n146K783K280m687N13L272
1698A575k372n23K139j010j28O61j78J447r56k196K369q1l738K860K425m277J092
1715h91L625l425m67L529j775k007J881l27r69J64j60J655j11k348K305J642m205
1732a884J407L430l695j348M268k066l087L330N14j696J055P9p8J30j388R61J579
1749A511k976O57K849l242p60M538k190k705L909m92l216K699L96j925P96Q9m19
1766d81R40j140K41K371k566m67L270k160k585L996k74l559K716J218l025J064
1782d41J295j235O96L66k74J031j624p38K502j811k345L018K98l152K551K069
1798B206l429J205K273k793J63J694j504j60m3l70J112o39j290K707J59k857K535
$$ plain form
1681 -79 -934 -353 -118 475 -900 -1561 1402 208 -2377 2039 2560 -2586 197 2477 -2210 -1697 1575
1698 1575 -797 -1320 819 -191 -319 342 164 1611 655 -1541 828 747 -2991 -131 2294 -1983 -891
1715 -891 2734 -691 -1158 2371 596 -1411 470 143 -826 -662 -822 833 722 -1626 679 2321 -1884
1732 -1884 -477 2953 -742 -2090 2178 112 -2975 355 869 -827 228 307 229 359 -1029 -68 1511
1749 1511 -1465 -808 2041 -1201 -1961 2577 387 -2318 1591 1099 -2117 582 978 -947 -151 -62 -481
1766 -481 459 -681 -440 1931 -635 -1102 2168 8 -2577 1419 1145 -2414 302 1520 -1505 -441
1782 -441 854 -381 315 681 407 1438 -186 -924 1578 -233 -2578 440 738 -2414 137 2206
1798 2206 -1223 -18 2255 -538 -375 1319 -185 -345 -388 -758 354 -285 -1575 1132 1291 -1566 969
1815I69J464m143J345K345l499L2K492j520k12J462n52q0K05r58J731J37k427
1832a209J468Q31l630J508K938k791j79L190j683j384K410o43j039O12r32k06
1848g39M00j284J203J690j967M81K713k533n61L369j983j929K305j480k080J697
1864f98M21p52J675l26M5R50j378L42J836k261j095K679k377j921L287l53j882
1881a808K991L97k407J528L36o50j80m70p27P95j522k8L044n44j677L520q45l057
1899a304K434L28k804J041P91k400M39J075p67J814N07p64J339q43j654J621n45
1916C08k541K040O35l082J780K178j939P90J891j576j52N42j243N53j79j779J380
1933c94J46k295K267K063k308J729J668k864p09J986j543j187J897j387l09Q03
$$ plain form
1815 969 2433 -1710 -365 1980 -1519 -1487 1005 -515 -727 735 183 103 308 -650 1081 1218 -1209
1832 -1209 259 1090 -2540 -1032 1906 -885 -1064 2126 443 -941 1469 826 -213 399 -533 -739
1848 -739 -339 -1623 -420 1270 -697 -216 2497 -36 -597 2772 789 -1140 1165 -315 -2395 -698
1864 -698 -277 -1029 646 320 365 1315 -63 279 2115 -146 -1241 1438 -939 -2860 427 74 -1808
1881 -1808 1183 1580 -827 701 1037 387 207 -263 -990 -195 -1717 -1745 1299 755 -922 2598 1753 -1304
1899 -1304 1130 1458 -1346 -305 486 -1914 -1475 -400 -1167 647 1154 390 1729 886 -768 853 308
1916 308 -2233 -193 442 -2640 -860 1318 -621 169 2060 484 332 874 -369 184 5 -1774 -394
1933 -394 -248 -2543 -276 1787 -521 1208 2876 12 -697 1289 -254 -1441 456 -931 -1240 -437
1949d37q92J117J112r71J315P54k900N62J558k633J78K857k725r90L234o40j125
1966f26K020o81p48M91q62k22Q31j507K72J937k469L39L072j289r33L143j233
1983A535k509J677l68j748Q97j78p37J243o04MJ966j080k96K590j786j920K460
2000A146r35k197K456o9k193J929M57j389J621K49q92M63o87q55J284o12j571
2017a795K319m16k038K724L43j799J648J059k662P40N01j756L28L17p55Q60L53
2034b9j174K048Q9j555K111N25k934J028J131k687N79J349j572M08J506j198N19
2051A44R58j000M60K72k006R66O23k313J789J377k241M55K384j770n28J889j187
2068B72j012R32j182L9M39o41P09J436j753J072J852k580K05K183k125j106K174
$$ plain form
1949 -437 -1329 -212 900 -71 1244 1998 -902 -340 1218 -1415 -1237 1620 -1105 -2095 1139 499 -626
1966 -626 1394 713 -35 456 -406 -628 203 -1304 -1032 905 -1564 -1225 1847 558 -375 2768 1535
1983 1535 -974 703 335 -1413 -516 -694 -1431 -188 -792 -788 1178 98 -198 2392 606 -1314 1146
2000 1146 211 -1986 470 401 -1792 137 594 -795 826 1075 183 646 -41 -896 388 -224 -1795
2017 -1795 524 108 -1930 794 1137 -662 986 2045 -617 123 624 -1132 -804 -487 -1242 -382 -29
2034 -29 -1203 845 934 -621 1490 2015 -919 109 1240 -1447 -868 481 -1091 -683 823 -375 144
2051 144 1102 102 562 834 -1172 -206 417 -1896 -107 1270 -971 -516 1868 98 -430 1459 272
2068 272 -740 192 -990 -951 -512 -1153 -444 992 -761 311 2163 -417 -212 1971 -154 -1260 914
2085I14j171j530K103k99q41J452k76k86R83j138L7J223j814l85J972j732p62
2102a550K748q16j574K382p0j761J590l52j575Q66n5p17J099o66m99K111j148
2119A3o02K167p57j924K122n54k240J535P85j813J239J011j034O57K8m36O38o12
2137B23j311J401n74j595K050O02k042J629J371k179P40J546k335K11O11j438
2153a090K92K20l10P80O84j162J508K75k004J758M25k492O09J620k471K14J934
2170G90r70m0J080r17J77M24j011O97P24j855M27J359k321O54K113j925L32J727
2188A465j350q14J619r44r66J026n98l70J148o90M97J292j306K29J378j905m81
2205g70J686j400j493K203m18j443J886J76m67J134p7n33O79j069q52J605j436
$$ plain form
2085 914 -257 -1787 316 17 -824 628 352 66 1049 -89 -52 1171 -643 -1028 944 -788 -1550
2102 -1550 1198 382 -1192 1190 1120 -641 949 597 -978 -112 -167 -884 215 -451 -950 1161 13
2119 13 -589 1578 821 -1103 1019 465 -1775 -240 545 -1268 -29 982 -52 605 633 197 835 223
2137 223 -1088 313 -261 -1856 194 796 -1246 383 1754 -425 315 1861 -474 -263 348 -1090
2153 -1090 -798 -578 -888 -108 576 -586 922 1197 -807 951 1376 -1116 -507 1113 -1358 -1144 790
2170 790 -180 -220 860 -57 120 544 -467 230 954 -901 -474 885 -1436 -782 1331 -594 -262 1465
2188 1465 115 -699 920 -24 -990 36 -562 -932 216 -474 23 1315 9 238 1616 -289 -770
2205 -770 916 -484 -1977 226 -192 -1635 251 427 -40 1094 1017 484 1163 94 -758 847 -589
2222e89r20K207j244j076K633n03j666K075P2j862J307M94j395R08l35q99J089
2239B96l96m86J405m45j636K083P2k391K010L98j998R19R52j672N83J054r16M10
2257B42N24j096J205l11j620J604k74j905J522O60j867J266J521j935M39J562
2273A537j676J23M59r89J33K74j038O58P65j354J421R99j902J090J508k357r7
2290d46J383j720p00J544n71n01J303n75R9J246j098N16J053j946K39J443k364
2307a095k46K125j522o91K334o80o96J633p16o68Q58q45j09O67j184J58J273j190
2325e94j16K097j195q50J648p22j583K019m44j590J368jq04J140R5m42J130r23
2343B33p16J603r54j653J937n08j592J840K66j545J239J016j255O47J92q88L60
$$ plain form
2222 -589 -1509 698 -546 -1622 1011 508 -1158 917 989 -873 434 928 -467 441 106 -793 296
2239 296 -100 -586 819 374 -1262 821 893 -1498 512 910 -1088 -169 783 -889 -306 748 -168 242
2257 242 766 -330 875 564 -1056 548 274 -1631 -109 551 -1316 -50 1471 -464 -25 1537
2273 1537 -139 -16 443 -546 -413 -139 -1177 -519 246 -1108 313 1312 -590 500 2008 -349 -446
2290 -446 937 -783 -1483 61 -510 -1011 292 -283 -184 1062 -36 480 1533 -413 -174 1269 -1095
2307 -1095 -1341 784 -738 -1429 905 225 -471 1162 446 -222 636 -209 -318 349 -835 -677 596 -594
2325 -594 -710 1387 192 -658 990 268 -1315 704 260 -1330 38 37 -767 373 468 26 1156 233
2343 233 -483 1120 166 -1487 450 -58 -1650 190 456 -1089 150 1166 -89 558 750 -138 222
2360B22k73q29R43o26j061J879L67j503J567P58j787O43P91j834O44N37j021J38
2378d45N63p91N50L06o87J415k64j184Q88M49j917J107Q92j685L88J384j454M0
2396d45J730j329j70N76p22K77K83j179P91P46j627P48J490j646M16J721j466
2413A94o54J418j035p50J197m98o13Q64l92j01O93q22J38J399j144m63J772j344
2431a41q29J639q01p90J489m26r61J376k68m92N56p46j51J216j261k74J572j036
2449c28o20J993n52j325J718j78j540J080J1j243R20k4n29M64O7n36J139l96n54
2468d33J593o60j622J646K01k041J500N63j610Q22N64j063N80L62q23P19l79m87
2486e68Q32l28j008J351N91j552R12J144j753K50J285j390q2O93p75j1O36q35
$$ plain form
2360 222 -51 -880 63 -563 -1624 255 622 -881 686 1444 -343 300 1091 -743 -99 438 -583 -445
2378 -445 118 -673 -123 183 -504 911 647 -537 351 800 -1117 -10 882 -803 -415 969 -485 -445
2396 -445 1285 -44 -214 362 -360 -83 200 -979 -188 558 -1069 -321 1169 -477 -61 1660 194
2413 194 -460 958 -77 -827 370 -128 -741 123 -269 -370 323 -499 -361 1038 -106 -569 1203 -141
2431 -141 -970 669 -132 -922 567 141 -820 556 288 -204 352 -394 -545 671 -590 -864 708 -328
2449 -328 -948 1045 493 -832 886 708 -832 248 259 -984 -64 -88 -617 -153 -86 -622 517 121 -433
2468 -433 1160 500 -1122 524 725 -1316 184 747 -863 -41 523 -540 40 402 -421 298 -81 -568
2486 -568 264 -64 -1072 279 870 -682 230 1374 -379 -129 1156 -234 -316 377 -398 -409 227 -608
2504f08N86O38j049P51P42j420P79O31j509J91J145j445k37J605j066k39J107
2521F02n01j13L70o30K33L84j180K11J065j051J08J396r45m37J508n37q15R66
2539F34l63q83Q80n45k94O28o28K54J293j151j57J545j266q15J833j122r27J675
2557E91l97p25R18J17n98M40N6m51N02o81m62Q15m70n04J291n54o97J921j25j675
2577f88J245M20j651P65L02j442N35J89l32P60R9n01J399m30q85O87L15j319M90
2596d2M77j601P25Q19j064N13N88m55K52K71o78P12r0j156O74K87j201R76P35
2615G42j348P62Q80j266J5P72p48n83P20n04o8P71o15P61L09n25M18L40j122J49
2635a40J029j649j76J125r72Q7J148n03k13R35m43o3N21p68n6N43j150J42J027
$$ plain form
2504 -608 -22 616 -433 318 1060 -360 419 1050 -459 -268 877 -568 -805 800 -266 -505 602
2521 602 101 -12 358 -272 -39 345 -835 -624 441 -610 -502 894 -51 -488 1020 483 -332 634
2539 634 271 -612 268 -277 -571 57 -571 -317 976 -175 -332 1213 -53 -868 965 -157 -1084 591
2557 591 194 -531 387 504 -94 346 402 -49 453 -228 -690 125 -345 -849 442 -112 -809 1112 987 -688
2577 -688 557 977 -674 91 393 -1049 -514 -325 -657 103 202 -299 1100 670 -215 472 787 -532 -42
2596 -42 435 -1166 -441 378 -686 -173 415 -40 212 483 -195 517 427 -729 -55 232 -969 7 742
2615 742 -606 156 1036 -230 -215 557 -191 -774 -54 -558 -626 145 -470 291 600 75 493 833 -289 -140
2635 -140 889 -760 -936 189 -783 -696 452 -51 -264 671 228 165 686 -82 -138 405 -745 -603 424
2654D24j048r0J499q18n32J513n59j007J132m21k98J03J68o93O31k45J39P74o31
2673D1k19Q70p05p48J271k50r97P55K33r64P25K52n01P62J20q20J03j2m84N18
2693e0J01r92J321k90j090J593J84j221R89K89j389O18j24m99J20N30m09N89k5
2712B45o71J016J06j082P97J43j404P37M29j193M78J170j285K00P89r33M02L61
2730C05l51K73J82j182Q74N11j163N83O66j658M95J232j322o5J215o77m28P74
2748B64n39J04N93o65M58L92p98K3J164j508L90Q03r42o06J262q05k0P24k74l17
2768b97N85k06l21J036o41K4O18j117M9R02r12p01J365l17o52J023J54q68O66
2787C90P3q27M13j09m34P58o69k91J114l09m84R61l74p79R56j11p56P25J09p08
$$ plain form
2654 424 -624 -714 785 -33 -565 948 389 -618 514 93 -205 -102 66 -627 4 -241 -102 672 41
2673 41 -178 692 -13 -761 510 260 -737 18 251 -713 12 264 -237 525 645 -175 -72 -84 -568 -50
2693 -50 51 -941 380 90 -1000 593 777 -444 545 834 -555 63 -61 -560 -440 90 -319 270 245
2712 245 -426 590 696 -386 411 554 -850 -113 316 -877 -399 771 -514 -314 475 -458 -56 305
2730 305 -46 227 409 -773 101 612 -551 32 698 -960 -465 767 -555 -620 595 -82 -510 264
2748 264 -275 -171 422 -243 215 607 -191 -168 996 -512 -122 681 -261 -867 395 -410 -430 294 20 -297
2768 -297 288 82 -239 797 156 180 798 -319 -270 632 -280 -981 384 67 -585 438 592 -276 390
2787 390 463 -364 49 -60 -494 264 -405 -696 418 109 -375 586 212 -567 389 278 -478 247 356 -352
2807c52J43N33o06M55K21n03L04K06j016P84L6r69J125n7j181R97M72q69M45L21
2827D89m31j05J79o15L35K35o35N23J44o83N89M50o11L65P12j477N75N22j126
2846e65M80M61o92K80M18n22M32J4k26k18N32o42K29P82j270k42J151p52l7R61
2866E74n67j56P68p65J83J12j67k81K45m16N12L74r11O20O71q93o7Q51m13j030
2886g56J163l96n38R34l47r2N15l89l1N30o42m74P84l96p07J244o07l28P62M17
2906F46q69O86J02p11R9L30o91N36k88k52M01k70k65J007k54q92Q94L56j078Q85
2926C72J12j031M98J88l64J50J35j94L30m3n83Q77j63o09N03q5m32L51N68j225
2946f45O21N17n65K6N30n63L50k33m11L41q7l75L17M29o94L63N16r41P67O83j158
$$ plain form
2807 -352 -209 324 -282 173 394 -109 195 401 -615 169 205 -764 361 304 -877 120 592 -277 168 489
2827 489 58 -47 132 -483 -148 87 -548 -25 119 -564 25 475 -136 229 941 -536 39 561 -565
2846 -565 -85 376 -316 -36 382 -140 292 306 80 -138 394 -248 -19 763 -507 -749 402 -350 -387 574
2866 574 7 -149 619 -146 37 149 -18 -299 -54 -470 42 416 -495 125 796 -97 -164 687 274 -756
2886 -756 407 11 -527 407 60 -32 483 94 63 593 -49 -523 261 -135 -842 402 -205 -533 229 646
2906 646 -223 463 565 -146 -47 283 -408 128 -160 -412 -11 -281 -546 461 207 -685 209 565 -513 372
2926 372 484 -547 -49 139 -225 -75 60 -134 196 153 -430 447 284 -325 178 93 -339 12 580 -645
2946 -645 -24 493 -72 -46 484 -79 271 38 -373 -32 -119 -494 -177 252 -442 -79 437 -504 263 946 -212
2967b12K08P77r00k57Q13o28j19M71n30L33K53l38Q0M52o93kQ74j154J04R05p10
2988b73J91O56m76r2O83n18l43N02o01k11N94p82R1P88l94k13Q12j51o82R64m4
3009E01q02J033n14o76M61k64j01L45P2j86L58p1m73O80n13k57Q35m26p26J025
3029C01n7j013N97M64o43O94l48j08L10k71k84N26l71j98N89J30o27Q95K3p92
3049a83M85J58r79L24K75l75Q0M01o92Q14km22P76l2j039O75Jo08J86J97n55J96
3071c19O38n94K01O62l96k80L37n49J94J05n27M89K31p51M99M26o47M66N04o84
3091Eo2O98q48r7P92p90J19M05m53K73P04q27r7N03o96P9P99m96k35N53o08j15
3113c94J081m67k13N27l75j63L35n81j11O01o19k36J023m01k96R64o04j77P86
$$ plain form
2967 -212 -4 773 -127 -384 429 -199 -318 153 -377 -44 209 -129 -49 403 -290 -292 582 -572 -468 437 -273
2988 -273 -82 574 98 6 689 171 -172 330 -271 -482 112 -670 -579 209 -185 -398 414 263 -419 545 501
3009 501 -301 732 218 -458 3 -261 -362 -17 55 -131 227 156 -317 363 -150 -407 428 2 -724 301
3029 301 244 -769 -172 292 -351 343 -5 -113 197 -74 -358 168 -203 -401 188 318 -309 586 609 -183
3049 -183 302 460 -519 -195 80 -295 -215 186 -506 308 306 -116 660 628 -411 264 265 -343 -157 40 -515 -319
3071 -319 319 -275 -74 588 192 -88 249 -300 -106 -1 -528 -39 192 -559 -60 366 -281 185 689 5
3091 5 -57 641 -207 -304 488 -302 -183 222 -231 42 746 -81 -178 325 -371 -292 507 11 -224 329 -279 -394
3113 -394 687 220 7 534 159 -4 331 -250 -361 240 -379 -615 408 7 -289 675 71 -106 680
3132F80m43q70P29k9m46K71p7k91N68L21n46M69K5n00O13o9p10N53k80n59N98
3153GQ2n99N16J67n33P16k06j5Q7M9n14M44Q5p44N27J44o14K92N11o02K2O49q82
3176d11J99N23p33K39K65k10M37n8m13N24R0q72M26L17q39j52Q51p11Q7N77k26
3197i0j19Q59o26J97K68m42O2J20l93Q3K76n53j67R66n33J49M26n26k72O46n55
3218b24n1K88o6l25O81n44N6M04k88j98N46k09m90Q11n06l58N91K8o12O88k59
3239c7l82N68k97k51P41l70j85O67o77l00R82l86o45J193j24q33N97M6p64P72
3259C15m60k58N07J57n17L79n5l06O93k62l63P98k65p59O45o9m85L6M61n04L54
3280D2K41m07K94K65l82j40L70k98O6J71n95L75J11m06J80P32r94J77M53p4J89
$$ plain form
3132 680 237 -633 96 67 -379 -108 -185 -476 92 413 -133 336 361 -139 474 405 -305 248 -32 -591 7
3153 7 89 -510 6 173 -360 356 150 135 222 271 -243 201 286 -458 69 213 -401 -109 402 -200 -178 471 -411
3176 -411 -212 311 -422 -183 82 -128 309 251 -162 362 452 -420 6 323 -516 -668 183 -528 -441 136 -90
3197 -90 -209 650 24 221 489 47 109 229 -164 -81 195 -358 -525 441 -92 57 483 -43 -315 331 -224
3218 -224 -275 13 -53 -378 303 -241 -185 219 -69 -267 279 70 -420 391 -115 -473 118 146 -466 222 -37
3239 -37 -419 149 -148 -399 342 -28 -213 454 -223 -523 459 73 -572 621 497 -336 261 307 -457 315
3259 315 -145 -403 104 261 -256 123 68 -238 455 193 -170 628 363 -396 249 180 -305 -269 192 -312 42
3280 42 283 -124 170 435 53 -87 283 -15 51 222 -373 2 113 -293 -113 619 -375 -198 255 181 370
3301C70j3o94J99J78l20L11K95l91J00K79n85L17L90o24J30M22m66n72P82k18
3321a10N6K87l87K87K59l38m55M22k51j93P26p45J10O69l51j88N44l91k50L04
3341EJ09l41K13j97q9P12k86m58O90n17J94O51p90l02O57j77n38O37m9l45M54
3362B33m7m02L79J06l87K17j08l94O45J39r50N18K00p49O57J51m38L68L29n08
3382d1J69N7l10N0n2l51P12j6m49N55j09n77P35P4m06p8N21q03L48L97l69J33
3404A90J68p01M52P2m33K04L00n08R4M80p56K84K68l18J00P73n60n5R9k33J64
3425H4J04q16N49%k51L51L31n88K98M95p71N3O23n66k52L92j99n8K62l37Q6N94
3447C84o36J80L93m56L20J15n74l27Q41n21k06R06l25k33M20j97m86N90K8l74
$$ plain form
3301 370 357 -337 -138 40 -280 31 326 -65 35 314 -271 46 436 -188 -58 364 -102 -674 108 -110
3321 -110 -54 233 -154 133 392 54 -401 21 -230 -423 303 -442 -332 337 -14 -202 342 -49 -299 5
3341 5 114 -227 -14 -211 -300 412 126 -332 358 -159 35 686 -104 -406 251 74 -464 173 124 -221 233
3362 233 186 -216 163 269 -118 99 -9 -403 242 381 -569 -51 149 -600 57 208 -230 138 467 -41
3382 -41 128 185 -125 -75 -127 -478 234 218 -231 324 215 -362 373 447 41 -37 484 -319 29 426 57 190
3404 190 358 -343 109 181 -252 -48 252 -256 -162 318 -438 -154 114 -204 -104 669 109 54 153 -80 84
3425 84 188 -628 -79 -79 -330 21 352 -236 62 557 -214 -161 462 -104 -356 36 -163 -221 41 -296 -210 384
3447 384 -252 -72 321 -135 185 300 -274 -601 240 -281 -487 419 94 -139 281 84 -402 188 216 -158
3467a58K84K16o67M95k24o1M20k66k58M08qo75J008j20q55M52K13n09L10L5k77
3488b37N66l65j30K98o5l87O75l52o06L97L73m22K98J75n22M89K76o67K86m7j07
3509g4l8J66l86M72P1p30P86J01q22K75N55o36l4P23n86P4j10m4J63J1l01K51
3531a13K41l99K68K5m16K51L37o59L47M76o12Q1N31k70n5L72k24k35J35l44j2
3552b75L19j89l61O88l77J99J99l59n0N93n40L6J31l25o9M22k24o1L44M0l94P52
3574D99o43k76R90l48k86K71m5m18N00p5l54K83j33l22M73j0l55N37q8k01K13
3595B12j91j14M68m27m97P62O7m13J71N2j81k21J98q7Q1K80m62M61j6j12J17j07
3617D1j48J29J76m04J94kl14K59Q1j66K40K01n88K45M10o35L42Q1l65L79k84j78
$$ plain form
3467 -158 126 342 -325 170 -54 -115 305 39 -219 189 181 -494 514 394 -461 -9 204 -305 5 40 -237
3488 -237 329 -36 -166 132 67 -320 355 3 -603 -206 167 -255 43 218 -304 185 461 -206 80 33 -74
3509 -74 -112 54 -332 140 211 -519 267 368 -454 -179 376 -260 -294 429 -157 -83 -193 -237 -74 -63 -364 -113
3531 -113 128 -271 -3 22 -394 -143 194 -465 -118 358 -254 -173 358 88 33 405 181 -54 81 -263 -275
3552 -275 44 -145 -506 182 -195 4 203 -156 -206 387 -153 -117 14 -311 -380 42 -182 -243 101 141 -253 499
3574 499 -144 -420 570 222 -64 207 162 -256 244 169 -185 98 -35 -357 116 106 -249 288 200 -1 212
3595 212 21 -93 375 -52 -549 213 280 -133 38 90 -91 -312 -114 -201 -120 160 -302 159 143 31 148 41
3617 41 -107 22 198 -206 -12 -14 -328 -69 12 -154 86 287 -301 -56 354 -281 61 142 -223 156 -128 -306
3639c06K88J42j34Q0J22k52J73Q2o2k63J92j40o1K76m30K98K58n19K45L34m44
3660a21K18j33l68J46K68K50m58N88k43k23K03j55j04L67l19J85l5k55l25P69
3680B55l18J14K57k29p9J04j9m65M08j32l92K43L49l37L41o9J41j5r8k00J41J26
3702A26m39L08o6l20M59R0k63K46n8j73M33m16l24M65k89m8O45k85l16L64j22
3723A7n11N62M2j60J85m5n6l52L56J8J27j74j11k9L72l47J62Nk22P3J28l15M15
3746A40m0k73Q4J82j18n8K03j75K94J76n43K14nj51K87ol24R9L29k91j6L22n22
3769a92J54L25m54K33k88J90K0Pq8L64k16m6N0K71l01j88L11n34J67M76l07l57
3791d03M19L0p0K19j57k03K10j94L9P9j49k4L82r5k40J57j84j10L54O2j32J89
$$ plain form
3639 -306 -18 124 -10 70 192 -60 113 195 133 -130 62 -78 -139 137 -293 5 263 -256 -11 323 -121
3660 -121 97 -36 -404 -258 10 260 -198 390 147 -76 127 -28 -132 235 -84 101 66 -189 -514 255
3680 255 -63 51 308 79 0 104 85 -380 28 -104 -496 -253 96 -241 100 31 172 157 59 -141 0 126
3702 126 -313 -5 -71 -391 68 158 -105 141 83 -90 343 -73 -397 68 -221 -269 376 91 -225 139 17
3723 17 -494 68 110 -50 135 90 34 -318 38 56 183 9 -102 -131 241 -106 56 61 -161 -88 40 -275 140
3746 140 100 -173 -89 93 -25 -83 120 -55 239 415 -128 86 81 -70 217 211 -113 -14 315 24 8 330 -192
3769 -192 -38 287 -167 66 -222 -32 -12 -5 -93 271 55 9 59 330 29 -159 152 -382 -215 261 -46 -403
3791 -403 16 46 -24 195 38 -165 45 -149 -110 -31 -180 -204 178 83 -157 0 -184 -294 60 122 -10 179
3813A79j93j86L22j21j26K97k85L4K59K05m43O8L43n72K57J29l16K12L3l69L78
3834A05p4k20K56J25k30OJ51l46K94j32J5j10K49k23M42j26k47K33Ll44K71M6
3856A44L5l01L3j40K39Q4l96L82J04m34K10M85n59K27j25j83j49L66o8K46L0k84
3878e4L16K55q46L20Q3j16j03K08k86k00Q63l52j95M56k38j17L15l21m9k0J61
3899H0p9L32m12j08K25k9J8J50j95J4J98l06m1M47m65p4K86l0k44K11P2j43K22
3922A29k30K6M90m28n4K64j16j83Q1l8J69j21J48l18K12k88K55j32L0q5L94q9
3944A16k14L41l2j9N0q1k12j5K45n46M80j0m06K03J07K5J6K54m33q9K92l62L59
3967F9N3l52K79J05j26m6J65l78L72K63n92K28j4j61R5L10l29K52K07k73k13K75
$$ plain form
3813 179 -14 -200 122 1 -125 172 -113 -79 180 385 -58 10 353 -219 38 167 -149 63 96 -273 105
3834 105 31 -189 67 192 -38 -32 119 -227 67 -65 -50 -160 89 -134 308 182 -65 168 171 -173 98 144
3856 144 179 -122 -89 -229 10 94 -302 80 184 -250 -40 445 -114 113 -12 -195 -344 22 -46 200 230 -54
3878 -54 262 517 -329 -9 74 -42 -145 63 -223 -423 440 88 -107 349 111 -6 309 -12 -61 -81 80
3899 80 1 333 -79 -187 38 9 27 177 -18 -4 194 -112 -153 294 -171 -245 41 11 -233 -22 50 -93 129
3922 129 -101 -75 415 -13 -67 197 81 -102 -21 -59 110 -11 137 -181 31 -257 -2 -134 -104 -189 205 116
3944 116 -98 243 211 192 242 161 -51 -66 179 -367 113 103 -303 -100 7 32 48 302 -131 -220 72 -290 69
3967 69 122 -230 49 154 28 -18 147 -231 141 404 -188 40 26 -135 -40 270 -59 193 400 127 -86 189
3989A89m95Q9N87m89J3L02m14J36K32l87K42j39P7j09M10l50L08k46l7q6K33n71
4011e05K82K74M6m2n6r9K11j59oJ89K9l92J91K02l66LN08l42lL33l55J00L4J46
4035B23l43J96l61L34j76mJ83L98m43o0J51k56L7K17j47k50M93l06r9L25K0j66
4057c4m1L23j4j26LN1O0l54O7R4Q3j76L50j90l77M38j32k36K38k8O8L0M5j29J61
4082A74p1k18J61n2j28J89qk62P6p7j7L79j50P4q3P0o6j10K53QK38k23k22l4J43
4107D4k47K86Rl91K31N13m19p4Q0k93M62j76oj67J16jq9J78k1J21q3l8l6k81K8
4132b54J93K00J2nK6n1l76N24k20n1K48m08L0M2L5L4R0j64j41K98J44m06N64k17
4156A47j25Q6j33l13N22m1J1r0j54j4L04q7j14R7k92R5J70R0r7j6L8j68j05O41
$$ plain form
3989 189 -306 -217 370 -119 -106 196 -218 -82 150 -237 5 -134 -57 -166 244 -106 202 -44 -81 -167 66 -505
4011 -505 -223 51 97 55 -1 -100 111 -48 -54 135 164 -228 -37 165 -201 -198 310 -32 -35 298 -57 43 77 223
4035 223 -120 76 -285 49 -127 -131 52 450 7 -53 98 -158 -121 96 -51 -301 192 -114 -213 112 132 -34
4057 -34 -75 248 234 108 111 162 222 -132 -65 29 112 -64 286 96 -281 157 25 -211 27 -1 67 97 142 13 174
4082 174 103 -115 46 -6 -134 55 47 -215 -139 -216 -233 146 -4 70 -13 57 -9 -119 134 142 380 157 -65 -99 44
4107 44 -203 83 92 -299 -68 445 26 -48 32 -261 201 25 19 -148 -32 -33 -122 56 35 156 73 35 -1 -282 -254
4132 -254 -61 139 151 146 172 121 -255 269 49 -2 246 -162 -132 -90 -55 -21 69 -95 -236 62 206 -200 364 147
4156 147 22 108 -25 -338 184 143 154 64 -90 -104 200 113 -1 96 -196 -101 69 159 62 46 84 -84 -189 452
4180D52p95P39j00l99K28j39r0J56O4l99M47p9o3Q7m29L29J70j59K1j49L7j45
4202b16K74J98l88K6L09n40K51M40l22N2j43m7N7J28l38K12O8j49k1L43k29%O7
4225C2M8j14O2j83J19J94m04J48Q3l12K24J03j23J49K14l47p1J18o3K8L59j35
4247A29o0O0l00lO58k68j39m9L9j29Q0p4%J24R4l13L85j88N2K00n41K56m2J7k17
4272b29N47j84l38K93j60j60L23j17j57J28L02m32L54m8k48J09j3J07o0L50m18
4293e1K51q3l8lj24j75K52k27p1K52N1j70K73J76m25J07K4n0J12n2k03R8J44j08
4317d0j24K36k42K43j6j73L05n0l92K71M13n35L7Q1k23K75J5k82N06m62P1J52
4339F6pk10K23m3N9k36J48J60k58K42O5j67J1k11P5p9k25L92J44m64M21J40k92
$$ plain form
4180 452 -343 396 296 -103 125 -14 -104 52 116 -283 164 85 22 109 -320 9 179 20 41 -108 -71 -216
4202 -216 58 256 -132 -106 203 -337 -86 354 32 84 -59 -106 -49 79 -259 -47 21 -128 -149 194 -35 -35 32
4225 32 80 -34 28 -155 -36 158 -246 -98 -15 -327 -103 0 -123 26 240 -107 -178 -60 -123 -95 264 129
4247 129 69 129 -171 -174 484 216 77 28 67 -62 18 -56 -56 68 162 -151 234 46 98 298 -243 13 -29 -12 -229
4272 -229 318 134 -204 89 -71 -231 92 -25 -182 -54 248 -184 170 122 -126 -17 -30 77 17 367 -51
4293 -51 200 117 79 76 -48 -223 29 -198 -269 -17 34 -136 137 313 -112 -5 19 -31 81 29 -174 -76 68 -40
4317 -40 -164 72 -170 73 57 -116 189 139 -253 18 431 -104 -67 14 -209 66 81 -201 305 -157 -86 66
4339 66 59 -151 72 29 88 -148 0 160 -98 144 209 42 53 -158 -83 -162 -387 5 149 -315 106 246 -46
4362d6j06L32L3m88M30j05j41R3nJ32k00J4J72k53l1P1J10LK1k10L32j53M3k03
4386a55o8L22Op0J84k81j68M65k50L5k52J71K3K71l27m0J66j54K96j66K15m49
4408b26K69j11K58k18N9p1J93j79R5J81j62J10l96K22l83M21J07j06m14N93m55
4429b13J83l00K46J99k70k6M4J36k55N37pl6o38K04L88m3K23m04J54n3j53J03
4451A9n2P6j28K75k74J34k9m21J67M09q1K0J90n59P5J9K82l26L85l41J07K75M7
4474B69r4R0o4k00J84m00J01j51J4M44j20k03J42lP0k94J83K58l49J94M9j64J13
4497F9j69j22M12k22R9k38L64k19K63j06k23K46m70M08lJ5k25J55J47N3m02J65
4519cm8K82j88j80L02l45j00M02L5Kk89O8r3J93o0j63K94o6l83M80j34j64K19
$$ plain form
4362 -46 -152 180 213 -275 155 50 -91 2 -3 129 -71 -57 115 -138 -169 -98 12 15 36 -174 158 5 48 -155
4386 -155 -223 99 105 35 219 -62 -230 235 -15 20 -232 -61 -38 233 -94 -134 32 -122 174 8 223 -226
4408 -226 43 -68 190 -28 31 -40 153 -26 69 250 88 198 -198 24 -359 62 169 63 -351 242 -213
4429 -213 -30 -330 -84 115 -155 -181 -137 -1 -256 281 274 238 -400 -196 192 149 372 -32 122 69 -84 19
4451 19 -33 43 -85 190 -84 50 21 -400 -233 176 95 115 305 -254 -179 -160 122 -204 181 -160 -53 222 269
4474 269 175 265 201 1 185 -215 -114 -265 -251 193 73 -130 12 9 79 -215 -32 226 -123 71 120 -44 69
4497 69 -100 -222 190 -32 67 -171 193 -26 237 131 -92 154 -316 92 89 104 -121 34 181 234 -168 -3
4519 -3 -51 231 43 -137 165 -180 -280 122 157 159 -130 -62 -155 38 -22 -185 109 43 -340 140 6 -158 61
4542F1j05pk09L45k20M87k07k72J77q3j53M8K21o9q8L85l45PJ42J05n4n0l61R
4566b36N32o21O44j80j48J92j44j04m7r7K5J00K64r3k24p1K1j9L36q8K61l3l83
4589a13QJ96j01j71J64%o6L18m49N27l80j36K55j97j86L67n9n3l2M9P3J5K41j36
4613A34m37L52p3k29L22j69K58j7L5j64J43n4k05r0K28k81J86j71j05K93K37j79
4635A4j1j03j02J71K9Q5l11L98m9q3j59J11K52k21j71K20j72n4L50j60l35L31
4657C0K09j71j71K95k56j04J25m9L61k5m39K38K92l48rj57l3L64l19J37n0P6j
4680ej05M3K51J05k36j43j62M51k05k04K15O2l40O7j2L26j08k18R5J5K93k20J5
4703b0K3J00R0k98J85K9l29j00M56k69N2J70l89M32l53mn8L58J24k98M62j30m01
$$ plain form
4542 61 -44 -51 -260 85 -135 352 145 -127 50 -33 -186 -138 83 14 -74 311 -34 -27 115 220 166 116 -245 -236
4566 -236 296 -325 319 139 -9 183 39 -65 -112 -209 -184 -84 180 87 -137 -208 -187 -206 130 42 303 270 -113
4589 -113 -105 91 -10 -181 -17 -17 -83 235 -214 313 -67 -203 52 -145 -331 36 -23 -76 -108 -59 14 29 270 134
4613 134 -303 49 -24 -253 69 -100 158 141 176 12 155 101 -104 -194 34 -247 -61 -232 -337 -44 193 14
4635 14 3 -100 -202 -31 -2 83 -228 170 121 38 -121 -10 242 21 -150 70 -102 -156 194 34 -301 30
4657 30 239 68 -103 192 -64 -168 -43 -92 269 244 -195 43 335 -13 -22 -179 -212 152 -167 -30 -80 -4 -5
4680 -5 -110 -67 184 289 53 -90 -252 199 -6 -210 5 67 -273 -206 -218 108 0 -218 -123 -108 185 -35 -20
4703 -20 3 103 193 -105 80 109 -220 -320 136 -133 -81 89 -300 132 -221 -225 -283 75 199 -99 363 233 -168
4726a68K36O7j89P0m1m1J49j84k5J28j14J17k8K25k57J39j11j42K86l09J02K82
4748A92k6j15k43K33J24l04K43m02M29J22l30Q3j47K55O0j86l43M95l9n2j80L22
4770A91k38J97j01J19m0J16l08l4m3J36J57Q9m12j15J45P2J00l4k82K55l13K62
4792h1J27J7LNj87K03l2K7k25J04J8J81n4k25JR8J32k92K36k97J51j55N8L38j31
4817B0m1P6k56J9J45J13K60n96L18J65k39k41L13j23%O0j10K28j65J29O0r8k7
4840A0J4l6ml4K37n49K91K08n4k03L79j68m37L75p2l8J18j21q9L50J3o0j73j04
4864a47J89k95L21M2O1j19r8O2q3J64l22K16r7J74j10Q8q0K51k91o1K21j07P4
4887E3O1o6M36n07m0K48j37k6J37j78k36L59l7P8j94j66K52K95m01K20o4n70L46
$$ plain form
4726 -168 68 135 -54 16 -25 -66 83 -101 -126 2 -112 5 -23 202 -55 84 -27 -169 117 -192 -90 192
4748 192 166 51 -192 41 165 -139 104 -298 131 253 -77 6 -141 114 174 -12 -355 140 101 49 -131 191
4770 191 -47 150 49 168 128 244 -64 -98 -141 -5 152 241 -171 -286 -141 -69 31 -3 -285 -30 -343 -81
4792 -81 46 63 66 71 -116 87 55 82 -143 -39 -21 160 106 -119 -118 -20 112 -180 56 -241 -90 -245 -187 151 20
4817 20 -21 55 -201 -182 -37 76 336 -260 58 223 -16 -257 56 -67 -67 -7 -117 111 -54 75 135 37 10
4840 10 24 -12 -16 -50 187 -362 -71 137 83 -120 259 91 -346 29 -43 -81 37 -84 -173 177 190 130 -43 -147
4864 -147 42 -253 68 110 171 52 -46 16 -67 97 -225 -9 -106 68 -42 46 -34 217 -74 -135 86 -21 53
4887 53 114 48 484 -23 -63 185 48 22 159 -19 -255 104 67 145 -49 -215 37 332 -69 151 87 -483 -137
4910a37M3L75k80Q1oJ38p1l70L55j29L4l80K70q2P0J40j00j59L6L31j52J37j85
4933d1L0k58M26m36L6m0K72J39K02j68j61j75L1R5J42l88L12k9K09j50K3j34R4
4956C1l10L21k1O0q6j38J02M8L1j78M9n5M44j32R8N4j89n13J73L03nj05j13K36
4980A05K4k82J6K18K4k42J38K09K4j43l14K28p4k8N1q8K6J01j79J64l74M69k43
5003a70J69J00j44m00N33m0k01O7K01k36L89k58M3j6j51K31qk20p4M1P7j74J21
5026a20L80l81L00K78l90j80J71J14Ml67m1J67K11k25Q6J08j60N9k2l2K8k15J72
5049e5j99K96J57m81O5J19J62Q7k39K62r1J4p3K0j8j44J47j82Q3N5J93j32r1p1
5073a16j32J80k9j25J54N6j04J56j8k54J49N2k14J34L95m07J67m24J44J87r4n5
$$ plain form
4910 -137 -94 281 1 82 76 214 143 -227 128 -1 33 -347 -77 -159 -89 51 -49 -208 -172 159 7 144 -41
4933 -41 -11 -269 157 -279 -243 -283 -11 128 330 162 1 -174 -143 -48 94 -294 18 -11 198 48 71 -63 31
4956 31 -279 42 21 81 -5 -143 -41 7 38 -140 -91 -146 298 166 264 318 129 -384 -211 92 87 -18 -131 105
4980 105 129 -153 -137 81 105 -137 1 210 234 91 -223 5 -69 -97 -46 -134 -108 -7 -186 -22 -396 73 -170
5003 -170 -1 99 -45 -445 88 48 -153 -86 115 -121 268 10 53 37 -114 117 109 -111 -185 -144 -67 -241 -120
5026 -120 260 -121 179 457 67 -113 58 172 176 -191 -232 -65 146 -79 7 115 -45 14 -8 -40 -12 -227 -55
5049 -55 -254 42 199 -282 -217 -98 64 151 -88 174 83 97 24 44 26 -118 29 -153 -70 -15 178 46 -45 -116
5073 -116 -248 -68 -97 -222 -68 -12 -116 40 22 -232 -83 -31 -245 -111 284 -123 44 -380 -236 -49 -143 -198
5095a98M13j24l00K42p7J63j63j26L12j44j20j69L95j04qo8K1J12O7n6j66L33
5117B35k87p5K31j02j69o5J94J76K43r8j91j75N0n8o4K82k08kJ28j54L41j75k8
5140B9k32M1K46K4l20R7M26k13K6l0P8l37J93J2n7O4J73j15k93L07l96K09J37
5163F9m7K49k69K76n4k09K64k73J09k89L21M5k73O4J1M10l08q7q2R9q4J65Ok03
5187i0J72L3o4P9j03k80J99q7L80n00K29j83L78n27L29J26K71k51j53J02k66J67
5209c9j34O49o61J77K42l03M6j0l7O6L6L5k40J05o7J39l49O26j72K22k13j37P1
5232E2J68l03J49m0j01J51k23J37P8j22P6J63q3q6k06R3K3o0K32k34J16R1m36
5255c65K22N9P4J98k53O8R3k7j51J70l9o4q6j01j14J49J79j61J66n1J54N3m55
$$ plain form
5095 -198 215 91 -209 33 -44 119 -44 -170 142 -2 -122 -291 104 0 -8 -76 -55 57 124 68 -98 235
5117 235 -52 -127 104 2 -167 -232 -38 138 381 283 92 -83 -33 -91 -155 127 -81 -83 45 -109 232 57 29
5140 29 -203 -162 84 108 -212 -115 311 98 124 94 172 -165 28 40 -17 47 220 105 -188 119 -277 -68 69
5163 69 22 271 2 278 224 15 279 6 115 -174 147 192 -81 -17 -6 404 96 9 -73 26 -58 107 113 -90
5187 -90 82 115 51 130 27 -253 -54 -141 239 -261 -32 -215 163 -364 -35 91 362 111 -42 60 -206 -39
5209 -39 -173 476 -185 -8 234 -69 -23 -33 -70 -4 32 67 -173 -68 -135 4 -345 281 109 331 118 -19 52
5232 52 220 -83 66 26 -75 76 -147 -10 68 -54 22 185 102 16 -190 -97 -74 -134 98 -136 -20 71 -365
5255 -365 -143 -84 -10 188 -65 3 96 69 -82 88 49 -15 -101 -202 -316 -167 12 -149 17 -34 120 173 -282
5278b82L77k24J14J41m20M34n9l1j9K8k30M00k21K1j4Q1k32m8J85J06m4l28L46
5301H1K5j67J12Mj08M2k09K89j10N7Q0O7j06p9k92L86j52K21l58K78j30j53J11
5324a11J04k32M52k42K3K0k41K30p1Q7j09K6k7P2J31k58J67Jo6J3RrkJ11k9L4
5350H3k24J43M8R5k52J53O5p7n6j84M42k41MMm1J13Q3k46J80l27L49j08J15j17
5374Dj76n9K38p6r4R7J85j74j29J77L6J4n9J85k00k92L63j55J50j56J16p3K31
5397A53n47M98L7l03L29J03l06p5M7O6J6l2k64J30L06l9Mm33j28M95j68J31k55
5420b35K92R0j15j30J62j51O1J7J6l8L21j87j40R4J23k68j45J79n2K79j29K24
5442B68l45J8J15k72L56k41o2K98K38k80k47J92j45K03q0L0k31M44k63N8j76O6
$$ plain form
5278 -282 95 -129 -15 126 -294 140 81 50 31 59 -171 229 8 29 15 96 -136 -184 1 107 63 -265 81
5301 81 106 -61 51 55 -53 -11 -220 69 -41 16 96 163 57 -22 -314 72 -80 141 -217 61 -69 -222 -111
5324 -111 -7 -239 213 -29 -6 14 -227 3 -68 19 -90 -64 -91 -19 112 -146 21 22 -44 -31 -22 -31 -33 78 49 83
5350 83 -141 2 50 145 -107 46 111 34 -22 -206 236 -5 -1 3 -38 75 158 -88 92 -235 114 6 121 4
5374 4 -172 -231 7 -69 -163 -66 119 -55 -184 -7 29 43 -16 169 -31 -323 40 -115 35 -121 -5 -78 153
5397 153 -394 104 141 -162 167 270 -36 -111 -64 2 18 -14 -278 -148 158 119 123 -310 -438 57 -111 20 -235
5420 -235 57 147 32 -98 64 -87 -26 -9 7 -31 290 103 -37 57 180 -88 -233 -54 -106 173 44 268
5442 268 -77 -59 56 -216 140 -101 -163 135 373 93 -154 38 -107 96 16 46 -185 259 -4 54 -122 -56
5464e6o6R1j98N6JJ63K7k31R3k0j9K02qL3j06J28J62k90Q2m7J66j68j65R3O7J30
5490A20J33j58l38PL43l47N10j77M1N1j60j45l0J79o1J1q1K39k17J87j12K9M9
5513G3j53nJ16L9O0j85Q4j13J89J01l72k3K38j44R7p6J74q3K4k75J69K67j58r8
5537e4O4k03K19j57j88M50q2k91N85l46L5j64m6J02q2j2KJ86o7J01n4M1k15L29
5561A53k31O3J52K5j70O8L61n71k54M05j12J64k1j39M6N2l2J39k20K70j12j37
5583a01J99m13L30L0r7M5J06K3j01M0l29K90r6J79j41k42L41L1q0k10J25J49l0
5606D8q7j61J3K33L0k55K87j76j38K18N9j18l7O1l52M53J91k90M8l52J82L53j55
5629E5M2k39k8K25N5k52J76k37K21j5r7J36J12k65P0J74L7j14oP4o0m1o3o6J58
$$ plain form
5464 -56 -122 -31 -229 -173 -172 -9 18 -213 -120 -140 -159 43 35 68 -38 90 252 -38 44 -3 163 -5 -170 -77 -10 120
5490 120 253 95 -243 -236 107 -240 270 93 134 185 25 -120 -150 29 -32 -21 -102 137 -80 107 -5 24 73
5513 73 -80 -85 31 70 130 -55 29 -84 105 206 -166 -189 49 -95 2 -74 100 17 41 -234 -65 202 44 -54
5537 -54 10 -193 26 -131 -319 131 49 -242 343 -3 32 -132 -178 -76 -158 -170 -168 18 -49 52 -2 39 -176 153
5561 153 -78 -15 137 162 -8 60 421 -150 -404 1 -111 53 32 -107 -61 -9 -41 98 -122 148 36 -101
5583 -101 98 -315 15 45 -52 -7 99 122 21 61 -268 22 -74 105 -36 -278 63 94 14 -196 -71 78 48
5606 48 -39 -200 -187 46 76 -179 108 -68 -206 12 71 -47 -84 -23 -375 78 269 -21 27 -325 -143 210 55
5629 55 97 -142 -170 55 110 -142 34 -203 18 3 -94 42 154 -111 -41 133 170 56 50 124 64 23 -40 -106 52
5654E2m4L1j7J19Lk30J48k76K07j05J64j06j9l83M59R6j88R4k86K61JJj68M33
5678B47j20n8j26J47o2Jr4L73m26M11k06j92O45o22K95q7j76J4k1K20j40qK95
5701C10l48K54k93P4J06l00M0J55l5J92l77K38J14r9J81k46J62m6l2k18N63m77
5723h2p7J46L5M1p0r6M9K46l8k68J44l8R8j5k49j00K52J95O3l63J12Lj13J79r
5748D5N2k88Q4Q6j08lJ91k43J59k56M75k54J8N8j67j29K12o7J23Kj4n6J23R0k53
5773a20OK48j49Q8r6p3m5J70j38K51j65K19l36R6K77j58j3k26J86k55J53lJ21
5796C8J43J19n57K96j72J32j28j1J3k28N30q7j32K97k51j40O9N2O9K19j77J92
5818B86m20M52m10K30k53O1J71j48j49n9J99J99J72l29P2r4r5J27P7nk53L54n3
$$ plain form
5654 52 8 39 22 141 144 -86 62 -214 -7 -112 52 -54 -73 -456 3 99 -89 5 -281 -20 -19 -18 -186 247
5678 247 127 69 -57 90 28 29 -65 308 -118 293 87 -105 540 -82 213 126 -50 -36 -57 163 23 15 310
5701 310 -38 216 -77 -3 103 -197 -157 -2 -37 155 -222 16 130 31 212 -34 128 82 50 -168 395 -82
5723 -82 -159 -13 22 63 -7 -103 -54 192 154 -114 30 -8 90 75 -174 -274 -22 173 236 -127 -15 -12 -125 54 45
5748 45 97 -191 -107 -21 -129 -132 59 -184 -25 -281 194 -60 -42 16 -151 -280 -68 -135 -12 -10 -24 -80 43 133 -120
5773 -120 -114 134 -15 73 -23 -96 -141 29 -109 142 -23 196 -140 -44 233 75 62 -164 22 -233 -80 -83 38
5796 38 181 300 -257 39 -133 -1 -129 -140 -127 -355 175 88 -44 253 2 -138 -69 -17 52 271 94 286
5818 286 -134 318 -92 138 -115 -54 117 -31 -180 -239 -40 159 331 2 74 -20 -115 12 89 84 -169 185 132
5841A32j64j41J86j18Q1M7j13P1O5j81M7k8J3j4J15l27L64k6M08l34j86M6M8K19
5865B10k16J64N8k81k77L00L80m03Q1l9J69j1n87N02q6N4j3l0J13l94L34J87j71
5888D4j79K3J60q4R9k00L1J75o6P5P4k20J29k64N31k82m0J5j53J17nR7k00P6j21
5913a68O8J21j14J74k24O54n68J27O6k84J94k30P1J40Mj46Q4o1K96q9k19K47j41
5936BL6m7L4k51K60J79k96O9k23J91K13l06K5j9J88L3j11K21k65L4n3J87k49j7
5960a65N2P2LJ97l35M1J67n6J45j43j6R1m2l81K11J04L79k7l17K0j1J24P3Om14
5985b22M47k53K9K37l12n1M63m15O3J55j12n2j7j74K92o4j50jJ26o1Q1jJ60j75
6009gk93K06J11Q2L4l83K12K1M3j55L49k66J84j77R2L8j53R2mM36m96k9J19Kq7
$$ plain form
5841 132 -32 -173 13 -105 -24 23 -90 -19 46 -135 -88 -116 -103 -117 -2 -329 35 9 417 83 -103 -57 -9 210
5865 210 -6 158 216 -65 -342 -42 338 -65 16 -23 146 135 -452 50 -36 18 5 -25 88 -306 28 215 44
5888 44 -135 -112 48 -36 63 -137 -106 69 3 78 152 -68 61 -203 328 46 6 21 -132 -15 -20 77 -123 -47 -168
5913 -168 -100 21 -93 81 -143 511 -57 70 136 -148 46 -184 -113 27 31 -115 -31 -92 204 115 -104 143 2
5936 2 38 -9 25 -226 34 213 -83 -14 -237 -46 167 -139 -114 -133 55 88 -23 198 -67 -33 -86 101 -148 -165
5960 -165 -113 -41 -38 159 -176 -135 32 -24 121 -22 -38 53 11 -370 -159 -55 324 297 -20 0 -11 113 186 192 -222
5985 -222 225 -28 1 238 -74 -125 338 -77 -14 141 29 -23 -40 -214 78 14 -136 -137 -11 -72 9 8 168 -7
6009 -7 -300 -94 17 99 133 -250 -38 -17 26 -129 220 -46 138 -39 53 91 -62 30 26 462 -34 -63 56 58 -29
6034b9j12J66O1l2P2K2q5K1o4l47K90J63r0j04PR2k02J89l5r9j2L53j38j96J20
6059A1P8l52J72nJ40l1j82K9L52n16L27M2Kl1P9j9M9Rj87P2J03J15j95o2l26K57
6085f9K67k61p1K9jJ03L47l15j46O3j89Q7K12k35J26l7J98j62K7j25N1M5K97k50
6109iJ7j74P0O5r2K83kl29L56k81K35j34k9J52N4l36K30K9j31J72l0j55k9P9r5
6134h4J64J83m07J07n7nO1m2R7j5L1J05j92J0J47j57l2J29j65J35K82k93J57m10
6158b51M32r8k79J74L45J3n10M1M0J81n5K6J17k52m7P2j63K44K0r4L5q9K22J10
6182B34j27Q0k44L1l6J47j43m0J60J5l28J18J20j72K42j67O8N3l2j8j58k9K53
6205B7l3M9M1Q2j34J28n6%j09%j96J97R3j98L3K00l02L13j14p9o4J57O8o8k66
$$ plain form
6034 -29 -141 25 86 54 126 148 63 84 20 -327 -37 126 36 -68 -61 31 -171 18 -17 -116 -128 225 87 -109 11
6059 11 89 -263 -91 -96 44 13 -169 -140 212 -304 23 65 67 36 115 96 145 154 -33 39 142 257 62 0 -326 -69
6085 -69 198 -63 -134 -105 -106 -3 344 29 -117 -54 -243 -156 56 -179 -53 -90 108 -54 -27 -152 -101 -56 241 -9
6109 -9 8 -166 -96 -31 -123 160 158 -171 185 -96 139 5 -24 128 182 -154 76 105 -26 146 116 -39 -68 11 -84
6134 -84 80 263 -144 -37 -94 -99 -38 -80 17 2 33 138 -54 -44 103 -54 -86 43 -122 13 295 2 159 -251
6158 -251 181 83 -196 -22 323 336 -174 -133 -93 88 33 59 176 -76 -123 -51 -214 30 50 -44 -9 -98 124 234
6182 234 107 187 -57 -26 -62 85 -58 -98 62 77 -251 -133 -13 -185 57 -110 -42 11 -21 -39 -197 -226 27
6205 27 -6 43 84 166 32 160 104 104 -5 -5 -201 -4 89 -109 -76 124 -178 135 21 -58 -122 35 103 35 -231
6230b31L06m00O00m04J11NL4j36K04O7k92L41m73K09k03J33J82k2J94l0k27J19
6252H7j49l1P2k90L56M8j16J65j44o7M34n52K36m8n2J33j39L38l57K34k39L85
6274C04m4L1k32k27K68K0k65m1N6M38m32n6M19j73Lnm7q6J50Kj99O6J02k33O9
6299a12J25Q4q3j51M5k23M56k42L35j04l44M52j78p1j08R0K06m11K34Q2J21M2
6321B45k54q0J56j02n9R9L06l30L34k20L7j32j29L43l72J42p3M04l73J31qj52
6343h7q4J93M9j58o1J83Q1j24N7j01j21K12mj93K36j42P9j62J10L2k19J58Q0r2
6367g8L42j74l76K88J30n1j57M5n8K27l02J97K1Q0m2J2r0OJ80j32k9k47K16J18
6391A26m9k09j4J67k02M25k73J96Jk75L2j37K77n8R9J76l19j6K68j31j96j1K45
$$ plain form
6230 -231 75 -325 275 -129 -18 -13 21 -115 89 156 -136 205 -268 -59 -262 -129 53 31 225 195 -32 87
6252 87 -62 -93 -21 -311 45 93 -23 142 -2 -69 365 -187 49 1 -51 82 -57 281 -76 158 -81 304
6274 304 260 291 59 -168 100 120 -145 -186 -130 308 -124 -180 239 66 69 64 17 -69 81 83 -116 -50 52 -181 -112
6299 -112 13 97 14 -137 -92 -315 141 -101 234 130 -214 238 60 -11 -119 -29 177 -234 0 82 203 245
6321 245 -9 -89 67 -35 -94 5 311 -19 315 95 132 0 -129 214 -158 -16 -89 315 -58 73 65 -87
6343 -87 -171 22 71 -87 -148 35 116 -8 49 -52 -173 39 35 -158 78 -64 15 -147 -37 -5 -224 -66 14 -78
6367 -78 264 90 -286 2 132 81 -76 -31 -89 138 -164 33 54 134 92 104 14 20 200 68 39 -208 8 126
6391 126 77 -132 -146 21 -181 244 -29 167 168 -107 -75 -212 65 7 106 282 -37 -53 215 84 -112 -123 122
6414A22j91J53k57L1K25r1J12o7M2Q1j49j11K25j53M4k15L54k41J19P5%l28R5
6437a25L63n30L58j05J43J64k31J0J48m15J69R8R1J02j54j29j56L07k6k29J14
6458c3J79k50J74j8MJ24k80%J71m7k09K67J1j14j32k2J83Q4j40l7J6J33L3Q6k63
6483h0Q1K3j16l6J97P8J18j57j37j5J43n0r2K07k11j73J96m3L11k45J13j6J42
6506B38l88L00Q4j46k61J40J2K6M7r9O9P4N4k56L92j30j21P8Q5j04R9L8l41Q6
6530b4jM3j56L14j9l32K19J0j76J77k67K47P6j51K63m67J02P6O4j03jr4J56l2
6554g6m9J00jr6J31N8k45K77p6L1k49J79K77j98Q7l22q8J15J6K24j75J58j25j35
6578a82K60J3o9q2KQ7k00J83oj43J17%o1k6Q9J27m9j37J05N8k93L47l24K41r1
$$ plain form
6414 122 -69 84 -173 -142 83 -8 104 37 79 160 11 -100 125 -28 16 -199 155 -86 33 108 108 -220 -125
6437 -125 238 -292 66 -39 104 268 37 47 195 -220 -51 47 138 240 86 -43 -199 108 82 -147 -33
6458 -33 146 -104 70 52 56 180 -100 -100 71 24 -185 82 93 -21 -153 -175 8 92 -48 -85 -69 64 97 183 -80
6483 -80 1 24 -92 -128 69 147 265 108 -29 -44 99 49 -43 164 -47 -220 -24 -67 244 -1 112 96 238
6506 238 -150 150 234 88 -173 -33 -21 5 52 -47 22 96 150 -106 286 156 35 113 198 94 193 231 -110 -24
6530 -24 -25 18 -138 176 157 -175 44 54 -122 55 -212 35 111 -40 223 -244 -142 -66 -2 -105 -106 -200 -44 -76
6554 -76 -125 -25 -26 -122 9 67 -178 99 23 54 -195 -16 261 63 150 -172 -260 -145 -129 95 -80 78 -47 -182
6578 -182 78 91 22 -60 -58 29 -171 12 6 -137 -20 -20 -81 -107 -18 109 60 -77 28 86 -207 140 -184 57 -34
6603c4K51j6j00r2R6m4k56l3K52L8Rk2Mr9M8K22l93J79J20m32J54L05l07k5J36
6628c9K12k61Q7j51R4J93j72J45k0O5k19M5j7l8N9K23k54J38j35M6k53L76q2N0
6652I2j91j60K35o7J76j9j18j59K44J60j83K05k03J9j54K07k66J23K08j49Q9M0
6674A29J2k0P3j25J56k88R8J3J1j78K18l6l87L44j21k1O2j07K01l09K78N7K0k44
6698a64J19K78k65l9P6j03nP7k86K40L65j67j45J95n35N25j5Ll04M68o10K75K65
6721B48k25j37J99r3J5%r0j67L45j42j8K81j74N1l6K42k96J3L2j29j54K59M1J96
6745B61n05K25L11j57j47J19j51N8P5k12r7J50J44p2Q8K00l25J1L03l36j87Q2
6767a62K27J54l05L00j38O2m29L78j86p4P4K02j20k09L18j24O1j1j06K40j55J08
$$ plain form
6603 -34 217 201 101 9 105 61 -195 -228 24 62 71 49 53 -46 2 224 -169 10 130 -302 -148 157 -150 -175 -39
6628 -39 173 -88 -1 -152 -58 135 -37 108 88 153 -66 -21 -38 -76 -17 206 -48 90 -45 1 -252 124 42 92
6652 92 -99 -259 -24 -91 85 66 -52 -211 33 193 10 215 12 31 -123 84 -182 -59 149 0 89 129
6674 129 141 121 194 69 225 -63 35 48 59 -119 99 63 -324 20 -101 -122 -60 -167 34 -275 3 60 80 -164
6698 -164 -45 233 -32 -71 5 -98 -103 -26 -312 -72 293 126 -19 176 -359 166 151 154 -150 318 -292 -17 248
6721 248 23 -114 85 -8 7 7 -83 -250 95 -47 -65 216 42 93 57 299 3 16 48 -81 -235 24 65 261
6745 261 -244 -19 292 135 -12 107 -44 14 89 -123 -220 -70 74 2 90 290 -35 -24 279 -57 -244 -162
6767 -162 65 219 -86 214 76 138 -291 87 -99 -173 -99 103 -17 -226 92 -32 29 18 -88 152 -3 105
6789A05l21L60j66k2j09J39l31K27J08k0j3L30j59p5l68M05M6k80K16m56N11%
6811A27l10J49j16K5R1o8L39l78L02j64K70k41k5j2j58K58j39j21K15j66L18l83
6833a87L77L5o32K62n3L98m68L95rJ17k29o0m9L7L0KK31n50J79K70jj49m1J43
6857D8j30n3J74O3Pr7o9r2m6R8R4o1k14L02J07J73k12k60K64j69K0J84m2j41j51
6882b03M13k03j41O4J50j92Q4k2M9q7r8L05J97l27j41J11n7J35J16k75J91K38
6904C07m29k0J35o0N7Nj52L39j04j08K57m68K86n9j26l1M0L8J18n9Q0K3j40Q8
6928A7n6J90j37q8L47l31m8j43K77l3N8J06k74J02qJ43K2l78K87K7j56j57K17
6951a6K7K01l78p9J09K96l77L01j0k4p5J7J3j28R0p6k33N03l36m7N06l38k57O1
$$ plain form
6789 105 -216 144 -22 -44 -153 -14 -345 -118 -10 -30 -43 287 128 53 -315 90 136 -144 72 -384 127 127
6811 127 -183 -34 -150 -125 -34 -102 237 -141 161 -3 267 26 1 -11 -169 89 -50 -171 44 -122 196 -187
6833 -187 190 225 -407 -145 -198 200 -268 127 118 235 6 -54 -103 -66 -36 -34 197 -353 -174 96 95 -54 -95 48
6857 48 -82 -135 39 102 109 12 -57 -149 -195 -97 -3 -64 -278 24 131 304 92 -168 96 -73 -53 131 89 -52 -203
6882 -203 210 7 -134 -70 80 -112 -28 -50 -1 -88 -186 119 316 -11 -152 -41 -98 37 153 -122 69 307
6904 307 -122 -142 -7 -67 -10 -5 -157 182 78 -30 227 -241 45 -14 -140 -171 -131 -93 25 -34 46 69 -71 17
6928 17 -39 151 14 -74 273 -58 -106 -249 28 -5 53 159 -115 -13 -21 122 144 -234 53 80 -76 -233 -16
6951 -16 11 212 -166 -245 -136 160 -217 84 74 50 -25 -8 5 -123 -33 -109 -342 161 -175 -222 284 -54 -311 -250
6975b50J80l4K48k13M9J7ko0J83q2P6K2m3j56K5m8L89j48j99L3K6j87L8J40rq4
7001h9J24L5j68k3O9O5j04j17K65j69J16L0M7k0Q3j70J21m7j23p9K7Nk09K20J3
7026i8J26k21J52J97k09n8M0N1L9k2k21J65J39J61l17J17j9j11K1J12N2j9Mj2
7050F9rQ9l8J64j28k94j37J86k7Q7J31j66J6N4L2n7j28l9J89j65J33j0O3J42j82
7075b5p8j32L22j5m2R9j77R1l9o4J88j4l5l27L30L9j21j28L37j70J42p1k40l0
7099a60L04m60L62O1l01L11k72J61l31O9K75k77J35N4k2J29k61J89K8j19j29K59
7121Ek11L37J4k27J1K7J18rK2J85k01q8K55o8j53J02j49j32K4K63j52J6J2j20
7145a19jL2Q6k14J09L63k41j61K16j46L2J90l10p7NJ55p8J00J62j22J44k66K1
$$ plain form
6975 -250 -70 -104 144 -69 -20 -3 -5 -65 118 36 112 134 91 -65 -40 -88 301 153 -46 -13 13 -174 -136 4 -5 -89
7001 -89 35 70 -98 -121 -52 13 -91 -208 57 -112 4 34 81 61 144 -26 95 48 -75 -154 -127 -122 -331 -111 -98
7026 -98 28 -193 -41 156 -53 -111 -71 -20 19 -3 -224 -59 80 241 -76 41 22 -89 -68 44 96 77 81 69
7050 69 60 149 111 275 147 -147 -284 -98 -125 -38 93 -73 -57 -3 29 -28 -156 -195 -6 -171 -38 -48 15 157 -25
7075 -25 -103 -235 87 72 30 129 -48 43 4 -60 128 114 79 -248 82 121 0 -128 209 39 181 110 -130 -160
7099 -160 144 -316 46 107 -194 117 -155 6 -325 -256 19 -258 -123 -69 -91 38 -223 -34 -6 -125 -254 5
7121 5 -206 131 145 -82 -71 -44 74 65 87 272 71 -17 238 170 17 119 -30 -162 -138 125 -27 -11 1 -119
7145 -119 -120 -88 -2 -216 -107 256 15 -146 70 -76 -44 146 -164 -241 -236 -81 -159 -59 103 -19 125 -141 -120
7168a20l4j7K17nj18K24j79j63K98k80K28r8J91q8k96M78m15J52k87L48L29m78
7190a13J92j56O3K00r3r5K16l64J46k05L50k71lJ78j61J11j89M2L56j12k71m1
7212b20M5p6J99J58k08J00R4l95J94M84k66M8r0m4j30J58l06K44J56k15J37m0
7234B7J22k22p3J54K25j69L3k85N03j57k43M37o47N93j70j53j57R3K61q8L08n01
7256a09M32r9q6j03k26j08J65K61%M3j43l2J15K5j83m5OJ52n8K4RK08l50n8L13
7281A53j60j02J98J6k52n8L56m10K18M3N7K8l7J36j38r3k8K25o8oN8m38J68J10
7305b4KJ45q7k04L6J43N8L9k5n1k64J20L3j40J36M14l05m2j75K00M4J82m03J46
7329b2J18j70N9k0j74Q8J02Q8k50K19j6k62K37J02M7J39k83j63K54J16l6l67N44
$$ plain form
7168 -120 -154 -171 46 41 -77 147 -32 -195 103 -177 51 -47 144 56 -240 238 -177 -25 -312 36 365 -113
7190 -113 79 -77 -14 186 93 -2 214 -150 -4 -209 141 -130 -133 45 -116 -5 -194 -152 204 92 -179 -220
7212 -220 -175 -251 -52 106 -102 -2 92 -303 -109 375 109 157 67 23 -107 51 -255 -11 145 -70 67 27
7234 27 149 -73 -146 8 233 64 97 -188 315 158 -85 352 -295 298 128 -25 -182 -89 172 84 392 -109
7256 -109 323 224 138 35 -191 -299 -134 127 127 170 27 -5 110 135 -48 -93 -87 65 7 31 40 248 -102 -160 153
7281 153 -7 -109 89 105 -147 -205 151 -259 -41 2 59 87 50 186 48 -45 -73 152 84 78 136 -302 -134 -24
7305 -24 -22 123 36 -168 -132 11 69 108 83 32 -232 -112 -79 -219 -83 331 26 -16 -191 9 53 235 -168 -22
7329 -22 96 -74 -15 -35 -209 -121 -19 69 -181 38 22 -240 -3 99 146 285 2 -161 93 209 173 -194 350
7352C50m16K25m0R8l03J92j80L82j11m97K28L98k59j75l8J16j04K17j14j92L42
7373A19j32K2J36k72P1k59K49J64k7J49j12r1jj00l9K14j28K26l77K73j52k8J19
7396B4k75L50k63M7q7L07j24K7Q1m26L26q2O0mJ94k5l53J93L1j30K21j59L33m8
7420B18nj87Qn4j44L00j81j1N9L56m14R3J07j43N4m01K51K4l8k18L48j1j45K25
7444I1p7K58r8k15j36R1L33k65Ql9N4q2J87j16j30J65k28K13r2j22L24l05J5J59
7468gj73M58j41j78J95l88M01m04K74j44J66L9k23K51l7j79r8J33m8m0JJ73O3
7491I4QJ8r2K4l22J69J27O5j75p0K7L60k42J30r6j82K54l38J22J03J08j10j13
7514a31Q0K72l71j76M20k16K08J24k10r0k1K5Q9j42M63j72rl08m8L4J59K1r7J35
$$ plain form
7352 350 -66 159 119 217 -86 106 -74 308 197 -300 -72 326 67 -108 -146 -30 -134 83 -31 -223 119
7373 119 -13 9 145 -127 -56 -315 -66 98 71 220 108 17 16 -84 -123 91 -37 189 -188 85 -67 -95 24
7396 24 -251 99 -164 -117 -204 103 -21 6 87 -339 -13 -95 -35 -39 155 130 -223 -30 1 -129 92 -67 266 218
7420 218 213 26 34 -20 -164 136 -45 -56 3 359 -55 38 145 2 56 -345 -94 -70 -108 -326 22 11 -134 91
7444 91 14 272 174 -41 -177 -86 247 -18 -10 -49 5 -77 110 -6 -136 29 -199 14 -78 -200 124 -181 -166 -7
7468 -7 -180 278 137 -41 154 -234 167 -237 37 -107 59 98 -125 126 89 -90 -188 -55 -103 -143 -142 31 94
7491 94 102 120 28 52 -270 -101 26 91 -84 -154 -127 233 -9 121 25 -157 97 -241 -119 -16 92 -18 -131
7514 -131 -51 221 -150 -326 94 -122 86 210 0 -90 -111 -86 3 -139 324 152 143 -165 -213 -179 -20 1 -96 39
7538C9J65k39J50j34q3J35pL8o3K09j70lK22k00m4J0m9kp2J58k7RQ9n7O6j16l58
7565c34L77j27L83m65L10j08l06N12J6k25k50L49k12L02l84K63k71K38K25k47
7585D6k13K2M7J49M0j22o1j34L14m7K7k48o5j3K99K47l48J47l78M33j16j80J39
7608a5k2q5m9K74k39J72k03K12r7N0j3jn2j20L91j86K04l28K24j15L2r1o7K22
7632I8j17j7j17K34k14K83p7k17J40K1k42k39O05m7j25l8k84M34K63j75k51J24
7654D2K00l34K80O2m4k00j65J22J00j75K89K0l39N66n21k7L41k28J2L64k41m13
7676b89L2K82M46m37N1l17J4L94Nk30J77J01k18R6k44r6J69J34J06J25k69o4J20
7699H8j1j35L4J81NJ95j38n04M20j76j58n2N59l99k53J95K7K69J52k02L9q5l56
$$ plain form
7538 39 204 -35 115 -19 -102 33 26 64 1 210 40 37 259 59 15 25 -24 -26 -98 60 33 42 131 74 140 24 -334
7565 -334 43 -84 299 -166 144 36 -270 242 258 33 -217 132 -80 222 -162 101 -170 68 293 46
7585 46 -167 -145 -98 51 91 -31 -92 -226 88 41 68 -180 -245 -258 41 288 -60 87 -291 142 26 -154 -15
7608 -15 -37 -122 -171 103 -136 36 -167 45 -52 -2 -15 -16 -68 -188 203 17 221 -107 117 2 34 -57 -124 98
7632 98 -19 -36 -153 81 -133 150 73 -144 -4 17 -225 -464 141 94 -31 -69 -353 81 344 169 -82 42
7654 42 242 -92 188 250 206 6 -159 -37 63 -112 177 197 -142 424 -97 -124 217 -11 1 365 124 -289
7676 -289 -257 25 471 34 85 -232 -218 176 181 -49 128 229 11 107 -137 -233 -64 70 176 301 32 -32 88
7699 88 77 -58 -24 157 162 357 219 -285 135 -41 -199 -251 308 -91 -344 -149 -122 147 299 97 136 51 -305
7722c05K21O7j35J92j71J29q6M10m69K05k4k08k33M99n8j40j51K7L61Lq9J3k19
7745a61J51l4o1lN9K4N7k10J92p7N9K35k19K3L70j17l38Q3Q7pk95K44m4m1K10
7770A87k90j23J70p4K65l26K85j72J83k45K15j12J62Pj94rK75k6k06P7k6j7q8
7793h2k69K09N0K91p0j75P0J9j05J22l26M14l67K62L3j04K58j65J35q6k10N4K09
7816A67k85M1Q2r5K25m33M31j81j37K43J66k01K7m6q6J04k02P2n6N26l89j74M28
7839B27l39r1R2J84l75N40l46K02L0p1l34L65j20M06k05k08l23L20j07J31L47
7860C25l60J9j33L14j98L0K29k51r6J54R3O5j86P9J43m21J14J24m2J09k7K18o31
7883c29K90K5M3L8k14J66k49L46n0j58L1M1K20k78K38R7k24j94K68j06R0L4j15
$$ plain form
7722 -305 -84 -17 -152 40 -131 -2 -88 322 -147 58 34 -174 -407 92 34 -106 -257 -230 131 134 45 58 -161
7745 -161 -10 -44 -105 -108 -49 -25 32 -178 14 -63 -4 231 12 35 405 288 -50 33 120 113 -182 62 18 -23 187
7770 187 -103 -226 -56 -130 135 -191 94 -78 105 -140 75 -37 125 132 -62 -71 204 178 -28 49 23 6 -82
7793 -82 -351 -142 -92 199 129 -46 24 43 -62 60 -266 148 -219 43 76 -28 230 65 200 114 -96 -42 167
7816 167 -118 -77 5 -90 135 -298 133 -48 -185 58 224 23 50 4 -82 22 -180 -108 -164 362 -27 -201 227
7839 227 -112 -203 -111 73 -302 238 -108 94 124 53 -281 84 -36 370 165 -43 -366 -46 -153 -22 325
7860 325 -35 -16 -149 165 -33 -3 226 -25 -121 33 126 191 5 84 227 -194 -80 44 2 111 84 302 -329
7883 -329 -39 -14 29 67 -147 19 -230 116 66 -92 -61 -20 200 -78 160 257 33 -161 107 1 91 125 10
7906A0J2o4K13Q6k41K18l00K03j07K38j34k02K37o3j85J61j22K51q3p4oj31J53
7929G0j74j69L0M2K47Q0k15k8J40P8j28J63j20j94K57m1Mj10R4K62l29K46k67
7952f2L32J7m64M55k22j21P7J19J2l62K13Q0Q4k80j5p6K0R7K71m53K55k3Q1k63
7976b28K00J69k72J24j42J01J24k5J32l17K17j11J24j39L6N3k15K61j28J38j52
7997e0%L8k55K57Q9o6Q5n4n86N87J04l92K71k2q7J93k9J07l26J66o7j80K81j31
8021f7k07K15J63k29J97l57M84n2l17L74k31M3J38k45K60p4j26J12k10K50J34
8042B55m57N1J60J7J06j4j64j35l6J62K02j46j20M7K4K1Q9Kn2k8o5p2L53j28L4
8067A06l02N42r9j34j97J1m5K77j17q8j80L74J57k72k4p7J49Q3j12L26l48j05
$$ plain form
7906 10 22 -42 171 257 16 234 -66 137 30 268 134 -68 169 106 -79 82 -40 211 128 54 48 -83 70
7929 70 -104 -273 -243 -201 46 126 -89 -117 23 101 -27 136 16 -178 79 38 42 -68 26 288 -41 205 -62
7952 -62 270 287 -177 278 56 -65 12 131 143 -219 -6 74 158 -122 -137 -213 -193 -96 175 -278 -23 -46 35 -228
7976 -228 -28 141 -131 -7 -149 -48 76 51 183 -134 83 -28 96 -43 -7 46 -169 92 -36 102 -50
7997 -50 -50 -12 -267 -10 79 13 98 44 -542 45 149 -243 28 6 -81 112 83 190 -136 30 -37 -217 64 -67
8021 -67 -274 -59 104 -125 72 -285 199 147 -170 204 -27 16 154 -91 169 95 -31 81 -129 121 255
8042 255 -202 -151 9 26 132 118 -46 -181 -217 -55 147 1 -119 -72 -48 -27 62 64 12 -16 -81 -153 200 72 106
8067 106 -196 346 247 113 -84 -73 -118 159 42 -46 -226 148 305 33 9 -68 81 164 52 378 30 -75
8089g5J62q9M3J50k72j30M87q7k98J67k02J03N8J18j75j70J83j35N9J53k37n9
8111b46Q0%M7o5K94J11k25J67p5k64k9K75o9K41p7l10P1K8K18q0j47N3l09K78
8135c3J00J0Oj54L08j84j00l5N3j22R2N71m21j21P0k03J30J8j59M19p1k51R6r7
8159g8J61K07k45l08K38J13j6l18N16o9k33K78l02j93M51j77J83l81J74j16Q5
8180c0J46O0l02q4K0K45R9l73K75N5l60
$$ plain form
8089 -75 87 -2 41 191 -81 -211 276 189 -109 58 -144 -41 17 135 -40 -210 -27 -162 -103 50 -187 -246
8111 -246 -166 -166 -119 -184 110 221 -4 163 88 -176 -205 70 1 242 165 -145 -74 -46 172 92 -55 -2 -311 -33
8135 -33 67 77 83 -71 237 53 -47 -82 -29 -151 -59 512 91 -30 40 -163 -33 -15 -174 245 174 -77 19 -78
8159 -78 83 290 45 -263 -25 88 72 -246 270 201 -32 246 -56 -249 202 25 208 -173 1 -115 -30
8180 -30 116 176 -126 -210 -190 55 154 -219 56 111 -249
8191b49
$$ Imaginary data points
##PAGE= N=2
##DATA TABLE= (X++(I..I)), XYDATA
0@%%%%%%Qj6J6j6K4l2M0m8N6q0J04j28J60j92K32k73L21l84M50n24O11p13Q25
29D41r46J082j235J407j597J803k032K288k566K870l206L574l975M412m890N413
45B843n985O608p287Q033q853R753j0743J1839j3059J4418j5945J7676j9655K1942
59A1585k4617K7800l1664L6467m2629N0862o2481Q0231j10975J78802n85834L32293
71a40160R72544j112175l19777R94569K33689j088594Q451R95650J8489r29200
81c66514Q0845O43353k74209o11041L99897N20232l03242l84925K60504K35474
91B00374k17236j99858K67593K38275k84938l09111K88394K47350l21599j41936
101b32692M63830J31549n32887j58808N34330O7822o00934N1202O92307k05232
$$ plain form
0 0 0 0 0 0 0 0 8 -8 8 -8 16 -16 24 -24 32 -48 56 -72 88 -104 128 -145 176 -208 242 -282 329 -384 441
29 441 -505 577 -658 749 -848 955 -1077 1211 -1355 1515 -1691 1883 -2092 2320 -2570 2843
45 2843 -3142 3466 -3821 4212 -4641 5112 -5631 6208 -6851 7567 -8378 9298 -10357 11585
59 11585 -13032 14768 -16896 19571 -23058 27804 -34677 45554 -65421 113381 -472453 -140160
71 -140160 832384 -279791 -599568 395001 628690 -459904 -451453 544197 562686 -366514
81 -366514 -285669 357684 83475 -527566 -127669 392563 89321 -295604 -35100 200374
91 200374 -16862 -216720 50873 289148 4210 -304901 -16507 230843 -90756 -232692
101 -232692 231138 362687 -170200 -329008 205322 273144 -327790 -276588 415719 210487
111B10487p66516L16110P35001l98955n56917N66130M61526o53925m15367O26146
121A23720L13593o00543j89455N77062K7480n96349N9879N55203o2657l79671
131a71738J18983K51925j57656k27459J21362K30567p5393k38212M2562J95878
141I0819q3930j66958J63098K23680j48923k43222J35469K23590k04906k22634
151b33917L02631J99940m13324j67970M50803P4028m42957O7210M67691j34556
161A69579m54956J72917M10046k28482l58932L03242L01313l75705k46107L83496
171G6411J53892l50142n1756L12319q976k85178R031K53309R015k09532J9321
182g2286J99378n7242k01816P4091J96011n7445j72740L9290J50076p1686j90654
$$ plain form
111 210487 -556029 -239919 495082 96127 -460790 105340 566866 -87059 -502426 123720
121 123720 437313 -163230 -352685 224377 251857 -344492 -284613 270590 207933 -171738
131 -171738 -52755 199170 41514 -185945 -64583 165984 90591 -147621 -105059 90819
141 90819 6889 -160069 3029 226709 77786 -165436 -29967 193623 -11283 -233917
151 -233917 68714 268654 -144670 -312640 138163 212191 -230766 -163556 304135 169579
161 169579 -285377 -112460 297586 69104 -289828 13414 314727 -60978 -307085 76411
171 76411 230303 -119839 -171595 140724 131748 -153430 -144399 108910 117925 -91607 -72286
182 -72286 127092 69850 -131966 -57875 138136 80691 -92049 -52759 97317 25631 -165023
193a65023J03012K30324j39614k23300J95558J84683k39888j16516K87806Q3570
203B00612k96270n9221K80981M756k96562M8323L03922j14011k94337J66408K44577
214A89178j97777j61447K27348J12580k19483q6528J93395O1811j84462l6626
224a02011J86773M617j90465K0058J70004l5046j31927M2936J10644l6806j16875
235g8098K5403J36547l0452j50027O0241J47919r7517j32468J23253J14801j30131
246a0529j00055J31362Q7906j51159p6807J82246N3882k03366r227K05585m1253
257F8585j85665P7745J54014r4121j30518R5644J15698j01824j04875J21342R1456
268A07481j38552o0350J45522K4731j36475k938J11717n381r7489J42R9364L371
$$ plain form
193 -165023 -62011 168313 28699 -194601 957 185640 -54248 -170764 117042 200612
203 200612 -95658 -154879 126102 130858 -165704 -117381 186541 72530 -221807 -55399 189178
214 189178 -8599 -170046 57302 169882 -49601 -136129 57266 119077 -65385 -102011
224 -102011 84762 89379 -101086 -81028 88976 53930 -77997 -35061 75583 38777 -78098
235 -78098 -52695 83852 53400 -96627 -36386 111533 14016 -118452 4801 119602 -10529
246 -10529 -110584 20778 108684 -42475 -119282 62964 116846 -86520 -95747 109838 68585
257 68585 -117080 -39335 114679 20558 -109960 -14316 101382 -442 -105317 16025 107481
268 107481 -31071 -91421 54101 78832 -57643 -60581 51136 45755 -51734 -51592 47772 51143
280E1143j10051J0828J21646l1470j14657N2351R6029o4746q5194O0804Q2022
291F8705o0677q7080P6214R0253j02216p4716J29642M7079j37628j6008J25679
302E9247j0206j15140J9368J10557k2049j13534L6823J15569o2577j03791R2456
313F723Q0560j06207n2601R7389K8265q4715j9910Q0316K2369q6464j9227R6276
325D2774M231r7002K0386Q5774l9003p1290L7853N8966k7247n6556K6252O6132
337E1270l7583p2255N8609O4898p5454m6968P7238K3493p3867j6385O9246J9995
349D2237o9137j5265Q5551N084r3824J9787Q8710m7809p6419N3878N0197n5664
361a2674l8566N0204M1188m5808l7059O2926L6563p1317j8114P1070p577o7133
$$ plain form
280 51143 -58908 -48080 73566 42096 -72561 -20210 75819 11073 -74121 -13317 68705
291 68705 8028 -79052 -2838 87415 -14801 -89517 40125 87204 -50424 -66432 59247
302 59247 49041 -66099 -46731 63826 41777 -71757 -34934 80635 18058 -85733 6723
313 6723 87283 -18924 -71525 25864 54129 -30586 -50496 29820 52189 -34275 -53502 42774
325 42774 47005 -49997 -29611 56163 17160 -54130 -16277 42689 15442 -41114 -14862 51270
337 51270 13687 -58568 41 64939 -10515 -57483 19755 43248 -30619 -47004 22242 42237
349 42237 -26900 -42165 43386 48470 -45354 -25567 63143 15334 -61085 -7207 42990 -12674
361 -12674 -51240 -1036 40152 -5656 -42715 20211 56774 -14543 -32657 38413 30836 -36297
373c6297J1812M5595j3479l9407L822M7068M115n1210J3922O2632k9065n7687
385c8179L8371L9231m3034l1918L4529K8869l6000l4852M8605M2939n9082k6217
397c6738P1188o69p6990J5883O2175k4245m6740K3664M2126k0758m1263L2737
409C70N0553m1612m4228M6510J7234n7422m728M5431J175k9129l942K6972J7094
422B4278k7382r859M4987k15n7988J518L9606j6140k8789K1026L1163j2735l7523
435b8053J5470N1397j9579m3262M3402K5654p0306k3004N8712M058m4031R275
447b0267L9003q004l9059J3914N6305q620m8050K1779K6618m7559k1353M1654
459F361Q969k6776p770P489R015m538p500K9303K3563l2858k2607K3323K324k1336
$$ plain form
373 -36297 -24485 21110 7631 -31776 -27954 19114 23229 -27981 -14059 48573 19508 -38179
385 -38179 192 39423 -3611 -35529 -1000 27869 -8131 -42983 5622 48561 -10521 -36738
397 -36738 34450 33781 -43209 -27326 34849 10604 -36136 -12472 29654 8896 -32367 370
409 370 50923 9311 -34917 11593 28827 -28595 -33323 12108 13283 -15846 -19788 7184 24278
422 24278 -3104 -12963 32024 31809 -26179 -24661 14945 -1195 -29984 -8958 22205 9470 -28053
435 -28053 -12583 38814 19235 -24027 19375 45029 -25277 -48281 10431 14489 -29542 -20267
447 -20267 18736 10732 -28327 -14413 41892 33272 -14778 7001 33619 -13940 -35293 6361
459 6361 15330 -11446 -19216 -11727 -2712 -7250 -14750 14553 38116 5258 -17349 5974 8298 -13038
473a3038M852K4558N022l0089j8025L6528J3314m4139J0118M9052l8523n4182
485e4552L9021L4574l2890o446M4886J1998m1906j4651M7073J4724m9762j619
497i550L8091l7594m9753L3888L3003j6397j616J7102K030q166p400J5614K7285
510C6537j2616k8181K801m26j7956O28J8292J4444p226k7492O775L0507j9397
523c310j5482M6491N028n9461Q10M4695j4116k6694K9387K8324l1743l7347K9420
536c998L5075l5788k0593M8666j980o2501J1058M9093j4206j7276K5443R168k1469
549F92j4454Q448J8114m093j5585P123K257j7974O96J4134P797J0162p817j6852
563g352J4452J819k9690J3088L2153k8890k7409K8601J1909k3134N896L4554K441
$$ plain form
473 -13038 -8186 16372 21394 -8695 -26720 9808 23122 -21017 -10899 38153 -370 -54552
485 -54552 -15531 19043 -13847 -20293 24593 36591 -5315 -19966 27107 41831 -7931 -9550
497 -9550 28541 -9053 -58806 -24918 8085 -8312 -9928 7174 9204 1038 -6362 9252 36537
510 36537 23921 -4260 -1459 -1885 -19841 -19213 -921 13523 6297 -21195 -14420 16087 -3310
523 -3310 -18792 27699 32727 -26734 -25924 18771 4655 -22039 7348 35672 3929 -33418 -3998
536 -3998 31077 -4711 -25304 23362 21382 -41119 -30061 19032 4826 -12450 12993 22161 692
549 692 -13762 -5314 12800 8707 -6878 245 2502 -15472 -14776 -642 7155 17317 9500 -7352
563 -7352 7100 8919 -20771 -7683 24470 -4420 -31829 -3228 8681 -14453 -8557 25997 28438
576B8438l6592o621L5431q090l8986K7247L3615m6877k6564M3036N732l0837J5061
589f007K7158j2874k1288M728J7367o01j2876J1423J1969j9448q223J2821m522
602c73j943Q288j3592n064J4673j3100j0634K9638Q111k4548P062K0732j1815
615G435j5709J3114J8041j6077k7180J6225J8374l4525q173M6964m355m1144K1938
628e072K8805k7622j2622K9035P132k2819p854J7090M652k1200J632K5697j0618
641F236k1942J6654N737j8061O458R711j0485M133N108j0609P099J2824j1362
654A501m027J1573k340j2179k468J0444M166j7080k661K6079p759k6816K4369
667B802K1576l2665o464L2365p864k6566J1510J6798j1387j4134J1846J7266j3953
$$ plain form
576 28438 -8154 -14775 20656 12566 -26420 827 34442 -12435 -38999 4037 9769 -21068 -6007
589 -6007 21151 8277 -13011 -8283 9084 8483 -4393 7030 18999 -449 -8672 4149 -373
602 -373 -2316 5972 -7620 -12684 1989 -11111 -21745 7893 16004 -8544 -1482 19250 7435
615 7435 -8274 4840 22881 6804 -20376 -4151 14223 -20302 -28475 18489 14134 -27010 -5072
628 -5072 23733 -3889 -16511 12524 19656 -3163 -11017 6073 10725 -10475 -8843 16854 6236
641 6236 -15706 948 6685 -11376 -4918 4793 -5692 -1559 3549 -7060 39 12863 1501
654 1501 -2526 9047 6707 -5472 -7940 2504 6670 -10410 -13071 13008 5249 -21567 2802
667 2802 24378 -8287 -14751 17614 9750 -16816 -5306 11492 105 -14029 -2183 15083 1130
680A130j5653K2359P286k7346N761K3508j7320j2882J6240k334j0438Q259L932
693B502j877K785l790j012M973r52P01M75n309K339j399j2069J0692J4440j8980
708f481l677K2890j0230j9678K1010J3381j8596n628J1944k87j2966k310J8542
721G914L908k2052L274K0728j6482j2569K5768L131k2200N414R257j1548j974
734g431Q296L332j38n596j254O316m954k205J1434l328q414N011n343o280J4362
749C808J283j0989J1763L403j8807L276J5928o006o947M426J646o795q457P670
763d798J6924r236j1330J7415M60k3263J0537J9458j5023q902J0664m398q969
776a0461L821Q618N331n128m975Q154j811j1111J0235Q734j4158j201N794j0275
$$ plain form
680 1130 -14523 7836 15122 -12224 -6463 17045 -275 -13157 3083 749 -9689 -1430 2502
693 2502 625 3410 -380 -1392 3581 2629 3330 3805 -1504 835 -564 -12633 -1941 12499 -6481
708 -6481 -10158 12732 2502 -17176 3834 17215 -1381 -7009 4935 4648 -8318 -10628 7914
721 7914 11822 -10230 -6956 13772 -2710 -15279 10489 13620 -8580 -3166 6091 -5457 -7431
734 -7431 865 4197 4059 -1537 -2791 3525 -1429 -3634 7800 4472 -3942 1069 -4274 -10554 3808
749 3808 5091 -5898 5865 9268 -9539 -6263 9665 3659 -3288 1138 2784 -4011 -12468 -4798
763 -4798 12126 2890 -8440 8975 9435 -13828 -3291 16167 1144 -7758 2906 -1492 -10461
776 -10461 -6640 1978 7309 2181 -2794 5360 3549 -7562 2673 11407 -2751 -3952 1842 -8433
790h433l3J1099l556P95P852p575m097P759n04k603K923k172j631l966n959R657
806d44O675j2108M742J2816j5414p271J8267o32j1011P118K593q792k325K705
820c081O274J577p627L608N672j3574j122J5235n147q081J0220j326j0091P473
834A0M020l247M342j333n657J902k004j712N348k883k300M892n458j985J2266
849F201k475o331J1315j858j3805O240N866r069N57M824l350j645j230K586P366
864E192m322l004J0806l913j1710J0034M557j2616L077O432r439j539O440j966
878a971J030J757k210L674n56l745O757J089q338N073K052j0418M427N889j0001
893e491J170P585p033j724Q136k085j990L680o41J015L10l564N449K87j0335M107
$$ plain form
790 -8433 -8466 2633 -923 -128 7724 149 -3948 3811 3307 704 3627 1455 -176 -4142 -10101 -444
806 -444 6231 -5877 -1135 11681 -3733 -11004 7263 6631 -4380 2738 5331 -3461 -5786 -3081
820 -3081 3193 4770 -2857 751 6423 -7151 -8273 6962 1815 -6266 3954 2628 -7463 10
834 10 4030 783 5125 3792 -1865 37 -1967 -3679 1669 -1214 -3514 1378 -4080 -6065 6201
849 6201 3726 -2605 8710 6852 -6953 -713 5153 -3916 -3359 1465 -1885 -3530 -4760 -2174 5192
864 5192 870 -2134 8672 4759 -6951 3083 7640 -4976 -1899 4533 -4906 -6445 -5 -1971
878 -1971 -941 816 -1394 2280 1724 -2021 4736 5825 -2513 2560 4612 -5806 -1379 4510 -5491
893 -5491 -4321 3264 -3769 -5493 2643 558 -1432 2248 1607 2622 2932 -632 4817 5104 -5231 -1124
909a124O496j1766N4J1301q083n061R617r40m139N850J732j151N82l080K344J955
925D587p474K294N409j0365j953J0391o399l414J1563k337o894O900J206m709
939a195M045J249k383n31l642J08L893m833J393P933q197n239J1191k762p082
954f052J0940J523j0308K859L730n360J754L502j317K81m770n73O546m037k509
969c791J0480l801r817R182K647r457O317N708r914j294L350l307K06L050L96
984d5K652l253k123P359j330n514R761o2j2994M295M643j0848J950R696o547l270
1000e630N272r00p65K871K026L093k817n740N971P0q530P331N557j3295k31Q825
1016C108q093k319J0745j825n913L625M56j123K045J197M361r65p588M555K871
$$ plain form
909 -1124 5372 -6394 -6340 4961 -3122 -8183 1434 494 -3645 2205 3937 2786 3368 288 2632 4587
925 4587 -2887 -593 4816 -5549 -7502 2889 -3510 -6924 4639 2302 -4592 2308 3514 -1195
939 -1195 2850 4099 1716 1185 -2457 -2349 1544 -3289 -1896 6037 -2160 -7399 3792 1030 -6052
954 -6052 4888 6411 -3897 -1038 2692 -2668 -914 2588 1271 1552 -3218 -3791 2755 -1282 -3791
969 -3791 6689 2888 -6929 2253 4900 -4557 1760 7468 -2446 -3740 -390 -3697 -3491 -441 -45
984 -45 2607 -646 -2769 4590 3260 -2254 7507 7445 -5549 -1254 3389 -7459 -5509 4187 -2360 -5630
1000 -5630 -358 -1258 -2023 848 2874 5967 3150 -2590 3381 3451 -5079 2252 7809 -5486 -5717 3108
1016 3108 -4985 -7304 3441 1616 -4297 -672 -216 -1339 706 1903 6264 5299 -2289 2266 5137
1031E137j0362L119R520j0835n264J0130m203o857J0413L502n559K235K435j171
1045B240l32j050L559J060r723J339O405r508j491J3417n043q260J0123O44q990
1060e610O276M980n916o62J883j148r20j157L517M470p374o71Q511p525o572J2558
1076D640p20j1929P219N746j0250J162Q686k409k430J072J471N3m978J109P181
1091E623n933o293J0581j424j0530Q773O073j1241K619P494p262k432O139r43
1105A244k929P71R90J572l091j012P415k464p346Q808J753j2349M854Q929j1492
1120d347k423J0945l839o607O701L222l506p37J883M123l996n713O953J165j1430
1135g606M752R359j0618j562J1443m749o282Q538R86o261K075J178j991j443j65
$$ plain form
1031 5137 -5225 -2106 7414 -3421 -8685 1445 -2758 -9615 798 4300 -1259 976 3411 2240
1045 2240 1908 858 4417 5477 -4246 -2907 3498 -6010 -7501 5916 873 -7387 2736 3380 -5610
1060 -5610 666 5646 -270 -932 951 -197 -1117 -2274 1243 5713 -1661 -2332 6179 -1346 -7918 4640
1076 4640 3920 -8009 -790 4956 -5294 -4132 4554 2145 -285 787 2258 2311 -2667 -1558 5623
1091 5623 -310 -6603 3978 2554 -7976 797 6870 -4371 -1752 5742 -1520 -3952 2187 1244
1105 1244 -1685 -914 76 1648 -1443 -2455 4960 2496 -4850 3958 5711 -6638 -1784 7145 -4347
1120 -4347 -6770 4175 336 -6271 430 3652 146 -591 1292 5415 1419 -4294 2659 3824 -7606
1135 -7606 -2854 6505 -4113 -5675 5768 1019 -5263 3275 4261 -2000 75 1253 -738 -2181 -2346
1150b346M079L86n466M514M491r549J539J0105q197o060J0295k878r205P530N001
1165D239o081Q28L958m25k741j759M654J933q743J287Q139q693n130J3068j042
1180C492r236Q131L559r056R97N817l396j620R37P3m52l000K004O241m469k315
1196b293Q229m436p858R162J469r374M266N271q429p38O869r91j658J949J093
1211B531m19m476J27O557m024n996Q439K82j0983O258Q453q754j19Q293m850n362
1227d043M321J007j404o37m2K246k749l617O638K019o875M209M750r567K81Q078
1243D615n587k671P226k351n321L706J349p10R37k96J562j773n250M264L693p905
1259d512K313Q094q112l651J0011j423o021O391J604n819q35J450L60q2k531K967
$$ plain form
1150 -2346 1733 2119 -3347 1167 5658 -3891 -2352 7753 -444 -6504 3791 913 -8292 -762 4239
1165 4239 -1842 -1014 2944 2519 -222 -1981 2673 4606 -4137 -2850 5289 -3404 -8534 4534 3492
1180 3492 -5744 2387 5946 -3110 -2113 3704 308 -1312 -375 -302 -754 -3754 -1750 4491 22 -2293
1196 -2293 5936 1500 -6358 2804 4273 -5101 -835 4436 -3993 -4731 2138 1147 -511 1438 2531
1211 2531 2112 -2364 -2237 4320 296 -5700 2739 3021 -7962 -1704 6749 -2005 -2124 6169 1319 -4043
1227 -4043 278 1285 -119 -756 -798 1448 -1301 -4918 1720 3739 -3136 1073 5823 -3744 -3463 4615
1243 4615 -972 -3643 3583 1232 -4089 -383 966 256 1193 897 2459 686 -4564 -300 3393 -4512
1259 -4512 -2199 5895 -2217 -5868 4143 2720 -3301 3090 4694 -1125 -1960 -510 -150 -232 -2763 204
1275B04K187o369J240P961n248k371Q087l418o948N927P80n933L672K161l923
1290a991O65J172K98J163j626Q46L127n030k034O841l310m946P699J75q264M813
1306d02M470o139J017M314k453j689m67P47J702k563j072N933k405n616P004J345
1322C726p153M018L736o619K57M048l604o10K998j182K95M80n60K715j222l018
1338a695L627j51n917L774L179p040J966O148n506q96O265k182k716K529k19p12
1354D54p99j502K679q6m951M014L783o298J596O597n735l042N910k367l457L904
1370G00J9j807J718j019K62J444k174J471K437n115j02M511m578j037O814k494
1386A050m133N711p40m222L408J168l011M85o84m28J296j764J845L727m731j221
$$ plain form
1275 204 2391 -3978 -2738 5223 -25 -2396 5691 2273 -4675 1252 2032 -3901 -229 1932 -1991
1290 -1991 -1326 -154 144 1307 -319 527 3654 -1376 -3410 3431 121 -4825 2874 3049 -5215 -402
1306 -402 4068 -2071 -1054 3260 807 -882 -1349 -602 1100 -1463 -2535 3398 993 -4623 2381 3726
1322 3726 -3427 591 4327 -2292 -2035 2013 -1591 -2201 797 -385 -90 390 -170 2545 1323 -1695
1338 -1695 1932 1781 -4136 -362 2817 -4223 -2257 3891 -1615 -2511 3754 1572 -1144 1385 1166 454
1354 454 -345 -1847 832 746 -4205 -191 3592 -2706 -1110 5487 -248 -3290 2620 253 -3204 700
1370 700 719 -1088 630 -389 -127 1317 -857 614 3051 -2064 -2166 2345 -2233 -3270 3544 1050
1386 1050 -3083 2628 1888 -2334 1074 2242 -769 -284 -968 -1396 -100 -1864 -19 3708 -1023 -2244
1402b244N717k709m465O528L73o703K715J974l779J504K517j020Q30j601l40K331
1418A628k121j426M706j753m511M480J73m726M646K298n101J221K316m027L97
1433a800L011j249L41l38q47K038j173j600N166r64n647L566J827o594K302N772
1449C811m812p96L431k250j091J862Q95J517j077k638K480p83m193M359K497n869
1465b657Q72M212m864l16N854k037j947K545j580j948K088j07P49L84k743J192
1481c03J219m241L189M487n297p28M976m553l170O090j68l425K764L05k481P03
1497f33O00J618L84l080P04K334m627l38O081k660l763N401p70m215M001J846
1513B883k773N81N09k224Q1j86Q05J927k745m63L673k910j918O282j150m554M121
$$ plain form
1402 -2244 3473 764 -3701 2827 3200 -3503 -788 1186 -2593 -1089 1428 408 1238 -363 -703 1628
1418 1628 -493 -1919 2787 1034 -3477 1003 1176 -3550 1096 3394 -1707 -486 1830 -2197 -1800
1433 -1800 1211 -38 303 -35 -882 1156 -17 -1617 3549 2585 -3062 504 2331 -4263 -1961 3811
1449 3811 -1001 -1797 1634 -616 -1707 155 1050 2567 1490 -1148 1332 549 -3644 715 3212 -2657
1465 -2657 -1785 2427 -2437 -2753 3101 1064 -883 1662 82 -1866 222 115 864 1248 -1495 -303
1481 -303 916 -3325 -136 4351 -946 -1674 3302 -1251 -4421 1669 1501 -1924 840 1145 -1336 -633
1497 -633 -33 1585 1969 -1111 -407 1927 -2700 -3038 3043 383 -3380 2021 1251 -2964 1037 2883
1513 2883 110 691 1200 -1024 -943 -1129 -324 1603 -1142 -1605 2068 -842 -2760 3522 2372 -2182 1939
1530A939J58o059K387L337l430O90K124j311m92P5P23K762k446k212M188k396
1546C7m513N210J793n984K979L562m762K02L512j125p01R38q95n66p36j075L090
1563I66n10k882L680Q20m767L019L345m986N70M122m375k048L912j130j632K225
1579C29q6j11M14j312K882k56m073K778J687n756J226N007l581k051N478j259
1595A316l281L062L51r81J1m61k0j66k460J789K504l873P27M654l460j746N056
1612C022j702l171L385l94l450J797R10j488O51L90M64O66j743Q78K804l885j170
1629b036M585k657l967N382K54m821L233K632l065K52J822q24o82p64N5J314j974
1646a261q61M020j920k817M976R0m493L299J797m368M98K227k483mJ595p74N27
$$ plain form
1530 1939 2097 -3962 -1575 1762 -1668 -978 1146 -165 -657 -582 141 2903 457 -1755 2433 37
1546 37 -4476 734 2527 -3457 -478 3084 -1678 -1476 2036 911 210 1148 253 -313 -1049 -2124 966
1563 966 456 -2426 1254 2074 -2693 326 3671 -1315 -745 3377 -998 -3046 866 -264 -1896 329
1579 329 243 132 546 -766 2116 1860 -2213 565 2252 -3504 -2278 2729 -852 -2903 2575 1316
1595 1316 -1965 1097 1448 467 478 17 -3 -169 -2629 -840 1664 -2209 -1482 3172 -288 -2034 3022
1612 3022 1320 -1851 1534 1140 -2310 -513 397 -1091 -440 -50 414 1080 -663 215 3019 -866 -2036
1629 -2036 2549 -108 -4075 1307 1561 -3260 -27 2605 -460 -208 1614 790 108 -656 -601 713 -1261
1646 -1261 -2122 1898 -22 -2839 2137 2227 -2266 1033 2830 -1538 -1040 1187 -1296 -1300 295 -479 48
1663D8k91m46K246q15j702L157q71m432L447J937n365J795L916l921o73L749q41
1680I38j851J749K13o82o14j326K339l16l376L610J668m918J919L758l964q60
1696a713M549k322k562K420k37j304R85J81N28L12j751J617J310l362J056K790
1712B497m123j013M461k403k062M607n76k621K315K79j758K97rJ79J59j936R28
1729g79K537l092j32M431k420k949M351n45l732K807R08k485J50J231p35N08K8
1746H2k26J516j954q03L381k493j643L800p01l638L271J080l502J713J736k333
1762g14K35J157q92J84m85k86J702j265j444L246l43l068K928J031l976J627K365
1779B002k988m7K440k206k07R27l82Q81P3j315K373j86k970K456J013m042J199
$$ plain form
1663 48 -243 -689 1557 742 -960 2197 1326 -3106 341 2278 -3087 -1292 2624 -1297 -1970 1779 938
1680 938 -913 836 1049 367 -247 -1573 766 450 -2926 684 2352 -2566 -647 3111 -853 -1713
1696 -1713 2836 514 -2048 372 135 -1169 -184 -3 525 837 -914 703 2013 -1349 -293 2497
1712 2497 -1626 -2639 1822 -581 -2643 1964 1388 -1233 1082 1361 -397 -100 -109 70 229 -1707 -779
1729 -779 1758 -1334 -1466 2965 545 -2404 1947 1402 -2330 477 1385 -1100 -950 281 -454 54 82
1746 82 -144 1372 -582 -1385 1996 -497 -2140 1660 959 -2679 592 1672 -1830 -117 1619 -714
1762 -714 -479 678 -214 -30 -515 -801 901 -364 -1808 1438 1095 -1973 955 1986 -1990 -363 2002
1779 2002 -986 -1033 1407 -799 -1006 -79 -461 420 493 -822 1551 1365 -1605 851 1864 -2178 -979
1796i79K913l365j11L235j749j083K179l92n01M86m75K22J31k106J509Q01k824
1813b109J742K607l005J35L292k527j662L074j150j945J770l62q90J196p02P62
1829B26J177j935N18J986k884n6L160k937j933L799j276k035K891O50j506J345
1845A190j39r92O80j376M24J296k146o44K274j577j262M063k75k437K821K45l013
1862h68J189J009k224L95R9j168Q18R1j52K603j209j074K324p59k744K431L80
1879A141l513J629J439k749J019K054n15N34J75r19N13p86j886K074j15k543K231
1896b17J038k838K466K008k372N00J469k136n11Q95j296K8L88r25J137P63q45
1913d48J803J317k862Q39J378l709R3K499j969n95K411j134q07J950k67N20J011
$$ plain form
1796 -979 1934 -1431 -1542 1693 -56 -1139 1040 648 147 633 158 380 511 -1595 -86 715 -2109
1813 -2109 -367 2240 -765 -630 2662 135 -1527 1547 397 -1548 222 -140 -1030 166 -536 226
1829 226 1403 -532 -14 1972 -912 -968 2192 -745 -2678 1121 -155 -2190 701 1351 -155 1190
1845 1190 1051 59 739 -637 -213 1083 -1063 -1707 567 -1010 -2272 1791 1516 -921 1900 2145 -868
1862 -868 321 1330 -894 -499 -400 -1568 -750 -659 -811 1792 583 -491 1833 1074 -1670 761 1141
1879 1141 -2372 -743 696 -2053 -1034 1020 505 1039 1214 295 808 22 -1864 210 95 -2448 -217
1896 -217 821 -2017 449 2457 85 585 2054 -82 -593 302 -994 -966 -578 -1503 -366 397 -448
1913 -448 1355 2672 -190 649 2027 -1682 -1589 910 -1059 -1654 757 -377 -1184 766 499 1019 2030
1930B030j732K12J76k526Q22J630k501k3L167k052n06L347q76j168J786r17j743
1947h74J027p19n84J474j148k80K000j594J66K897j648j025K168j662k433K814
1963E79o74j717K245J22j203J260q2m75J171j044p73J539j692j455K447m84j970
1980b206L147J00k337K353Q42k013J157O7j406J4l82o67J282j99j035K087o17
1997A87j780K502Q83k514J434R12k822M78J574j872M70J156j081N86M79j009J053
2014F36M53k136J754J77k890J377J435k520R66K210k004J50K023r64l92J218j374
2031A19l95J97j743J182R24j920J363J532k290O40K444j823n50K222j371j667
2047a136J913j296m74J393p30J71J144j166L05J094k103J50J701k021q15K826
$$ plain form
1930 2030 298 510 686 -1840 -1018 612 -1889 -1912 1255 -797 -1303 2044 1168 0 1786 869 -874
1947 -874 153 -566 -1150 324 -824 -1104 896 -698 -532 2365 717 -308 1860 198 -2235 579
1963 579 -95 -1812 433 555 -648 612 530 55 1226 182 -591 948 -744 -2199 248 -236 -2206
1980 -2206 941 1041 -1296 1057 1899 -114 1043 1110 -296 -282 -664 -1331 -49 -248 -1283 804 187
1997 187 -1593 909 1792 -722 712 1624 -1198 -720 854 -1018 -548 608 -473 113 592 -417 636
2014 636 1089 -1047 707 884 -2006 -629 806 -1714 -748 1462 -542 -392 1631 667 275 1493 119
2031 119 -276 -79 -1822 -640 284 -1636 -273 1259 -1031 -391 2053 230 -320 1902 531 -1136
2047 -1136 777 -519 -993 400 -330 -159 985 -181 124 1218 -885 -735 966 -1055 -1870 956
2063I56j436r40K498q5j192J360j79r35Q24j014j103R89p26l83K034j224k07K328
2081A565q10j503K160l33k382J673J64j791R37N78j222R72Q5n37J786r24q17J836
2099A437j081j932K129k23k056J766Q50k172J305J459j858Q89M92j037M59k56
2115A71j200J276n51j239J974O45k197K006J077k764Q06J461k405m0J100r75J75
2132f80J224q93P38O35j178J047L30k140P13J162l016J117J681j968M55K436j394
2149B69l95J651j130n84Q04q82k67O67j400N78J316j753Q90K003j803k69J928
2166A623j505j204J965r04j235J239l97j97J199p63oJ314j445j87J810j646q47
2183a186K490j613j567K941q26j540K207Q0j115O96O4j291N35l13n29J438j218
$$ plain form
2063 956 -480 -1420 1078 993 -199 1161 982 47 871 -143 -1246 -257 -983 -1366 668 -556 -763 1565
2081 1565 755 -748 1412 1079 -1303 370 534 -1257 -320 258 -964 8 93 -444 1342 418 -399 1437
2099 1437 356 -1576 553 330 -1726 40 890 -1282 23 1482 -376 513 1005 -32 427 171
2115 171 -1029 247 -304 -1543 431 1076 -1121 885 1962 -802 4 1465 -940 -980 120 -855 -680
2132 -680 544 -349 389 1024 -154 893 1223 -917 -204 958 -2058 -941 740 -1228 -773 1663 269
2149 269 -126 1525 395 -189 615 -267 -534 133 -1267 -689 627 -1126 -236 1767 -36 -305 1623
2166 1623 118 -1086 879 -25 -1260 -21 -418 -615 584 -179 -185 1129 -316 -503 1307 -339 -1186
2183 -1186 1304 -309 -1876 1065 239 -1301 906 986 -129 567 631 -660 -125 -438 -967 471 -747
2200g47k61K350j043r85K430p64j991J904k56k076J059M01j553Q33M39k15R71
2217D96N4o86J726p67j606J748o69k051J883O09k346J172J032j670Q77J284j418
2234c32P97K51q65N39J72j189P12N86j987J770N66k056J086J186j795J56J552
2251A149j884j90J579r24j40N23p28O20O20r30J125P11k197Q40R22k430K71J992
2269I29j344o75J825n18n17J293j10p99P44j082K59M73j620J87J342j536J10K289
2287A250j410k90K381r91j349J581q13j267J006m19o92J016p01L8J876j269L2
2304b1J523r01j367K259r96k083J803K45j884J223N57q60R72K54r29R02n12r13
$$ plain form
2200 -747 -1008 1342 299 -686 1744 980 -1011 893 637 -1439 -380 21 -1532 -699 -260 -475 496
2217 496 550 -136 1590 823 -783 965 296 -1755 128 737 -1609 -437 595 -1075 -198 1086 -332
2234 -332 465 716 -149 390 562 -627 85 671 -1316 454 1020 -1036 50 1236 -559 -403 1149
2251 1149 -735 -925 654 -270 -410 113 -615 5 625 -305 820 1531 -666 174 1096 -1334 -1063 929
2269 929 -415 -1090 735 217 -300 993 883 84 828 -254 5 478 -1142 -955 387 -1149 -1039 1250
2287 1250 -160 -450 1931 940 -409 1172 359 -908 98 -321 -1013 3 -698 -660 1216 -53 -21
2304 -21 1502 601 -766 1493 497 -1586 217 462 -1422 -199 358 -502 470 724 -205 697 185 -728
$$ [...]
8191A23
##END NTUPLES=NMR FID
##END=
