##TITLE=1H_08-2025-Bay
 200.13MHz, DMSO-d6,
 24 sc
 
 15.1.2025
##JCAMPDX= 6.0         $$ Bruker NMR JCAMP-DX V2.0
##DATA TYPE= NMR FID
##DATA CLASS= NTUPLES
##ORIGIN= UXNMR, Bruker Analytische Messtechnik GmbH
##OWNER= pz
$$ XWIN-NMR		Version 3.5
$$ Wed Jan 15 14:13:41 2025 Russian Standard Time (UT+4h)  she@DPX200
##.OBSERVE FREQUENCY= 200.1312
##.OBSERVE NUCLEUS= ^1H
##.DELAY= (6, 6)
##.ACQUISITION MODE= SIMULTANEOUS
##.ACQUISITION SCHEME= undefined
##.AVERAGES= 8
##.DIGITISER RES= 18
##SPECTROMETER/DATA SYSTEM= spect
##.PULSE SEQUENCE= zg30
##.SOLVENT NAME= DMSO
##.SHIFT REFERENCE= (INTERNAL, DMSO, 0, 14.3821)
##AUDIT TRAIL= $$ (NUMBER, WHEN, WHO, WHERE, WHAT)
$$ ##TITLE= Audit trail, XWIN-NMR		Version 3.5
$$ ##JCAMPDX= 5.01
$$ ##ORIGIN= Bruker BioSpin GmbH
$$ ##OWNER= she
$$ F:/spectra/data/she/nmr/H-C/1/audita.txt
$$ ##AUDIT TRAIL=  $$ (NUMBER, WHEN, WHO, WHERE, WHAT)
(   1,<2025-01-15 14:12:13.48 +0400>,<she>,<DPX200>,
      <created by zg, POWCHK disabled, PULCHK disabled
       configuration hash MD5:
       00 E9 B6 7A A2 85 ED C7 34 08 36 98 17 FE 4E 26
       data hash MD5: 16K
       D7 B8 97 5D 1F 3B ED B7 02 74 C8 39 EC 74 4F D9>)
$$ ##END=
$$ 
$$ hash MD5
$$ B9 FE 6A A6 B0 09 CB 42 91 82 B6 41 9B C1 E1 4B
##$RELAX= 
##$RELAX= 
##$RELAX= 
##$RELAX= 
##$RELAX= 
##$RELAX= 
$$ Bruker specific parameters
$$ --------------------------
##$DU= <F:/spectra>
##$EXPNO= 1
##$NAME= <H-C>
##$PROCNO= 1
##$TYPE= <nmr>
##$USER= <she>
##$AMP= (0..31)
100 100 100 100 100 100 100 100 100 100 100 100 100 100 100 100 100 100 
100 100 100 100 100 100 100 100 100 100 100 100 100 100 
##$AQSEQ= 0
##$AQ_mod= 1
##$AUNM= <au_zg>
##$AUTOPOS= <>
##$BF1= 200.13
##$BF2= 200.13
##$BF3= 200.13
##$BF4= 200.13
##$BF5= 200.13
##$BF6= 200.13
##$BF7= 200.13
##$BF8= 200.13
##$BYTORDA= 1
##$CFDGTYP= 0
##$CFRGTYP= 5
##$CHEMSTR= <none>
##$CNST= (0..31)
1 1 145 1 1 1 1 1 1 1 1 1 1 1 1 1 1 1 1 1 1 1 1 1 1 1 1 1 1 1 1 1 
##$CPDPRG= <>
##$CPDPRG1= <>
##$CPDPRG2= <>
##$CPDPRG3= <>
##$CPDPRG4= <mlev>
##$CPDPRG5= <mlev>
##$CPDPRG6= <mlev>
##$CPDPRG7= <mlev>
##$CPDPRG8= <mlev>
##$CPDPRGB= <>
##$CPDPRGT= <>
##$D= (0..31)
0 0.7 0 0 0 0 0 0 0 0 0 0.03 0 0 0 0 0 0 0 0 0 0 0 0 0 0 0 0 0 0 0 0 
##$DATE= 1736935932
##$DBL= (0..7)
120 120 120 120 120 120 120 120 
##$DBP= (0..7)
150 150 150 150 150 150 150 150 
##$DBP07= 0
##$DBPNAM0= <>
##$DBPNAM1= <>
##$DBPNAM2= <>
##$DBPNAM3= <>
##$DBPNAM4= <>
##$DBPNAM5= <>
##$DBPNAM6= <>
##$DBPNAM7= <>
##$DBPOAL= (0..7)
0.5 0.5 0.5 0.5 0.5 0.5 0.5 0.5 
##$DBPOFFS= (0..7)
0 0 0 0 0 0 0 0 
##$DE= 6
##$DECBNUC= <off>
##$DECIM= 32
##$DECNUC= <off>
##$DECSTAT= 4
##$DIGMOD= 1
##$DIGTYP= 9
##$DL= (0..7)
0 120 120 120 120 120 120 120 
##$DP= (0..7)
150 150 150 150 150 150 150 150 
##$DP07= 0
##$DPNAME0= <>
##$DPNAME1= <>
##$DPNAME2= <>
##$DPNAME3= <>
##$DPNAME4= <>
##$DPNAME5= <>
##$DPNAME6= <>
##$DPNAME7= <>
##$DPOAL= (0..7)
0.5 0.5 0.5 0.5 0.5 0.5 0.5 0.5 
##$DPOFFS= (0..7)
0 0 0 0 0 0 0 0 
##$DQDMODE= 0
##$DR= 18
##$DS= 0
##$DSLIST= <SSSSSSSSSSSSSSS>
$$ [...]
##$SUBNAM0= <"">
##$SUBNAM1= <"">
##$SUBNAM2= <"">
##$SUBNAM3= <"">
##$SUBNAM4= <"">
##$SUBNAM5= <"">
##$SUBNAM6= <"">
##$SUBNAM7= <"">
##$SUBNAM8= <"">
##$SUBNAM9= <"">
##$SW= 18.0517418723606
##$SWIBOX= (0..15)
0 0 2 0 0 0 0 0 0 0 0 0 0 0 0 0 
##$SW_h= 3612.71676300578
##$TD= 16384
##$TD0= 1
##$TE= 0
##$TE2= 300
##$TE3= 300
##$TEG= 300
##$TL= (0..7)
0 120 120 120 120 120 120 120 
##$TP= (0..7)
150 150 150 150 150 150 150 150 
##$TP07= 0
##$TPNAME0= <>
##$TPNAME1= <>
##$TPNAME2= <>
##$TPNAME3= <>
##$TPNAME4= <>
##$TPNAME5= <>
##$TPNAME6= <>
##$TPNAME7= <>
##$TPOAL= (0..7)
0.5 0.5 0.5 0.5 0.5 0.5 0.5 0.5 
##$TPOFFS= (0..7)
0 0 0 0 0 0 0 0 
##$TUNHIN= 0
##$TUNHOUT= 0
##$TUNXOUT= 0
##$USERA1= <user>
##$USERA2= <user>
##$USERA3= <user>
##$USERA4= <user>
##$USERA5= <user>
##$V9= 5
##$VALIST= <valist>
##$VCLIST= <CCCCCCCCCCCCCCC>
##$VD= 0
##$VDLIST= <DDDDDDDDDDDDDDD>
##$VPLIST= <PPPPPPPPPPPPPPP>
##$VTLIST= <TTTTTTTTTTTTTTT>
##$WBST= 1024
##$WBSW= 4
##$XGAIN= (0..3)
0 0 0 0 
##$XL= 0
##$YL= 0
##$YMAX_a= 240947
##$YMIN_a= -246288
##$ZGOPTNS= <>
##$ZL1= 120
##$ZL2= 120
##$ZL3= 120
##$ZL4= 120
##$ABSF1= 10
##$ABSF2= 0
##$ABSG= 5
##$ABSL= 3
##$ALPHA= 0
##$AQORDER= 0
##$ASSFAC= 0
##$ASSFACI= 0
##$ASSFACX= 0
##$ASSWID= 0
##$AUNMP= <proc_1d>
##$AZFE= 0.1
##$AZFW= 0.1
##$BCFW= 1
##$BC_mod= 2
##$BYTORDP= 1
##$COROFFS= 0
##$CY= -3
##$DATMOD= 1
##$DC= 2
##$DFILT= <>
##$DTYPP= 0
##$F1P= 0
##$F2P= 0
##$FCOR= 0.5
##$FTSIZE= 0
##$FT_mod= 4
##$GAMMA= 1
##$GB= 0.15
##$INTBC= 1
##$INTSCL= 1
##$ISEN= 128
##$LB= 0.25
##$LEV0= 0
##$LPBIN= 0
##$MAXI= 10000
##$MC2= 0
##$MEAN= 0
##$ME_mod= 0
##$MI= 1.114404
##$NCOEF= 0
##$NC_proc= 0
##$NLEV= 6
##$NOISF1= 3.799351
##$NOISF2= 2.8
##$NSP= 1
##$NTH_PI= 0
##$NZP= 0
##$OFFSET= 14.38212
##$PC= 1
##$PHC0= 248.9459
##$PHC1= 13.1922
##$PH_mod= 1
##$PKNL= yes
##$PPARMOD= 0
##$PSCAL= 0
##$PSIGN= 0
##$REVERSE= no
##$SF= 200.129724274929
##$SI= 16384
##$SIGF1= 3
##$SIGF2= 2
##$SINO= 400
##$SIOLD= 16384
##$SREGLST= <1H.CDCl3>
##$SSB= 0
##$STSI= 0
##$STSR= 0
##$SW_p= 3205.1282051282
##$SYMM= 0
##$S_DEV= 0
##$TDeff= 0
##$TDoff= 0
##$TI= <>
##$TILT= no
##$TM1= 0
##$TM2= 0
##$TOPLEV= 0
##$USERP1= <user>
##$USERP2= <user>
##$USERP3= <user>
##$USERP4= <user>
##$USERP5= <user>
##$WDW= 1
##$XDIM= 8192
##$YMAX_p= 0
##$YMIN_p= 0
$$ End of Bruker specific parameters
$$ ---------------------------------
##NTUPLES= NMR FID
##VAR_NAME=  TIME,          FID/REAL,        FID/IMAG
##SYMBOL=    X,             R,               I
##VAR_TYPE=  INDEPENDENT,   DEPENDENT,       DEPENDENT
##VAR_FORM=  AFFN,          ASDF,            ASDF
##VAR_DIM=   8192,          8192,            8192
##UNITS=     SECONDS,       ARBITRARY UNITS, ARBITRARY UNITS
##FACTOR=    0.0002768,     1,               1
##FIRST=     0,             0,               0
##LAST=      2.2672688,     0,               0
##MIN=       0,             -246288,         0
##MAX=       2.2672688,     240947,          0
$$ Real data points
##PAGE= N=1
##DATA TABLE= (X++(R..R)), XYDATA
0@%%%%%%%%%%%%%%%%%%Qj6J6j6J6j6K1k9L2l3M0m7N3o1O9p9Q8r9J14j28J42j59
40h4J77j95K16k40K66k96L27l60L97m35M79n29N83o43P10p86Q71r69J082j213
60f42J372j566J807k119K540l140M070n723R527l4535J8786J53492R7078n0535
74A90412j24428l1691L3795k4080j01682n3129K6244J7162l2503R963Q6797O7479
86F4339k7798m2025L2357M8903m2002q1408P238Q3341K1259o8722l5531O0444
98B0395M8338n1782p3814J0962M8105j5871n2972R560O5275K1730l4193P57N4431
111E0921J4322o1881m0782M3065M4308l9738n7388K9612P7543j852p8252l2660
123e2782M4464J6999o2395n0802L8712O5458O888j1093M8242O9651O94n2044j8477
$$ y = [0, 0, 0, 0, 0, 0, 0, 0, 0, 0, 0, 0, 0, 0, 0, 0, 0, 0, 0, 8, -8, 8, -8, 8, -8, 13, -16, 16, -17, 23, -24, 29, -32, 37, -42, 46, -53, 61, -67, 75, -84, 93, -102, 114, -126, 140, -156, 171, -189, 208, -227, 252, -277, 306, -337, 373, -413, 458, -511, 571, -642, 730, -836, 971, -1148, 1392, -1748, 2322, -3401, 6126, -28409, -9623, 143869, 240947, 190412, 65984, 34293, 68088, 44008, -57674, -110803, -84559, -67397, -99900, -89937, -3140, 64339, 36541, -5484, 26873, 75776, 33774, -47634, -40396, 42945, 64204, -4518, -40049, 20395, 68733, 16951, -56863, -45901, 2204, -13667, -66639, -57079, 8196, 29926, -4267, -3510, 50921, 65243, 3362, -37420, 5645, 49953, 10215, -47173, -17561, 59982, 58130, -20122, -52782, -8318, 8681, -53714, -104516, -65804, -346, 6542, -4551, 43691, 113342, 114036, 61992, 43515]
136D3515J4347l9786r6588n0321L9203L5771k7976j5348P4969R9517J6740m4861
148D9182j732M4907n232p7819n6227J5057J8678l0458k6054L6423M9619q693l2013
161b4362J9482M4206j4225n6507o288N6867K5767m3792k9086M6835M9229k9962
173C8164o1805k747L9834m999n1653j3514M4097K6941k4701j2795L6302K5551
185C8675l1951l5276K2566L8529j7321m2838J7011O1639J2347n2019k9378L0501
197A2485J5989n3502n9529J0024M3218L539j8769K8743O6324L0454j8327o041
209E4608K3064r439o4906n2784N535J1118l4407l2950L6245P2108K1667k6007
221C852O272N1769J8897m7712m4797J0483K0924k5330l6441J3011L8097p66k8498
$$ y = [43515, 57862, 18076, -78512, -128833, -89630, -53859, -81835, -97183, -22214, 77303, 94043, 49182, 47450, 92357, 87125, 9306, -46921, -31864, -13186, -43644, -69698, -33275, 16344, 7651, -24362, -4880, 39326, 25101, -31406, -37694, 19173, 44940, 1148, -27938, 18897, 68126, 38164, -23641, -26388, 13446, 8447, -43206, -56720, -12623, 14318, -10383, -23178, 13124, 38675, 6724, -28552, -5986, 32543, 15222, -27616, -10605, 51034, 63381, 11362, -18016, 12485, 28474, -25028, -84557, -74533, -31315, -27776, -46545, -17802, 48522, 78976, 60649, 54608, 77672, 68233, 3327, -49457, -43922, -32804, -67211, -100161, -63916, 8192, 29859, 3852, 10124, 61893, 80790, 33078, -11719, -1236, 19688, -5642, -42083, -29072, 9025, 8259, -20239]
234b0239L895L2834m21m0771j4375L7914K4752k8263k3701L4958M5748j2300m6092
247f061m347L5392J439m5880k2535K9666K5191j9398k0278K1509K7469j6497l2185
260b6515P445K9890o471l0387P782M8790K2837k8747j9185K7902J9239m0003n7545
273d4968p674K3876o874l1322O515N3002L7843l010K391L3109J7148l3771m1762
286D503m970N364l3187m3474P306M5602J5031k2014M002M7228K8939k7146l3409
299f225J2248K5230j7397l6247K382L1994N556k6010o165K5457O991l1233k0356
312c3775K1845K0611j8890k2343K2258M1085r55l3451k971L2217P932l6487k4684
325b7608K1676K4505j5209k3811J2345K7029p305l1596l797K1336j241k7626l079
$$ y = [-20239, -16344, 16490, 16069, -24702, -39077, -1163, 23589, -4674, -28375, 6583, 52331, 40031, -6061, -10408, 24984, 26423, -19457, -41992, -12326, 12865, -6533, -26811, -5302, 22167, 5670, -26515, -19070, 10820, 4349, -26038, -18256, 30534, 53371, 24624, 5439, 33341, 52580, 12577, -44968, -52642, -28766, -35640, -66962, -60447, -7445, 30398, 27388, 29779, 62888, 80036, 46265, 4503, -467, 4897, -28290, -71764, -64458, -18856, -3825, -25839, -21837, 25391, 54330, 27184, -6225, 6023, 31253, 13856, -22391, -20009, 11985, 17541, -8469, -14634, 10823, 17814, -13419, -33775, -11930, 8681, -10209, -32552, -10294, 30791, 29836, -3615, -6586, 25631, 33563, -2924, -27608, -5932, 18573, 3364, -20447, -8102, 18927, 11622, -19974, -23771, -2435, -3676, -31302, -34381]
338c4381L7405K7384j3096j0352K8551K8576k2133m7141j3185J4858j2507m2312
350e8333j3366L4440L1534k766N83L4763L4207q773k8646j952J0475k1879m3218
363c2931r765K5291R057k2082n855L5582L0068j5288k6046J1236K6717q022l1772
376a3810l832K8523J1664k1578j1079K1114J2986k2527k3599R855J8054j3179
388g408k3948J0287L3496N084k5023m371K8425J3499k7068k3613J6562K5075r856
401A1141k4019Q067K7633m21k8699j1560J5538J128k8148j5031K3798K5174n237
414f36p862K6255L5655l220l0873r588J3747r896m2316k5995J5684K0204q662
427b7503q566K6883L8202M822j6395K461J7823o752l3647j6840J4514P194k1066
$$ y = [-34381, 3024, 30408, 17312, 6960, 35511, 64087, 41954, -5187, -18372, -3514, -16021, -58333, -71699, -37259, -5725, -8491, -7908, 26855, 61062, 52289, 23643, 21691, 32166, 10287, -32931, -42696, -17405, -8348, -30430, -36285, -703, 29365, 14077, -11969, -733, 25984, 17962, -13810, -17642, 10881, 22545, 967, -10112, 11002, 23988, 1461, -22138, -12283, 5771, -7408, -31356, -21069, 12427, 17511, -7512, -11883, 16542, 30041, 2973, -20640, -4078, 20997, 11141, -12878, -4811, 22822, 22401, -6298, -17858, -2320, -1192, -29340, -44371, -20573, 4601, -636, -8498, 17757, 53412, 50192, 19319, 9731, 23478, 13582, -28734, -54729, -39045, -18841, -27503, -36069, -9186, 29016, 33838, 17443, 19904, 37727, 30975, -2672, -19512, -4998, 2196, -18870]
440a8870j4101K2391K6151r291k2367O800K5025j600k7315p349K5578J4767j6974
453B845j2506J8374J8529j3962k4043L608J7272q346k4820j35K6055Q270k0107
466h966p822K2322J5754j8905k2610J1717K3729m871k0622N171K7949P417k2167
479H096j3308J2483L567k5852k4074Q903J8259m065j0694J8562L5850J0491j6312
492B1906l451J7808k59l3212k9165M007J1234j3859j8366J4116L2415R504j1915
505G63L664K2792N760k3510j6915J1086R465j7367j8299J2118K2281m152k1267
518a3581J238K1559K634k3843j0635J9535J5579j2399j3381J5081K1514o190k0997
531c886L33J6894k431k2772o957J9017J0327j5226j1855J5395J6155j2291k1767
$$ y = [-18870, -32971, -10580, 15571, 6280, -16087, -9287, 15738, 14138, -13177, -20526, 5052, 19819, 2845, -9661, 8713, 27242, 13280, -10763, -7155, 10117, 1771, -23049, -23184, 2871, 11141, -8966, -16788, 5534, 21288, 2383, -20227, -8510, 15219, 10348, -10274, -5103, 22846, 30263, 8096, -5212, 7271, 10838, -15014, -39088, -30185, -11926, -15991, -26685, -8123, 27727, 38218, 21906, 18455, 36263, 36004, 2792, -26373, -22366, -11132, -24991, -43357, -29241, 3174, 12678, 763, 4427, 27219, 32979, 9469, -7446, 3640, 13105, -4262, -22561, -10443, 11838, 7686, -13581, -12343, 9216, 11850, -11993, -22628, -3093, 12486, 87, -13294, 1787, 23301, 17111, -3886, -3553, 13341, 10910, -11862, -18819, 198, 10525, -4701, -16556, -1161, 14994, 2703, -19064]
544a9064M760J9767m68j8017J127K5909J4188j3603j0738J2264Q640k0090k6703
557b2028j812J1759o451j7120P004K9966J5825p932Q7K1289J1293k0272k4844
570c236O6Q333j4634k3784K189K3294Q670j1646k38K2542J2815j4975j5147R425
584C674J2815j1807j8640N656J9298L32j8343l203J7622N112j9317j3283J2448
597g636J4556q982j4139R580K1350k08j7447j161J6128L054j8485j0162J3603
610E1J2462j0600j3575R545J5791o990k0385k005J4876J512j7561l325K1085J6796
624A7677o863p576J3236J4900j1087k3951n683Q137p070k1759m384K0071J4414
637F2n243j817K0388J8744q093j8017N76J0215r717k3143o018J5112O994j2273
$$ y = [-19064, -14304, 5463, 4995, -13022, -11895, 14014, 28202, 14599, 3861, 16125, 24765, 4675, -22028, -23840, -12081, -18532, -35652, -28648, 1318, 17143, 9211, 9298, 30587, 41880, 21608, -3236, -3170, 5163, -9471, -33255, -31066, -7772, 898, -10748, -10986, 11556, 24371, 9396, -5751, 3674, 16489, 4682, -13958, -8302, 10996, 11328, -7015, -10218, 7404, 12516, -6801, -20084, -7636, 6920, -2062, -16201, -6621, 14729, 14521, -2926, -4087, 12041, 15095, -3390, -13552, 51, 12513, 1913, -11662, -2117, 13674, 6684, -13701, -15706, -830, 682, -16879, -20204, 881, 17677, 10814, 3238, 16474, 31374, 20287, -3664, -9347, -1210, -8280, -30039, -34423, -14352, 62, -5181, -6998, 13390, 32134, 24041, 6024, 6600, 16815, 7098, -16045, -22063, -6951, 43, -12230]
651a2230m962J6755J5020q923j3349O186J4003n248j6642P59J6851N068j4294
664a006o260J3796Q076j4133j4492O651J2812o135j5017M568J8192L099j4015
677c864l766J4298P128j3836j1669J0428J3303o047j2748N551J6076j906j8479
690e531o090J0860J622j6638r315J4053J6107k874o674J2313J9243j319j7543
703H214n537P794m180k1280j2155J0047J1029o655n451J5159K0150k6j2172J114
717F051J2079k345j8920r537J0484O602j1158r421J1186J4158m881j3263K974
730e991J3575q80j5064k590J4666P519j0431p287J0995J0960q841j4949L019J2058
744F759l738j4606p76J4725N765j1972o223J1776Q770j0098j2333O617J3427j811
$$ y = [-12230, -17192, -437, 14583, 5660, -7689, -1503, 12500, 7252, -9390, -8631, 8220, 13288, -1006, -7266, 6530, 14606, 473, -14019, -7368, 5444, -691, -15708, -11140, 7052, 10151, -3864, -7630, 6668, 13796, -40, -11709, -1281, 12022, 5975, -6773, -1222, 14854, 12948, -5531, -11621, -761, 861, -15777, -25092, -11039, 5068, 2194, -4480, 7833, 27076, 25757, 8214, 2677, 10471, 6291, -14989, -27144, -17097, -6068, -12723, -18174, -3015, 17135, 17109, 4937, 6051, 18130, 15785, -3135, -12672, -2188, 4414, -6744, -16165, -4979, 9179, 4298, -8965, -5991, 7584, 6704, -8360, -10950, 3716, 11235, 804, -6483, 4512, 15472, 6631, -8318, -5299, 6759, 3021, -11585, -12361, 2364, 8129, -3843, -10066, 1710, 10480, 382, -11951, -5334, 8093, 6282]
758F282j1668L160J5882L640j4302p533Q088K994j4841j3808O077J2457k085p564
772a3221R040J9431N506j0555l626R407J474j7532j4917M142P175p445r934P760
786a3295J7648M065r391Q64J3352L683j4251r789Q350O969r031j0782O077J3235
800G704k286j2897K3J2281J743j3230n722J1315R001p479q743R012J2498m362
814H858j3123O75J0813k20j3191m268J1749O844r587p625P708R596o814j2480
828a1065K035J1918M25r915O66J4573P663q804p101P164N624j1389j5493P6Q720
843d903k682j0008L258J6843Q880o158k358J1432O881j1527j4034J058O554o679
857c443j3126J292J3675N094q685j221J2477P095r279r490O052Q672n942j0853
$$ y = [6282, -5386, -2226, 13656, 17296, 2994, -4539, 3549, 6543, -8298, -22106, -16029, -3572, -5657, -13221, -4181, 15250, 20756, 10201, 6575, 15982, 17456, -76, -14993, -10851, -3676, -11121, -21055, -13295, 4353, 8418, -973, -109, 13243, 16926, 2675, -7114, 1236, 8205, -826, -11608, -5531, 7704, 5418, -7479, -7456, 4825, 6568, -6662, -12384, -1069, 7932, 453, -8290, 722, 13220, 8858, -4265, -3590, 7223, 7003, -6188, -10456, 1293, 8137, -1450, -9075, -1367, 8229, 1415, -11065, -9030, 2888, 3313, -6602, -5936, 8637, 16300, 7496, 395, 7559, 13183, 1794, -13699, -13623, -4903, -7585, -17593, -14335, 2508, 11388, 5230, 2872, 14304, 21185, 9658, -4376, -3318, 3236, -3443, -16569, -15277, -1602, 3492, -5193, -6414, 6063, 13158, 3879, -5611, 441, 9113, 3171, -7682]
871g682K482J2141R10j1373k991R799L871j0650p942P629Q920n017q790N263J1779
886H349l64j0609j744J0025L053j1201n890R015P951o049r186M772R858m074j2345
901h439j832R604J807r824k142J1833J0247m587n663P084Q496o618j4154k792
915f980O587l017j2052k566J2256R091m298k837J0541J0310m954j1051R3O341
929G464l792j2647l219J0012M323p298l815R549Q108n848q590L521R008k645r955
944e824K07J1087K975q827m594Q257N339q198q936M201Q208l365q891J924J0773
959D336K151r140l017Q635M678q148p134O474Q953l517q072K856R414j020j1271
974c822m053O913K073r121n850Q542J0050j830n186O225J0841j231j0993l491
$$ y = [-7682, -5200, 6941, 7851, -3522, -6513, 3286, 7157, -3493, -11435, -3806, 5114, 97, -8693, -3430, 8349, 7985, -2624, -4368, 5657, 8710, -2491, -8381, 634, 8585, 2536, -6650, -1878, 7980, 3906, -8439, -10271, -667, 1140, -8684, -10826, 1007, 11254, 6667, 1004, 8088, 16584, 9966, -4188, -6980, -393, -3410, -15462, -18028, -5772, 3319, -979, -3816, 6725, 17035, 12081, 1030, 1123, 7464, 3672, -8975, -12194, -2182, 2141, -5157, -8972, 577, 8685, 2837, -5753, -2232, 6776, 4131, -5824, -5617, 5470, 8445, -382, -4976, 3281, 8620, 422, -8514, -4313, 3895, 530, -8361, -6437, 4336, 6487, -2653, -5670, 2965, 7643, -505, -7639, -1165, 7788, 4271, -3801, -945, 8469, 7449, -3822, -7875, -962, 1111, -8010, -13860, -5318, 4732, 2902, -2284, 3941, 14782, 13551, 2558, -933]
988i33N745j662j1677o886P488P003l753m446Q056J1640j069q534J78P602l35
1003H417j1148n036O553M718o055o012O000Q650l192q385J259Q319m1q680k017
1018f650Q850N303o777n110O364O739n128r219J627Q023j420q579j085R269L588
1033E795p539m491O546N467n709p295L896Q557p60p482J463R710J832q557n439
1048d006M838K796q282q322L929Q726r60n030M308J1340K800p384k963N562J539
1063H891r892q742L447N324l550o332M311J0544J605o240p64P907K332p858o099
1078e116M812N546m625p214L689P953j551p900m05P238J775q146l884P550N804
1093E526m659n968N206P170k303q236lP335M42q055k627P460M353n625n494L959
$$ y = [-933, 4812, 3150, -8527, -15413, -7925, -922, -4675, -9121, -1065, 10575, 9506, 972, 1150, 8752, 8417, -2731, -7767, -1214, 3504, -2551, -8563, -2563, 6087, 2895, -5490, -4231, 4088, 4047, -4633, -6650, 2200, 7503, 726, -4384, 1980, 8719, 3591, -5628, -4001, 4022, 2602, -5977, -7062, 2207, 5795, -1744, -6235, 311, 5778, 69, -7226, -3330, 5227, 4467, -3015, -1552, 8158, 9990, 1433, -4006, 832, 3628, -4654, -12976, -9047, -321, -1281, -6311, -2003, 9337, 12137, 4753, 1790, 7352, 8891, -1001, -9743, -6296, -972, -4522, -10854, -6543, 4001, 5606, -634, -1398, 6509, 8841, 983, -5116, -304, 5242, 617, -6597, -2908, 5045, 3494, -4406, -4811, 2427, 4202, -3944, -7828, -278, 5526, 867, -5101, 105, 7275, 4972, -3264, -3267, 4068, 4510, -3545, -6172, 1288, 5641, 16, -5478, -1519]
1109a519O346m209p748J062Q037J088o390j59Q894M775n954n127L842M232o507
1124F63r591M24O185j36o534J446J0061N573m504k771N947M167o564q572R88N072
1140A854l041q162J075Q806K951n681k058P285M689n932o165L877N905l127p024
1155d748J418P776Q20p286k663O629K692o608n040M830O293l138n995K402P749
1170E131R3p615j030O534K215o478m307N708N371l365o222K851N810k295p966
1185e565j228O307J883o044j819P899O084k768m665L577N636m066r046j729M591
1200i53l46p034j852P857O017l225k336N263O790l315p736k86N119j528p786j803
1216g154O382L658m807l315N282N611l545o230J832O435p61o626l62O754K470
$$ y = [-1519, 4827, 618, -7130, -6068, 1969, 3057, -3333, -3492, 5402, 10177, 4223, -904, 2938, 7170, 663, -8928, -8504, -2319, -2455, -8989, -7543, 2518, 8091, 3587, 816, 6763, 10930, 4366, -4206, -3218, 1854, -1187, -9349, -8274, 532, 3483, -2198, -4256, 3029, 7718, 1786, -4379, -502, 5403, 2276, -4748, -3330, 4446, 5266, -2020, -4683, 1946, 4638, -1970, -7010, -2180, 4113, 975, -5020, -2618, 5131, 5224, -2391, -3421, 3113, 5328, -1150, -5457, 251, 5622, 2257, -3965, -1114, 4696, 2401, -5565, -6793, -486, 1397, -4647, -6466, 1433, 7517, 4749, 84, 3661, 9297, 5231, -3815, -5544, -953, -1299, -8333, -10185, -2328, 3689, 464, -1872, 3391, 10181, 6866, -870, -1156, 3963, 2435, -5351, -7154, -772, 2886, -1921, -5236, 46, 5657, 2112, -4118, -2286, 4149, 3388, -3238, -3600, 3154, 5624]
1231E624n662l689N078L785m761n789K366O058j567o197Q12O763J938o301k680
1246d222N265L764m791m766L999O210j937n542P28O183m47p246l171M675K246
1261I48n410l863N361O968q84m130K899P166r12p748k825L949M05p036m509M963
1277d658N474j979l589L950P183j36n898j063N141O37p051l800M902M120l914
1292f81m536L677N672j746o157K79N859N92n468k081O038L613m234m066L709M686
1308E156k764o053N02N772J56n961j582O265K768n054m019M515L863l033n529
1323d998K570O034K09n003l2O156J834o089m016K905K641m989n287K493N914M80
1339H22m170J931P139K327n227l182L434J682n613n697K054M573j254m750K014
$$ y = [5624, -38, -3727, 1351, 5136, 375, -5414, -3048, 3010, 1443, -4754, -3942, 2821, 4759, -1542, -4222, 1043, 4807, 16, -4750, -751, 5459, 3522, -2020, -1292, 4891, 4444, -2802, -5973, -1298, 948, -4462, -8325, -2964, 4004, 3120, -1010, 1889, 9055, 8143, 395, -2430, 1519, 1924, -5112, -9621, -4658, 816, -1163, -4752, -802, 6381, 6245, 347, -716, 4425, 5062, -1989, -5789, -887, 3233, -681, -5217, -1540, 4132, 2386, -3771, -3492, 2367, 2959, -2509, -4590, 1448, 5061, 827, -3239, 470, 5156, 2392, -3661, -3159, 2613, 2769, -3192, -4774, 1491, 4259, -795, -4814, -299, 3564, 531, -4998, -2428, 3606, 3815, -1188, -1220, 4936, 6770, 681, -3335, -430, 2211, -2778, -8065, -5572, 342, 822, -3348, -1417, 5722, 8049, 2822, -360, 3074, 4756, -857, -6554, -4500, 73, -1181, -5931, -3917]
1354c917P020J605m959j658N060K124m809m572L504M311k623m941J592N328j48
1369B917n503j191N046J558m941k821M529M251k742m146K234N382j108n957m98
1384b990N098J020m893k228M445L710l596m428K331M550k517n695P61N746J363
1399B677m147j065N874L521l709m303K190K931l708o100j60N222L58m317R6O871
1415B231L518l317k662L255L390m130n755J96M478j280m896p9N871K091l864k022
1431b975M054L827l568m482J714M760j355m936O61N039J182m967k581M453K322
1446C148m128l703K939M184r74m519J162N108K44m737j529M067K539m091l188
1461c478L663M095k346m151P13M384j139n568j096M303K121l755j856M764M919
$$ y = [-3917, 3103, 4708, -251, -1909, 3151, 5275, 466, -4106, -602, 3709, 1086, -3855, -2263, 3065, 2917, -2586, -3777, 1269, 2827, -2114, -4935, -406, 3845, 1103, -3043, -809, 4573, 3465, -2492, -2990, 2108, 3128, -1765, -3993, 452, 4162, 566, -3862, -1531, 3019, 502, -5193, -4432, 1314, 2677, -1470, -2535, 3339, 6860, 3151, -1152, 1038, 3969, 261, -5839, -5999, -777, -419, -4736, -4640, 2231, 5749, 2432, -230, 3025, 6415, 2285, -3470, -3274, 1204, -76, -4972, -5051, 820, 2911, -953, -2975, 1079, 4906, 1338, -3144, -1430, 3330, 1975, -2961, -2300, 2739, 3921, -1046, -3627, 826, 3148, -980, -4683, -1744, 2440, 1466, -3053, -1891, 3217, 3461, -1276, -2805, 1262, 3801, -290, -3478, 185, 4280, 1934, -2217, -1504, 2880, 1741, -3827, -4923, -620, 1501, -2254, -4110, 654, 5573]
1476E573k051l888J929M088k317o316j397L682N23m164j742M731M494k031k823
1491a709L365M510j953n530l96L955l44m956j815M547K914l394k740L121M232
1506C807k420m128N98M537J21m554o33M421K199l821k674K823L268k916m357J347
1522b382M434o25m312P2M287J678m115k439L539L113l125l302K491M507j104m147
1538a430K68M344j06n083k354L291J868l093l124L346N431q03l079J171M880j68
1554E359n482j897K430O87m254l033L057M391j352l076K611M735j02m251q48L403
1570B378J039m418k947L011L483k540l469J829M204o61m178l44L915J060m020
1585a658r59L555K664k877k881K188L287j666m493O66M024J54l851j440M161K183
$$ y = [5573, 3522, -366, 1563, 5651, 3334, -2982, -4379, -697, -174, -4338, -6080, -1349, 3145, 1114, -1709, 1656, 6166, 4213, -1317, -1713, 2242, 1898, -3058, -4873, -326, 2588, -806, -3546, -425, 3807, 1387, -2741, -2143, 2394, 2515, -2039, -2672, 1749, 3948, 127, -2547, 276, 3544, 628, -3729, -2382, 2052, 1427, -2885, -2813, 1474, 3152, -963, -3402, 137, 3250, 125, -3177, -686, 3821, 2717, -1430, -1162, 3182, 3076, -2007, -4361, -1070, 798, -2295, -5419, -2073, 3358, 2555, -524, 647, 5527, 5359, -123, -2020, 410, 1097, -3157, -6190, -3133, 1258, -94, -3170, -559, 4176, 4074, -177, -1025, 2378, 3417, -1001, -3948, -937, 2546, 6, -3463, -1634, 2570, 1909, -2269, -2613, 1302, 2362, -1658, -2617, 938, 3602, 725, -2156, 32, 3319, 1653, -2840, -2174, 1850, 2004, -1847, -3287, 874, 3057]
1601C057l398l200K662L282k094l813J660M205N62l614k85M183J132l983l159
1616b803K179K095k866l895J673M574J19k988M76N360J478l778k738K419J800
1631C105l162m357J219L841j189l019J183M367J170l687r83L339J633l277l390
1646c207K728L500k166l437J046L875O7m112j272L565J642l290k279K919L231
1661B810j737k962J327L499r39l726l07L458J150l540j802L090L131k833l460
1676b841J359L344j086l846k14L974J464k937p06L585K216k471k921J330K498
1691B748k487m316K83L409N94l154m32M612K882k612k078K038K748k171m423N8
1707b301L231o47l266j17L639J788k659j943K969K580k509l240J464L776j117
$$ y = [3057, -341, -3541, -879, 2403, 309, -3504, -1844, 2361, 2923, -691, -976, 3207, 4339, 356, -2803, -624, 1471, -1395, -5290, -3617, 957, 1076, -1912, -1436, 3924, 5402, 1624, -1114, 1305, 3105, -57, -4414, -3195, 646, -543, -3562, -2379, 1988, 3158, -529, -1512, 1827, 3460, 183, -3207, -479, 3021, 855, -2582, -1536, 2339, 2406, -1706, -2978, 587, 2229, -1061, -3340, -421, 2810, 1073, -1889, -562, 2937, 1998, -1728, -2035, 1423, 2573, -967, -2769, 321, 3452, 619, -2841, -1482, 1862, 776, -3070, -3284, 690, 2154, -783, -1489, 2096, 4312, 1841, -1080, 250, 2748, 261, -4055, -3772, -363, 231, -2923, -3355, 1257, 4139, 1527, -551, 1487, 4235, 2064, -2359, -2301, 930, 283, -2983, -3100, 539, 2327, -332, -2275, 694, 3274, 765, -2475, -1011, 2765, 1648]
1722A648l655K62L544J016l258j948K836J984k477l171J778L095l74l472Q15L442
1738B065K05l352j031K913J905k996k240K714K791j295l711Q48K990k32l986j213
1754c625L202J761k431j820L236K978r67k749J346K400j189m185p45K772J10k864
1770b770j217L361K967j313k629K284L464j422l726o17K929N38l521j608L188
1785i2K056k205k079J939K903j650k944O32L020L64l650n26L729J383k892k365
1801b377K365K335j565l267J195K674K45l182l96L026J114k871j484K151K139
1816B102k204k406K151K908k94l510J87L173M41l846j975K586J783k401k246K085
1832a466L502k61k175O63L155j96l418j248J973O73l181j822K382K798j414k285
$$ y = [1648, -2007, -1745, 1799, 2815, -443, -2391, 445, 2429, -48, -3219, -1441, 1654, 1280, -2192, -1377, 2065, 2270, -1082, -2113, 800, 2705, -291, -2531, 183, 2974, 1679, -2032, -1184, 1806, 1574, -2412, -3625, -423, 1338, -1093, -2913, 323, 3301, 2334, -415, 931, 3331, 2142, -2043, -2788, -16, 94, -2770, -3987, -626, 2341, 1028, -1601, 683, 4147, 2725, -1001, -1618, 1311, 1849, -1672, -3280, -92, 1964, -241, -2320, -381, 2522, 872, -2072, -1440, 1580, 1944, -1706, -2232, 1497, 2880, -12, -2377, -12, 2323, 758, -2509, -1314, 1360, 1605, -1577, -1973, 1053, 2167, -704, -2188, -37, 2102, -102, -2508, -357, 2551, 2257, -1253, -1066, 2107, 2548, -1298, -3273, -687, 1096, -1305, -3551, -1466, 2036, 1775, -400, 263, 3418, 3222, -196, -1444, 529, 1202, -1979, -3801, -1419, 1379, -35, -2320]
1848b320J460L817m10k821q16K307J257k900k169K360K197j584k452J066K856
1863A848p45k866j21L221L80k917q53K660K163k690k185J498L142j061l239q8
1879a853K826R45k702j127K538J267k421j576J723J796j316k647J248L075Q5k407
1895e46o19L415R23l006k720K093J778j939l007P88L575J71k111L29K955J166
1911C245k195j677J804J065k639k403J174K634j140k533R29L354O03k705j279
1926a763K797J764k333k557J700K125p50k685O02K681r2k323r49K538P29k452
1942i68j513K357K170j298k715J406K554k09l308q7K457J182k476j702K193K018
1958B061j279k340O09K613j157k878R7L248M78k536j76K636J923k300k275J448
$$ y = [-2320, -860, 2957, 2547, -274, -1090, 1217, 2474, -426, -2595, -235, 1962, 378, -2074, -1008, 1848, 1103, -1763, -1884, 1337, 1717, -1200, -2053, 607, 2770, 80, -2105, -607, 2535, 1474, -1765, -1853, 973, 1918, -784, -1911, 627, 1894, -527, -2103, -380, 1416, 100, -2547, -1299, 1776, 1861, -546, -1165, 2250, 3173, 167, -2553, -460, 1318, -621, -3628, -2840, 735, 906, -1205, -876, 2079, 3245, 1050, -627, 1177, 2242, -397, -2800, -1626, 1008, -132, -2665, -1736, 1618, 2221, -484, -1763, 1034, 2798, 465, -2092, -392, 1733, 983, -1702, -1100, 1581, 1489, -834, -1783, 755, 1484, -968, -2481, -124, 2046, 748, -1967, -561, 1993, 1784, -1524, -1611, 846, 2028, -448, -2150, 43, 2061, 782, -1558, -949, 1664, 507, -2371, -2274, 974, 1452, -1084, -1260, 1376, 3299, 999, -1276, 172]
1974A72J871j541l332n7K834M88k173m47K854K047j837j385J585J621j823k605
1990a728N25K142k70k815k8K751J055k311j558K616K107j599k581R55K433m94
2006A200k428R3K121J001k188j100J599J199j795j989J639K327j246k254P25K584
2022A488L46l020q58K397J392j657k023J769K285q33k252%K222k30k378p32K137
2039E3R50k093p29K107K247j500j782J342J997q84l125n10K090O26k452r90K452
2056b01J609r65j630J352K039o33k620K66K135O7k802m05K082J494j866j766J633
2073b11J979q20k618M22K561K74k434n58K213J019j720j630J697J180q84j910
2089a440N23K001m20j769j54K002P33k271j356K240J640j699j794J226K454j88
$$ y = [172, 2043, 502, -2830, -2887, -53, 435, -1738, -2185, 669, 2716, 879, -506, 1079, 2700, 877, -1728, -1203, 939, 669, -2146, -2174, 577, 1632, -679, -2237, 379, 2486, 887, -1694, -739, 1694, 1200, -1228, -1135, 986, 1987, -201, -1301, 298, 1497, -298, -2287, -648, 1679, 433, -1821, -1096, 1488, 1834, -1186, -2044, 353, 1745, 88, -1935, -166, 2119, 1286, -966, -966, 1256, 1026, -1352, -2084, 53, 1003, -1090, -1819, 288, 2535, 1035, -747, 595, 2592, 1708, -1417, -1927, 163, 789, -1663, -2653, -201, 1408, 443, -1187, 165, 2204, 1571, -1049, -783, 1352, 1419, -1383, -1788, 294, 1788, -78, -1844, -211, 1768, 948, -1670, -1248, 1313, 1587, -847, -1405, 808, 1827, 107, -1523, 174, 1354, 470, -1440, -917, 1084, 664, -1105, -1259, 743, 1476, -795, -2151, 89, 1729, 30, -1764, -538, 1916, 1728]
2105A728k683R3K228L41k499j085J304J429j946j586K072K157o69k003J359K058
2121B298K75k846j078K079P44k501j760K097J748r87j583R54K137J18j799q32
2137i36J946N17j987j089J564J662j733j860J343K123l77k659J67K315M56k324
2153h72o12J660J662j764j508J067K021q38k069K08K082J68k149k41J795Q34j687
2170b43j617J675J433j292j644M78K418L8j797k56K119Q87j930j428J128J312
2186A281j583j733P78J943k29j659L79K354N73j953j200J429J405j976j615Q85
2202i21J882m91k000J99K330N20k175o28K071O05j259j600J485J462j152j526
2218a198N68J912k34k039k02J925N54j467j614J830J428j005j625N98J818k06
$$ y = [1728, -955, -862, 1366, 1707, -792, -1877, -573, 856, -1090, -2676, -604, 1553, 884, -1119, 240, 2298, 2573, -273, -1351, 728, 1472, -1029, -2789, -692, 1056, 69, -1514, -560, 1577, 1695, -104, -936, 1010, 1527, -460, -1549, 15, 1677, -56, -1916, -573, 1550, 1173, -1486, -1319, 996, 1452, -872, -1484, 176, 1838, 74, -1434, -367, 1654, 816, -1253, -1045, 1037, 1205, -944, -1185, 610, 1444, -243, -1860, -185, 1248, -44, -1688, -1210, 1208, 1246, -551, -807, 1312, 2199, 269, -1159, -31, 1281, -302, -2035, -1257, 686, 457, -1202, -823, 1531, 2104, 151, -1049, 380, 1785, -191, -1806, -921, 961, 470, -1530, -1331, 999, 1519, -656, -1284, 787, 1392, 133, -1467, 18, 1480, 328, -1198, -630, 1282, 1048, -991, -1193, 732, 1286, -181, -1795, 35, 1463, 458, -1167, -569, 1249, 1043]
2234A043j961k46K030M07k068o55J976R76j449j300R99J786r25k299M75K070K90
2251A149j967m28J984J230j339j685R86J596j134j845J85J633q3j669j50K395
2267H58P59j649j036J588J230r29k084M43J711J41k137l46J984Q24k000o88J391
2284F0J224j229j451J119J525o38j604J86J633M64j912o58J648P87j408j232J157
2301c29J465m07k111N17J860L0j875k86J521R55j587q34J048J842j451j483P28
2318c97J717m82j992k21J631Q26j740j244J886J965j628j055R46J755j049j952
2334a034m5J601j17j769j78J727R20j215j064J368J498j041j446Q4K027l50j725
2351g59n75J660R44j370j230J067J569j104j509M92J708j41j662k9J587O82j731
$$ y = [1043, -918, -1164, 866, 1273, -795, -1450, 526, 1502, 53, -1247, -248, 1538, 613, -1686, -1211, 859, 1149, -818, -1246, 738, 1968, 629, -1056, -70, 1526, 392, -1453, -1268, 365, 282, -1387, -1537, 858, 1617, -32, -1068, 520, 1750, 821, -1263, -820, 891, 1032, -1105, -1451, 533, 1357, -643, -1331, 60, 1284, 55, -1396, -277, 1248, 610, -994, -808, 825, 1289, -623, -1281, 367, 1154, -254, -1486, -329, 1136, 729, -1382, -865, 995, 1025, -850, -1136, 385, 1340, -247, -1081, -33, 1809, 358, -1125, -397, 1320, 838, -1154, -1375, 256, 1082, -658, -1902, -16, 1949, 321, -734, 212, 1967, 918, -1034, -1079, 522, 405, -1364, -1542, 185, 1105, -110, -1174, 194, 1692, 651, -795, -711, 1316, 966, -759, -1334, 326, 1270, -100, -1330, -263, 1306, 202, -1307, -815, 893, 752, -910, -939, 648, 1330, -401]
2368d01p40J532Q57j102j293Q81J315m05j730Q4J747K72j320j007J422Q84j175
2385a79j068J167J372p88j158L44J261Q0j424q63J716M11j433j077J333J405r05
2402A94j231R22J474k61j742J7J260J39j316r13J343O65o20j285R88J428k32j924
2420a094M92J403M87j637p72J351J210j378j291O88J757n88j688J04J588J67j504
2437g05k85J333P22j321p24J302P94q11j701P06J511j77j369j71J610N61j420
2454a45q94Q09J106r30j123N00J374j66j163J64J465O06j520j048J028J078j109
2471C2j688Q97J246l90j314P01J249K42j137m48J213P56j481j033J015P56n11
2488A05j122L04J447m5j198n81J490P48j182j109J140J093r53j117N50J243l60
$$ y = [-401, -1141, 391, 1248, 146, -1147, -266, 1049, 644, -1086, -1002, 745, 1017, -303, -1310, 112, 996, -179, -1247, -80, 1292, 504, -654, -310, 951, 1031, -393, -1256, 460, 871, -562, -1639, -306, 1099, 194, -1037, -115, 1359, 1098, -644, -627, 633, 772, -544, -1457, -114, 551, -69, -1354, -366, 1062, 830, -1094, -602, 801, 1288, -349, -1121, 230, 1440, 62, -1229, -541, 1216, 628, -1060, -956, 632, 799, -705, -990, 343, 1065, -256, -980, 322, 1116, 305, -1396, -690, 821, 644, -725, -896, 714, 1275, -145, -1039, -230, 876, -54, -1177, -677, 697, 531, -632, -468, 997, 1603, 83, -965, 63, 1141, 32, -1656, -759, 487, 97, -1217, -516, 733, 975, -162, -610, 603, 1359, -122, -1155, -140, 616, 105, -1017, -713, 734, 689, -509, -1090, 400, 1148, -34, -1143, -3, 1090, 137, -980, -430, 813, 453]
2505D53j193l03J514J72j009q06J271Q21p35j228O74J405n94r03j12J297j26j280
2523f82j64J283P49j197j123J006Q17j87j767P81J071j97j244J73J328L65j112
2540a00p57J175Q05q55j144J45J320k82j117j63J301N22j179l23J079Q19r44j084
2558g82N57R02k79j282M02J147L25j531m92J086O49j050r19J122R94k88j392L37
2576d94J358Rj535P9R86M81j194p03J012Q80q12j098N80J311o19r26n2J063J87
2595E13j061k87R13R99q75j313Q43J148m71j083K63R12k03q87l85J034R48j081
2613g3n50P56R19m27j370K39J257n1j360k95R48P18j173k93O77J128n93r25J33
2632c35P80J6j008n3R50M49j053m78P36P48n50j058N55J165l90j087K00O85J23
$$ y = [453, -740, -1043, 471, 643, -366, -1172, 99, 920, 185, -1043, -369, 1036, 442, -461, -573, 724, 598, -682, -846, 437, 1186, -11, -1134, -128, 689, 502, -1265, -484, 587, 390, -854, -681, 647, 1012, -100, -857, 318, 1123, 268, -876, -731, 589, 307, -810, -973, 328, 850, -329, -652, 427, 1246, 302, -782, -225, 677, 398, -884, -482, 665, 990, -541, -1033, 53, 702, -348, -1267, -145, 849, 561, -831, -494, 864, 873, -662, -583, 403, 884, -310, -1013, -1, 879, 67, -1031, -451, 860, 241, -685, -737, 326, 513, -548, -835, 78, 1077, 202, -1111, -268, 880, 409, -674, -411, 501, 298, -589, -974, 60, 1008, -73, -623, 133, 1052, 625, -745, -506, 751, 700, -660, -955, -7, 711, -462, -755, -78, 1050, 457, -468, -335, 445, 461, -547, -600, 350, 799, -254, -732, 4, 752, 202, -856, -301, 864, 474, -613, -413, 272, 395]
2651C95q15o77J217P05q33n23K71J039l38j030R0J118k25p97j89R17M42j122j20
2670d75O33N35m52j055O17J139k44j064j62Q00N31j024m56P93P47q69n44N49P12
2689G11J18j378J47J012K15q40l97J92Q26n07r31O37J057o68o19P1R36k45o54
2708c17n54R92P45j042n83P07P60m04q39J92O85O9o81n04J156K78p94o07J034
2727B93O39j126m60L67Q51m9r99K03O60J09p89j41M74N23p32n86P00L16j95n82
2747e24J11J008P3j024N4M88P49q90q59O87P43n95q25K89J042P3p70k62R16L31
2767H15j069l86O01P69p42o72L27Q46k40q34j84J146J40o92k15L38P50p67p15
2786g84P47P92k66j042J83P69J26p21k37R67K94j127j88P20N66p15m84k03Q84
$$ y = [395, -420, -1097, 120, 825, -8, -531, -260, 779, 441, -589, -499, 619, 394, -403, -592, 325, 767, -355, -475, 158, 693, 241, -814, -197, 942, 698, -366, -528, 272, 803, -221, -677, 116, 863, -6, -550, -1, 711, 829, -549, -402, 610, 825, -15, -412, -220, 606, 99, -832, -195, 862, 194, -425, -354, 582, 337, -317, -871, 121, 866, -176, -759, -52, 708, 304, -535, -343, 342, 411, -270, -774, 382, 660, -134, -741, 293, 932, -194, -654, -287, 564, 515, -484, -281, 379, 488, -301, -442, 32, 555, -177, -763, -63, 253, 58, -524, -413, 595, 668, -356, -302, 186, 935, 45, -814, -127, 616, 21, -804, -515, 527, 600, -170, -432, 484, 815, -254, -640, -39, 730, -12, -684, -357, 489, 249, -585, -769, 377, 517, -175, -390, -52, 698, -69, -784, -37, 755, 489, -553, -370, 399, 525, -196, -433, 534, 828, -299, -487, 233, 799, 84, -400, -603, 281]
2805B81K6p60K73K29N84p39m40P25K58k62o44O2P18j54o76q2Q38K32m38m67P74
2826C38N12p73o47M55O21j73p99k5J035L2p65k49N57M86m86n92L18P27l48n46
2846c22O6O14n0p54O4N26L86q10l90P30L42l82n32K2P28j78n24j16R49K84n97
2867E6o24N86M13l47m74M4R00l30p10R5N94L41q21n1O98J87l71n15M32K06K1o57
2889c27K14M10o4l81k79O34O9k28l50K41N56m47k87J20K32J27m59j39M42K46o61
2910c31l36Q28K79l49p62P06M49k16p67K76N40J8k69k20K49M13k12o34K42L31
2930B35j64j83n1N92Ml36n98O59K89m26j82Q7O23n35n47J61J037k42q60L3M05
2951AJ92k05l71L21M00k47l63OO97j25m85NN07k95k95k49P90J99n90l55N51K24
$$ y = [281, 307, -453, -180, 49, 633, -106, -546, 179, 437, 175, -469, -407, 311, 157, -519, -601, 237, 469, 31, -436, 338, 850, 77, -570, -115, 506, 333, -466, -491, 544, 576, -189, -438, 119, 605, 119, -473, -155, 572, 224, -322, -256, 358, 308, -446, -382, 144, 530, -280, -670, 60, 402, 20, -512, -490, 238, 60, -464, -580, 369, 653, 56, -568, 18, 431, 84, -390, -346, 554, 224, -486, -391, 203, 544, -277, -328, 370, 557, 186, -329, 103, 309, 330, -327, -113, 297, 233, -148, -427, 207, 276, 48, -302, -61, 495, 48, -239, -119, 113, 240, -219, -358, 84, 330, -331, -667, 161, 440, 91, -671, 35, 484, 268, -499, -223, 317, 335, 66, -154, 95, 508, 296, -338, -96, 235, 71, -112, -163, 429, 433, 97, -501, 158, 447, 21, -161, -74, 549, 14, -533, -372, 665, 423, -437, -404, 1, 193, -12, -383, -62, 338, 91, -272, -266, 431, 306, -179, -174, 333, 38, -257, -506, 284, 483, -107, -462, 89, 313]
2973C13j40m28J44L76M8l49j77M09J03n74k40L18O67l25p32K87N81j01l64k07
2993c91O64R9n23k03N36K26m83k91K42L81M6n51J78J40J10m15j45O03j7q4m25
3014c03O8N66q1m78j95N59l04J19l51M95J74l31j80J77J47K49p53K86K91Q0n27
3035b92J02M51J23l62m57N00L26l06n01rN47J56n90J59K32L64n74k19L35L02k98
3056a1k45N5L30O7l24k30L48J27j58j99K22M21n06k6j20M70no42K23J28L53j53
3078A25l91K34L04n11j10M15J01l50L9j57M43J7m46J17L25J20l04o6J49L27l88
3099gl25K51K94j98o8j32K15K22k60j76J18L68m82j03M86q1k21L6k24O30j44p86
3121e87L83M55j33o6l02M74K66n47l1J91PN3l03k67K31K12j61k09M66K35l45k85
$$ y = [313, 173, -255, -111, 265, 313, -36, -213, 196, 299, -275, -515, -197, 470, 145, -587, -300, 281, 180, -184, -391, 273, 372, -151, -354, 182, 408, -75, -366, -124, 257, 303, -248, -70, 70, 180, -235, -380, 223, 206, 122, -303, -235, 331, 250, -228, -423, 136, -168, -49, -400, 95, 269, -62, -242, -65, 82, 331, -422, -136, 155, 235, -292, -190, 261, 384, 22, -435, 65, 391, 85, -416, -425, 122, 278, -312, -153, 79, 443, -131, -350, -15, 287, -11, -256, -201, 129, 196, -128, -358, -10, 117, -41, -240, -18, 403, -103, -129, -249, 221, 216, -426, -203, -75, 278, 125, -266, -32, 272, -239, -349, 66, 167, -183, -144, -301, 142, 159, -287, -170, 155, 275, -29, -95, 54, 381, -7, -332, -81, 213, 15, -53, -185, 30, 252, -8, -184, -66, 302, -180, -283, 203, 122, -99, -63, -287, 343, 199, -587, -204, 251, 118, 52, -250, 224, 490, -57, -88, 103, 110, 163, -140, -407, -176, 36, -125, -334, 132, 367, 22, -263]
3143b63K76L74k10k21J15O9J69n29L9J28K41j05o55N18M35k11k75M03k82J75n36
3164c45j03O28J45k62l42K44M60j17m26k1M58j10q7j94J00Q0r8j87L45J63k63
3185F8j2K33j34j23j37L4L33k67j34l20L11L48l75j19L25M34l04o11L33L29j04
3206A08j68r4K51J6oj61n7K66m03L9J75L59k30RQ6J19k61l2m9J18j38R3k56J54
3230f2L09n0l20K3J93J71r1m87K78J26o5l64L09n9K46k30k7M26m16j02K04K33
3252B45Q4k05m38K17L38m4n1j10K67j90m52J08L25O7j52p4K5M5l2M9M6O2Ol18
3276a82R4J96J58k50R9o2j63K39j78j7R6J41m69R4Q8L37j77n25O47RO7o09L43
3299b4K50n47k37N34N1J79m31J12P7k0K4n3L10j86k01j44L34J15l9k34K21Q0r1
$$ y = [-263, 13, 387, 177, -44, 71, 140, 309, -220, -181, -53, 188, 83, -572, -54, 381, 170, -105, 298, 16, 191, -345, -448, 180, 325, 63, -279, -35, 425, 308, -118, -139, 319, 209, 122, -72, 28, 108, 10, -177, 168, 331, 68, 56, 289, 155, 32, -105, -71, 262, -5, -139, -459, -148, 200, -175, -294, 31, 465, 161, -450, -117, 212, 108, -60, -154, 97, 113, 107, -54, -111, 155, -248, -209, -34, 325, 95, 104, 190, 309, 48, 16, -33, 85, -53, 40, -216, -62, 247, 197, -123, -100, 93, 264, 173, -314, -36, 90, 25, -339, -30, -89, 157, -73, -100, 326, -90, -192, 12, 245, 329, 124, -314, -97, 241, 197, 146, 36, 303, 113, -339, -231, 94, 161, 9, -65, -40, 5, -27, 22, 68, 130, 136, -182, -88, 108, 266, 16, 115, 53, -110, 129, -49, -66, 30, 171, -298, -204, -116, 221, 44, -481, 166, 175, 242, -367, -24, 226, -321, -558, -24, 27, 206, -225, -113, -36, -56, -32, -85, 225, 39, -162, -306, 28, 143, 104, -130, 91, 171, 80]
3322H0J4o5j36K12j52j28J9J23q8JJ85j48J52j12L19q1k10J45j74rK40j02q8m9
3346e2K04M8p0j31J38l4k47o0K53N0o0M2j64K35P6l16r2K22L3p6j08o9K00N9k60
3371a79L21K17l21j29J01J11j04L4j36L6K65l11oL19j45J7j89P1N7J59k65k61
3393c38N51p7l37K37J8K47M3o63J99L53Rl58jJ94K89n98j09M69l13K91j12J3q6
3416g9K07k86J97j57J05J74m06J39J13p8j62j67L04K51k0j59K26o0j22r1K19k41
3438i3J17J04l62pL18j4k57J60k10J90j3J2Q3k63q3L50L21k06k07j8J90j24j81
3461a93l4K92K4k22KO5L28Nl91K36N7k76O9J26j51L9q5k5mN30k60k66K86k6K67
3486C93n14j80L34j02pJ46k43N7K92k17L42l06J42J5l50L48J77n40K59k32J84
$$ y = [80, 94, 29, -107, 105, -47, -175, -156, -33, -121, -120, 65, -83, 69, -43, 276, 195, -15, 130, -44, -53, 187, 85, -3, -52, 152, 200, 130, -1, 137, 103, -144, -204, 49, 99, 39, 81, -83, 152, 228, -88, -180, 42, 75, -1, -109, -178, 22, 81, -179, 142, 359, 38, -91, 10, 121, 17, 51, -85, -49, 216, -95, -101, 218, 73, 90, -99, -28, 29, 188, -77, -338, 213, 136, -201, 36, 54, 301, 344, -319, -120, 233, 242, -116, -117, 77, 366, -232, -341, 128, -185, 106, -6, 7, -79, 128, -158, 39, -118, -13, 161, -245, -106, 7, -71, -233, -400, -96, 155, 135, -24, 202, 142, 20, -71, 148, -93, 24, 128, -234, -241, 77, 63, -194, -34, -244, -54, -67, -55, 28, -235, -318, 32, 353, 147, -60, -78, 112, -12, -193, -227, 65, 89, -133, -131, -66, 262, 267, -124, 112, 169, -107, -38, 88, -63, -24, -109, -134, -138, 392, 132, -134, 152, 126, 393, -121, -301, 33, -69, -76, 70, -173, -116, 176, -41, 301, -5, 137, 152, -198, 150, 327, -213, 46, -186, -2]
3507bp6k9%Q4j00p3J98M28l14j01k55L89j58J01m6J94j56j33j88R1J02L7j35K62
3531A20P7r8K04l83L28k48n7p6J27L12m04j42o7K46j77J2K19m4q6N7q5J42J99
3554A76j3k85N9J94o6j75OK81j14j79l9L01j61j04J01K55j81j91mJ84j79K30l02
3577b06O4K67M2m30m3J78J41nl4K1%j65Oj49K27o1M18M9n5l00J29K9r1J1j25P9
3603cj81R5R6O7j13O9l9J00p9j38o3K26n5l8L3J22K0k7j63J45l3j46J04K53j00
3628A52l37J9N16m63j28K42J46J38l45K6J71M7k18l3J96K8m44J83l7J57j43J03
3650b4k10J13L84k46j11j41N61nk58k14J23N6J07m00L30L4j5k63L6N23l30l58
3672c08K77j32L84o9l3o7J87k30p1Q5K12j30q0l3l0O1k58J22K89q5j90n0N7J00
$$ y = [-2, -78, -107, -107, -23, -123, -196, 2, 430, 116, 15, -240, 149, -9, 92, 46, 240, 84, -49, -237, -146, -44, -7, -142, 120, 197, 99, 303, -80, 248, 0, -57, -133, -6, 306, -98, -240, -307, -61, -238, -226, -7, -51, -137, -80, -165, -23, 176, 163, -122, -63, 131, 65, -110, -104, 177, 63, -116, -155, 146, -15, -119, -18, 237, 56, -135, -139, 45, -134, 96, -206, -142, 125, 167, -263, -306, -128, 13, 8, -26, -5, -5, -170, -164, -313, -86, -147, 271, 320, 265, -35, 94, 123, 32, 43, -82, -3, -184, -89, 7, 74, -39, 30, -9, 91, 12, -126, -189, 37, -18, -56, -23, 99, 119, 92, -71, 74, 41, -105, -1, 252, 152, -185, -166, 350, -113, -241, 1, 147, 285, -60, -34, 137, 184, -34, -67, 129, 157, -287, -104, -141, 16, -127, -24, -234, -121, 263, 17, -94, -235, 326, 321, 63, -151, -28, 28, 135, -265, 65, 99, 84, -179, -143, 380, 50, -308, -31, -163, 221, 152, 119, 52, 239, 9, -62, 23, 235, 105, 25, -8, -38, 23, -235, -113, 176, 91, -99, -149, -92, 8]
3696HJ98N3j68N6k17J48n2k44K91k7J67j73k36J55K9m0L14r2k00k29J91K6P2l2
3720bk75O04j77n38N81q9Nk74q0j03N69k46p2k6L29k38j82P8p4M37l70K20O8J89
3744C34lj05m42L37j51l38L75k29K14l73L18J60k0q9j65K73K6m22K71k33M39j5
3766A62l07K19J0R1kl15O7p2j4rJ77p7J72p7j3M0k07K37o4j06K52K90m42l09M21
3791A24q2j93K43K56k23k53K97l46L76l97k7K38K4K32n21J36M40m52K9O7j4j47
3813a93L18l97L21p9K08j26L0l1k65J31mO5Q4o5j92M07m3k01k59L00N2k32J08
3836f3n7K67Q3k85K34j71oQ2j29J32J5j70O3r0J00J67k02O0J44pj65L9J43k10
3860b6J48j77N6J34m12M18k34j36L67k79J38j29K33k00L9l1Q7K48l66K2K96r7
$$ y = [8, 206, 259, 91, 147, -70, 78, 26, -218, 73, 46, 213, 40, -196, -41, -12, -52, 262, 170, -30, -259, -68, -42, 30, -2, -277, 327, 150, -388, 193, 104, 109, -165, -245, -348, 221, -25, -97, -123, 206, -32, -214, -136, -210, 227, -143, 77, 145, 334, 331, 226, -216, 121, -30, -368, 7, -222, -8, -381, -63, 97, 77, -12, -177, 96, 122, -300, -29, -262, 177, 162, -145, 74, 84, 175, 173, -142, -75, -147, -161, -170, 7, -70, 102, 25, 12, 52, -155, 82, 18, -88, 164, 454, 12, -297, 124, 42, -151, 92, 348, 125, -128, 169, -177, 199, -198, -225, 13, 37, 269, -252, -116, 324, -128, -99, -32, -46, -193, 125, -272, 49, -30, 178, 52, 82, 51, -214, -83, -87, -22, 62, -3, -195, 212, 169, -32, -291, 9, 61, -171, -63, -120, 147, 230, -55, 179, 8, 2, 84, -45, 87, 102, -68, -5, -95, 5, 172, -30, 30, 174, 167, 2, 41, 184, -26, 122, -55, 1, 135, -277, 141, -93, -229, 138, -141, -3, -132, 101, -99, -60, -91, -4, 244, -122, -100, 196, 99]
3882I9k17J05Q4K11l73K02k7J43m19K97j66k66L61n7L1N3p5r9K20M1k17O3j39
3905a45K71J05l79K52m19L73l7J22k62K95j65Kk69J52N5qO3K4j41J38k38K66J50
3928B05l9j96O9j08K87J01m42n1J56J64j95j17J53l8j8K36p8j42%R3j3J37O8j32
3952A00l58K37l0L13l96J23L18j52p4p8n7K4K1j06J11R3j71l7J11K46n1k18P2
3975D1l8j21J94j44K86K7k15j4K3J22k57n0M2K60l06K2K50N2m05Q7j69J83K44
3998A14k14K4k0J63L2j19k88O33l80m57N61j13R7l1j07J79j83L67l58K62M1l68
4020a65O8N2j54J37p3P8L07p2l28J22J60k13n6P3p1PK05k99j02O43k00m3j99K88
4044A65n4l93K36n7L83k66j37k1N3k4n4J79p6O4J0k30L01qJ23l76N8p8L79l32
$$ y = [99, -118, -13, 71, 282, -91, 111, 84, 227, -192, 105, -61, -327, 34, -23, 8, 61, -14, -113, 107, 148, -69, -6, -145, 126, 231, -148, 104, -315, 58, 21, 143, -119, 176, 11, 13, -256, -104, -49, -57, 6, 30, -111, 27, -211, 55, 205, 166, -30, 39, -69, 218, 319, -123, -174, -18, 146, -49, -166, -13, -51, -69, 167, 89, -53, -53, 40, 27, 164, 232, 100, -258, -21, -51, 262, -134, -11, 307, 155, 81, 3, -54, -30, -9, -115, -4, 89, -82, -119, -8, 238, 187, -31, 41, 3, -118, 76, -68, 218, 245, 30, 16, 39, 161, -96, -146, -104, 156, -150, -128, 122, 174, -231, -144, -313, -130, 114, -100, -76, -96, 67, 99, -20, -308, 325, -55, -512, 49, -64, 33, 2, -105, 74, -109, 258, -100, 162, 203, -165, -97, -45, -199, -62, -135, -57, 250, 178, -150, -28, 132, -81, -137, -64, -135, -128, 77, -222, -324, 319, 119, 76, -123, 165, 111, -282, -46, -103, 280, 14, -123, -144, -91, -115, -169, 10, -66, -2, 8, -222, 79, 71, 194, -182, -124, -202, 177, -155]
4068a55J46j53J80Q9n4k53K43K33m39K40j56L8J51l90M4J61N9k93L54o3J73k12
4090e7J57J55R1l13j86K20J55j83q1J42j1m3K8m57M74l7k09K7j2J08K49j56l24
4113b63J81K26k94L3L58j92KJ03l60j1J70k9N7K47l35O9m7K14j03k89K42K92j35
4136A36K21k57P3k73j22K22J78M3l27K38n9M6l50j5L41R7k43l4QL43l05O4l06
4159b81K71Q7n52K74p8M14R4n4l13mK41j12Q9l03J51M32l28j78J86l4J2k07L31
4182A38P9j43J48j22j99K90j76k39j41N92l02R8J44j02j87j24K21K76k37o0j76
4203b22K92l78N4P7K17K37m69J95m49O17m9j80J95j71L60l02J14j5j23q5n3J23
4225a5R0k3m14M83l10K09P9j78N3J85l46K46M7j3K8m10L90K33l64r7J71K8p7N1
$$ y = [-155, -9, -162, 18, 107, 53, -200, 43, 276, -163, 77, -79, -41, 110, -280, -236, -75, -16, -309, 45, -18, 155, -57, 100, 255, 346, 33, -153, 67, 222, 39, -42, 100, 89, 46, 74, -383, 91, 54, -155, -128, -140, -32, 217, 61, -263, -82, 144, -150, -117, 241, 49, 51, 154, -206, -217, -47, -76, -19, 228, -107, -38, -85, 129, 26, -263, -21, 271, 136, 357, 100, 173, -100, -222, 0, 178, 221, -106, 132, 73, 119, -231, -246, 95, 192, -51, -85, -77, 266, -39, 25, -281, -10, 77, -475, -201, -279, 135, 229, 175, -138, -142, 99, -13, 76, -227, -76, 356, 28, -150, 36, 2, 14, -193, 138, 217, 74, 222, 100, -99, 191, 15, -224, -365, 227, -75, 23, 167, 65, -122, -246, -25, 251, 14, -46, -222, 70, -308, -254, -177, 40, 277, -192, 3, -446, 171, 122, -58, 137, -34, 326, 24, 138, 123, 0, -85, -138, -15, 75, 52, -362, 121, -189, 20, 99, -79, -26, 159, -187, 59, 106, 93, 121, -289, 101, 334, -30, -127, 44, 72, -5, 46]
4249D6l69L15K83n30M89j6r3j41J7j69N61m98R3P9j75J05K3j84j86K26J08J11
4271I5l8j75k1k59J90M04k93%J2k16Q18q72M42Q9k17Q8K0j91J11R4j39J5J68M1
4295A66o2j10N8Q2j40n6O1r1J94j00l1k0K91m66L7J50J6J66k20K23K2L7n07L46
4319D6P0n4o3j56J16J35l44M6K61n9j23Q2J31n4K17k51j86J1K61J7l35j05N27
4342A90k71O9j42J06J18KL2k26J85J95k24J50k46K44l66L72j03k59M05l31j33
4363b33L84j84N3PN6m4l46K54K32k27j72K85j26q8K1J27R7k46J13J84j49J56j11
4386D3m53N29k33J82k72K26J14j28J45k19j81L02l1j20L32l16K56r0m7K03L0k41
4408C1j08P2K31k69m4K45j23p4j46K04m8J43l16N0J51j63L38j11j90L79l63p8
$$ y = [46, -323, -8, 275, -255, 234, 218, 125, -16, 1, -168, 393, -105, -12, 67, -108, -3, 20, -164, -350, -124, -16, 95, 57, -118, -139, -398, -208, 196, -97, -97, -85, -301, 517, -355, 87, 176, -41, 47, 67, -124, -13, 81, -58, -43, 125, 166, 104, -6, 52, 134, -6, -62, -1, -92, 102, 2, -29, -49, 242, -224, -187, -37, -21, 145, -75, 148, 170, 207, -300, 46, 116, 62, -1, -157, -41, 94, -250, -204, 57, -2, -125, -43, 88, 34, 251, 0, -186, -175, 86, 103, -232, -337, 190, -81, -12, -154, -48, 70, 72, 104, -122, 63, 258, 34, 184, -62, 182, -184, 188, 85, -174, 231, -100, -233, 151, -33, 20, 27, 83, 39, -307, -53, 179, -48, -220, 65, -61, -149, -128, -1, 96, -150, -37, 147, -2, 154, 43, -410, 119, -114, 68, -204, 22, 136, 8, 153, -66, -247, 55, 24, -96, 236, -80, 176, 86, 39, 242, 272, 31, -77, -5, 226, -43, -87, 158, 35, -39, -185, 19, -29, 114, -202, -152, -1, -164, 174, 63, -127, 252, -111, -189]
4430a89J16O2J3M5pj29L22m19L5K68J90n14m1k69O60Q8k35qk44M58l20j61K48
4453c1K6j90LL16K40l67m1P3k27K92j94L24l57K90j21l37p4O38k45j57J12R3n5
4476A1K29p9mj66J88j20k26L71J28k78j68J49O3k10K33k29K95q0j36o5nQ3o3P8
4500aO4J39j56M6o9m6L8k16L46r2Q5j04o5M67m92m2R2J53k06k52K28L15j88k10
4524a66J28k95L66P0r4Q5J81m63j50N70m44K70N6m62n2P63m37n9J2N7R0p7J5L0
4548fk1L8j52k5K07j22J25P0j63J46j4l23L48r9j36R4o7J4P7J4oJ40N1k65J16
4573D1n0j6j4o6M38k12O0k30K2K15k23J42m1j20Lq2q4J98o7P6l98J98M15r8j67
4598f0K16q2o2l3J03L6j08j85K55J55j44l08L7K10k37M55p0j96k6J89j77j48J52
$$ y = [-189, -73, -11, 2, 47, 40, -89, 233, -186, -151, 117, 307, -207, -248, -517, 143, 231, -4, -12, -256, 202, -118, -279, -31, -5, -195, -192, 124, 364, -3, -44, 29, -198, 94, -100, 224, -133, 157, 36, -301, -375, 263, 18, -139, -27, 66, 11, 240, 161, 157, -9, 179, 59, -167, 204, 332, 54, -114, 35, 98, -112, 121, -108, 187, 107, -29, -94, -99, -16, -79, -1, 63, 202, 46, 92, 23, -23, 15, -201, 145, 53, 138, 34, -31, 436, -56, -98, -6, 147, -59, -311, -83, 232, 44, -166, -38, -333, 33, 103, 9, 94, 275, -188, -338, 232, -212, 58, 114, -348, -400, 363, -74, -133, -121, -64, 26, -51, -36, -6, -27, 11, -141, -166, 41, -81, 44, 114, -49, 97, 83, -240, 108, 9, -127, -33, -100, -86, -9, 5, -1, 139, 190, -75, 41, -9, -25, -39, -105, 333, 121, 181, -49, -27, 188, -35, 107, 66, -54, -51, -133, -217, -19, -86, -10, -408, -210, 205, 107, -60, 156, 74, 12, -21, 82, 118, 10, -175, 80, 235, 91, -217, -180, 30, -207, 248, 178, -18, -44, 145, -32, -180, -28]
4621b8O7j68J54k92K40L57k44m52O13j76j55J28K8K50m79k14L76k56J12j65P3
4642b31M70l88J90O3M3J98n85K28J61k31J09J24j28K54l06jK44j62J98k14n0r
4664b3r8K00k18q2O42m43k07O8J46K00k19j4P7K97l62K36j16r3P7j18J87j18J92
4687B11l14n5O7k4N5q5P4N7K6l63L56J95j36o1j59J65J26j20j44L49p5l64K12
4710gK3J02J10m67R4N53m92k90J11Q8M37l86J69l29M51j14j45J80j35N6R1O5j00
4733F5K42l22j17P8n5K20l1K2j98J45j82J91j26J87j72j2l7M0J57l72J59J0m8
4756a56J05R0j01K86k53P2j17M76m01j38M11k52n9J17J24O9l33k4l6N8J51M4j42
4779ij02L74k48NK21k23K42m68Q2N8j78J03K91q5R8j05q7J54p1j26J70Nj4P8k11
$$ y = [-28, 39, -129, 25, -267, -27, 330, 86, -366, 247, 71, -84, 44, 72, 322, -157, -371, 5, -251, -139, -304, -231, 239, -149, 41, 104, 147, 345, -240, -12, 149, -82, 27, 151, 23, 277, -29, -30, 214, 52, 250, 36, -14, -23, -121, 79, -139, -221, 421, -22, -229, -161, -15, 185, -34, -48, 29, 326, -36, 200, 84, -9, 68, -50, 137, 19, 211, -103, -158, -91, -115, -60, -145, -71, -14, 12, -351, 5, 200, 64, 3, -156, 9, 135, 15, -129, 220, 145, -219, -7, 16, 118, 228, -239, -145, 408, -84, -374, -263, -175, 262, -124, 45, -284, 167, 53, -92, 88, -47, 9, 100, 165, 65, 307, -15, -132, -54, -109, 111, 80, 102, -96, 49, -133, 58, -68, 119, -53, -65, -102, -62, 95, -277, -118, -108, -156, -51, 39, -62, 224, -29, 43, -74, 402, 1, -137, 274, 22, -37, 80, 204, 273, -60, -84, -120, -62, 89, 133, -9, -111, 263, 15, 20, 241, 18, 260, -208, -126, -68, -246, -143, 148, 63, 161, 56, -31, 123, 52, -74, 96, 101, 87, 165, -46]
4804d6q8K01J20k33n5lL5R0k60O03m39L22n03K9K02J54P9n28N33j05o1k00m7J31
4828f9j56j4K7L04n4J58n8J53n0K4l56qK43j79R2p8N0J2J91k62L75m04P9k54N03
4853B69k24O0k7m4k06K51k43k9L72j63j40j74M1R2K13j60N5o3K77j25k49J98m5
4876f4PN0%J36j76K6o5J12L67l87L18k50J14r1pl5l7K15n94L14M8k36P8o1K49
4901C1K37j34p1K2r2J40Q1o8p2j92m9R2j0J55k10J09J39o4l6n0J74J16k28r3L28
4926B55j81l33P8O7O1L88k44j23ON0L6j69l4Q9o9K15l01J74J8R8K42j82k3J46
4950B64m74K94k82K38k58N4L54q1n33L07K78qj60n1J72p2J6j59j28K93j44J84
4972A04K5j11l17M96j78PJ98m04J29Q3J05l8j02n9L19j62j62Oj17L03m9q2k1J23
$$ y = [-46, -134, 67, 187, -46, -101, -104, -69, 21, -239, 364, -75, 247, -256, -227, -25, 129, 208, -320, 213, 108, 47, -153, -200, -69, -225, -239, -212, 92, 38, 196, 138, 291, 241, 265, -91, -99, 144, -35, 57, -21, 29, 41, 232, -30, 345, -59, 20, -234, 269, 45, 105, 78, 34, -172, 79, -164, -193, 179, 16, -124, -298, -257, -165, 48, -112, -57, -120, 157, 32, -217, -19, -64, -57, -7, -7, 129, -47, -21, -86, 26, 393, 6, 324, 74, 188, 97, 90, 55, 18, 233, -361, -47, 1, -235, -157, -218, 31, 268, 134, 63, 85, -7, 133, 214, 146, 74, -118, -167, -75, -85, 70, -140, -31, 108, 44, 8, -42, 132, 248, 20, -73, 255, 74, -259, -181, -114, -53, 335, 91, -32, -26, 24, 60, -109, -143, -54, -123, 92, -209, -35, -17, 81, 323, 141, 118, 264, -210, 84, -198, 40, -218, -164, 190, 109, -424, -117, 161, 153, -7, -58, 114, 42, 58, -101, -229, 64, -80, 104, 129, 18, -299, 197, 19, 26, 224, -180, -51, 32, 137, 99, -3, -62, 257, 95, -67, -61, -178, 125, 76, -6, -27, 96]
4996I6j01K2R5k04K74k46l9J82j38M6o9O1K62k98J81q3L2J45m15K37m8K52k47
5019cq5J01n8R9j28L8J13j71J43o1K75j62k41j08PJ06J92j96JM7j7j97J57K45
5043I7J27j5k99J86j33m4K09J02l64R5k50N61j00J5o5k44J26o4k56K98j96J43
5065g1J25j84K36m2N5j53J50J10r7j36J25o0k4l24J35L04j46j23P0k88M22J35
5087B19L4k77j10J03q5J08j15J62J21k34L00l14J34k71J31K67l45M1O7P8l4j7
5109c7R4l8K3k4j39op0N15m32R5j25j5J84l90L43j18K19k3k17N3j08L46j89K03
5133A44j20R9j00Mr8n8K01k30K38L5n9J27J9J78m60J01k88K43N4R3j7Q9k58L08
5157B45l94J41o4J41m8k05Q9R7m0R9Q8j34O5j30L11m5k83J11r0o3k34K75L87k84
$$ y = [96, -5, 17, 112, -92, 182, -64, -103, 79, -59, -13, -82, -21, 241, -57, 124, 41, 73, 218, -197, 40, -8, 244, -3, -88, 13, -45, 54, -74, -36, 77, -94, 49, -12, 263, 101, -140, -248, -241, -135, 57, -139, -138, -91, -108, -305, -148, 97, 224, 209, -90, 96, -37, -81, 128, 230, -134, -39, -289, 272, 172, 187, 122, -122, 4, -60, -316, -18, -214, -71, 54, -130, 106, 64, 119, -34, 116, 226, 129, -7, 118, 58, 34, -290, -155, 149, 3, -120, -50, -338, 84, 219, 253, -24, -134, -31, -116, -8, -123, 39, 160, -74, 226, -88, 46, -225, -94, 173, -172, -131, -64, 14, -20, -37, 57, 19, 42, 18, -121, -127, -197, 318, -114, -19, -144, -159, 25, -365, -22, -140, 79, 56, -161, -108, -216, 130, -59, 144, 24, 123, 23, 27, -71, -129, 72, -158, 80, 115, 56, 183, 202, 380, -80, 21, -267, -24, 30, 123, 106, 195, -63, 245, -149, -8, -72, 69, 21, -184, -95, 2, -38, 61, 149, 15, 80, -50, 261, 216, -67, 44, -46, -109, -343, -68, 319, 35]
5181C5j85J09j99J65J31j09j0j1K14j96J41l0r1J37j19l78N10l15K3L04j49m9
5203g2J28p3K03k15K04l61L32lj7k73K13J69k18J07r6q7N57m78k09K10k08J05
5225h2MR4j57K46nk71L09j76l2n0K54k75K71k61J59r7J16j26m1K55k22J73j50
5248f4K6j18M58n17K80J50k34P5L00n6j80j52k53N51l32J55j26k84J48K91k61
5269a43O9J50j54N7j35J89k23L68l36M0K62j04J68m07J01J61K98n56K93p9J06
5290A25j92J44j85N73p32K00J83l4j4k8Q1k86J37l86L61J78l47J09K75k34M8K02
5312A78l56J35j47j8K42j04Q1j40J09J20O4l10K17k46J81p9L35l02J21k6j78L12
5334A89l3k2j96j81K63k56J85oQ4M4K5M1j08p1L7J42k49K29j13k28L17j33p1L17
$$ y = [35, -150, -41, -240, -75, 56, -53, -63, -74, 140, -56, 85, 55, -36, 101, -18, -396, 114, -201, -178, 126, -23, -72, 56, -17, 186, -29, 175, -186, 146, 143, 126, -147, 66, 235, 17, 124, 28, -59, 498, 20, -189, 21, -187, -82, -78, 16, -141, 105, 100, -171, 138, -38, -70, -120, 134, -141, 130, -131, 28, -69, 47, -79, -120, 135, -87, 86, -64, -38, -156, 302, -215, 65, 215, -19, 56, 356, 300, 120, -32, -285, 266, -66, 89, -37, -321, -173, 118, -143, -74, 76, -78, -21, -156, 33, -190, 178, -158, -118, 144, 40, 208, -199, -98, 63, 361, -195, 98, 19, 125, -67, 77, -108, 465, -267, -67, 116, 82, 68, 40, 121, -165, -28, -414, -53, 125, -222, -113, 162, -72, -24, 178, -178, -43, -190, -208, 34, -70, 11, -129, -20, 100, 164, -146, 71, -175, 6, -73, 262, -40, 81, 55, -123, 189, 156, 134, -62, -243, 20, -236, -51, -57, 27, 71, 96, 137, 29, -42, -5, 137, -112, 117, 4, -224, 93, -40, -111, 206]
5358B06k28j54N25k98p1J37j66K67n27L33J59J00K9m55J67J72j74k07K12J34J29
5379B90k70k80J31L36j53l6l3L9Kk3j29K5N1J96j52J35j77m3JJ52J4p7j56O5J51
5404E9j42J17%j97K01J4Kj69q5j6K97k34N9k16J76K98J1l69K85l37L88k49K47
5427A40k8J6k93L17j53N8J08j77k78J73K9k8P0J03j3K70p1r1j32k6O1Kk74M07
5451A90k78R7j15lJ70m25L70j20j23M05r5O3m91M11k04k45M04j46J73M2O1j46
5473ej58J17J41j26R0r8J25L7j24R4j50K13n40J28L5M6M6J4N5j83J74k34J11R
5497a83K8L10O1m03K08K88k96o5J08j84K65m01j2J35L83j21n1m54N78J41n33K59
5519F1j2k7Ok5N2J25O1k52j81K50j10r4J85nj69o8J78J16l3m5j09K31n47N26K7
$$ y = [206, -22, -176, 349, 51, -20, 117, -49, 218, -309, 24, 183, 283, 312, -143, 24, 196, 22, -185, 27, 161, 290, 20, -260, -129, 207, 54, 18, -15, 24, 26, 3, -126, -101, -50, 146, -6, 129, -48, -91, -90, 62, 76, -1, -157, -92, 59, -83, 34, 34, -163, 38, 52, 54, -115, -200, -216, 81, -153, -94, -310, -134, 164, 175, -194, 91, -246, 142, -107, 140, 112, 128, -165, 152, -1, 57, 165, -12, -290, -117, -88, -116, -46, 57, 44, 314, 243, 152, 20, -6, 55, 57, -217, 190, -88, 9, -106, -109, 61, -364, 6, -114, -237, 168, 73, 136, -355, 56, -148, -393, 11, -135, 38, 80, 141, -5, -163, -46, 95, -31, 59, -39, 86, 123, -1, 93, -57, 156, -384, -256, -221, -175, -129, -115, -60, -243, -69, -303, -192, -183, -155, 155, 216, -187, 21, 309, 13, -52, 56, -128, 137, -264, -276, -141, 242, 121, 70, -384, 194, 335, -198, 61, 49, 22, 28, 3, 55, 180, 241, -11, -192, 58, -52, -146, 39, 34, -135, -203, -25, 91, 58, 13, -96, 135, -412, 114, 141]
5544A41m46M92l97LL07l27J6M8L22k74M27k18l2R0j86R8k5j44K72k44K2q8J35
5567hJ41j57J17j04R8k37J26j04J46j68P5oj39M25k32M8k51J62L1M0O4J81j40
5590A08M7k94M6K42nq9j78K16j23q0l1L10k75L9R5q3k03J09J48j23K76l92JM5
5614a94LJ84k52M59k67j70Q6Q4L80l01n2j73L18j61J99l09P0L31j7j06j44J14
5636H2k06m3L76k23N5j06M1M2J23q2l8J75p2k9j10R7Q9lj10j08J00L89j03l46
5660a0K93k52N3Qj90K91j19j87J07K99o3k25O1r4n1K08k32N7L0j36K75M5j57L00
5684C11k38k23N1J21M8k12J15L5J11o0mJ9j87J00l36K62L92m39P9P6p2q5J14R6
5708G4k50K74M9l41J67O9J79k72K1J07k68J22K10k28J06J83k57m1M33l16J09r8
$$ y = [141, -305, 187, -210, -207, 100, -227, -211, -163, 159, -115, 312, 94, 62, 152, -34, 64, 39, -105, 167, -77, -55, -143, -8, 133, -24, 93, -11, 87, -150, -24, -128, 18, -150, -75, -81, -220, 205, -27, 21, -230, -68, -37, 3, 67, 248, 108, 155, -139, -93, 149, 144, 55, -123, 93, -30, -110, -141, 169, -106, -67, 28, -55, -258, -149, -1, -124, 152, -240, -239, -194, -191, -7, -259, 200, -67, -237, -151, -67, 313, 12, -40, -213, 105, -56, 143, -166, -96, 235, 218, 112, -32, 82, -124, -167, 209, -14, 41, -65, -24, 18, 141, 59, 21, 196, 124, 95, -15, 82, 171, 168, 58, -50, 50, 439, 336, -10, 283, 31, 84, 92, -98, 193, 74, -113, -6, 293, 230, 5, 66, -28, -79, 129, -103, -46, -16, -152, 123, 168, 11, 311, 73, -150, -99, 22, 70, -142, -27, 8, 119, 59, 55, 74, -113, -13, -349, -87, 305, -134, -55, 21, -51, -136, -22, 74, -176, 98, 147, -194, -27, 42, 221, -51, -30, 77, -191, -69, 141, -87, 19, 202, -55, -96, 337, 21, 130, 32]
5730C2N8j27J95m0k55M4j97M57L2p5j56j33J65M5K03q4k66K43k64M43j05j38J09
5753A86j56J40l65P6J64j63j68N61q0K8n3K2l03j62J81P4O0J30j47r2j5J52j71
5776a01O6k8J65j19J87k87K28r8j73M36l05N4l01K14p6K10k2o0q6N9J62p6K8j5
5800F2q4m5o2K37n6r0J9J20Q6N1k34K16l27o1K17Q2j47J41j98p3J15K21q7n6M
5825E1M4R3m82j57M80m18M07N8k6Oj08R1m7L23k01k90K85j50n8J27j33mR9K37
5849B27n08M34j39j30J09J21M6L6Q1m35M5N5k21J09J50j64L3J25O9P0j17j33R1
5872d6R0jm46L42pJ08k07j53L05n4P3O0l5j21L05m48J10N7J45k15J55k3J20q8
5896B6j09J98M9q7j4l5j40K52j79mp9N3k55K53K83j13k31L2J97J30k44j42r2K90
$$ y = [32, 90, -37, 158, 118, -137, -93, -290, 167, 199, 124, -32, -165, 0, 45, 248, 164, -102, 141, -123, 320, 215, 77, 186, 30, 170, -195, -119, 45, -118, -286, 275, 195, 223, 170, 192, -111, -273, -92, -18, 42, 172, 25, -67, -82, 70, -101, -35, -63, 102, -17, 170, -117, 111, 13, -160, 276, -29, 25, -276, -62, -138, 72, 50, -10, -96, -37, 125, 49, 77, 62, -22, -67, -129, 108, 52, -38, -19, 101, 187, 238, 4, 220, -107, -168, 49, 131, -16, 125, -73, -146, -31, 190, 103, 47, 51, 95, 188, -294, -451, 29, -389, 18, 76, 50, 56, -52, 39, -8, 315, 114, -176, 109, -41, -99, 28, -105, -109, -10, 227, -281, 153, 14, -116, -7, 114, 160, 196, 277, -158, -113, -58, -279, -170, -20, -184, -151, -26, 43, 113, -4, -137, -46, 44, 43, -403, -61, -68, 40, -167, -320, -15, -69, 4, 64, 29, -92, 213, -235, -125, -68, 77, -138, 17, -6, 114, 26, -83, 115, 164, 77, 63, 28, -112, 140, -39, -43, -122, -69, -324, -71, 212, 99, -132, -100, 97, 227, -17, -159, -251, 39]
5920C9p2J00k0L0r6O0L7o8R0k33o7L16m1k74N9J37J31j15l19L00K47l04L41k38
5944D0R9j07J33k61J48K4o5J21QO9j19j76q5J85L56n28J16J29q6J48j48j75K03
5967B9Jj77j63L12n4J73l36J57n0J02p0m9J40o7L08k87K03l30L52m84OM15k75
5990a44K95j18Q4l6j37j61K70j63j78K13J76j55M07m80N3Q6j05J11j54J36J44
6011A44j19k16O80n01m1j67M51k48pl25L29J6q1K44l21K58j34j02JJ85L77k79
6033A44j25j69J24n9O7K2j2J87l55J23J41J34m77K10j76K87l3k9r2j21K19k90
6055b80L68k79L03P1m11j7K93l1k2k04J84o7M2j31J86j9J41po8M7k05J82j79J91
6079H8j92J58k8K7J98m72K64l2k6rp4p4L01j66J61J55l57K06j00j94K69n9r7K73
$$ y = [39, -33, 67, 47, 77, -19, 41, 78, 10, 100, -133, -200, 116, 75, -199, -140, -3, 128, 13, -306, -6, 241, -63, 278, 40, 139, 32, 165, -96, 52, 76, 11, 132, 140, 209, 90, -86, -171, 14, 370, -158, -42, 87, 1, 149, 1, -174, 29, 30, -147, -310, 2, -52, 121, -215, -58, -108, -6, -76, -125, 15, -52, 256, -31, 172, -158, 194, -290, -284, 131, -144, 151, 33, 117, 81, -56, -217, 53, -110, -288, -75, 101, -54, 353, -127, -74, 12, -93, 18, -136, 0, 144, 25, -191, 489, -12, -53, -220, 231, -17, -24, -349, -20, -4, -85, 159, -162, 96, -38, -140, -139, 46, 423, 144, 19, -150, -26, -85, -18, 4, -8, 179, -176, -53, 88, 222, -255, -45, -221, 66, 33, 4, -88, -209, 10, -280, 88, -191, 112, 183, -228, -245, 48, 17, -5, -209, -25, -92, -50, -181, 5, -14, 127, 120, 52, 99, -106, 76, -103, 88, -104, 54, 26, 53, 251, -221, 43, 11, -15, -24, -98, -172, 129, -37, 124, 279, -78, 128, 28, -166, 103, 44, -53, 220]
6103B20l48R0mJ20j53jJ04K29l20M60m00J03k80J72L18l05r2J06j1K61l64R7j00
6126i8K4R8j6K15k65r1MK53j31j78J34K58k17l5J13o2J3l3J36R1Nj33k25J60j87
6151a67J93K11l48L19k08l76M82J01k72M8m7J7R6L2p2P2j21O4j53L1j49J97L3
6174a7L0R0n1J38k71J63j18k4KQ7l5j12J76j2j99M79m26K99l17L04k86J09J78
6197A87k61m3J81K01l81RM11l42j19nK80l33L09k52L33k26k22J23j16K97N5j21
6219c5O9j9P1k04j10J29R2K6m0l8L07l91K45J11n0j56R4j89P7K0K19m63L34J43
6243B42j09k83K8K04j87R2m5q2k65L49K1j06K32j99J13j77k9L08Mm01J29J65m1
6266c7J08j15N18l41l33L8J03K57l03j27K37j49J02J04M7k27Q5k0j2J35n3q6o
$$ y = [220, -128, -38, -42, 78, -75, -76, 28, 257, -63, 397, -3, 100, -180, -8, 310, 5, -87, 19, 8, 269, -95, 2, -98, -74, 24, 8, 223, -42, -133, -129, 124, -7, -185, -51, 207, -10, -45, 68, 6, 19, -14, 122, 213, 218, 85, -140, 20, -167, 26, 237, -111, 208, 0, -376, 106, 207, -65, -17, -64, -47, 49, 81, 9, 81, -40, 24, -129, -98, -247, -50, -17, 13, 103, 52, 190, -81, 82, -36, -60, -58, 29, -6, -118, 58, 46, -153, 326, -100, 199, -118, 186, -100, 9, 187, -74, -117, 64, 265, -116, -107, 304, -38, -157, -162, 118, -215, 94, -158, 175, -51, -273, -150, -266, 31, 86, -35, 34, 15, 86, -118, -228, -99, -7, 19, -21, -59, 248, -143, 102, 213, 163, 7, 101, -88, -11, 9, 228, -235, 99, 242, 133, -150, -122, 82, -105, -13, -58, -140, -405, -56, -35, -141, 91, -108, 5, -172, -201, 107, 111, -290, -161, 4, -37, 71, -44, 474, 133, -200, -162, -59, 198, -105, -232, 5, -144, -42, 62, 109, -118, -33, -53, -65, 70, 17, -69, -75]
6289g5n5O7J29k97L43o6o6j89L09M3l99J45L04l9q7j17L28p9o0J26m49J60J00
6312G6l1J52k44K94k99j44P5L56j38Nl08K98O8k64J00R6k65N46m96K9J17J36l17
6335a58J78o0k0J63j81j22J68J38k30K54n2J07o6k97P1K06l5j08NN4J67m90J93
6358a15J93k96Q0J66J5J37l00M1p5M33l85K6L38k50J26J08m21J55n1k2M4M2K1
6381A0J18j75P8J63l20J33r8L16l16J45q6P4k42n3L33j20P2j90J55j67k9K47j62
6404a14o9L98q2j40J21K93l91k33Q0j40M63q3r0N5J89l41J66j63k21L82k4j3k92
6427b49L95j71j46J97j07K39J5l42K7K18j57p5K37j81K55j67K05j6J63m32L00
6448B08k71K35%l74j1M06j42K60j41j17J1Q3l52J87K58k76J33K5Q6l32J66j52
$$ y = [-75, -130, -63, 66, -231, 112, 46, -20, -209, 100, 143, -256, -111, 193, 154, 67, -50, 278, 199, 139, 265, -184, -24, 76, 45, 197, -47, 247, -52, -196, -121, 235, 97, 102, -206, 92, 160, -104, -4, 92, -173, 373, -123, -94, 23, 159, -158, 20, -40, -60, 103, -78, -200, -32, 106, -124, 130, 78, 185, 119, -178, -107, 99, 64, -44, -39, 15, 182, -308, -115, 78, -218, -138, 28, 43, 180, -120, -79, -154, 279, -106, -80, 258, 8, 134, 242, -179, -24, -75, -97, -53, -11, 10, 128, -47, 31, 194, -126, 7, -91, 225, -91, 54, -32, 42, -200, -253, 80, -40, 32, -158, -3, -170, -199, 48, -114, -183, 215, 133, -7, 114, 407, 16, -217, -137, -277, 186, 103, 13, 68, 257, -84, 82, -81, -302, 80, 56, 43, -249, 146, -25, -171, 26, -81, 158, 173, -169, -142, 76, -81, -156, 81, -100, 155, -12, 193, 177, 340, -92, 208, -63, 172, 172, -202, -213, 193, 51, 311, 170, 53, 64, 147, -205, -18, 240, -36, 97, 122, 208, -124, 42, -110]
6470a10K00L5j57j14J34J36j12jj1K30k02k3o5K53o4L8l60L20k45J29J82k44J37
6493H6l01J13K4JP2j09J15J09j50j79K89k05J30J38l25J93L6J72m15M51N0k89
6515FO7j41J38k83M02k22J37k84K33j05L45j92K4j30L2M8j65N0j96L75L4n76K94
6538a09q9J57o6j66R7M27l36J40n91O72l29P6J03l3J20n9r6nK51j07k51K24Ok36
6562b00J49j29K96j64j4j63K82O1j99k68M89p1k16Q8L9J2j90j22L16j61L76l55
6584a44j14Q5J31j55q3M90k6n9m30J71K21q0l37J13J38jK16j67P2O1j37R6L4j55
6608f0R5j51L1R3K30k42M0n8Q2N6j99J99k47L81l08l32L14J04J64j32J13n53M32
6631E2M6r9K27k62K05r7O6r9j17K66j76j85J98p9J85l31M05j87P6P3k01j42m7
$$ y = [-110, 90, 125, -32, -146, -12, 124, 12, 11, 0, 230, 28, 5, -60, 193, 129, 167, -193, 127, -118, 11, 193, -51, 86, -215, -102, -78, -77, -5, -114, 1, 110, -40, -219, 70, -135, -5, 133, -192, 1, 37, 209, -206, 245, 295, 6, 73, -68, 70, -213, 189, -33, 104, -180, 53, -52, 293, 101, 125, -5, 27, 75, -90, -40, -236, 139, 173, -403, -109, -198, -41, -107, -273, -176, 251, -85, 55, -536, 136, -193, -117, -14, -47, 73, 14, -82, -87, 164, 57, -194, 30, 36, -200, -51, -180, 116, -48, -62, -225, 57, 118, -81, -349, 140, 69, -147, -59, -20, -8, -198, -320, -4, -165, 211, -144, -258, -173, -42, -197, -280, 210, 184, 125, -305, -134, 87, 7, -330, -217, -79, -80, 136, -31, 41, 102, -35, 61, 95, -60, 35, -116, -85, 8, 238, -4, 36, -22, 60, 116, -83, 116, -131, 250, -58, -390, -76, 28, 192, 60, 173, -380, 52, 98, -1, 226, -36, 169, 72, 138, 39, -78, 188, 12, -173, 25, -54, 131, -200, 205, 18, 94, 167, -34, -176, -223]
6654b23L37j46o6K81q0j04l2k16K22O2K92p10N75q7j06m3M0J36l11K81nJ8n3J07
6678A69m48K46j42J87j4o7k0J89j43o7R9J13q0l07L20J46L2l45J32j36K89l10
6700a57L25l8j18m7k35L44n4n8R1K29l37J45r9k40J49L8J82l00Q9J94J27j64q9
6723b3m5J28k35N6k2L74j82J76l83J28K59l94j27M31j40J48n7K1N4j18p5j27K50
6746I7l72K62j80J76L43l62m8m8J28p8j56L73j2j1l46P2N9J84k66k2L45j83L31
6769B86k69j48M6J3j02j11K15k4q6L2K06r9J86k45M20l02L4J33j90N4lR6p8k9
6793C5M8J11j25jk0o8J24j94M51k13o52L13M9J56J00j24J21p1k8O3j17K06L7l22
6817a21K52K11k06j77l08M02O2qn0J78j67k77J31K1J7K29m19J73K87n7m11K31
$$ y = [-223, 114, -32, -98, 183, 103, -1, -33, -249, -27, 35, 327, -383, 192, 105, -1, -44, -4, 132, -179, 102, 97, 115, 62, 169, -279, -33, -175, 12, -2, -69, -89, 100, -43, -110, -11, 102, 22, -285, 35, 181, 213, -132, 0, -136, 153, -157, 168, 130, 12, -35, -270, 74, 20, -38, 53, 282, -55, 90, -9, -249, -100, -62, 120, -180, -91, 103, 230, 66, -23, -68, 60, -175, -119, -141, 233, 51, 227, -156, -28, 231, -163, -290, 141, 1, 149, 92, 113, 167, 49, -26, -153, 97, -275, -13, -193, -17, 326, -36, -84, -132, -4, -82, -238, 135, 123, 112, -234, -162, -103, 81, -185, -207, 138, -45, 286, 17, -131, -85, -72, -174, -285, -70, -94, -180, -148, 58, -41, 145, -100, 320, 18, 52, 185, -5, 49, 46, 142, 64, 35, 83, 194, 69, 68, 48, -20, 104, -90, 361, 148, -504, -191, -142, 14, 114, -10, 111, 40, 12, 75, -42, 164, 201, -121, 131, 342, 136, -41, -349, 53, 115, 107, 57, 235, 68, -209, -78, -57, -40, 189, -230, -57, 230, 173, -238, -7]
6839gJ06n8q0r9J82j6j52J40lqk6K65l33J46O2J65j84q8J8q7K3j62L13k6k68L22
6865A45j50LN2J10j89k5j11K35q0J65j41l4nJj46K71k50J96j68N5o8J50L84l81
6889A9p7j23Q0J94j74M6N8J55j80J27j95K21J21m67J15J0J43k02N3L46J13k63
6911A20j03l81M95k26o9K65qk16L08L6j26l9j66m6K78j63o3K63k01k02L84k4k94
6934a78K62p4j99l4L84r5o1o0l0J77P1o1j96K09k20J31j14K83N2n70L92m3R4l28
6958b08n0K95J27R8l98j11L37NR8j76J78m4o7j51K1J14n5j19q5L4J06Q2M4o3k42
6983b30j57K26L37j48Jj16j00M20k19J1J08j15l1j27Q7o9O2rJ55K7j35n0R3L8
7007E9l02M2J86J81l58K10J2Q8j21m0J09j15Q3k56K78k87K8K66k0j40m8K27N4
$$ y = [-7, 99, 41, -39, -138, 44, 28, -124, 16, 13, 5, -21, 244, -89, 57, 119, 284, 100, 12, 30, -57, -34, -196, 117, 91, -177, 145, -5, -2, 50, 160, -29, -54, -165, 70, -10, 155, 14, -20, -25, -24, -170, 101, -149, 47, -121, -66, -134, 16, 400, 19, -58, -181, -101, 93, -81, -35, 23, 178, -2, 125, -70, 151, 272, -195, -80, -70, 73, -129, -76, 270, 383, 120, 17, -364, 131, -95, -164, 101, 93, -123, 185, 221, 95, 56, -110, -156, 122, -41, -104, 159, -42, -244, 140, 116, -178, 84, 10, -189, -223, 161, 66, 5, -55, -85, 92, 163, 102, -94, 115, -105, 26, -88, 195, 247, -323, 69, 26, 120, -208, -258, 37, 164, 262, -136, -247, 90, 95, 193, 17, 195, 151, 84, -67, -46, 68, 13, -106, -191, -157, -51, 31, 75, 12, -230, -387, -161, 176, 28, 29, -87, -187, 233, 14, 25, 133, 18, -13, -140, -53, -122, -60, -69, 86, 113, -22, -72, 21, 59, -243, -201, -15, 166, -192, 18, 30, 118, -3, -43, 66, -49, 34, -222, 56, -231, -203, 63, 43, -97, -145, 82, 136]
7030A36k77J56J21K31j98l21K60l4j46K92k76M9p7j47J29n8L28j32K85k12j12
7051cJ65j83n8K21k5k48K46j39k0j56j76K72K59j4m9P1R9k59k16L9L01l5j21j57
7075a86K77o2o0Kk48K07j75O7PJ06N12l22m38K19r2J86k81M36j20p4J7J89q8j07
7099b8j4j13oR5J89k06K9j71K78j39l5R2l5j64J75m5L94m80l3J15J84N5j22Ro7
7124d3rK8k3J21k34K73j07O1j08m5k4j17J34J61k00K67J5J4r7k01K84j94J55j77
7148f6j42M52r0m46L37K78l88R3j05J82l28R1K86j04R0l6j50j31J88j18K64k86
7170a29K50J3r5m1k73O9K00Kj03M15k03j78J12j42O5P3k08J36N4ok49J79L54j82
7194A13l16J10M7l3J25j09J06J35l4l49J89j93M65l49J68kN1P4j66K50l48j60
$$ y = [136, -141, 15, 136, 367, 169, -152, 108, 74, -72, 220, -56, -7, -84, -231, -102, -160, 168, 36, 321, 109, -3, 162, -21, -79, 142, 117, -131, 115, -24, -44, -200, -376, -104, 155, 141, 92, 163, 262, 3, -213, -174, 127, 92, -29, -186, 91, 29, -31, -29, -277, -70, -245, -178, -171, -65, 447, 125, -313, -94, -186, 0, -281, 155, 35, -39, -22, 167, 79, -28, -42, -155, -161, -66, 123, -83, -54, -225, 53, -86, -121, -29, -64, -228, -53, -98, 296, -184, -217, -102, 82, 137, 15, 24, -43, -52, -24, -47, 74, -160, 113, 6, 67, -41, -86, -110, -227, -93, 68, -132, 135, 150, 164, 67, -134, 150, -44, 111, -66, -208, 244, 154, -292, 45, 323, -65, 28, -77, 105, -223, -132, 154, 50, 140, 104, -46, -177, 11, -107, 157, -129, 121, 134, 39, -2, -275, -206, -6, -4, -107, 308, 105, -73, 39, -103, -38, 35, -173, -37, 17, 11, -238, -59, 295, 113, -203, -93, -46, -79, 46, -63, 43, 178, 144, -205, -16, -209, 256, -93, 75, 73, 124, 198, 32, 282, -66, -226]
7216b26o0M11m8k71K42k15J42J36Rn5Q9o9k32J62J34q9k24L02n68L42K27j81j35
7239a77L4L23M9k37o2N9L6K1k98N72l32j24J47K17J8K4l80L01k24J7J25k97K06
7262A8L4o0j17L7K56k31j39K83J08k69J58l20K57J0m0J4l2r8O3o4M5k88M64o1
7286B8J3o5j70J71J45j20j29J63j65J53J5R5l64K08L8j52J38k50M13k43k77L41
7308a4j2r2L3N9j6m3K74k72J86L10n13J13k84K37J88j82j61N45l18M8N2k47J84
7331G5R1j33j28L82j94k12M72l12J62k72o5Q8J29K5k19J60J28k69P2o4j01O4K95
7354A74k4l59N53m89K00J55J70l50j48J9L50j50k67L38J5j44k78l3M04j09j73
7375a46J20J94l5j23n6J66k42P8k46J24J34M03j24l51JK79j62l08J97J09K92k02
$$ y = [-226, -286, 125, 77, -194, 48, -167, -25, 111, 120, 65, 154, 85, -147, 15, 149, 60, -164, 138, -430, -88, 139, -42, -177, -143, 180, 229, -8, -70, -11, 25, 46, -252, 320, -12, -136, 11, 228, 246, 270, -110, 191, -33, -16, 109, -188, 18, 52, -8, -125, -88, 168, -63, -202, 81, 189, -80, 78, -242, 15, 25, -15, -1, -33, -131, -68, -132, -87, -375, 89, 28, 41, -24, -194, -23, 122, 2, -127, 36, -129, 24, 39, 134, -230, -22, 16, -136, 2, -248, 165, -78, -355, -14, -26, -118, -85, -26, -42, -85, 189, -83, 103, 413, -100, 13, -271, -34, 154, -28, -189, 356, 38, 86, 138, -109, 75, 166, 33, -95, 287, 93, -119, 353, 41, 203, -69, -134, -46, 83, 108, -111, 49, 177, -92, -20, -84, -185, -121, 174, 150, -209, 344, -145, 55, 210, 380, 30, -118, -99, 251, 101, -166, 172, 187, 43, -235, -268, 136, 27, -146, -26, 168, 133, 10, -46, 120, -122, -44, -290, -166, -32, 371, 247, -104, -103, 176, 14, -294, -97, 12, 304, 102]
7397A02k49M02R6l57K0P7j99J76o7K70j29Ok50N6o3J8J18j55K49K04l31K17j06
7420A05p7N4j47N7N5j87K06l40J47O7k05K67m2L31l47%m8Q9L5j8L6J70l29J48
7444B7K59m62M43o6m9k53O6J70k60O0J34L2p3r5kK28k70K4K3J38rk13N1M77k95
7469H5O8L0m62M83l05J52L09m95K14k28K81k9J60k41j45M5J85j68J0k9R7P6l36
7492b43O2R9P5K5m0K39n2k15K65j84K59k55n8M8L60m41l4R1rj7L7q9k7j3J8Q2
7518a7n4K94l50K97l68L71J31m91J40j64K40j19J48l4K1J13M0j98q2R6j08l1J99
7541G4L5n8l9J10J31p2k1m09K02M80l70J33l71J05L22n05J27J52l0k39K33j1J9
7564bM4R2j63J22Q6m96M35j68J73j08j01O2j74O1K94k92K49q4P4l63L33M0j92
$$ y = [102, -147, 255, 351, -6, 14, 91, -108, 68, 1, 271, 142, 148, -102, -46, -109, -91, 27, -128, 121, 325, -6, 211, 105, 28, 82, -65, -8, 47, -140, 66, -274, -127, -60, -265, 2, -40, 291, -56, -56, -104, -15, 20, 2, 38, 208, -121, 27, 286, -176, 267, 201, 152, -101, -35, 135, -125, -65, 69, 101, 28, -67, -69, 159, -111, -87, -64, 74, 65, -148, -97, 380, 85, 153, 183, -279, 204, -101, 51, 360, -135, 79, -149, 132, 103, 263, 22, -123, -78, 107, -61, -51, -80, 17, 93, -243, -181, -82, -7, 18, -22, 217, 165, -50, 215, 31, 290, 35, -23, 25, 385, -56, -90, 1, -8, -25, 12, -77, -104, -117, -99, -17, -71, 223, -127, 170, -198, 173, 304, -187, -47, -211, 29, -90, 58, 24, 45, 158, 198, 0, -82, 14, -94, -125, 74, 109, 51, 12, 122, 253, 181, 160, -249, -47, 433, 63, 196, -175, -70, 252, -253, -126, 26, -4, -243, -10, -21, -2, 42, 134, -29, 93, 179, -317, 118, -50, 123, 15, -86, -24, -198, -137, 157, -135, 114, 30, 104, -259, 74, 114, -78]
7587g8L74l24K03j40J0p7J20k85J54j15K28J7m38L73L4p0O6K22k75j35K08j20
7609d8r3K32j29m5J61J26k82j4j27M90o62L72j12l5K06j3pJ53J81k77q5J63k6
7632A29j72m1P0j48K23r8RK57k72LJ88j3J03j69j78R9K41j24l25N2J41J60k84
7655a49L95p8m18J24L07l46O20j40l66N4P0j17K80j66l44Q9K36P4l88M53j74q9
7677g3j4K94q0j05o5J92j02K18m09L8J7J15N0l4n0k3n8K62j07n8J53j26K99j76
7701A58k33j06J18QJ91j99J36Q7n5l41J53J23j10j34L96k23j55K02j02K4K90k37
7723iJ58j13J27n9k21M6j82L61j0n1p5K0q2K31j32Q2j7j36M6J17N5p0n8j94P43
7748E77m46j7j23J27j4M9Ol05K53n3j70j16M36l5j24J78l24J36O0j43K55k79O6
$$ y = [-78, 296, -28, 175, 35, 45, -32, 88, -197, -43, -158, 70, 87, -351, 22, 56, -14, 52, 274, -1, -136, 72, -48, -141, 91, -38, -83, 78, 204, -78, -92, -219, 271, -391, -19, -131, -166, 40, 27, 20, 173, 354, 77, -8, 155, 129, -43, -84, -14, -162, 61, -37, -28, 229, -43, -40, 148, 135, 238, 69, -109, -10, 231, 107, -218, -166, -25, 135, -149, 246, 168, -250, -126, 181, -165, 455, 315, -51, 3, 73, -44, 236, 70, -274, -185, 51, 125, -263, 190, 16, -73, -87, 207, 127, 22, -43, 149, 47, 265, -144, -106, -89, 26, 76, 42, -8, -31, -89, 173, 66, 8, 161, 35, 334, 158, -75, -181, -63, -55, 136, -63, 73, 160, 105, -236, -83, 40, -70, -204, 192, -31, -186, 16, -86, -62, 228, -9, 149, 36, 163, 104, -117, -71, -253, 108, 98, 47, -28, -8, -90, 141, 9, 91, 74, -62, -16, 101, 156, 86, 28, -166, 577, 131, 114, -9, 118, 104, 153, 159, -146, 107, 54, -116, -232, 204, 169, 45, 223, -101, 35, 95, -48, 207, -72, -6]
7771fj9J28k77P1j6J13J44j54N6l15M06j09KK8j59J20J29k52K30J34j76K9j28
7794b1J32L52m17n46O42r6j21J88l28K42Oj77M0K55k21P3J12K23k66r8M8m4P1
7817D9J18k68O8j4j8j57K31J80k97J19n00M59J91k93J9O4k32MK13M4K5j28N2n8
7841a29j33K76r8p3N5K2O6k0Q8p2J97j35k02nJ14L97j70l71J06P5p6k55L44J57
7865A58k20%N8j22K47K52p20K27K23O5q8k5o1p7N2r1K55k11K3K32L7m93L82n0
7889E3l7J29j73n7J90j8k07L8M8K70r0j51j38O0K02j20jJ3j47N7K25K25l99K05
7913A77r0k11J31j26K50p0Q1j38J31K8q6j67j95L47K06m8o94L74J65R1j20l57
7935c21J97m0K90k73J77n0J70l54m7L35o7k92K87J12j39kpJ28j7j10k4l71M09
$$ y = [-6, -25, 103, -174, -103, -119, -6, 138, -16, 40, -275, 131, 22, 24, 52, -107, 13, 142, -110, 120, 254, 78, 107, -21, 111, 463, 46, -500, 142, 46, -75, 113, -215, 27, 33, -144, -104, 151, -70, 3, 115, 338, 72, -26, 22, -22, 49, 167, -101, -33, -47, -65, -222, 9, 189, -108, 11, -489, -30, 161, -132, -113, -49, -281, -277, -64, -20, 5, -123, -71, -129, -262, 14, -84, -157, -102, -80, -14, -34, 54, -18, 179, 44, -158, -163, -49, 348, 178, -193, -87, -12, -88, -343, 1, 158, -62, -62, -4, -126, 121, 373, -347, -120, 103, 168, 80, 55, -6, -83, -31, -122, 133, -78, -55, 177, 214, -279, 103, 53, 16, 145, -28, -85, 105, 87, -120, -82, -34, 236, 146, -5, -143, -83, 119, -1, -2, 11, -136, -79, 146, 371, -28, 177, 87, -124, 7, -119, 131, 61, 142, 4, 135, 163, 77, -90, -285, 62, 268, 220, -474, -100, 65, 156, 36, -321, -124, -164, 126, -147, 30, -20, 150, -204, -251, 84, 17, -275, 12, 124, -15, -17, -24, 104, 87, -23, -47, -418, -9]
7958in3L61l97J58q3L89m86K98j06J07k76J62M3k07L0J91j36n5K07k66Mm54O58
7981H0j5k96J67K10J42j95j46l3J41K8J9rk44m6K09L56l45k20J39j13N1K81k98
8004a37J51J20n1o9Q7Mj22m1Q9k87L75j67k15J29K00k2L8m0L19k90qn9k62M08
8028A50k85k7K01L8q2J90m12N98q5m55M64o8k25l4j31K11J34j29l4J3j4k06N80
8051C92k93J89k11n8k7o4J00J44j17k1J96l49p8K03j2R3j15q8J32L7n6j86K10
8074B1K25k95j1m9J10n3m0M69p1q7l05m6m2R0M0k44N5M10k1m22P3L56l7j17j63
8099a54J95J23L9k43k5q4K48k29j6K07j66j8K36q6l31L00k1q5J31l2k1k49O18
8122C37n22L19j70p4K07k24J21J40k37J83l00j63L72j03Q9l3J31R5q0k95M44l54
$$ y = [-9, -62, 299, -98, 60, -23, 366, -120, 178, 72, 179, -97, 65, 108, -99, -69, 122, -14, -69, 138, -128, -124, -578, 80, 65, -231, -64, 146, 288, 93, -53, -86, 55, 83, 102, 93, -151, -197, 12, 368, 23, -197, -58, -171, -120, 161, -137, 14, 134, 83, 14, 101, 105, -17, -58, 31, -256, 119, -48, -263, -134, 66, 44, 82, 42, 361, 71, 63, 4, -258, 150, -135, -162, 39, 77, -5, 185, -227, 371, 286, -169, 295, 227, 2, -32, -163, 48, 182, 53, 19, 32, 18, -188, 392, 99, 288, 77, 19, -8, -72, 28, 172, 55, 34, 230, -119, -197, 6, -6, 87, -28, -116, 16, 53, -3, -189, 21, 246, -49, -60, -109, 1, -52, -92, 377, 306, 219, -86, -132, -174, -84, -44, -288, -233, 177, 156, -266, -193, 163, 126, 9, -154, 41, 164, 203, -40, -65, -149, 99, -130, -146, 61, -105, -123, 113, 27, -304, -4, -25, -110, 21, -11, -32, -281, 337, -185, 134, -36, -110, 97, -127, -6, 134, -103, 80, -220, -383, -11, -114, -25, -58, 73, 168, 88, -207, 237, -117]
8144a17L22l56O1K52k99L89n36K97J2PO3j35j70L77k46n6K45k10Q3k36O83k44
8166A86k86j1Q9J12k17J73M2j05j09P9R2m4j50J20J14q6k11J09J28j46J42L0j1
8189D0j91J13
$$ y = [-117, 205, -151, -90, 162, -137, 252, -284, 13, 25, 32, 95, -40, -210, 167, -79, -135, 110, -100, -17, -253, 430, 186, -100, -111, -22, 90, -127, 46, 88, -17, -126, -47, 45, 1, -149, -29, 85, -1, -212, -103, 25, -121, 21, 51, 40, -151, -38]
8191c8
$$ Imaginary data points
##PAGE= N=2
##DATA TABLE= (X++(I..I)), XYDATA
0@%%%%%%%%%%%qJ6j6J6j6K4l2L9m7N6o4P2q8J04j20J43j67J91k22K54k88L28l74
34a99M22m74N33n97O69p48Q32r24J026j137J257j391J538j696J870k060K267k499
52a311K755l037L354l712M117m578N115n744O492p403Q538j0003J1977j4793J9167
67A0934k6965M5178j73277j02158J87845K2091K1388N1536J07342l185n6046k6503
79E8180M4586k3616r3591p0909K5028K0232l1031j9063P2530P1218k3677o9457
91c9570J5654O8796r36p9406k1543P4586N7381m4776n1542L4067N7893k6938p1859
104b8193j3304L7459p345n0016j005O2783K6619l9948j6290N5311L6256n2316
116A0011o1991K9743P0813o075o2153J712P6376K9439o3961n8698J5442J9377
$$ y = [0, 0, 0, 0, 0, 0, 0, 0, 0, 0, 0, 0, -8, 8, -8, 8, -8, 16, -16, 23, -24, 32, -32, 40, -48, 56, -64, 79, -88, 103, -119, 135, -153, 175, -199, 223, -251, 282, -315, 354, -394, 438, -486, 540, -597, 660, -731, 807, -889, 981, -1079, 1188, -1311, 1444, -1593, 1761, -1951, 2166, -2412, 2703, -3041, 3451, -3952, 4586, -5417, 6560, -8233, 10934, -16031, 29147, -144130, -246288, -58443, -36352, -14964, 36572, 143914, 140729, 84683, 58180, 102766, 79150, -14441, -85350, -60322, -40090, -71121, -90184, -17654, 53564, 29887, -39570, -23916, 44880, 43944, -35462, -57005, 17581, 74962, 30186, -21356, 12711, 70604, 43666, -28193, -41497, -4038, -11383, -61399, -62404, 379, 26998, -12950, -29240, 26071, 62327, 10011, -51980, -22237, 48576, 42501, -19652, -17940, 58436, 87875, 23914, -34784, -19342, 35]
128C5n1134o0866J6703N9363J5674o927M8896Q3094K1238m8395k3877K5991j5497
141F4298r6874q0428J5820M5912j6183l8142L9000R7526M4145l0810j4125L8194
153F8333J5309n3456n3455P113K2078k6197l3980K6458N0637p353m7030K120N0214
166B0791O711n8064k9334N1563N1141k3581m1125K5476N6286l940n6769k0801
178b1646L0997O538m2782k1144L5545K8174k4103k2566L0414L3538k7916m9602
190d4553J1348N2119M662m2691r90O2987M0246l5190m4808J1857K0666l9446o6153
203f9946j4783L1021Q348j6915K0232O6212M1417j1111m834L1811R491n6729o5040
216c0826n312K1237k4642m9867P859O5686L7153k0848j0513M0516L3548k6682
$$ y = [35, -51099, -111965, -95262, -35899, -20225, -27152, 21744, 104838, 126076, 77681, 53804, 79795, 64298, -32576, -113004, -97184, -51272, -67455, -105597, -66597, 30929, 75074, 44264, 30139, 68333, 83642, 30186, -23269, -16156, 5922, -20275, -54255, -27797, 22840, 15487, -31543, -29423, 20791, 27502, -30562, -59896, -8333, 42808, 19227, -21898, 3578, 59864, 55924, -845, -21646, 9351, 15889, -26893, -48037, -12492, 15682, -8421, -30987, -573, 32965, 5049, -44553, -33205, 18914, 23576, -19115, -20105, 42882, 83128, 47938, 3130, 14987, 35653, -3793, -69946, -84729, -53708, -45360, -62275, -42043, 24169, 65586, 54475, 49641, 81452, 90943, 34214, -30826, -36138, -14901, -39543, -89410, -81551, -15865, 21288, 440, -10073, 30443, 63991, 37309]
228C7309m3387L004K5003j3203l4100O383L6876L127l4223q479L2986J0124m2734
241b1314l1018L0993L9666j4790l3528J7254N1630Q658m1381j8656K8641J3976
253C0131l2785k8008K0577K7480j3112k4201J3538K7913j4433m0919l500L2534
265d785N995l2252m938N0022M3315j3441k7085J7201K8897k3310n9786k7120J3607
278c3680j947l1420o333M3370M0855K435J730L5381K9858k2408m4917p354J5482
291B1052k1892n1272j1617L9773K5679k0768j4052L3890L7466j2596l4855K533
303f659K7209l060k9989l342L0076J2562k4692j3149K3491J2560l0256l1068J4183
316b2134K9074r968l0902Q074M3657J3932l0011j5809K5840J9083k3606k8424
$$ y = [37309, -6078, -3074, 21929, 8726, -25374, -18991, 17885, 21012, -13211, -21690, 11296, 21420, -21314, -52332, -21339, 18327, 3537, -29991, -12737, 38893, 47551, 6170, -12486, 16155, 30131, -2654, -30662, -10085, 17395, 4283, -19918, -6380, 21533, 7100, -33819, -37319, -4785, 1210, -31042, -35980, 14042, 57357, 43916, 16831, 34032, 62929, 39619, -20167, -47287, -33680, -35627, -67047, -73380, -30010, 10845, 13280, 15010, 50391, 80249, 57841, 12924, 5570, 21052, -840, -52112, -63729, -23956, 1723, -19045, -33097, 793, 38259, 25663, -9192, -6659, 20550, 17490, -12499, -15841, 14235, 26797, 2105, -11044, 12447, 25007, -5249, -36317, -22134, 6940, -3028, -33930, -25856, 17801, 31733, 1722, -14087, 11753, 30836, 7230, -21194]
328b1194J2782K8486m708k3895O127K5875l826l4877j4401J8520M776l0382j4980
341e1697L4098M0229k062j5015K1726L8601l748m5199k5326R370m930m0181k6228
354g0362K0918L1409J144m030K9231L9625N65k6572l397J8199j0293m2288k0805
367c6656K2339J8081k0045j9501K2397L4428n773k9305p32K6288L994k5968r656
380b0109K5839J8381j5922j4163J6826J8374j8402k9181L395K2593o374k9202
392b7945o63L3075J5192k2930j6419K1308K2094j6980k8085Q275K8897J664k0319
405b836K012K7219O738k6912j9099J0470L771k8662k5421J6177L0278J504j1832
418a6593J9417M2228J2387k6446j6567J2500K91l6293l4623L689J9488m971j4144
$$ y = [-21194, -8412, 20074, 15366, -8529, -2402, 23473, 19647, -15230, -29631, -11111, -6335, -36717, -51697, -17599, 22630, 20568, 5553, 27279, 65880, 62132, 16933, -8393, 977, -3953, -44134, -70362, -49444, -18035, -16891, -20921, 8310, 47935, 48500, 21928, 18531, 36730, 26437, -15851, -36656, -14317, 3764, -16281, -35782, -13385, 21043, 15270, -14035, -14767, 11521, 15515, -10453, -20109, 5730, 24111, 8189, -5974, 10852, 29226, 10824, -18357, -14962, 7631, 1257, -27945, -28608, 4467, 19659, -3271, -19690, 1618, 23712, 6732, -21353, -13078, 15819, 17483, -2836, -824, 26395, 33133, 6221, -12878, -2408, 1363, -27299, -52720, -36543, -6265, -4761, -16593, 2824, 45052, 57439, 30993, 14426, 26926, 27217, -9076, -43699, -40010, -20522, -25493, -39637]
431c9637J7093L6750J1848j5330p96K0978L636k9214k1596J2988J5621j6635k1851
444b6145J2316K8238j080k6314m707K2520P314k3652j3714K0293K1067r846j5147
457h857J2986K2869p525k5768k036J9473j280k5662q218K3886J5706j7616j7527
470a9569J4870K0745j2121k6767K216K5313N930j7260p3K7516J6287j6563j7204
483C320P989O483k3509l0510j97J8301o04j4962J0170L7402K0749j1367p645J6895
497C2515J0679k4883l2862l477J1996q857k2293L730K8302J3406j1007k708K1311
510A5852J2913j8383j9412R150J5563r913k1398N062K3976K840k2410q427J8271
523C684Q526k0081j7502J3674J9814o168j5731Q834K3593N86k0654m965J6922
$$ y = [-39637, -22544, 14206, 26054, 10724, 9928, 30906, 34542, 5328, -16268, -3280, 12341, -4294, -26145, -13829, 14409, 13329, -12985, -17692, 4828, 12142, -11510, -25224, -4931, 16136, 6290, -8857, 4129, 26998, 19473, -6295, -8331, 11142, 9862, -15800, -24018, -132, 15574, -2042, -19569, -4699, 16046, 3925, -22842, -20626, 4687, 10617, -6643, -6716, 20800, 37087, 20524, 3320, 11309, 17792, -5717, -36227, -36424, -18123, -18727, -33689, -23519, 13883, 34632, 23265, 15620, 32515, 43194, 18311, -14551, -18028, -6032, -14889, -37182, -33452, -5150, 8256, -2751, -5459, 15852, 28765, 10382, -9030, 120, 15683, 5770, -15628, -10566, 13410, 16250, -6160, -14587, 3684, 12210, -7871, -25373, -11699, 8115, 1947, -13784, -4950, 18643, 19229, -1425, -6390, 10532]
536A0532M924j9963j2555J6082J6460j1352j7380Q555J8031p096k4771m725J8415
549d843O343j5396m123K4322K1437o619j2093R367J2730j4233k9875r133J0367
562a1749l765k0192j758K6389K1553m120m615J9327J9260j1520k5876l840J0500
575I594p496k4797o689J9618J2167j1332o723J7656J6959j0553j7109N192J6486
588A2973m177j8659j74K0816O818j7025r622J3835J0206j5574j8239O504J7173
601D855m275j5824L120K0656O009j5985p086J4386Q872j4564j3658J1403J6993
614A4902n587j5425M294J6877j875k2283r840J1919N299j5738r170J6873K1840
627A2086l45q961J0635J9337l560k3019j1444P437l084k2294j2217J4941J6766
$$ y = [10532, 15456, -4507, -17062, -980, 15480, 4128, -13252, -4697, 13334, 6238, -18533, -23258, -4843, 1500, -13896, -18019, 6303, 27740, 21121, 9028, 18395, 31125, 16892, -12983, -22116, -11749, -15514, -35706, -37464, -11075, 10478, 6358, 1743, 21070, 40330, 28810, 2934, -906, 9594, 2098, -22699, -29388, -9770, 2397, -8935, -15658, 1998, 18957, 8404, -8705, -3513, 12973, 8796, -9863, -10037, 10779, 17597, 572, -9050, 4785, 14991, -583, -18822, -12318, 4855, 580, -15244, -12124, 8532, 14541, -1444, -8530, 5856, 14728, 164, -13494, -2091, 14902, 9315, -6110, -1816, 15061, 13186, -9097, -18937, -7018, -1719, -17457, -26627, -9754, 12086, 11741, 2780, 13415, 32752, 29192, 6173, -5271, 2166, -918, -23212, -35429, -20488, -3722]
640c722l369o228J6267K2483j088j7059l151J2236k295k1376j1047J2042J0489
653D182j0372j0163J1347J6162m419j6348J642J5357N75j6088l821J6745J0182
666A4981j1055j0161J0549J1974r380j7808J564J3900j057j5888j698J7101P840
679A0862j2895r231J1395J1098j0385j3829O739J6596P1j2792J273J7109L707
692A9718j7845j1549P319M615j5408j4714Q635J7670J632p801R054K1449N343
705B8118j4653q274P241O27j9308j7163N592J1909m403r609Q886K0740N237j1920
719C020k407J3066L684j5726j1963P598J0384p543j2345O155J5001j698j4544
732g318k666J2768L648j3615o686J2488J1898o888j0589P856J3851m341j5616
$$ y = [-3722, -7091, -13319, 2948, 25431, 24343, 7284, 4133, 16369, 14074, -7302, -18349, -6307, 4182, -6190, -16353, -5006, 11156, 6737, -9611, -7969, 7388, 7963, -8125, -11946, 4799, 14981, 3926, -6235, 4314, 16288, 6908, -10900, -9336, 4564, 3507, -12381, -14079, 3022, 10862, -2033, -11264, 131, 11229, 844, -12985, -6246, 10350, 10421, -2371, -1098, 16011, 19718, 1873, -9676, -2357, 2258, -13150, -27864, -19229, -1559, 73, -7728, 1326, 22775, 28118, 13465, 5191, 12432, 13059, -6249, -23412, -17820, -5911, -10314, -19923, -11037, 9703, 14940, 3020, 613, 13679, 17363, 1637, -10326, -2728, 7656, 113, -12232, -6077, 8924, 7226, -7318, -9984, 2784, 6432, -7183, -13869, -1381, 10517, 3629, -6960, 896, 14747, 10406, -5210]
745e210j163J2400J016j3952n507J3240R423j0358j0673P821J0583o222j4961
758a3563K183J4830L201j0410k12J6456Q271j0569j1072M927N799j2360j7772
771b0291K42J2722P80r223M553J9468J0616p440n528Q656O461j3363j7473l9Q751
786a108m463j2663J824J6284P330r052l494J2614P637j0743j1539N825J0403m602
800D253j2519K339J3920J710j3204m760R984N270j1271r505Q063J1914m098j0263
814h167N041J3647o3j2829l219J0551M336j1535p540R742R841o067j0713L625
828c350J0560l942j3906l086J1781L984r136k538J3914J2022m741q879M931Q449
842A6063p741j7322m591Q224l85j1150k068J5032J2431m166m087R070J0559o306
$$ y = [-5210, -6373, 6027, 7043, -6909, -12416, 824, 10247, -111, -10784, -2963, 7620, 1398, -13563, -11380, 3450, 6651, -3759, -3971, 12485, 20756, 10187, -885, 4042, 9841, -2519, -20291, -20049, -7327, -6547, -15770, -11217, 8251, 18867, 11427, 5899, 14555, 21016, 7653, -9820, -9859, -1108, -5571, -18234, -16410, -126, 7204, -1848, -5342, 7272, 14909, 4166, -7373, -1548, 8855, 4253, -8266, -5927, 7993, 9703, -3501, -8261, 1723, 6993, -4278, -13783, -5720, 6194, 2096, -8167, -3126, 10521, 10458, -2371, -5590, 4961, 9297, -2238, -9778, -36, 9805, 3738, -6975, -3350, 7210, 3268, -10638, -13724, -1943, 2041, -7095, -9633, 4281, 16303, 11562, 2683, 7614, 16063, 8322, -9000, -13591, -5367, -5752, -16902, -18970, -3938, 8493, 4327, 240, 9310, 19869, 13563]
856A3563j4718j830P746k737j3705l055J1717O897p274n435R526R846o358j0931
870f748L139J1020j566j1403k23J1724M614j0063o672Q115O247q174j0765M277
884f478J0030j855r462J377J1673L232j0162n157Q852O221q160q210O550J0803
898I254k254j0285J385J0036r43j3134n571P605L817q561n423R738J3132j210
912G586o801N275J1150k419j3993o097N279j47j1517p244R404J0498k533n018
926f577P792J2466j020j1047k236P977O0j1796o160Q128O725o286p094O379J0055
941G366l197j0565Q10R488J314r719k650R846O854p058p168O147P652n325j0537
956f742J024Q896or192j743R770N003p953o396O567O908n591q777M323J0425M37
$$ y = [13563, -1155, -2985, 4761, 2024, -11681, -14736, -3019, 3878, -3396, -8831, 695, 10541, 4183, -6748, -3609, 7411, 5845, -5558, -5781, 5943, 10557, 494, -6178, 1937, 8184, 10, -10755, -6478, 3552, 1697, -7765, -6388, 5285, 8517, -1645, -6802, 2050, 8271, 111, -8099, -1549, 9254, 7000, -3285, -1900, 8136, 7193, -5941, -11512, -3907, -90, -8651, -14074, -4336, 8796, 7586, 785, 6060, 17210, 14791, 798, -5299, -20, -167, -11684, -18928, -9524, 974, -1559, -6577, 1215, 13681, 12661, 1614, -622, 7355, 7415, -4381, -10541, -2413, 4312, -1974, -9068, -2689, 7366, 4169, -6396, -5586, 3902, 5216, -4503, -7153, 2693, 9547, 2489, -4679, 1468, 9120, 3795, -6742, -5718, 3178, 3172, -6020, -7763, 2007, 7010, -943, -7339, -772, 6136, 545, -8232, -3909, 6516, 6953]
972F953q198J30R936K464j0901p503M765L727q230q471M953J1591J018n490L927
987F71J1867K730r401n745N014J849j0632r879L864Q510k522o073M078J2116K747
1002I194q093k650P799K660q324p633N648O670m226p701L023R182j166r122j627
1017f366P927K641p783m776P768P479m420o899M251Q233k131r616j218Q191J421
1032D702q201l474P708N627n958o674M143O646l738q858J215R570K199o713n44
1047b350R255N304o927p560K994M632o712j0662R42Q307J170n811J618J1111O311
1062A1622n683m359N067M257p698j0152O78O306j693p835J268R692L520n691k839
1077c540O551N079n772p476L266P195k026p693N77Q628J142q093l550O640L463
$$ y = [6953, -1245, -1115, 8821, 11285, 384, -7119, -2354, 1373, -6857, -15328, -10375, 1216, 2234, -3256, 671, 12538, 15268, 5867, 122, 5136, 6985, -3647, -13526, -9662, -1152, -3674, -9747, -5669, 6447, 9194, 1101, -1549, 6250, 8910, 586, -7047, -1399, 5271, 1045, -6656, -3633, 5549, 4383, -4739, -6366, 1561, 4202, -3581, -8357, -589, 6890, 2470, -4429, -178, 8055, 5924, -3692, -4910, 3281, 4702, -3499, -6973, 735, 6362, 404, -6270, -2127, 4519, 781, -8077, -6862, 2708, 4907, -1806, -2350, 6905, 12209, 5282, -2278, 716, 5348, -1364, -12026, -11084, -2777, -1607, -7418, -5800, 5311, 11622, 5939, 1580, 6647, 10904, 3206, -6946, -6268, 38, -1655, -9490, -8222, 1470, 4990, -701, -3540, 3011, 8090, 2318, -5158, -1892, 5303, 3277, -4416, -3839, 4789, 5931, -2162, -5712, 928, 4391]
1092D391o483o046N213P771k863o512K096Q226L51q135k602P088L136o413m810
1107e592N621O654l541p356J671O524j852q706j914P599L055n085k242Q063P573
1122A0472l661o449K512N399m092j0423k287N479J257o743j694R303P386k790
1136C669m246N063O368l777r595j015N962q85p723k175P664M565n192m067N181
1151b03O348l501p356J696P332n25o951p90P111L653o686m419M800M527m830o653
1167f447K676O990p29o699k65P639K157o801l641N640M468m349n593L967P367
1182F380j257p056K55O261k08q028m017M780L485m756m230O444Q224o47n134K460
1198B956O630j355r061m221M147J538o809m555N712O949j094m490L955Q026r86
$$ y = [4391, -2092, -8138, -2925, 4846, 1983, -4529, -2433, 5793, 6144, -1991, -4593, 2495, 5631, -782, -5592, 29, 6683, 3142, -4214, -2543, 3981, 2129, -6577, -8491, -892, 2163, -2922, -5164, 2899, 10472, 6811, 362, 2874, 8273, 4181, -6242, -8529, -3050, -1793, -8536, -10230, -927, 6459, 3669, -577, 4486, 10854, 7077, -2518, -3533, 2429, 1544, -6179, -8354, -690, 3875, -1317, -5384, -203, 6145, 2644, -4712, -3016, 4316, 3791, -3160, -3950, 3161, 6814, 128, -4291, 509, 5036, 206, -6447, -3771, 3219, 2490, -4209, -4474, 3165, 5322, -1479, -5120, 520, 4988, 639, -4954, -987, 6380, 5123, -1933, -1678, 4583, 4375, -3653, -7670, -2890, 595, -4161, -8391, -1947, 6277, 5630, 496, 2956, 9586, 8231, -830, -5051, -904, 634, -6175, -10730, -5018, 1931, 837, -3653, 302, 8328, 7342]
1213G342p254j565M833J108p052l973N300N098l670n517L278O646j701o791m53
1228d371O486J724o051k296N859M825m377n079L217N486k974p032L96O554O44
1243C011o207j748O200L770n553m616L852M914k792n818K134P484N83n598q19
1258a203O087J867o898n443L391L141m432n766L469P716J071m271J275P295K128
1273I427o597m323L121K006n793o080K178O196o31m760K002P655J732n954j772
1288a593M431K930n546m899L402N242k414n315J225N821k6n953j908N365K536
1303C298m895l448M604N114k747m686J619N816p63o336j468N743J894n372k765
1318d392M611M470m056n278K031N186j574n988K65O254K671m413j432N959L473
$$ y = [7342, 88, -1477, 3356, 4464, -2588, -6561, -1261, 3837, 167, -5350, -2072, 4574, 2873, -3918, -4371, 2115, 3839, -2212, -4508, 1351, 6176, 1799, -3280, -63, 5423, 2449, -4583, -4187, 2367, 3011, -3196, -4944, 1256, 5026, -527, -5143, -1291, 3623, 831, -4987, -2853, 4631, 5214, -384, -1203, 4884, 6751, -147, -5590, -2199, 942, -3490, -9256, -5787, 1929, 3000, -1271, 4, 7299, 9427, 2830, -1493, 1628, 3634, -2159, -8239, -6061, 135, -496, -5256, -3254, 4401, 6133, 179, -1593, 2838, 5768, 222, -4677, -1275, 3967, 1553, -3762, -2537, 3284, 3258, -2695, -4603, 762, 3298, -1597, -5045, -441, 4673, 1926, -2760, -1141, 4675, 3912, -2424, -3892, 1851, 3745, -1627, -4392, 219, 4689, 633, -4645, -2614, 2572, 998, -4990, -4725, 1529, 4200, -213, -1645, 4314, 7787]
1333G787m827n367J476L577l512o829K80O279J743m106J00O862M478m033m013
1348a05K782L046m053o564M9N222k38n046j75O387K965m053l450M654L776l770
1364A427n027K060M839m33n384j89N603J549n630l158M044L554l864m219K989
1379a839M901j079m860Q69N250P94n551j808M515K823l897l771L305N126k532
1394B246n310O89M325m29n910j411N165L259l641k236N292M853k458m601J160
1409I93L670k265o852j628M004J740l858j462N058N145k028l271K375M606k186
1424D041o341p37M196O20m904k025M693L554l045l755L217M439k291m853M40N327
1440B576N29m674j546N059K506m369l280K776L656k726m416J044N034m5m476o36
$$ y = [7787, 2960, -2407, -931, 2646, -866, -7695, -7415, -1136, 607, -3499, -3399, 3463, 7941, 3908, -105, 2677, 5723, 1670, -4894, -4845, 377, 139, -4907, -5082, 1305, 4270, 217, -3233, 1421, 5197, 1427, -3600, -1540, 3299, 2866, -2518, -2707, 2896, 4445, -1185, -4343, -299, 3255, -609, -4828, -1839, 3062, 1983, -2877, -2008, 3242, 4036, -1515, -3323, 1192, 4015, 118, -3653, -348, 4778, 2246, -3064, -2375, 1950, 1521, -4389, -5800, -635, 2624, -1017, -3253, 2039, 6892, 4434, -167, 993, 4663, 2398, -4454, -6082, -2078, -338, -4196, -5658, -600, 4545, 2517, -754, 1621, 6227, 4041, -2300, -3037, 1159, 1779, -3125, -5150, -457, 3097, 52, -3703, -486, 3953, 1662, -3191, -2751, 2576, 3105, -1569, -3115, 1944, 4450, 81, -3199, -423, 3233, 507, -3909, -2865, 2169, 2124, -2352, -2988]
1456b988M880J824m165l330L690L512k784l809K571M827n26m707o73L948M35n049
1472b344l606L982K720k940k487L317N834j82m083N89M889m94o054l322L161J614
1488E94m028l240M028M805r43l550J874N449j95n291j683L925J404m295l325L366
1504a105M003k310l965J766M462q85m436q62M686J280m000j645M165L086k717
1519A523l898J600M404j578n106K40M526J155m645j592M153K242l082l536K084
1534a510L905j810l917J530M719J192m208j093M249J357m531m146K361K702k518
1549a718m058J970N349R76l219N89M427J719m462l415K212J736l101m375J684
1564c686M172k1l532Q06M920J342l766k298L359K467l694l430K207L983j359m120
$$ y = [-2988, 1892, 3716, -449, -3779, -89, 3423, 639, -3170, -599, 4228, 3702, -1005, -1678, 2270, 2705, -2344, -5950, -1968, 752, -2188, -4675, -1358, 4476, 4294, 211, 800, 5689, 5195, -859, -4181, -1020, 594, -3434, -6674, -2646, 2159, 1216, -2334, -460, 4989, 4794, -497, -2180, 1745, 3149, -1146, -4471, -1105, 2898, 588, -3377, -1611, 2851, 1966, -2470, -3332, 1354, 2634, -1366, -3011, 1154, 4240, 1523, -2375, -775, 3629, 2051, -3055, -2815, 1711, 2866, -1779, -3371, 782, 3024, -58, -3594, -1510, 2395, 585, -3332, -1802, 2917, 4109, -99, -1192, 3057, 4414, -117, -4263, -1902, 800, -1718, -5776, -3806, 1543, 2519, -700, -111, 4316, 6035, 1573, -1842, 370, 2106, -995, -5370, -3686, 486, 465, -3067, -2261, 2659, 4001, 235, -2063, 1296, 3763, 69, -3361, -1154, 2829, 1470, -2650]
1580b650M54M298M46m287j592L336K553l120k866K873L916j658l813J055M003
1595B948j37m716o24L670K220l760k571L155L264k870l557R13L514p50l889J74
1611c016M460J881l236j135L738K540l337l839J022K940k164m892p9M735J323
1626I41k861k66M324L039k805k979J615K710k371m835L98L569K96l571o27M249
1642H26K012k948k372K827K968k321l864J339L780L2l983j24L444J220l561k322
1658c047K866K251k475k980J905L766j032l301K32M029N90l811j820L537K297
1673C007k673k960K478L126q21m067l26L388j3l945j360L387K490k447j376L448
1689A336L178j349l660Q39K516q76m789j730L670J399k972j445L537L737j321
$$ y = [-2650, -2196, 2102, 2548, -1739, -3331, 5, 2558, -562, -3428, -555, 3361, 1703, -2110, -1055, 2948, 2811, -1905, -2529, 1141, 3361, -399, -2970, 185, 3449, 579, -2978, -2065, 1449, 699, -3190, -3016, 1444, 3325, 89, -1046, 2692, 5232, 1895, -1944, -922, 2018, -146, -5038, -5117, -382, 941, -1920, -2186, 2138, 5177, 2372, -607, 1008, 3718, 1347, -3488, -3090, 479, 775, -2796, -3423, 826, 2838, -110, -2482, 345, 3313, 992, -2872, -1533, 2247, 2279, -1704, -1828, 1616, 2836, -725, -3047, -181, 2070, -405, -3385, -1480, 2286, 1254, -2047, -1815, 2214, 2804, -1007, -2827, 710, 3007, 334, -2626, -148, 2978, 2157, -1910, -2236, 1152, 1139, -2806, -4166, -779, 1711, -736, -2112, 1336, 4514, 3165, -495, 344, 2860, 1984, -2805, -4535, -865, 534, -2438, -3883, -346, 3391, 2070]
1704B070l019J276L213o85m155j101L388J68k956j471L151K465k330k371J680
1719f77L352j424l743P61L397R38l723j246L596J779k537k720J751K531j386l286
1735b637M68L679K36l268n87L065J361k731k524K688K923k154k832J428L966j77
1751B904l679o71K862P97l760k502K495K196j839j950K302L809m98k470N57K833
1767C386j33l926k282K315J660k868k494K552L714o86k733Q17L523K65l468j326
1783a684K274J808k987k216K290K362j372k684J077L275p05l448m85L302J273
1798B080k895j730K987K709k029k997J027K879m01l329l02K793J209k843j304
1813b146K804J463k496k264J795K746j492k996J041L628J026l378q65K842J894
$$ y = [2070, -949, 327, 3540, 2855, -1300, -2401, 987, 1155, -1801, -3272, -121, 2344, 14, -2357, -677, 2675, 1251, -2492, -1731, 1666, 2604, -1119, -2365, 1231, 3010, 473, -2247, -496, 2035, 649, -2637, -2169, 1510, 1746, -1522, -2109, 956, 2317, -414, -2938, -250, 2673, 519, -2313, -885, 3081, 2904, -775, -1446, 1416, 2213, -1547, -4049, -1554, 642, -1197, -3147, -845, 2964, 2466, -4, 553, 3386, 3253, -673, -2955, -640, 1020, -1848, -4342, -1790, 1924, 1238, -1495, -678, 2845, 3110, -358, -1684, 590, 2398, -589, -2805, -515, 1847, 475, -2209, -1132, 2143, 1438, -2010, -2495, 807, 2080, -815, -2545, 442, 3151, 1122, -1875, -848, 2031, 1630, -1699, -2001, 792, 2001, -842, -2146, 658, 2121, -375, -2639, -844, 1902, 410, -2586, -1545, 2083, 3109, -269, -1134, 1708, 3602]
1828C602l546k813J201K295j359l024J081L757N76k162K02K836J263l054k232
1843a377K017J206k654k700J482K951l22k702J78L452J350k824j790K355J995
1858B617k167k894J863K565r77k809N59K809P8l337o66K693J617k475k291K494
1874c21K829j041l270O49L133k9k919q68K501J231j962j599J627K350j596k803
1890b088Q68K598r51l029K63L355J104k169j400K972K168k042l289N63K554j161
1906C16l130n44L182Q78j927n36L029J915k276j499J193K042j762l487Q69K832
1922A095j28k727j026L434J327k230j590J679K240r96k655O03K621k27k684o0
1938a324K512Q06k745j142J825J818j849k248J290L123p48l192L86K683Q50k591
$$ y = [3602, 56, -2757, -1556, 739, -620, -3644, -2563, 1194, 1770, -392, -190, 2646, 3909, 855, -1377, 640, 1846, -808, -3508, -2026, 925, 603, -2099, -1921, 1531, 2881, 57, -1733, 622, 2617, 450, -2444, -581, 1984, 1007, -1802, -1243, 1566, 1644, -1693, -2359, 334, 1951, -524, -2815, -321, 2508, 1467, -1803, -1154, 1979, 1950, -969, -1837, 664, 1895, -67, -1666, -39, 2311, 715, -2088, -1220, 1378, 427, -2602, -2339, 1016, 2120, -49, -1449, 1523, 3691, 1649, -1640, -1077, 1477, 316, -2814, -3358, -176, 702, -1225, -1761, 1268, 3183, 907, -592, 601, 2643, 881, -2606, -1737, 1095, 967, -1760, -2786, 648, 1975, -255, -1845, -166, 2074, 1078, -1577, -974, 1647, 1420, -1264, -1324, 1188, 1994, -751, -1893, -68, 1750, -99, -2347, -1057, 2066, 1318, -1874, -1488, 1195, 2045, -546]
1954e46j540K073K072j613k038J701J947p54k405l36K302m7k991o88K809J544
1970A490k157j054K133K690q48k980M98K573q24l264j094K228J183k058j119K323
1986b80K319r89j971J131K393j127k703q1K164N41k706j372K817K000j829k249
2002a942J359K268o86k715K43K725K75k532m93K168J428k004j761J489K116j633
2018C05k240M55K869j35k574m19K510J178k475j720J707K145j369j896J046K621
2034B008k65k120n99K338J87k590j614K126J291j639j712J876K992l66k750O20
2050b17K552j05k650j395J780Q77j742k018J615K491l83k194Q66K282j04k341
2066f86m34K030J138k537j408J930J852j132k520P42K284J15k707l19K088J246
$$ y = [-546, -2086, -13, 2059, 446, -1592, 109, 2056, 1302, -1103, -1439, 863, 816, -2175, -2863, -54, 1490, -667, -1721, 412, 3102, 2254, -726, -228, 2345, 1521, -1743, -2837, -609, 574, -1484, -2603, -280, 2039, 1050, -921, 210, 2603, 1476, -1227, -1308, 856, 1397, -1309, -2681, 136, 2136, 307, -1942, -583, 1685, 999, -1716, -1473, 1252, 1527, -1005, -1498, 670, 2098, 94, -1667, -178, 1938, 305, -1935, -1480, 1389, 1254, -1320, -1739, 771, 1949, -526, -2246, -539, 1606, 237, -1659, -613, 2008, 1743, -377, -976, 1362, 1549, -1041, -2655, -529, 762, -877, -2589, -713, 2279, 1913, -837, -217, 2335, 2230, -420, -1815, -35, 842, -900, -2918, -1303, 1188, 805, -1389, -523, 1759, 1655, -686, -1120, 910, 2048, -489, -1897, 33, 1885, 753, -1767, -1025, 1259, 1374, -1333, -1652, 436, 1682]
2082A682k056j494K076J644j502j348O16J861p29k169J64K574J93k255p99J864
2098C22J621j964k180J516J982j023j952M65K680L62j695r64K203P77k399j594
2114a843J317J206j330k026J166K841l0k017l97K865R43k304j827J831J110j328
2130A77k505P90K249k63j855J78K143Q78k221p81J840R86j666j898J505K060q25
2147G92k383P23K262O5k172j064J702J642j651j638J425K024q69k309N55K262
2163A366j64j876k84J838R71k205r54J413J869j551k089Q69J820n39k396K34K228
2180E50R66j636r67K032J236j363j815Q22J160q01k002J69J761O36j910n72K770
2197A036J205j682j500J303J658j122k472JK365l4k166j36J590J328j555j169
$$ y = [1682, -374, -1868, 208, 1852, 350, -998, -382, 1479, 750, -1419, -1255, 1319, 1512, -743, -1542, 322, 1943, -21, -2201, -685, 1297, 274, -1678, -1213, 1467, 1829, 134, -830, 1373, 2150, -249, -1843, -526, 680, -650, -2676, -1510, 1331, 1301, -716, -1113, 1752, 2695, 391, -1436, 395, 1505, 177, -2328, -1538, 711, 448, -1407, -1229, 914, 1792, -429, -1210, 630, 1616, -50, -1948, -443, 1617, 792, -1591, -868, 1394, 1459, -713, -1777, -75, 1567, -84, -1722, -297, 1727, 858, -1451, -896, 1366, 1202, -674, -958, 880, 1851, -354, -1308, 105, 1974, 423, -1666, -797, 1023, 484, -1912, -1678, 550, 1516, -120, -1087, 945, 2181, 818, -997, -175, 985, 184, -1818, -1649, 112, 748, -1162, -1734, 1036, 2241, 559, -941, 362, 2020, 898, -1574, -1573, 792, 758, -1408, -1544, 46, 1374, -181, -1350]
2213a350J431J559j326j874P70K100n21j657l51K145N26k057r23J727J461j746
2229h6j545P65K083m22j991J3K149J85j930o01J605J113j223j318J297J690r29
2246H55j874K03J685j27k099p97J999J331j791o91J364J663n22j954N74J620j97
2263A242k298q14J880R38j995q65K047J316j041j536R46K025p71k330J88K014
2279I46L91j810j308J888J030j230j542J488J336n89j931L67K284m27j561l23
2295i91J560J099j838r57J264J418j209j455M11J706O6k164k7J688O69j529j332
$$ y = [-1350, 81, 1640, 314, -1560, -790, 1310, 789, -868, -1219, 926, 1452, -605, -1528, 199, 1660, -86, -1631, -866, 1217, 795, -1196, -1183, 966, 1151, -779, -1380, 225, 1338, 115, -1203, 94, 1784, 855, -1019, -816, 869, 742, -1357, -2154, -155, 1176, -615, -1306, 58, 1721, 1199, -755, -181, 1439, 1242, -1056, -1870, 10, 948, -1047, -1912, 135, 1451, 410, -1126, -180, 1845, 1074, -1256, -1068, 946, 1337, -473, -1781, 107, 1137, -93, -1635, -147, 1189, 600, -1331, -964, 1320, 893, -668, -991, 569, 1668, -170, -1127, 137, 1555, 346, -1109, -698, 1008, 1074, -1090, -1117, 571, 1240, -289, -1621]
$$ [...]
8191a25
##END NTUPLES=NMR FID
##END=
