##TITLE=1H_07-2025
 CDCl3
 8 sc, 
 14.1.2025
##JCAMPDX= 6.0         $$ Bruker NMR JCAMP-DX V2.0
##DATA TYPE= NMR FID
##DATA CLASS= NTUPLES
##ORIGIN= UXNMR, Bruker Analytische Messtechnik GmbH
##OWNER= root
$$ XWIN-NMR		Version 3.5
$$ Tue Jan 14 14:16:04 2025 Russian Standard Time (UT+4h)  she@DPX200
##.OBSERVE FREQUENCY= 200.1315
##.OBSERVE NUCLEUS= ^1H
##.DELAY= (6, 6)
##.ACQUISITION MODE= SIMULTANEOUS
##.ACQUISITION SCHEME= undefined
##.AVERAGES= 8
##.DIGITISER RES= 18
##SPECTROMETER/DATA SYSTEM= spect
##.PULSE SEQUENCE= zg30
##.SOLVENT NAME= D2O
##.SHIFT REFERENCE= (INTERNAL, D2O, 0, 15.7039)
##AUDIT TRAIL= $$ (NUMBER, WHEN, WHO, WHERE, WHAT)
$$ ##TITLE= Audit trail, XWIN-NMR		Version 3.5
$$ ##JCAMPDX= 5.01
$$ ##ORIGIN= Bruker BioSpin GmbH
$$ ##OWNER= she
$$ F:/spectra/data/she/nmr/H-F/1/audita.txt
$$ ##AUDIT TRAIL=  $$ (NUMBER, WHEN, WHO, WHERE, WHAT)
(   1,<2025-01-14 14:14:09.39 +0400>,<she>,<DPX200>,
      <created by zg, POWCHK disabled, PULCHK disabled
       configuration hash MD5:
       00 E9 B6 7A A2 85 ED C7 34 08 36 98 17 FE 4E 26
       data hash MD5: 16K
       99 7C 84 08 57 30 2F 4D CB 4B E3 D1 DE 94 6C 2B>)
$$ ##END=
$$ 
$$ hash MD5
$$ B9 D7 09 04 09 9B 34 17 F3 FF 88 BD 82 78 2A 40
##$RELAX= 
##$RELAX= 
##$RELAX= 
##$RELAX= 
##$RELAX= 
##$RELAX= 
$$ Bruker specific parameters
$$ --------------------------
##$DU= <F:/spectra>
##$EXPNO= 1
##$NAME= <H-F>
##$PROCNO= 1
##$TYPE= <nmr>
##$USER= <she>
##$AMP= (0..31)
100 100 100 100 100 100 100 100 100 100 100 100 100 100 100 100 100 100 
100 100 100 100 100 100 100 100 100 100 100 100 100 100 
##$AQSEQ= 0
##$AQ_mod= 1
##$AUNM= <au_zg>
##$AUTOPOS= <>
##$BF1= 200.13
##$BF2= 200.13
##$BF3= 200.13
##$BF4= 200.13
##$BF5= 200.13
##$BF6= 200.13
##$BF7= 200.13
##$BF8= 200.13
##$BYTORDA= 1
##$CFDGTYP= 0
##$CFRGTYP= 5
##$CHEMSTR= <none>
##$CNST= (0..31)
1 1 145 1 1 1 1 1 1 1 1 1 1 1 1 1 1 1 1 1 1 1 1 1 1 1 1 1 1 1 1 1 
##$CPDPRG= <>
##$CPDPRG1= <>
##$CPDPRG2= <>
##$CPDPRG3= <>
##$CPDPRG4= <mlev>
##$CPDPRG5= <mlev>
##$CPDPRG6= <mlev>
##$CPDPRG7= <mlev>
##$CPDPRG8= <mlev>
##$CPDPRGB= <>
##$CPDPRGT= <>
##$D= (0..31)
0 1.2 0 0 0 0 0 0 0 0.06 0 0.03 0 0 0 0 0.0002 0 0 0 0 0 0 0 0 0 0 0 0 
0 0 0 
##$DATE= 1736849648
##$DBL= (0..7)
120 120 120 120 120 120 120 120 
##$DBP= (0..7)
150 150 150 150 150 150 150 150 
##$DBP07= 0
##$DBPNAM0= <>
##$DBPNAM1= <>
##$DBPNAM2= <>
##$DBPNAM3= <>
##$DBPNAM4= <>
##$DBPNAM5= <>
##$DBPNAM6= <>
##$DBPNAM7= <>
##$DBPOAL= (0..7)
0.5 0.5 0.5 0.5 0.5 0.5 0.5 0.5 
##$DBPOFFS= (0..7)
0 0 0 0 0 0 0 0 
##$DE= 6
##$DECBNUC= <off>
##$DECIM= 24
##$DECNUC= <off>
##$DECSTAT= 4
##$DIGMOD= 1
##$DIGTYP= 9
##$DL= (0..7)
0 120 120 120 120 120 120 120 
##$DP= (0..7)
150 150 150 150 150 150 150 150 
##$DP07= 0
##$DPNAME0= <>
##$DPNAME1= <>
##$DPNAME2= <>
##$DPNAME3= <>
##$DPNAME4= <>
##$DPNAME5= <>
##$DPNAME6= <>
##$DPNAME7= <>
##$DPOAL= (0..7)
0.5 0.5 0.5 0.5 0.5 0.5 0.5 0.5 
##$DPOFFS= (0..7)
0 0 0 0 0 0 0 0 
##$DQDMODE= 0
##$DR= 18
##$DS= 0
##$DSLIST= <SSSSSSSSSSSSSSS>
##$DSPFIRM= 0
$$ [...]
##$SUBNAM2= <"">
##$SUBNAM3= <"">
##$SUBNAM4= <"">
##$SUBNAM5= <"">
##$SUBNAM6= <"">
##$SUBNAM7= <"">
##$SUBNAM8= <"">
##$SUBNAM9= <"">
##$SW= 24.0689530833862
##$SWIBOX= (0..15)
0 0 2 0 0 0 0 0 0 0 0 0 0 0 0 0 
##$SW_h= 4816.95568400771
##$TD= 16384
##$TD0= 1
##$TE= 0
##$TE2= 300
##$TE3= 300
##$TEG= 300
##$TL= (0..7)
0 120 120 120 120 120 120 120 
##$TP= (0..7)
150 150 150 150 150 150 150 150 
##$TP07= 0
##$TPNAME0= <>
##$TPNAME1= <>
##$TPNAME2= <>
##$TPNAME3= <>
##$TPNAME4= <>
##$TPNAME5= <>
##$TPNAME6= <>
##$TPNAME7= <>
##$TPOAL= (0..7)
0.5 0.5 0.5 0.5 0.5 0.5 0.5 0.5 
##$TPOFFS= (0..7)
0 0 0 0 0 0 0 0 
##$TUNHIN= 0
##$TUNHOUT= 0
##$TUNXOUT= 0
##$USERA1= <user>
##$USERA2= <user>
##$USERA3= <user>
##$USERA4= <user>
##$USERA5= <user>
##$V9= 5
##$VALIST= <valist>
##$VCLIST= <CCCCCCCCCCCCCCC>
##$VD= 0
##$VDLIST= <DDDDDDDDDDDDDDD>
##$VPLIST= <PPPPPPPPPPPPPPP>
##$VTLIST= <TTTTTTTTTTTTTTT>
##$WBST= 1024
##$WBSW= 4
##$XGAIN= (0..3)
0 0 0 0 
##$XL= 0
##$YL= 0
##$YMAX_a= 970887
##$YMIN_a= -1040740
##$ZGOPTNS= <>
##$ZL1= 120
##$ZL2= 120
##$ZL3= 120
##$ZL4= 120
##$ABSF1= 10
##$ABSF2= 0
##$ABSG= 5
##$ABSL= 3
##$ALPHA= 0
##$AQORDER= 0
##$ASSFAC= 0
##$ASSFACI= 0
##$ASSFACX= 0
##$ASSWID= 0
##$AUNMP= <proc_1d>
##$AZFE= 0.1
##$AZFW= 0.1
##$BCFW= 1
##$BC_mod= 2
##$BYTORDP= 1
##$COROFFS= 0
##$CY= 11.3945322036743
##$DATMOD= 1
##$DC= 2
##$DFILT= <>
##$DTYPP= 0
##$F1P= 15.6554695791079
##$F2P= 12.8336369535428
##$FCOR= 0.5
##$FTSIZE= 0
##$FT_mod= 4
##$GAMMA= 1
##$GB= 0.15
##$INTBC= 1
##$INTSCL= 1
##$ISEN= 128
##$LB= 0.24
##$LEV0= 0
##$LPBIN= 0
##$MAXI= 10000
##$MC2= 0
##$MEAN= 0
##$ME_mod= 0
##$MI= 1.114404
##$NCOEF= 0
##$NC_proc= 0
##$NLEV= 6
##$NOISF1= 3.799351
##$NOISF2= 2.8
##$NSP= 1
##$NTH_PI= 0
##$NZP= 0
##$OFFSET= 15.70392
##$PC= 1
##$PHC0= -26573.94
##$PHC1= 13.58744
##$PH_mod= 1
##$PKNL= yes
##$PPARMOD= 0
##$PSCAL= 0
##$PSIGN= 0
##$REVERSE= no
##$SF= 200.130013532006
##$SI= 16384
##$SIGF1= 3
##$SIGF2= 2
##$SINO= 400
##$SIOLD= 16384
##$SREGLST= <1H.CDCl3>
##$SSB= 0
##$STSI= 0
##$STSR= 0
##$SW_p= 3612.71676300578
##$SYMM= 0
##$S_DEV= 0
##$TDeff= 0
##$TDoff= 0
##$TI= <>
##$TILT= no
##$TM1= 0
##$TM2= 0
##$TOPLEV= 0
##$USERP1= <user>
##$USERP2= <user>
##$USERP3= <user>
##$USERP4= <user>
##$USERP5= <user>
##$WDW= 1
##$XDIM= 8192
##$YMAX_p= 0
##$YMIN_p= 0
$$ End of Bruker specific parameters
$$ ---------------------------------
##NTUPLES= NMR FID
##VAR_NAME=  TIME,          FID/REAL,        FID/IMAG
##SYMBOL=    X,             R,               I
##VAR_TYPE=  INDEPENDENT,   DEPENDENT,       DEPENDENT
##VAR_FORM=  AFFN,          ASDF,            ASDF
##VAR_DIM=   8192,          8192,            8192
##UNITS=     SECONDS,       ARBITRARY UNITS, ARBITRARY UNITS
##FACTOR=    0.0002076,     1,               1
##FIRST=     0,             0,               0
##LAST=      1.7004516,     0,               0
##MIN=       0,             -1040740,        0
##MAX=       1.7004516,     970887,          0
$$ Real data points
##PAGE= N=1
##DATA TABLE= (X++(R..R)), XYDATA
0 0 0 0 0 8 -8 0 -8 8 -13 8 -8 20 -24 24 -29 40 -49 53 -60 76 -88 100 -113 129 -152 170 -190 214 -244
29 -244 274 -306 342 -381 427 -473 526 -583 646 -714 790 -875 968 -1069 1187 -1320 1465
46 1465 -1632 1831 -2061 2334 -2665 3075 -3601 4291 -5241 6633 -8839 12735 -20983 45266
60 45266 -255528 -1040740 48702 730658 -232049 -506923 507785 487856 -564762 -429776
70 -429776 522196 232665 -603607 -173110 629587 198137 -469092 -101089 284273 -152982
80 -152982 -295207 270298 348719 -214781 -303033 85812 134056 -46192 -7568 44677 -34356
91 -34356 -51759 -21734 -11759 44605 28607 -77819 13982 182287 -33358 -335698 -87523
102 -87523 312540 126180 -195273 38053 224910 -217985 -403206 193636 407489 -192235
112 -192235 -255216 385408 215008 -557310 -276853 503624 156975 -449139 90182 561487
122 561487 -171633 -616217 128288 469304 -209614 -324539 389339 339792 -429281 -326781
132 -326781 372940 182785 -378197 -19426 458231 -27207 -451776 43332 358489 -78088
142 -78088 -228249 151891 155327 -176784 -105363 154178 57905 -104230 25521 136833 -14327
153 -14327 -150870 -72433 59885 103695 85002 18479 -58921 -62728 -38236 -52067 22312 159902
165 159902 77317 -114078 -20971 120538 -97381 -233838 91495 255277 -39926 -98077
175 -98077 164597 18476 -337803 -102474 333712 142059 -223936 -32593 208940 -67547
185 -67547 -251935 81009 216555 -127628 -155487 229650 150720 -290552 -168624 250574
195 250574 105797 -196980 12124 179418 -124163 -215970 139388 212171 -102540 -141307
205 -141307 88087 44550 -149366 -43233 154425 51372 -104408 7742 94045 -82746
215 -82746 -168525 18491 129583 47793 14486 11574 -84325 -108325 -1373 42744 24896 55662
227 55662 40294 -39391 -40378 -16679 -71230 -49157 94714 115178 -22002 -62517 8268 -18545
239 -18545 -92091 -4045 128038 49599 -89271 -17252 73806 -50296 -105813 80759 121587
250 121587 -78930 -82868 96739 31044 -131238 -1448 160692 19893 -123254 -13440
260 -13440 61713 -42039 -47016 98515 95411 -65000 -74472 47548 4150 -108313 7604
271 7604 166942 59540 -90855 -27365 18270 -75808 -48709 101475 96597 -17948 -21612 15307
283 15307 -35924 -73683 -10263 65676 64987 18675 -5268 -12559 -42782 -53254 4064 57868 45753
296 45753 12680 -15695 -38876 -20454 15063 6524 1162 25822 5700 -29281 588 12656
308 12656 -33897 -7613 69079 27055 -69016 -47885 19124 11952 794 40013 40140 -34839 -76417
321 -76417 -20146 29765 -1628 -5406 66053 50986 -68400 -81050 9336 2223 -38590 42149
333 42149 100196 4608 -76617 -43430 -16807 -27847 10237 67210 46280 -25002 -45575 -10009
345 -10009 -10392 -45374 -6037 72229 45092 -36832 -31407 276 -27629 -23009 36355 37061 -12222
358 -12222 -19922 -4313 -7802 -6424 6003 17867 19058 -10402 -39257 -13876 21271 12404 8519
371 8519 25371 6066 -31094 -33119 -15243 7270 36374 41500 17772 -8417 -38902 -49255 -4133
384 -4133 34294 19972 25252 48807 -430 -67185 -43033 10071 16353 22922 45745 30089 -16532
397 -16532 -42589 -28495 1082 11998 16218 41331 35895 -28996 -51330 3883 21679 -8533
409 -8533 8939 37094 2927 -26075 -5311 3994 -3831 10362 22851 7447 -18496 -27053 -2696
422 -2696 27900 17671 -2108 10824 2189 -40879 -33348 19522 30630 15082 17013 3430 -28081
435 -28081 -34666 -19634 730 26547 32907 17572 5195 -23076 -58988 -34145 27474 36512 14728
448 14728 14791 630 -32654 -34131 -12568 -898 14929 28050 17675 -3885 -27698 -38034 -8628
461 -8628 21868 8550 -106 15220 -2566 -35507 -14933 17451 7268 -3052 3378 -5705 -14859
474 -14859 -6953 -949 7639 16828 3429 -11587 -10025 -20353 -23723 16251 44453 15272 -13765
487 -13765 -15647 -22388 -20329 2383 16820 21435 24151 6862 -17429 -26158 -30070 -14391 34237
500 34237 48385 8891 -10094 -3663 -24743 -33840 7835 33136 17004 8222 7954 -6817 -18622
513 -18622 -15919 -1506 18912 22192 7861 3713 -4769 -25229 -9517 30460 22136 -9902 -6227
526 -6227 755 -8693 5155 20611 3124 -4779 8350 1250 -14524 -10199 1852 16190 30797
539 30797 15048 -17562 -24138 -16119 -7016 16074 31740 17585 680 -10779 -25903 -18784 4150
552 4150 5697 10210 31273 17165 -21385 -25301 -15667 -18411 6931 40700 22269 -14913 -18357
565 -18357 -11374 -11243 -1830 6046 5971 7527 3688 -4812 -8967 -16431 -14083 15948 23828 -10455 -21770
580 -21770 -107 -2425 -8664 14437 14585 -15386 -18019 -1984 -5858 -4516 11639 11111 1559 -2101
594 -2101 -12001 -19948 -13324 -2480 15418 30420 11730 -20408 -23748 -16841 -11905 12094 27652
607 27652 7125 -4130 4608 -8234 -26037 -13313 3470 12958 28155 18993 -17175 -26085 -8656
620 -8656 -1113 6755 18059 8131 -5021 -1399 -1433 -5544 -662 1322 1953 12142 7768 -8656 -5611
635 -5611 2350 -1348 10833 21821 -5969 -25777 -2828 12581 8072 15687 13390 -11185 -15692
648 -15692 679 2662 -943 5196 12259 18609 12837 -15092 -28130 -8079 8204 14973 26911
661 26911 16220 -15508 -19557 -4241 -3780 64 14029 12160 5457 5797 -6153 -17419 -7842 -374
675 -374 3597 21086 17809 -15039 -20727 316 2236 -1297 9257 4336 -11251 -6178 5191 2931
689 2931 -2967 -6379 -722 9524 -1127 -18878 -6752 11332 2940 1705 10925 -9540 -28367
702 -28367 -5283 12016 386 3542 13272 -1930 -15931 -11239 -8409 -5592 6251 11272 10023
715 10023 4192 -14414 -23456 -7191 4235 4000 11364 9430 -7423 -9526 -3294 -10392 -6906 7697
729 7697 5839 3317 11274 -5250 -26267 -4778 18546 3304 -5607 4551 -2211 -10678 3915
742 3915 12574 -1453 -9639 -1569 8630 4584 -8877 -5164 12727 7220 -4253 8056 3893 -25451
756 -25451 -13426 27616 21427 -5761 901 1885 -18294 -8351 18276 10501 -6269 3262 13909
769 13909 5454 -8983 -13714 -4149 7432 11935 17537 11780 -15745 -23013 5824 15781 -734 3008
783 3008 10109 -5881 -5417 12658 955 -15045 1509 11900 463 2658 6607 -9517 -12073
796 -12073 8961 15584 218 -10286 -7428 1159 3539 2875 9086 4789 -16593 -12741 13430 5433
810 5433 -16832 2437 19664 -4907 -12621 6615 -4843 -22199 3653 23580 2514 -10575
822 -10575 -785 -4094 -14318 -6717 9278 10428 -3776 -6802 4361 -1299 -18437 -5863 14441
835 14441 19 -10543 9940 6035 -20340 -8428 13691 -1993 -11084 7590 5784 -13088 -5521
848 -5521 6561 -714 -4250 3187 1388 -6958 -7613 1620 9858 1962 -6695 577 1201 -10764 -2021
863 -2021 13322 -1319 -9662 12305 10049 -16865 -10222 9644 -908 -3574 16616 10777 -13700
876 -13700 -10871 3690 2908 497 5610 7222 648 -4871 67 6385 -3863 -9304 10621 17188
890 17188 -4769 -6240 9109 -4096 -12447 14318 18522 -10782 -10566 11605 4642 -6151 5687
903 5687 7805 -5657 -4548 6230 5999 -2518 -4618 5247 9938 -2005 -6297 4093 -596 -10014
917 -10014 8159 18866 -4913 -13330 4953 1597 -10664 5068 12667 -4245 -5817 6325 -683
930 -683 -9359 -2107 2758 2473 3978 1897 -2472 -5641 -7241 -759 7629 247 -5812 3519 492 -11480
946 -11480 -1111 8751 -6190 -7183 9242 1245 -13373 -301 6701 -6722 -4181 7587 -687
959 -687 -10410 -3715 2949 1386 -2053 -1601 1959 -1368 -10709 -3908 8894 -494 -8101 7078 5839
974 5839 -14564 -7746 9459 -403 -7072 7487 5911 -9528 -5272 2971 -1721 -1798 4252 3711 1082
989 1082 -2961 -5661 770 3954 -1627 2303 8197 -2686 -7809 3766 2996 -4031 4485 7251 -4234
1004 -4234 -1296 5781 -3307 -3131 8763 4900 -4217 2107 3327 -4759 -895 6457 4274 1892 1126
1019 1126 -1552 318 1205 -2004 4384 8837 -2130 -3293 6335 -871 -9177 6800 11907 -4374
1033 -4374 -3167 8014 -1583 -8728 3370 7498 617 6 1376 -1311 -1457 -2732 -561 7360 3957
1048 3957 -5036 -158 2442 -7600 -3409 9020 2175 -5295 2700 504 -8867 -1475 4524 -2045
1062 -2045 -4 4665 -3157 -5710 -542 -3214 -2761 5490 2974 -4875 -2750 -1857 -4912 -482 2047
1077 2047 -1140 1166 79 -7457 -2690 3689 -4464 -4125 7576 1101 -10514 -1378 3623 -5960 -2301
1092 -2301 7711 465 -6357 -2495 -1482 -2907 845 2127 2195 1777 -4909 -6712 2009 595 -4632
1107 -4632 5384 8314 -6034 -6318 3507 -2046 -5381 5760 6300 -1578 940 560 -6706 -1961 5541
1122 5541 1341 2298 5429 -1911 -5468 1649 2145 569 3671 1604 -1019 2754 609 -3278 3217
1137 3217 4927 -2555 2703 7233 -5667 -5979 8368 5523 -2879 5400 5011 -8457 -5581 7052
1151 7052 5822 718 2067 1803 205 -1558 -3626 813 5717 608 1567 8220 -1096 -12345 -1219
1166 -1219 6251 -299 3385 9534 -3457 -9234 1893 2192 -4691 2024 5107 -1472 -996 1641 -3658
1181 -3658 -4761 753 1388 2535 2112 -3810 -4499 -361 -906 1360 5297 -4301 -9048 2837 3686 -7874
1197 -7874 154 8839 -4730 -9489 4095 321 -10891 -247 9455 1148 -4181 -1917 -4507 -6217
1211 -6217 -3155 3097 6637 1255 -5939 -747 298 -9836 -5403 10170 3272 -6390 4361 4636
1225 4636 -12781 -8561 7740 2984 -3513 4637 2860 -6703 -3035 2733 -1173 -1154 2398 2800 450
1240 450 -2897 -2544 3280 2359 -2921 3249 4156 -7701 -3948 10728 3811 -6586 4848 6122 -9650
1255 -9650 -4207 9217 1738 -3420 8724 7861 -6193 -6033 1130 542 209 5762 10157 3730 -8491
1270 -8491 -6945 4940 2256 -5425 6086 13195 -3135 -6394 6770 -2257 -12777 5167 15220
1283 15220 -938 -4540 5613 -1173 -8492 2442 8063 -639 -3418 2264 4051 -768 -4451 1599
1297 1599 5487 -3619 -5384 5516 1812 -9992 1322 12351 -2809 -8952 3350 -2682 -11567
1310 -11567 4937 14327 -2553 -7731 2594 -1198 -9820 -3233 4535 3005 1070 2728 1293 -7030
1324 -7030 -12965 -2672 9150 2490 -2134 6276 32 -14988 -4770 8207 -4597 -6703 11036
1337 11036 5822 -11912 -3683 5393 -6295 -7964 6798 7481 -4677 -6208 755 2641 -2002 -1909
1351 -1909 3270 -653 -8567 67 10375 -1320 -8444 7313 6918 -12843 -6976 9190 -319 -5529
1365 -5529 11357 9646 -10259 -9151 2503 -187 -2534 6238 10080 2687 -4720 -4520 -1038 -2836
1379 -2836 -2679 8629 11582 -1441 -2825 4128 -5860 -11507 7979 13640 -3025 -2168 9092 -1140
1393 -1140 -9360 3524 5282 -4345 1682 9244 782 -6371 -433 5297 2372 -2619 -476 3411 -1766
1408 -1766 -4259 8063 9575 -6793 -6328 7745 -1365 -12583 4476 14204 -2051 -4382 7229
1421 7229 -2100 -14062 -3134 6896 2856 2853 6474 499 -9737 -9995 141 5990 89 -671 8739
1436 8739 3740 -11872 -8011 2739 -3745 -2993 11699 6425 -10244 -4458 3136 -5531 -5066 5564
1450 5564 1936 -4047 830 2016 -4097 -3894 1168 1124 -1996 -4470 -406 3314 -1599 -2886 6029 2890
1466 2890 -11016 -6601 4030 -1710 -1271 11430 4343 -11385 -3942 3511 -7141 -6977 8186 10261
1480 10261 1341 -1670 -2572 -7166 -7775 -187 9152 8497 -1503 -1924 3265 -4437 -11420 2145 9771
1495 9771 -21 1296 8690 -2190 -10515 624 4288 -2722 2910 8719 -94 -5558 440 3966
1509 3966 1756 -466 -1943 393 2426 242 1941 4838 -403 -1244 3618 -1983 -8763 2267 9859
1524 9859 2473 2109 6057 -5562 -11248 744 4899 -143 5268 10183 720 -7430 -5922 -3101 13
1539 13 3733 5192 7231 3130 -5948 -6142 -2106 -4385 690 11785 5490 -7141 -1609 3744 -6881
1554 -6881 -7041 5211 4456 -2097 1257 1223 -4947 -3056 2011 629 -1396 -2893 -2433 2008 1907 -2226
1570 -2226 1169 2381 -5371 -5937 -232 -2505 -1880 8660 6411 -6497 -5117 -1716 -7343 -5268 5750
1585 5750 6631 3143 2106 -4446 -10631 -5717 18 2003 5137 5115 1557 -623 -6213 -10341 -1929 6217
1601 6217 3172 3726 6004 -3916 -8803 229 1503 -4514 1731 8342 784 -3140 164 -795 -1346 2287
1617 2287 1446 -1429 -72 347 874 2992 689 -758 2831 -1352 -8124 -268 8888 4209 1137 4694
1633 4694 -2221 -8005 -2142 1645 -116 6322 10792 2713 -4382 -5739 -6682 -2059 5726 6526 5890 4994
1649 4994 -1502 -6518 -4312 -3703 -299 9032 8776 -1337 -2039 525 -4808 -4776 3454 2518 1491 5607
1665 5607 982 -6431 -1973 3231 155 -1402 483 -392 -144 1619 -469 487 2766 -2467 -4574 -1597
1681 -1597 -2569 -1900 7160 6541 -3737 -3953 -1154 -6763 -5569 3817 4920 3589 5412 -1255 -10898 -8790
1697 -8790 -1338 1965 4869 5440 1609 143 -4501 -11152 -6943 3541 5102 3772 4590 -1396 -7341
1712 -7341 -2872 -1776 -4641 2060 7706 635 -2868 -772 -3000 -3172 2381 1470 -2856 -317 1460
1727 1460 -1003 71 1230 -263 968 -299 -5667 -3335 3663 4274 4009 4436 -2207 -7239 -1133 -87
1743 -87 -3991 4151 12185 4618 -3224 -4609 -7050 -5364 3475 6818 5630 5913 1310 -5211 -5817 -4496
1759 -4496 -1224 6676 9350 2452 -91 234 -5414 -5270 1941 3272 2748 6528 2724 -5879 -2592 3069
1775 3069 707 537 2152 -902 -403 3718 985 -2363 1888 3067 -1068 -2794 -3350 -1322 5426 6524
1791 6524 266 -900 -1168 -6986 -5688 2761 3790 3127 7065 2116 -8931 -7906 -1885 -1113 2187
1806 2187 7379 5365 400 -2897 -8508 -8978 -1145 4625 6096 5791 -1060 -6531 -2976 -2378 -5479 -138
1822 -138 6895 3562 -953 -1190 -5212 -5236 2067 2157 -3052 -208 2430 -2079 -2518 1461 -21 -878 257
1839 257 -2718 -4484 -678 2596 3747 4080 -1208 -5381 -2400 -2931 -5302 2969 9524 4490 -707 -1619
1855 -1619 -8159 -8685 1538 6150 2467 4511 5877 -1539 -8364 -7808 -2959 5039 9356 4763 594
1870 594 -1174 -5055 -5340 304 1262 1786 6895 4792 -3651 -3522 358 -1541 467 5397 1760 -1586
1886 -1586 2211 694 -2592 1625 4206 366 -2828 -2216 -1075 3363 5786 2336 -701 -483 -2997
1901 -2997 -3059 -468 -199 3392 10331 5650 -7128 -7569 -2965 -3086 1594 9146 6290 506 -616 -4435
1917 -4435 -8675 -3797 3099 6410 6050 2568 -2683 -3727 -4691 -5706 138 6956 4599 934 155 -5370
1933 -5370 -6315 1468 3555 -2405 -775 3207 -283 -2627 -552 -1684 -668 3202 -192 -5765 -3311
1948 -3311 1520 2644 3090 317 -3223 -2976 -3374 -4612 269 6022 3533 1966 630 -7250 -9870 -1401
1964 -1401 3379 1731 5159 6903 -1668 -7966 -6714 -4929 177 6815 7306 2054 -1595 -3699 -4805
1979 -4805 -3310 -2076 1774 8452 6292 -3714 -5172 -1436 -1603 -101 4729 1471 -1730 2183 1688
1994 1688 -3552 -1390 3610 1255 -362 -318 -2091 -733 3375 3219 1634 1071 -1936 -3939 -1294 55
2010 55 2357 7959 6355 -3314 -5538 -3023 -3443 107 6399 5209 2791 3753 -1297 -10100 -7089 2707
2026 2707 6617 6829 4379 -1357 -3899 -4123 -3743 -1045 3624 4447 3949 2938 -3287 -7674 -1103 2352
2042 2352 -526 1633 4848 -881 -4118 -428 -762 -1418 2666 1681 -3362 -3412 296 1870 2544 913
2058 913 -1978 -969 -869 -4689 -3287 2813 4963 3755 2409 -5022 -9737 -3172 1664 671 3498 6532
2074 6532 590 -5016 -5001 -6311 -3600 4602 7176 3329 -38 -2709 -5988 -4863 -2185 813 6096
2089 6096 6344 -773 -4313 -2991 -3940 -1506 3811 2140 -1216 2673 2019 -5110 -4111 2348 2923 968
2105 968 -108 -2461 -2322 1961 2678 901 1040 -393 -1953 -837 -1706 -907 4878 7124 755 -3308
2121 -3308 -2900 -4422 -2560 4456 5663 3334 3290 318 -6859 -6940 -827 3428 5962 6426 1482 -2467
2137 -2467 -2521 -4645 -3725 1959 5772 5934 3891 -2467 -7057 -2330 2343 246 1518 4853 1912 -1512
2153 -1512 -273 -1833 -3026 2346 4508 -521 -2072 -589 -313 1118 2535 523 -174 -652 -3259 -2932
2169 -2932 1029 2767 2956 3672 -1044 -6875 -4032 568 -371 1235 5927 3509 -2186 -4664 -6820 -5444
2185 -5444 2379 6553 4008 1449 -1218 -4516 -4623 -2650 -1721 3625 7002 2325 -2735 -3602 -5023 -3732
2201 -3732 2019 3198 466 1416 1175 -3972 -4332 97 1275 987 1926 -983 -3190 -342 968 -313
2217 -313 201 624 -678 -706 -2144 -3071 1725 5690 1977 -2190 -2111 -3904 -4019 1913 4039 1883 3586
2234 3586 3103 -4144 -6996 -2911 637 4383 6379 3440 -877 -2004 -4580 -4448 695 3601 4743
2249 4743 5368 1386 -5537 -4625 295 290 915 4770 3264 -614 -732 -2117 -3545 1189 4704 1459 -659
2266 -659 -171 -769 133 1644 70 489 2019 -786 -3196 -330 1335 2115 4260 1556 -3983 -3293 -362
2283 -362 -1208 667 5247 4063 -336 -1333 -4392 -6070 -977 4554 4727 2655 516 -3303 -3825 -3611
2299 -3611 -2832 1545 6140 3771 -981 -2306 -4464 -4526 332 2867 446 1780 2953 -2535 -5324 -1774
2315 -1774 128 684 2655 822 -2043 -1392 -269 -1045 98 654 -642 -141 -779 -3306 -1480 3275
2331 3275 2409 -619 -601 -2494 -4430 -296 2109 699 2202 3871 -1688 -5701 -3930 -1364 1758 5042
2347 5042 3749 151 -1237 -3356 -4870 -1982 2080 3359 5024 2759 -3585 -4830 -1583 -1199 65
2362 65 4218 3533 137 -571 -1504 -3935 -1341 3436 2617 736 136 -834 -1033 1141 439 185 2258 973
2380 973 -1567 -578 54 266 3373 3498 -1463 -2718 89 -1171 -782 3469 3998 1150 315 -1742 -4671
2397 -4671 -1888 2592 3340 3419 2380 -1246 -3304 -2745 -2754 -592 4859 4623 1268 -913 -3000 -5106 -816
2414 -816 2895 1380 1975 3602 -517 -3956 -2127 -959 -136 2653 2197 -966 -1433 -598 -1726 -796 931
2431 931 222 525 102 -2744 -2461 1639 1643 -738 411 -786 -4102 -1536 1026 -196 1157 3512 287
2448 287 -4004 -3439 -2456 -992 3268 3459 531 -595 -2033 -4542 -2546 108 1057 3866 3809 -1420 -4410
2465 -4410 -2346 -1550 -1395 2889 3458 659 -258 -1207 -3964 -2509 1820 1913 946 1457 -407 -1988 -764
2482 -764 -211 -236 2201 1907 -450 -982 -506 -1187 1716 3228 -668 -1873 137 -908 -1473 1943 2919
2499 2919 1091 1326 342 -3687 -3253 810 2405 2695 3043 604 -1743 -1877 -2721 -1306 3371 4299 1751
2516 1751 1016 -887 -3802 -2048 1462 990 1599 4197 941 -3256 -2443 -1535 -811 2513 3472 138 -601
2533 -601 -259 -1646 -1448 571 446 345 1565 -984 -2616 -170 1062 375 1332 191 -2437 -1339 565
2550 565 -778 189 3200 1184 -2761 -1657 -1545 -2308 953 2899 1509 302 -512 -2934 -2989 -1032 712
2567 712 2563 3737 -66 -3326 -1880 -2234 -2125 1494 3243 538 448 393 -3255 -3823 275 1668 1409
2584 1409 1868 55 -2186 -1342 -591 -613 895 2178 -124 -766 -279 -1457 -350 1675 436 -509 869
2601 869 -958 -2026 399 1665 443 1315 1425 -2333 -3242 300 803 1339 2654 1704 -849 -1148 -1210
2618 -1210 -1708 779 2573 2451 2037 223 -3343 -1909 751 535 1090 4013 1724 -2468 -1175 -619
2634 -619 -1796 841 3222 1182 23 685 -1055 -1870 421 1328 1174 1546 -82 -1324 63 236 -13
2651 -13 1353 1575 -1071 -1111 801 -1050 -735 2505 1843 -760 -272 -832 -2826 -99 2523 1305 371
2668 371 1086 -1489 -2689 -1088 238 954 2046 1362 -1188 -1224 -1805 -2471 320 2317 878 947 856 -2516
2686 -2516 -3572 323 958 -212 1780 1650 -1874 -1585 -493 -1414 -107 1352 934 -132 -536 -2166
2702 -2166 -1070 973 517 -321 605 -543 -2183 -211 936 -319 612 1709 -1465 -2220 -196 -99 -730
2719 -730 1863 2135 -101 -996 -1186 -1917 -733 1843 1625 1258 660 -1348 -1988 -232 -415 176 2762 1903
2737 1903 -819 -593 -756 -2486 89 2993 1009 16 993 -509 -2083 20 840 595 1375 1006 -718
2754 -718 -483 -307 -284 613 1564 144 -216 772 -1155 -1047 2169 1718 -631 809 599 -2314 -939 2082
2772 2082 811 216 1509 290 -1781 -1070 -232 39 1597 1877 -103 -320 -1288 -1770 79 1454 580
2789 580 671 1717 -922 -2966 -43 196 -823 1619 2201 -885 -1360 -256 -1649 -744 1492 835 -279
2806 -279 -163 -776 -1174 -122 299 -107 869 119 -1540 -569 93 -1119 234 2031 -343 -1923 -282
2823 -282 -519 -1298 682 1898 -409 -860 377 -1499 -1419 478 657 656 645 -828 -1474 -1064 -910 -284 2035
2842 2035 1114 -1146 46 -73 -2103 -673 1751 555 -322 1185 290 -2202 -398 808 -260 791
2858 791 1446 136 -1426 -302 -261 138 1150 251 -330 360 -641 -1771 784 1251 -255 724 704 -1291
2876 -1291 -713 1244 341 203 2277 654 -1655 -281 470 -499 531 1629 523 209 -372 -1158 -501
2893 -501 1111 214 349 1678 -134 -1459 -88 6 -606 1266 2273 -591 -903 529 -847 -1324 1283
2910 1283 1489 -179 204 -34 -1104 -254 297 -137 772 715 -929 -1063 384 -564 129 1540 98 -1129
2928 -1129 210 -399 -1594 8 1558 -140 -868 733 -864 -1283 228 429 -193 772 100 -1599 -591
2945 -591 -189 -775 719 999 -385 -135 124 -1604 -880 1179 -201 -721 1188 771 -1844 -975 765
2962 765 -314 169 1191 -273 -1126 -474 -419 -273 730 463 -202 466 -263 -1259 343 544 -466 599
2980 599 1163 -1063 -1417 728 104 -704 1187 1273 -786 -141 207 -606 380 1265 54 -443 659 -318
2998 -318 -597 603 511 140 1087 211 -1208 -34 460 -843 478 1678 -164 -724 297 -96 -790 909
3016 909 742 -238 319 517 -1059 -286 1011 310 456 826 -160 -532 255 -432 -216 1568 791 -1028 304
3035 304 -162 -1370 -159 1201 43 -275 1202 -401 -1433 365 289 -341 346 616 -184 -619 -102 -561
3053 -561 181 669 -583 -52 547 -1052 -1263 477 61 -1073 566 310 -1489 -339 824 -754 -150
3070 -150 1051 -192 -1852 -52 -457 -626 543 750 -346 26 -215 -1446 -358 800 -18 70 933
3087 933 -732 -1085 140 -278 -923 592 631 -562 -244 522 -962 -682 1131 24 -596 559 8 -553
3105 -553 127 272 -420 703 380 -809 -64 759 -310 168 1140 -619 -461 903 -34 -638 837 1071
3123 1071 -409 -92 490 -962 -442 743 505 500 911 -442 -756 296 186 -687 1090 1287 -54 182
3141 182 200 -1231 -417 921 -236 -296 1600 313 -1157 230 208 -522 322 797 -353 -40 799 -228
3159 -228 -458 467 -40 -246 388 17 -447 411 240 -496 90 322 -1362 -354 986 -326 -478 799
3177 799 -205 -1494 -100 -207 -722 767 1088 -347 -186 146 -770 -557 786 -26 -30 687 -179 -1038 312
3196 312 -447 -1053 115 833 -301 -208 585 -1058 -773 859 3 -618 724 106 -1048 46 238 -731
3214 -731 -76 576 -372 16 723 -2 -182 770 -319 -851 203 51 -578 440 767 -154 -222 -43 -1097
3233 -1097 -679 1202 577 -159 826 373 -684 -233 48 -200 448 1479 -58 32 304 -707 -752 690
3251 690 399 -365 964 697 -312 218 -217 -277 562 1044 -255 -328 953 164 -664 346 135 -708 239
3270 239 337 -434 278 1004 -235 -645 48 -608 -153 660 61 -43 820 -23 -1024 -472 -294 -498 681
3289 681 1248 -192 -373 456 -872 -905 490 327 33 1363 466 -748 -391 67 -639 -239 505 -200 142
3308 142 363 -799 -751 94 -134 -321 517 409 -930 336 387 -1386 -550 608 -522 -776 426 58
3326 58 -714 283 -64 -1110 -618 214 -62 762 723 -347 -124 246 -1061 -876 515 584 -44 467 -364 -1102
3346 -1102 -370 -121 -775 371 1359 343 -142 34 -564 -466 310 35 -120 1103 514 -666 -387 -146 -699
3365 -699 132 537 -36 -23 893 177 -527 569 -207 -1114 317 848 -374 501 884 -70 -266 -109 -395
3384 -395 -449 704 651 247 638 308 -920 -738 -166 -80 570 1198 94 -157 531 -632 -1608 365 690
3403 690 301 925 884 -473 -717 7 -323 58 756 344 11 744 -266 -1017 -5 355 -402 119 97 -360
3423 -360 252 215 -800 -529 534 -295 -857 553 149 129 802 -66 -1392 -769 404 -351 62 878 166
3442 166 -340 -173 -1140 -893 87 462 25 550 299 -1484 -765 -131 -705 -297 1311 637 -137 299 -679
3461 -679 -1284 22 213 -280 394 1005 -157 -510 -154 -447 -543 639 -237 -207 681 22 -303 -309 -34 -511
3481 -511 -38 593 -472 299 1217 154 -233 9 -543 -1018 402 818 -56 686 542 -418 -666 -333 -621
3500 -621 336 1209 265 -247 309 -337 -1011 -34 546 461 1068 1158 -928 -834 262 -447 -210 1015 137 20
3520 20 677 87 -849 -296 62 -267 411 553 -12 247 836 -237 -561 416 -180 -196 584 224 -205 615
3540 615 291 -1218 -853 379 38 341 419 70 -288 280 -659 -1104 -137 511 317 421 700 -933 -785
3559 -785 -108 -567 -509 1244 791 -27 444 -651 -1152 -348 327 -77 113 553 -219 -573 -164 -582 -704 679
3579 679 264 -807 119 297 -262 -145 -162 -681 -22 709 -170 -333 837 447 -231 -22 -816 -1091 430
3598 430 424 -370 141 982 -590 -740 -588 -569 156 1046 850 91 -32 -307 -818 -264 406 -141 768 1459 -176
3619 -176 -856 -244 -370 -110 776 292 103 889 225 -747 -668 499 458 259 534 13 -23 588 -158 -554 545
3640 545 434 9 462 673 96 372 467 -512 -756 -84 -57 166 965 511 -4 65 430 -1221 -751 432
3660 432 231 825 575 -106 -981 -160 -485 -417 952 998 194 160 -194 -1203 -534 236 -182 641 895 -179
3680 -179 -439 -278 -365 -844 504 559 -188 135 293 -392 -89 32 -752 -430 421 -171 -326 240 336 -238 304
3701 304 -423 -931 -29 682 201 250 1045 14 -750 -661 -1015 -518 1070 689 -194 137 -274 -1054 -501 -147
3721 -147 -73 843 878 120 -799 -402 -693 -171 719 204 -121 606 529 -813 -775 -98 356 447 659 -220 -83
3742 -83 434 -152 -797 -342 46 3 -4 205 -431 232 923 -143 -574 216 -104 -343 666 534 -175 207 11
3763 11 -851 -621 331 609 711 1137 -139 -584 -169 -170 -636 433 603 441 331 35 -959 -551 472 -116
3783 -116 190 962 343 34 -75 -213 -968 474 547 10 -80 326 -262 -444 249 -69 -164 615 105 -232 216
3804 216 361 -51 202 230 -802 -184 293 97 128 584 59 -680 -561 -653 -851 492 1133 -84 -306 -100
3824 -100 -679 -478 -318 -392 280 997 534 -784 -261 -563 -839 209 709 21 93 435 -1002 -904 -30 -135
3844 -135 143 659 146 -478 141 95 -434 -364 -39 -288 130 569 -579 -267 743 -40 -590 -150 161 -328
3864 -328 699 621 350 398 407 -519 -828 181 49 641 875 313 -694 23 -223 -304 -161 657 596 576 203
3885 203 -740 -512 36 18 -18 714 982 7 -36 -147 -1082 -49 749 124 17 334 -42 -88 478 -288 -337
3906 -337 637 207 -449 3 375 62 154 227 -405 -113 340 -200 171 654 354 -97 -74 -584 -1079 -176 1011
3927 1011 310 249 306 -678 -660 -69 -135 -37 1227 944 -381 -796 -497 -699 -5 321 111 339 486 45 -982
3948 -982 -566 -139 -216 807 453 -430 -297 362 -509 -505 33 -92 -205 306 -602 -428 441 223 -497 -441 98
3969 98 -315 146 462 -93 161 604 -461 -900 -292 23 213 920 341 -244 -40 -2 -1120 -532 265 392
3989 392 497 217 -628 -797 39 -112 -54 791 702 296 42 -38 -640 -652 983 611 566 401 -13 -365 109
4010 109 -57 -561 584 418 81 172 365 82 188 589 -353 -245 523 316 83 570 321 244 207 -42 -877
4031 -877 170 604 22 109 27 -309 -680 -241 -725 -279 708 1260 199 -269 -661 -1102 -53 332 245 -15
4051 -15 703 -399 -662 -346 -377 -348 607 425 -495 24 124 -268 -512 149 214 47 121 -301 -573 -274 145
4072 145 -443 -192 -455 -81 110 264 115 -168 358 137 -692 -324 -143 -234 648 21 -163 -234 37 -662 -569
4093 -569 84 126 904 491 -330 -812 -269 -101 -400 553 390 30 140 5 -1041 -584 525 310 -157 253
4113 253 52 -342 -151 -180 -293 31 868 259 100 494 -4 -164 354 -62 -507 253 226 -139 -17 375 -157
4134 -157 568 167 -702 -255 597 303 -33 468 184 -181 -234 -399 -296 165 1054 249 -284 -205 -793 -491 372
4155 372 187 83 708 148 -424 -164 -133 -365 205 753 44 -27 86 -26 -365 103 180 -23 621 172 -547
4176 -547 -317 390 -177 -129 -55 -265 -591 338 -111 -383 151 136 -341 16 -270 -448 253 366 -207 -403 -81
4197 -81 -589 -847 149 422 379 774 138 -623 -630 46 -235 189 644 -157 52 297 -335 -1117 -282 329 72
4218 72 489 -181 -498 -256 -386 -648 -126 667 489 -78 329 -208 -175 -21 348 -562 -68 41 -193 71 57
4239 57 61 110 499 -258 -516 370 233 178 356 345 -109 -203 -194 -369 90 795 699 228 228 -601 -558 375 528 218
4263 218 611 602 -94 -528 -243 -606 273 1086 142 -118 259 106 -103 114 50 326 589 480 -376 -117 504
4284 504 17 96 204 -74 -50 435 382 -219 368 365 -134 -81 -43 -461 -161 376 272 -234 54 -251 -449 0
4306 0 -182 112 718 409 -323 -492 -106 -400 160 566 411 -3 388 -252 -983 -300 264 -13 347 41 -480
4327 -480 -135 -142 -402 -100 254 -419 -92 -30 -521 -762 74 147 -545 -358 495 -298 -76 -99 -161 -464 383 -86
4349 -86 -630 -56 263 -86 67 282 -210 39 114 -410 -428 586 281 -13 180 -370 -794 41 106 -94 -11
4370 -11 466 -164 -61 -399 -385 -397 656 511 -242 -240 -65 -478 -19 -19 213 805 694 -53 -102 351 -82 71
4392 71 432 197 -318 312 39 -333 270 647 25 191 -16 -331 -4 458 350 221 222 249 -214 -66 99
4413 99 -269 513 787 -219 -112 -142 -574 -64 305 313 204 489 -80 -763 -521 86 271 569 425 -40 -488
4434 -488 -19 -149 -701 415 60 -24 306 141 -552 -15 -105 -274 243 20 -142 -161 79 -17 -449 272 269 -564
4456 -564 45 -47 7 -61 239 -564 -231 -26 -588 -407 -31 245 -140 361 -274 -595 17 -147 -372 360 370
4477 370 293 -192 144 -512 -663 306 323 18 -24 228 -519 -174 1 -408 -204 487 269 -372 -21 -141 214
4498 214 382 190 9 365 189 -373 -54 161 533 238 -158 -112 -462 197 -7 20 74 123 -167 34 -62 114
4520 114 150 669 144 18 238 -48 -336 470 317 304 345 291 -73 93 -61 -172 301 407 -79 -493 346
4541 346 -141 -371 128 215 210 253 219 -237 -138 408 -41 -70 456 129 -383 84 -45 -241 157 178 -420 -72 -54
4564 -54 -161 -78 516 117 -394 -31 -32 -413 -229 242 -76 64 -78 -422 -108 53 -146 -74 354 110 4 -268
4586 -268 -369 -836 -293 202 59 22 -14 -378 -515 -97 -412 78 326 81 -267 -361 -161 -396 29 249 -176
4607 -176 -210 263 -338 -100 154 -198 -71 155 -380 -247 326 261 -85 175 340 -159 -208 215 25 81 243
4628 243 18 -63 140 -26 -240 -94 151 110 112 460 -269 111 321 -88 -17 649 275 356 100 286 -455 -38
4650 -38 438 -45 423 201 -221 -362 240 -66 257 -46 184 -221 -51 142 12 155 47 55 -104 204 5
4671 5 -597 391 67 -326 86 -131 -357 -255 7 -263 -2 62 91 -139 -301 -533 194 106 129 -450 -102 146
4693 146 -509 272 103 101 -40 -77 -206 -589 -68 -337 85 259 165 -77 -49 -353 -498 -64 -88 -179 -12 427
4715 427 -319 -363 -201 -173 37 156 274 -237 -327 54 -299 68 361 -11 -213 353 65 -376 196 433 1
4736 1 175 0 105 -58 142 100 72 580 -308 -252 -86 -278 -42 304 116 -156 569 215 -59 -167 -68 -114
4758 -114 114 258 37 -115 34 273 98 418 234 -98 53 157 -117 112 605 83 -73 277 94 42
4778 42 465 178 -460 264 260 -143 -194 51 -50 114 457 -107 -35 328 64 -504 113 153 -78 97 -49 -596
4800 -596 -342 258 -24 12 -136 -268 -129 167 107 -92 269 215 -249 -140 34 -378 64 485 -49 -94 -146 -21
4822 -21 -173 231 -204 -150 148 44 -187 -60 57 -251 -182 52 188 40 20 58 -259 -192 119 -67 265 183
4844 183 -538 -339 -68 -195 173 46 -172 -133 -322 -364 -443 221 295 -318 187 246 -346 10 75 -20 235 57
4866 57 152 10 116 -61 -306 176 112 -24 91 -7 -76 157 348 -20 -133 379 -71 -245 173 226 -66 282
4888 282 383 -43 198 304 -122 -60 548 425 151 -353 169 24 -108 250 65 76 120 172 -114 -110 -177 -7
4910 -7 572 130 74 178 -88 -291 359 553 212 138 163 36 100 156 -187 24 36 346 -111 -156 -97 -274 -31
4933 -31 257 -119 -198 89 -5 -123 187 -13 155 -250 -11 -132 89 -2 175 54 -95 -170 -219 -296 -26 -118 136
4956 136 214 -251 93 34 -407 -6 234 -349 48 -28 -162 -52 212 63 -100 182 -14 33 -38 -284 9 0
4978 0 -44 -14 20 -257 -265 11 -221 -256 -163 4 -32 -456 -11 61 10 222 304 98 -204 108 -58 -274 501 305
5002 305 -19 21 3 -330 315 161 135 -42 67 270 -315 8 129 -120 236 94 -115 447 159 -124 153
5023 153 143 420 46 259 277 -262 -157 228 -45 183 59 39 -78 -95 -135 31 332 44 103 -20 -148 -177
5045 -177 187 186 23 44 401 -117 -68 337 -72 214 55 391 57 90 320 -101 -115 201 -29 -32 -277 60 -468
5068 -468 189 -154 -83 333 -209 -85 2 -183 -270 45 127 -50 -235 172 -81 306 266 -164 -187 -273 196 -258
5090 -258 36 43 -255 145 -21 -304 -40 158 -43 -312 93 485 54 11 -87 -115 85 -119 106 63 251 -71
5112 -71 -159 227 -344 115 78 87 -233 39 0 -265 -62 174 25 -86 296 71 183 231 208 -362 428 58 29
5135 29 136 251 -199 372 299 296 141 131 50 56 34 -26 36 451 308 -174 26 -229 -276 225 473 -41 -58 178
5159 178 8 319 82 -99 -118 -80 -30 -150 -72 385 265 -234 122 93 99 159 -36 -536 130 114 177 139 -244 30
5183 30 39 198 -116 -175 -247 -170 -191 230 248 -447 -408 -198 -186 -221 128 -52 -79 102 -585 -272 -190 -90 -230 210
5207 210 207 25 -162 -50 -139 214 151 -232 86 -100 -125 -314 -64 -192 -32 59 -368 -64 34 73 -236 -190 208
5230 208 -381 -66 -60 187 -2 77 -48 -276 -218 92 -422 41 99 -153 -193 257 -33 -118 488 -141 -6 232
5252 232 188 279 66 189 74 -95 227 174 327 314 -33 -140 46 524 29 -24 436 134 213 663 -99 -46
5274 -46 134 116 149 -154 206 -239 103 -49 -93 27 -92 -37 52 277 194 -60 42 -61 -74 -28 118 141 85 -196
5298 -196 22 240 -47 -395 -527 -175 140 185 107 -271 -144 54 29 -255 -85 384 187 -268 -247 -410 -341 -58
5320 -58 -78 -76 -44 134 -164 -258 -246 -133 -73 133 -350 -97 210 -22 97 17 -4 -483 59 -75 -166 -6 53 -13
5344 -13 -213 8 -174 159 -79 -145 -179 225 36 -113 -51 -60 170 95 434 73 -52 316 -100 -128 474 -21 -221
5367 -221 187 142 -279 -123 -190 -178 157 387 -99 21 229 -169 78 -54 230 225 495 83 50 270 -95 -42
5389 -42 -91 102 -16 -80 58 63 97 149 100 -512 -45 634 -96 424 199 -157 233 311 26 -123 172 4 347
5412 347 -182 -30 -46 -4 98 -173 81 143 273 174 -28 19 -182 240 -13 258 111 102 -52 -88 -230 -312 -72
5435 -72 28 220 -182 234 46 -482 108 -37 -336 152 -114 -24 -103 190 36 -136 -74 -304 -226 -60 -213 -339
5457 -339 121 212 56 -135 -26 -108 -431 133 23 -63 -192 50 -169 339 -95 -151 251 13 -117 -50 -55 -17 -70
5480 -70 247 204 -42 4 -17 -146 -143 30 -42 164 205 -241 -259 205 -52 -19 -93 215 149 98 190 -362 72 322 -267
5505 -267 -317 -153 55 7 255 107 66 120 -24 -166 163 -27 346 119 -136 -81 -152 142 -51 -111 439 -18
5527 -18 138 236 -36 -357 326 317 -225 115 259 445 243 150 -470 -44 406 302 -118 -91 -100 11 80 114 -356
5550 -356 230 141 -154 -104 68 -39 -149 237 -306 -20 25 110 -292 148 15 -303 233 -131 -441 -426 -97 87
5572 87 -257 -323 79 -307 19 0 51 156 205 -494 -349 -387 -247 148 -254 -175 40 304 232 85 -316 -199 -116
5595 -116 -49 319 -25 22 -246 -103 -144 94 -229 130 248 120 -282 179 342 200 -113 -42 51 40 49 -244 -163
5618 -163 334 -36 -227 -32 138 198 362 9 -149 -343 156 -207 -13 203 1 43 504 -327 -164 -25 -20
5639 -20 34 107 184 -218 -9 263 -140 -367 154 -88 -286 205 314 368 69 -116 -256 140 408 71 92 -49
5661 -49 172 328 510 -272 -523 100 513 -57 -114 230 -41 51 60 -273 -134 91 207 -159 -97 -17 -98 302 -16
5684 -16 -344 -75 149 8 -42 -152 26 23 522 -282 -88 -62 -109 -524 -288 -258 27 -65 173 -327 -269 184 -266
5707 -266 -155 -181 -25 -13 377 254 -349 -129 265 -179 -388 -92 120 -274 -167 -382 -285 10 -325 -473 -92
5728 -92 -240 90 70 422 -357 -92 221 247 -182 112 164 276 377 78 -291 -294 363 -79 -10 142 212 65 604
5751 604 306 -311 -113 6 -191 -79 138 -148 266 -48 318 -138 159 128 -121 151 243 -83 84 158 -321
5772 -321 176 297 -116 181 318 -90 30 453 -93 -229 -11 543 -60 -129 144 195 218 137 -7 171 206 75
5794 75 -324 -115 -63 -265 181 -130 -149 -153 108 -121 -267 -168 8 -98 315 -322 -83 25 -235 -247 -254 -528 -86
5817 -86 -82 -173 -277 -383 171 59 -196 13 146 -117 -68 -16 -311 -195 170 -181 -253 -150 75 86 246 -87 -483
5840 -483 44 -7 -153 160 116 -207 -57 -23 -410 -176 206 112 -133 396 -99 128 246 -47 -323 0 88 190
5862 190 -228 253 -283 -274 364 23 -393 339 -181 343 -11 95 105 105 -115 -152 246 246 216 -48 -30 -226 -136 65
5886 65 258 3 -17 256 354 336 164 -370 67 264 -244 -144 164 300 -184 -51 125 -147 -13 390 3
5907 3 190 205 233 -487 164 -322 -268 233 -278 -144 -190 1 49 10 0 -33 56 253 -82 -307 199 277 -227 -186
5931 -186 -445 -456 437 577 -363 -209 194 -81 -128 296 -175 -377 202 367 -511 -163 40 -184 -31 107 -69
5952 -69 33 9 -371 -378 -82 79 -81 18 -214 -12 -415 -57 -120 -329 57 219 -231 -92 -69 -400 12 -273
5974 -273 -519 -132 381 174 -137 -19 -34 222 187 -535 -378 18 69 137 -113 378 -5 160 153 -204 107 101 312
5997 312 379 -20 -175 45 218 26 -229 122 134 118 132 -9 -402 230 625 200 191 66 82 43 -140 72 33
6020 33 413 46 -197 -254 -103 436 -286 -43 -151 32 275 -88 -214 394 232 395 -89 -48 -167 -70 404
6041 404 -189 -127 178 -51 333 187 -67 68 268 365 -231 -406 -56 -512 -197 -327 -295 19 142 -195 -522
6062 -522 -150 44 -243 -178 -37 -23 112 -89 -313 -500 258 -270 -346 179 -174 -373 -140 262 -544 -92 89
6083 89 227 -108 -53 -6 -70 90 -59 45 -279 -4 -118 -21 91 -235 74 137 -429 -355 398 -50 115 28 -96
6106 -96 186 121 260 -243 -129 331 94 -284 259 -419 11 73 20 79 -15 190 -214 -84 -212 -254 88 292
6128 292 143 -179 183 108 -81 210 -149 16 421 -141 -189 237 -172 184 147 281 141 55 425 77 -124
6149 -124 -18 87 99 54 5 -49 313 303 -239 -114 118 47 -12 206 304 128 317 208 -279 -95 -5 99 -84
6172 -84 274 285 -177 215 203 -399 -95 406 5 253 -45 -359 13 50 -387 -143 342 -97 -80 -387 -27 -334
6194 -334 2 -47 -382 86 22 -51 155 1 -497 128 -76 -191 -241 180 -34 192 53 -314 -154 103 149 -72
6216 -72 -68 9 287 -90 -219 -236 -95 167 -17 -296 124 404 84 -112 -207 -387 255 372 118 -174 -68 -262
6238 -262 134 -190 -1 -92 299 64 -380 -115 9 -28 338 214 -13 22 553 -20 -302 142 35 -105 124
6259 124 -127 -310 131 2 247 43 -170 -26 -106 168 301 114 487 211 35 -100 -18 87 8 251 319
6280 319 -89 514 252 -10 92 58 36 78 11 -130 -122 -181 -348 -91 95 -25 71 -106 -108 -287 35 277 -163
6303 -163 -208 133 -200 112 -460 -107 -37 288 -213 -146 -187 -209 -61 85 64 -283 -106 -36 -95 -218 0 -46 207
6326 207 -61 -310 -548 -93 128 -25 113 585 41 58 -554 -176 -96 272 -16 -428 103 -277 -192 9 -146
6347 -146 -239 282 44 -80 -272 -207 92 128 128 -4 -112 246 78 -205 -230 -322 -143 87 -39 -87 -49 375 42
6370 42 -429 326 60 -187 216 101 -37 -91 435 183 -233 -33 -166 131 160 332 113 242 78 -218 -248
6391 -248 283 -108 127 78 -21 -249 241 21 -307 254 392 63 -29 -38 -328 -60 117 -77 87 -24 -64 -36
6413 -36 325 -48 -204 159 372 -53 155 252 -46 -91 -104 -413 -390 36 -89 -200 -34 18 -244 238 -93 -372
6435 -372 108 35 -44 51 326 -175 -309 275 -316 -239 98 -214 103 48 6 -303 -210 -209 -317 391 -76 62 -169
6458 -169 -236 26 -34 68 148 0 -94 34 -377 -123 137 34 -234 311 -211 -111 442 70 -84 -187 -159 81
6480 81 258 181 -74 -214 186 -80 -219 0 42 323 396 -135 60 83 321 -323 -155 -24 -6 2 298 232 13
6503 13 37 -70 -337 -219 -118 186 200 181 -64 185 -34 180 404 29 -66 164 531 73 -241 -112 7 -36
6525 -36 -32 -235 152 -147 -103 85 -29 419 -109 -37 104 20 37 238 -236 -218 -78 253 -267 -108 76 -25 -142
6548 -142 -23 -35 -223 43 137 106 -313 240 -186 -156 102 -175 146 -85 -416 -350 -149 -101 -224 -74 -85 -136 191
6571 191 170 -382 -317 159 -128 -109 78 -82 -351 -121 203 -93 -32 -85 -240 -134 -170 -86 26 187 -67 -80 38
6594 38 151 -324 32 355 -209 -106 189 -181 166 26 126 -280 -13 -147 -265 250 -13 -239 120 233
6614 233 -82 98 374 -109 -50 73 -121 94 434 294 -142 174 -233 -53 326 -109 222 168 491 127 162
6635 162 234 334 -80 351 -119 72 189 265 -75 -75 -128 -4 196 54 -142 -125 112 -232 8 239 227 -343
6657 -343 -65 -13 104 260 352 -125 -243 51 138 -135 -3 149 -276 54 196 -220 258 37 -78 148 144 -61
6679 -61 -124 -329 50 -98 -109 3 -419 -272 -430 -247 -120 -25 -169 -216 181 -15 -192 -124 -23 -299 -116 200
6701 200 -137 12 164 -206 9 397 48 -249 58 -274 -292 0 -99 -4 160 53 -220 -71 -89 -147 -28 88
6723 88 134 -318 -123 11 -342 -144 -19 -125 45 268 64 9 393 -169 63 23 -120 14 18 145 -164 405
6745 405 383 149 114 409 -154 -73 212 -29 -120 225 19 -235 100 244 109 378 205 -183 399 -97 -12 153
6767 153 -250 -204 -82 409 102 -21 82 257 -159 101 270 -328 156 380 10 -30 331 -123 -80 208 -223
6788 -223 -133 310 -226 34 -24 -69 -63 43 49 100 -55 -108 -246 -140 110 96 259 -117 -29 -189 -46 397 248 161
6812 161 -276 20 -172 101 -112 -7 178 254 -181 13 51 -166 -237 50 -462 -152 -50 250 72 41 -82
6833 -82 -145 -10 273 -72 -160 -18 -249 -249 328 203 -180 198 -467 -353 47 54 78 62 340 -186 74 133 -213
6856 -213 71 -339 212 -22 -39 -54 3 -33 -90 152 0 242 -111 -21 57 -68 339 472 194 220 142 166 225 23
6880 23 255 27 47 323 -96 -147 389 167 16 224 -208 -15 -214 25 40 175 94 -331 -61 126 -280 12
6902 12 -120 171 -124 417 19 -122 120 307 -212 148 6 -33 91 -127 -244 -183 253 -167 -22 -71 -91 -547
6924 -547 -312 109 -128 49 110 -203 -62 -184 -98 249 89 163 -521 -92 -296 -84 -186 259 -152 211 41
6945 41 -128 38 -132 -118 6 408 -128 72 322 76 150 33 134 -324 -207 377 -182 190 117 -145 -261
6966 -261 4 14 -248 -60 112 108 -51 234 -93 -259 118 127 -51 -85 66 -199 429 -37 -321 -113 384 -33
6988 -33 -44 103 -90 96 314 153 -136 384 37 -128 -147 170 -23 73 218 98 -257 49 -230 31 355
7009 355 93 291 1 -53 -27 9 75 -73 -365 318 178 -41 58 9 -40 429 289 -176 331 4 55 -221 184
7032 184 -16 -248 411 92 77 38 33 -3 301 195 -118 14 597 -97 179 -14 -169 -234 -135 240 -157 93
7054 93 220 -56 64 -122 -102 135 34 -199 -242 40 -183 17 85 -237 -241 208 -69 -363 -33 -109 -203 42 30
7077 30 37 -28 84 -12 64 -169 -73 -302 -53 33 -178 -204 83 -1 226 225 -112 -134 56 281 -120 225 -26 -300
7101 -300 15 140 36 27 92 -114 234 58 -80 -85 15 -11 24 467 375 -12 132 158 -145 -338 72 -27 -10 411
7125 411 -4 -69 416 96 3 169 137 -143 304 209 -349 -208 75 -185 -171 71 -49 -87 366 88 -5 4 -117
7148 -117 -445 58 -24 -240 123 212 -102 -8 72 -50 -148 -64 200 -162 -3 333 -180 -299 98 -268 -44 231
7170 231 140 250 32 -279 -258 122 -180 -135 -246 -177 -120 4 -200 -527 -236 -64 73 -147 -127 -189 -57 15 68
7193 68 -269 -17 108 -191 -101 131 -145 93 -10 -14 -361 431 -96 -416 -41 42 -15 -115 -6 27 -346 -16
7215 -16 -53 -27 259 -161 -397 -64 41 31 170 211 -396 7 176 481 159 315 301 45 309 -48 -453 132
7237 132 -8 -201 -18 263 19 -252 334 167 53 74 567 24 144 162 -112 -152 272 10 336 184 156
7258 156 82 63 3 -145 301 118 65 112 210 57 152 300 -199 -28 -127 93 -258 81 -9 -133 165 -224 -334
7281 -334 108 296 218 -259 16 -7 -53 38 -472 -130 66 -59 -35 66 -41 89 -157 10 -214 -179 173 -112
7303 -112 -319 173 -281 -269 -69 -577 -331 187 205 -277 169 -75 -318 -133 -131 -139 -202 -27 -4 -192 50 283 -41
7326 -41 57 101 -111 -304 -81 -154 -393 112 33 -81 202 149 -119 432 75 -475 -54 -62 -34 147 260 -334 -412
7349 -412 371 -117 -310 90 -68 -177 105 277 -188 -8 22 -252 24 201 34 -49 195 -32 -193 -41 246
7370 246 74 375 213 228 34 106 312 -415 181 102 25 266 306 19 46 38 -241 -86 486 81 -137 84 363
7393 363 -12 136 60 -36 248 186 269 -67 289 -179 84 83 -127 -12 219 76 -188 34 -225 45 142 121 -463
7416 -463 -91 228 -13 -194 205 -207 -163 225 53 -106 120 291 -5 -84 19 -123 231 71 47 -97 57
7437 57 -147 -127 -30 -127 -166 85 174 -589 46 -15 -295 -237 -56 -153 -38 -7 -63 -167 303 75 -190 -176 -57 -150
7461 -150 -41 174 -343 -19 200 108 -163 285 287 -116 206 192 -4 2 27 -222 -318 30 49 5 142 101 -212 81
7485 81 321 -137 127 250 -85 394 418 21 -575 335 60 -390 88 -67 183 124 20 -355 80 77 -85 -279
7507 -279 47 -41 -95 252 -119 187 434 127 213 -171 -138 -192 314 -37 -115 108 8 122 -407 -42 -88 -39 120
7530 120 -45 -205 -160 102 -152 -118 326 -156 -72 63 -187 50 -290 123 -281 -29 -148 -257 234 -274 -219
7551 -219 39 262 -95 -367 104 -192 -101 98 74 -419 43 112 -172 -185 153 -222 339 -120 -8 -141 233
7572 233 -204 -181 -23 34 19 157 -168 -454 -137 501 -42 -203 -16 -10 199 150 -246 -601 -187 73 -55 -77
7594 -77 123 27 -308 243 -276 -308 178 24 -114 301 82 48 -78 127 -19 142 168 92 -127 -171 271 -181
7616 -181 301 -137 215 229 390 248 -106 400 -291 -54 354 -75 -75 226 50 65 231 87 -175 209 -59
7637 -59 -5 -206 259 117 -64 -34 -22 81 -39 132 -135 188 316 -3 -50 69 -171 196 193 66 147 -23 78
7660 78 -502 -97 -74 -181 166 166 -13 183 339 -52 -32 -214 -45 -75 52 -213 -273 417 158 217 -142 344 93
7683 93 238 98 -432 -93 347 -50 -282 96 3 -176 98 109 -442 -184 -38 -69 34 -103 -80 -28 54 -196
7705 -196 -501 26 156 32 -61 264 -339 -97 231 -338 -153 105 13 -264 103 -81 -142 -216 -54 -251 330
7726 330 366 382 99 -75 -144 172 281 -403 -179 -47 153 -118 54 -47 -165 -186 422 10 190 377 122
7747 122 156 -10 -273 105 365 322 -74 374 -81 63 126 169 -210 87 332 -75 151 -120 19 -203 -82
7768 -82 273 211 255 213 -127 -326 -48 -106 157 -38 -255 -107 410 50 -170 -185 97 -428 -284 189 -219 247
7790 247 -226 77 -116 -76 -26 132 -63 123 -156 -52 -266 -48 -296 -237 -313 -96 45 -95 -240 460 -85
7811 -85 -377 -166 -109 -250 -49 -275 -162 -152 294 -299 -384 196 207 -80 -60 -307 -245 208 -122 -278 -216 -29 144
7834 144 91 70 2 -45 -65 161 -203 33 30 -205 -132 -29 -105 -121 109 -144 239 183 -68 -270 70 72 -47 265
7858 265 -11 -374 191 69 -11 6 6 28 174 389 184 -114 -262 258 211 -116 -54 -249 493 402 4 17 314
7881 314 -37 42 157 103 146 390 75 -380 -88 107 257 170 -178 -524 -11 45 -17 -221 31 45 -141 -231 -16
7904 -16 -202 -104 262 -406 -144 396 -91 -130 -136 183 -45 -44 -28 -389 210 158 54 78 -325 -181 14 100 -297 -473
7928 -473 280 -56 142 -5 -32 99 115 63 -231 -330 312 16 -43 277 -103 -88 402 -211 -138 -144 -58 126 -123
7951 -123 -78 -101 -112 182 -145 -277 -150 39 -33 52 -93 -234 26 -114 -204 -181 368 -8 -15 135 -11 -51 145
7974 145 188 146 45 -6 -45 -441 181 -188 -41 323 -234 36 -288 166 93 196 99 4 95 461 -147 -262 200
7997 200 120 193 102 -140 -154 139 106 -253 -67 246 17 14 214 260 199 157 -83 -45 236 300 -54 20 85 -189 2
8022 2 -16 -7 -407 131 275 238 80 -68 -394 570 -69 -533 104 239 -252 -37 16 -264 -153 154 27 -282
8044 -282 -100 150 -125 43 -249 1 -31 -201 -469 -226 219 175 22 191 -204 -264 -37 57 -216 340 138
8065 138 -84 -73 242 -228 105 106 -397 4 199 284 -225 -349 -83 26 118 59 -194 -94 -15 23 -339 56 201
8088 201 -296 417 -29 21 -104 141 -294 256 230 -130 5 113 -239 -136 36 147 -55 -143 -202 -151 56 215
8110 215 -140 -71 95 -303 155 178 84 -140 365 213 -192 38 31 145 123 205 186 -194 118 -2 -481 -84 654
8133 654 -154 84 -3 146 42 -17 -118 -136 322 -178 131 10 7 -3 -210 259 -321 -89 67 -174 90 -87
8155 -87 -328 -11 441 -186 -178 403 -181 -68 -60 -266 -52 222 -61 -173 -265 127 -448 72 -74 -312 -133 -295
8177 -295 21 -234 314 144 141 503 -154 -624 72 496 -222 132 7 11
8191A1
$$ Imaginary data points
##PAGE= N=2
##DATA TABLE= (X++(I..I)), XYDATA
0 0 0 0 0 8 -16 16 -16 24 -40 48 -56 65 -89 112 -136 160 -193 233 -273 321 -377 441 -513 588 -676 780
26 780 -889 1005 -1142 1294 -1455 1638 -1834 2054 -2291 2555 -2843 3156 -3503 3882 -4299 4761
42 4761 -5271 5833 -6466 7172 -7965 8868 -9909 11114 -12531 14227 -16305 18922
54 18922 -22315 26925 -33585 44100 -63214 108953 -432954 -40969 970887 -155409 -555782
65 -555782 353211 502094 -590420 -470187 516321 340227 -565829 -172328 626815 193312
75 193312 -578936 -173142 350850 -20985 -275357 241033 323396 -257964 -348705 148699
85 148699 221076 -53136 -62917 43629 -28714 -52242 9650 25876 39110 32761 -54674 -10194
97 -10194 117980 -37024 -265845 -14876 352633 135910 -246866 -62120 183727 -144532
107 -144532 -312492 229658 442084 -166624 -329696 274311 214014 -491636 -248205 556579
117 556579 252393 -451899 -24276 496569 -155907 -610375 152501 565085 -141035 -374259
127 -374259 307920 323338 -428378 -346222 405284 271175 -357806 -87454 422480 -13758
137 -13758 -467527 36850 415930 -53350 -289045 116919 186588 -170587 -127371 172957
147 172957 86968 -123572 -13365 112224 -35860 -154450 -26046 121090 106916 20997
157 20997 -52844 -96803 -64985 3474 17430 49443 121953 32360 -149766 -74300 96225 -48784
169 -48784 -175976 110505 267689 -56523 -189559 75827 30432 -266824 -53138 358148
179 358148 138677 -280054 -102994 196941 -32904 -237458 75549 241686 -97659 -185429
189 -185429 173271 141166 -275787 -167455 276306 145367 -223443 -53318 178167 -78594
199 -78594 -198001 142327 220793 -124842 -186993 83970 85447 -116768 -33612 163108 52876
210 52876 -132202 -31913 85438 -56369 -131013 66323 170747 27189 -60113 -34149 -70762
221 -70762 -70648 51069 95929 32344 17706 6814 -61817 -56896 4408 -10214 -293 104310
233 104310 96580 -58605 -100330 1854 16444 -43230 22753 125757 36349 -109309 -40453
244 -40453 76897 -15239 -84062 74532 122915 -76948 -104344 87012 58838 -109714 -7625
255 -7625 153546 10038 -147656 -20887 93225 -6761 -41549 80436 72749 -88857 -96155
266 -96155 47858 40028 -68093 16817 151154 27517 -141923 -60955 43140 -24481 -21260
277 -21260 106875 83277 -62395 -71000 -301 -20505 -46334 22535 83515 47386 -23679 -47257
289 -47257 -32567 -31605 -22935 30393 66850 26605 -27008 -41233 -37821 -10207 26940 16777 -5617
302 -5617 8716 -1208 -34603 -9118 18590 -17396 -10009 50448 11651 -78467 -43990 44151 34879
315 34879 -3571 14672 11620 -50714 -68995 3276 58267 20243 -9530 34213 20345 -81766
327 -81766 -79130 35584 48779 -11219 32470 73552 -27438 -104252 -36728 26661 15267 29149
339 29149 59815 20655 -52456 -57276 -2059 16079 -10572 13708 69785 30690 -58476 -46170
351 -46170 13789 2421 -5118 41189 36290 -23291 -29609 2659 6105 2895 13097 16212 7149
364 7149 -15108 -30235 773 37641 21887 -1106 7181 -4949 -33752 -20796 13580 31196
376 31196 38023 24214 -11852 -33285 -36745 -23582 23282 55497 25048 1220 12269 -22694
388 -22694 -69471 -25859 44621 41508 18370 21425 -213 -41812 -46225 -10830 24572 30124 17053
401 17053 17767 6222 -43564 -52223 13055 39088 -1848 -2997 23454 -7355 -37420 -7585 13223
414 13223 462 4647 12717 -6270 -25658 -20386 7558 29723 12116 -17606 -10493 -5892 -32262
427 -32262 -19829 34067 37432 -870 -10603 -15117 -34564 -26584 4381 22887 30921 20552 -7813
440 -7813 -25041 -32853 -40600 -6293 50901 44736 -2316 -13912 -16076 -35056 -24108 10738 22327
453 22327 21167 19873 557 -23014 -30094 -21616 9651 35421 15002 -8493 2198 -3948 -29010
466 -29010 -6318 29685 14076 -8652 -1259 -2427 -9474 1662 10661 10957 11943 -2041 -17195 -9072
480 -9072 -3061 -1592 26866 42117 1174 -32587 -20832 -7378 -309 20898 28883 16844 6332
493 6332 -9922 -27708 -21218 -5030 13562 43521 41191 -10378 -33952 -12703 -11661 -14011 23755
506 23755 42706 11054 -10191 -6979 -12686 -16962 -3849 12550 23331 16678 -4303 -12477 -9758
519 -9758 -16694 -2214 31323 18765 -21244 -16603 3330 -1725 3494 16186 -1546 -15099 -249
532 -249 -702 -14350 -5023 11302 15885 15091 -4779 -32509 -27220 -1936 10769 21169 24018 -256
546 -256 -22339 -22832 -20831 -7799 16719 17159 7067 12604 -1639 -35716 -30018 -1172 4648 16311
560 16311 34438 7586 -33959 -28148 -4598 436 5762 11367 5382 644 -3254 -11034 -10668 -7487
574 -7487 -2050 17654 20271 -14539 -25881 3693 10008 -3043 10138 11943 -17906 -19085 6278
587 6278 7493 1989 12697 9299 -6453 -8914 -9851 -10204 1833 15115 20740 20064 -2049 -30550
601 -30550 -22603 1343 10522 21782 27301 1231 -16896 -4061 -5283 -16979 781 22233 20351
614 20351 17552 3943 -26156 -26509 4541 16491 13669 15366 4099 -11600 -5424 1616 -2297 2262
628 2262 6852 4156 7383 4243 -10457 -6895 7322 4340 5672 12221 -9281 -25744 1858 22780
642 22780 9137 3072 1576 -17060 -17943 5139 10139 1196 4741 8179 5525 -3432 -22149 -25318
656 -25318 3039 22055 15938 11267 -1404 -27743 -24507 2280 7058 4124 11976 7010 -7021
669 -7021 -7095 -11302 -16912 -3015 10094 7721 11474 5642 -22955 -24614 4890 10751 -864 3301
683 3301 1451 -12662 -7696 6890 2729 -5590 -5792 -667 5796 -1557 -15821 -3708 16123 5632
697 5632 -5819 1663 -9506 -23206 2218 22998 5554 -2946 6329 -5930 -18698 -6672 3700
710 3700 5340 11749 11938 2061 -5754 -15608 -16848 4389 18224 10255 7302 4229 -10643 -11713 1328
725 1328 136 886 13635 10569 -614 2930 -5162 -19772 1704 26094 7389 -9825 2186
738 2186 2349 -6494 4978 13756 -1306 -9602 1139 10501 4680 -7084 -3111 13573 8474 -7651
752 -7651 160 3905 -16305 -6786 31279 21551 -16022 -11565 1948 -11388 -4032 21886 12319 -10504
766 -10504 -2869 9161 -1150 -13820 -10979 3012 14037 11207 5407 -2317 -20357 -20835 10270
779 10270 21518 -2198 -6244 4662 -6522 -10045 7920 1745 -15531 -43 13823 -1549 -6478
792 -6478 1009 -8740 -11214 9294 13192 -6451 -15498 -5822 4004 5154 861 1068 -1763 -15906 -11590
807 -11590 14081 9212 -15654 -2229 17767 -5230 -19747 2802 1837 -15086 5675 25183 -886
820 -886 -19139 -4847 319 -8190 -370 13561 9382 -6646 -9929 2321 1252 -12237 -2199 18443
834 18443 4867 -12122 4512 7541 -15867 -7603 18586 5131 -11477 6470 8857 -10443 -4768
847 -4768 11302 3133 -3928 3182 3235 -4178 -2943 6228 10706 1845 -7551 -430 4876 -4372 -197
862 -197 15084 3208 -10185 7820 10371 -14850 -9484 15910 7897 -3769 10890 7819 -15896
875 -15896 -11055 10140 9214 1247 3877 4344 -1929 -6036 -757 5809 -693 -6768 8525 14998 -7414
890 -7414 -12789 6216 1049 -10282 9827 16556 -13118 -15292 10666 7466 -8557 697 6451 -7078
904 -7078 -6885 5247 4331 -4970 -5338 2905 6020 -4841 -9977 884 2454 -7108 4192 14118 -8391
919 -8391 -19330 2460 6245 -8850 1436 11755 -6475 -11285 3012 359 -9972 -1655 5475
932 5475 1940 -92 -1947 -5860 -6256 -3505 1843 7466 549 -8146 -29 2111 -8725 -1702 10260
947 10260 -2749 -9038 7769 3741 -12248 -1104 10432 -3071 -5966 7100 978 -9909 -1234
960 -1234 7351 3118 -1407 -959 1797 127 -5714 -534 11857 3525 -7210 3886 7620 -10785
974 -10785 -6470 13917 5958 -7001 5713 7745 -8804 -4795 7658 3617 -480 5048 3900 -1085
988 -1085 -2581 -2823 3191 6969 796 972 6061 -1240 -7563 4472 7010 -2263 2046 7155 -3991
1003 -3991 -4242 5964 -47 -3737 7416 5249 -6519 -1261 3603 -3534 -1065 7061 3178 -2597
1017 -2597 -1892 -2482 -869 1794 -980 1800 5576 -3719 -7603 3204 640 -8543 4016 10734 -6530
1032 -6530 -8915 4669 -560 -9472 2511 7852 -2589 -4906 -917 -2496 -2843 -1691 -96 4347
1046 4347 1486 -8092 -4219 2163 -5136 -3286 8114 1955 -8801 -1270 1167 -7577 -2286 6309
1060 6309 -556 -2837 2601 -3112 -6715 98 483 -1241 4491 2616 -6237 -4269 615 -1582 1008
1075 1008 4070 -777 -758 147 -4791 -1271 5963 -373 -3599 6820 2807 -9581 -1018 7918 -1218
1090 -1218 -1759 8192 1737 -7558 -764 2909 678 3065 4234 1503 230 -3360 -4223 4755 5243 -1286
1106 -1286 4316 7597 -5646 -7665 5616 3765 -3005 6352 7826 -2893 -2103 1160 -3401 -4
1120 -4 8097 3524 36 2683 -2008 -5210 2630 4924 568 2189 1518 -2138 760 1748 -2688 2262
1136 2262 4993 -2500 -977 4869 -4459 -6511 7899 6771 -5692 -696 3495 -8350 -5999 8357
1150 8357 6351 -3546 -2760 -980 -2642 -2625 -2626 836 5068 89 -2478 2125 -3871 -12691 -1520 9639
1166 9639 822 -1823 3978 -5307 -12532 1229 4985 -3998 36 4779 -3356 -5085 55 -3394 -4430
1181 -4430 1792 2603 271 -556 -4536 -5236 837 1498 258 2541 -3923 -8595 2871 6499 -5770
1196 -5770 -1960 8358 -3206 -10405 3613 4805 -7121 836 11415 910 -7881 -2532 -848
1209 -848 -2040 1821 6240 6195 -445 -7009 -1838 3027 -4073 -1695 12465 6394 -7496 803 5212
1224 5212 -9223 -6262 12132 7490 -3932 2213 3537 -6081 -2625 5927 1754 -540 3128 3410
1238 3410 -95 -2371 -513 4122 3849 -1647 1146 3981 -4506 -2988 10958 5500 -8059 891 6215
1253 6215 -7478 -5112 11048 4851 -5323 4175 5430 -8584 -7616 3848 4135 1115 4637 5396
1267 5396 -2335 -10598 -6997 6238 5575 -4170 2651 9745 -5941 -11685 3408 1093 -10321 4230
1281 4230 15153 -3605 -11265 1444 -259 -8204 1859 8065 -2258 -6635 578 2902 -2580 -5697
1295 -5697 378 3941 -3469 -6790 3672 3189 -8502 -1094 10721 -3170 -12742 1095 2217 -7659
1309 -7659 4452 13427 -5139 -12810 670 1574 -6962 -443 8565 3771 -1987 -1563 -1742 -6690 -8567
1324 -8567 2325 12602 4246 -5321 1076 10 -12050 -3004 12436 1148 -5883 9131 6042
1337 6042 -12210 -5489 8346 -694 -5785 8280 8763 -4992 -6406 2891 4747 -267 -1369 3045
1351 3045 1852 -5215 918 11500 795 -9194 4370 8292 -9759 -6689 13193 5426 -5570
1364 -5570 7395 7894 -11654 -10248 7032 5809 -245 5741 7358 -2004 -8149 -4387 1937 2168 1463
1379 1463 7656 8319 -4807 -8658 1533 -1828 -7186 8362 14300 -4659 -8527 5424 -902 -10063
1393 -10063 2243 7702 -3233 -1360 6540 -1483 -8660 -1496 5168 793 -4282 -2044 2390 -548
1407 -548 -3591 4665 6252 -8457 -9949 5766 1464 -10498 3328 14057 -4089 -11148 2804
1420 2804 -1034 -12511 -858 11481 3659 -1983 355 -4504 -10810 -6518 4598 8709 1430 -3048
1434 -3048 3346 718 -12737 -7910 6873 2465 -1626 9014 4500 -12652 -6963 5661 -1318 -3834
1448 -3834 6307 4475 -5096 -954 2568 -3135 -2961 2672 2768 -1519 -2580 1388 4566 155 -2499
1463 -2499 4312 2671 -9202 -4703 8825 4525 -1130 7629 2973 -12257 -4341 7714 -578 -3160
1477 -3160 10660 10813 -3020 -6136 -3338 -3550 -1259 6097 11349 6671 -4450 -6131 1334 -1516 -6844
1492 -6844 5391 13021 749 -3273 4678 -2184 -10457 1860 8545 -870 678 6903 -1003 -7355
1506 -7355 215 4940 690 -1598 -1712 523 2995 329 120 2445 -1547 -4155 1368 -385 -6830
1521 -6830 2537 10660 399 -4557 7 -6147 -10299 3118 9428 327 1148 4547 -4574 -11737 -5134
1536 -5134 1011 3543 4778 3568 1284 -2745 -9537 -7496 913 1668 2079 8846 2451 -11321 -5624
1551 -5624 3523 -4335 -6090 6854 5655 -4126 -1891 555 -4912 -2920 3212 1473 -1616 -2273 -1113
1566 -1113 2214 2025 -2790 -1050 1309 -4500 -5217 2470 2420 513 6498 4182 -8921 -7302 1546 -996
1582 -996 -402 8762 7828 -864 -3078 -5730 -7927 -393 7130 6314 4995 2693 -2319 -4496 -5301 -5552
1598 -5552 3394 11152 5036 -37 1605 -4511 -8326 2247 6305 -1075 1962 7738 286 -5760 -505
1613 -505 1476 -532 2492 2372 -1253 151 2115 1091 2004 432 -2453 1049 -309 -5074 1671 10395
1629 10395 3092 -3740 -323 -2833 -7627 -464 6052 2735 4536 6345 -2867 -10019 -5831 -2023 2263
1644 2263 8279 6165 403 -1890 -5671 -8357 -2919 1539 3166 7942 5470 -6203 -7508 -1126 -3293
1659 -3293 -3423 4600 4408 -827 568 -1200 -7772 -3080 4416 392 -2904 -157 14 -569 756 -923
1675 -923 -1545 577 -2547 -4964 -239 1225 60 5578 3916 -7004 -7424 -843 -2339 -1906 6699 7157
1691 7157 269 -1264 -4503 -10538 -4826 5463 6708 5351 3165 -2284 -5014 -4952 -6388 -914 9004
1706 9004 8156 1508 206 -3792 -7870 -1747 3377 631 3565 7645 -84 -5786 -1154 -301 -1140 3888
1722 3888 3830 -1847 -133 3277 494 195 2249 -145 -505 254 -2679 -171 6452 5547 893 455 -4054
1739 -4054 -6966 815 4843 1162 4732 9629 489 -8791 -6094 -2619 588 7432 8732 2687 -139
1754 -139 -3365 -7536 -4739 821 3929 7759 7374 -2070 -6187 -3026 -4092 -3312 4410 5517 895 2202
1770 2202 -357 -7727 -4183 4068 1555 -1131 820 -813 -1734 1771 500 -3790 -59 1912 -2301
1785 -2301 -3689 -1459 891 4901 3733 -3682 -5639 -2920 -4432 -2484 5879 6143 467 727 -2665
1800 -2665 -11208 -6912 3137 4773 3477 5408 1304 -5616 -6913 -6473 -3979 4626 8663 4643 571
1815 571 -4749 -8565 -2988 1447 -739 1698 7495 2844 -4140 -3329 -3388 -2503 3725 4475 -2463 -704
1831 -704 3079 -871 -2360 2168 1426 -1481 -202 -855 -2139 2253 4968 3098 1458 -2295 -5756 -1468
1847 -1468 1318 535 5238 9512 1350 -5836 -4509 -4764 -3201 6959 10301 2627 -55 1417 -4712
1862 -4712 -8594 -2917 4041 8884 8890 760 -4897 -4355 -3761 -2287 3733 5337 2321 3925 1701 -6521
1878 -6521 -4886 1746 1285 683 4508 1191 -3423 111 1014 -2628 32 3884 -1461 -4431 -1109 1051
1894 1051 3459 4193 -916 -4507 -3189 -2242 -2053 1749 2297 2693 5572 85 -11279 -8930 911 3040
1910 3040 3627 7515 3033 -5994 -5834 -4638 -5278 240 7169 6251 1958 -2385 -6914 -5562 -2642 -1238
1926 -1238 3303 7763 2668 -3805 -3477 -5263 -4821 3277 5556 -1802 -1851 2900 -117 -3594 -380 311
1942 311 -484 2362 15 -4588 -1190 4103 3617 1146 -1390 -4026 -2825 -335 -455 3268 6899 2530
1958 2530 -2747 -2789 -6062 -6137 3862 8858 3447 2407 3053 -5002 -9295 -3290 2442 5297 8695 5547
1974 5547 -2537 -5471 -3800 -2345 840 3009 4432 7038 3187 -7002 -7057 618 2252 1636 4875
1989 4875 2102 -2891 649 1798 -3028 -1083 4157 1832 -1843 -584 -257 328 3584 2470 -1093
2004 -1093 -1759 -2729 -2877 877 3522 2940 5052 2007 -7035 -7929 -1019 1258 2800 6670 3724 -2126
2020 -2126 -2413 -4054 -9185 -3250 7510 8597 3059 -1586 -5566 -6406 -3113 -984 2051 5340 3811
2035 3811 -261 -2141 -5628 -6922 229 5129 560 260 2488 -2668 -5506 -438 880 -721 1227
2050 1227 1072 -3722 -3357 2043 2706 957 -978 -2930 -1706 -275 -2090 -1073 4860 4753 331 -2207
2066 -2207 -6121 -7305 772 6792 3237 2324 3031 -2788 -7453 -4166 -1076 1918 7373 6931 193 -4201
2082 -4201 -4658 -4514 -1417 3389 4734 5779 3818 -3602 -6356 -2139 142 1634 5390 3404 -1506
2097 -1506 405 1573 -3989 -2587 4284 4007 -215 -622 -1665 -814 3120 3116 -245 -1036 -681 -2038 -248
2114 -248 1154 1489 4345 4880 -2540 -6460 -2697 -733 1076 6331 5842 -250 -1455 -2693 -6582 -3998
2130 -3998 4323 6869 4887 2541 -3151 -6270 -3851 -1739 -358 4595 6434 2567 -1507 -5487 -6964
2145 -6964 -1110 4888 2131 15 2692 -112 -4224 -1760 -777 -1134 2391 3808 -2118 -3972 -976
2160 -976 313 714 900 -1058 -2650 -1041 -2517 -1654 2548 3448 623 -158 -2978 -7372 -2525 4150
2176 4150 2286 1207 4050 484 -5682 -5862 -3578 -301 6169 7429 1175 -3171 -4408 -4413 -2754 1182
2192 1182 2780 4733 5352 -867 -6125 -4523 -1848 -59 4437 4808 -91 -1008 -82 -3614 -3291 2049
2208 2049 3327 1144 1373 -487 -2684 588 2793 496 54 768 -686 -701 -316 -148 3083 5594 430
2225 430 -4676 -2448 -1315 -451 3987 5614 1127 223 -246 -5139 -5444 1004 5316 5132 3998 -301
2241 -301 -4705 -4246 -2653 -667 3902 5940 3361 725 -2359 -6807 -3734 3295 3578 1653 3164 1232
2257 1232 -3449 -2865 -1457 -1351 2155 4845 460 -3293 -1077 -510 -332 1341 378 -915 320 -1243
2273 -1243 -2837 38 2562 1107 924 -906 -5529 -3772 1497 1790 1379 3655 1487 -3742 -4504 -3349
2289 -3349 -2982 1892 6395 3470 -1169 -3273 -4838 -4332 -964 1054 3948 5856 1157 -4842 -5069 -2988
2305 -2988 -1838 2614 4597 852 -465 591 -3434 -5306 29 3015 1985 1632 173 -2856 -1510
2320 -1510 544 211 259 1635 -782 -811 -253 -1691 126 4070 2576 -2206 -1867 -1219 -2211 2459 4466
2337 4466 1452 469 1743 -3514 -5321 -736 3293 4133 4748 1656 -2861 -3179 -2390 -1981 1430 5410
2353 5410 4173 2317 -594 -5325 -4531 799 2494 2090 4097 2751 -2176 -2573 -1107 -2189 1025 5073
2369 5073 2741 -892 -1198 -1192 -1014 1388 904 -18 1202 533 -2124 -830 1461 1049 2072 1698 -2911
2386 -2911 -3379 469 965 45 3178 2642 -1713 -3122 -2594 -3245 1 4451 3457 337 -1120 -3567 -4292
2403 -4292 -1674 2 1830 4714 3051 -2779 -3901 -3723 -3029 897 4736 1798 -333 933 -1972
2418 -1972 -5144 -1963 1423 1125 2305 1513 -2258 -2544 -132 -902 -500 1528 152 -732 -657 -1933 -1588
2435 -1588 2529 2109 -1054 -656 -837 -2807 -681 2863 1056 518 2026 -1056 -4681 -2392 930 2226
2451 2226 3939 3238 -1161 -2303 -1946 -2297 -416 3348 3186 2629 1744 -3237 -4949 -848 1776 1470 3676
2468 3676 3701 -671 -2090 -1415 -2428 -379 3691 3143 156 90 -341 -2209 -103 1444 793 1591 1604 -1490
2486 -1490 -1511 584 284 1722 2603 -846 -2876 237 475 -643 2295 2759 -455 -1009 -641 -2810 -1576
2503 -1576 2748 3544 1278 475 -1759 -3732 -2072 -587 953 4019 3720 -970 -2462 -2432 -3455 -994
2519 -994 2990 2592 643 1704 -1345 -4579 -2320 742 903 2000 2460 -1317 -2642 -906 -1019 -689
2535 -689 1181 1042 21 103 -1355 -2384 55 1751 281 72 -239 -2754 -1639 1541 419 224 2357
2552 2357 -79 -3603 -2115 145 -238 1773 3187 253 -1724 -1877 -2608 -1827 1364 2574 2500 1802 -1717
2569 -1717 -4471 -1457 361 174 2621 3579 -450 -1709 -688 -2471 -2397 2428 3528 725 693 -594
2585 -594 -2574 -816 1096 673 1343 1892 -691 -1587 22 -254 483 2244 1032 -1205 509 -155 -1502
2602 -1502 985 3495 295 -210 356 -2051 -2307 1969 2792 1432 1329 208 -2365 -1830 -311 121 1907
2619 1907 3311 1317 -690 -1486 -2948 -1354 2356 2252 877 2191 86 -3688 -2188 598 -67 1309
2635 1309 3051 350 -2180 -794 -1224 -1828 658 2157 809 -28 -820 -2072 -532 1065 255 268 525
2652 525 -1704 -1908 921 -173 -785 1717 1435 -2005 -1378 -498 -1539 616 3055 679 -1352 -900 -2084
2669 -2084 -2558 292 1595 1220 1361 -79 -2467 -1577 -974 -1042 1412 3365 393 -722 -464 -2589 -2491
2686 -2491 1633 2617 439 688 1016 -2276 -2083 508 284 81 1964 642 -984 -795 -875 -40 2000
2703 2000 1018 -519 215 124 -1420 223 2304 86 1 1393 -906 -2271 471 1593 -67 1147
2719 1147 1788 -1153 -1627 -535 -362 880 2565 1501 -326 -532 -1568 -1903 1015 1649 554 2183
2735 2183 1008 -1994 -1706 -319 -802 663 3723 1188 -1854 -202 -337 -1706 243 1856 576 303
2751 303 453 -742 -1267 108 279 529 1306 -328 -1278 -236 -705 -542 1879 1391 -1862 -805 267
2768 267 -1489 -734 2113 776 -855 63 -621 -2476 -684 661 441 1183 1011 -1349 -1900 -970 -824
2785 -824 639 1842 34 -263 325 -1743 -2768 195 1840 -177 816 1280 -1605 -2479 -4 -184 -29
2802 -29 1605 1137 -1199 -900 -707 -743 184 943 21 318 -111 -1541 -272 1062 102 85 1738 -344 -2266
2821 -2266 58 650 -426 1218 1881 -701 -1374 191 -369 -798 1278 1799 -279 -135 -953 -1310 63
2838 63 321 641 1611 1290 -1335 -1148 729 -785 161 2447 1337 -471 401 30 -1923 31 1759
2855 1759 557 231 882 -243 -1352 11 204 494 1106 45 -871 203 -171 -1091 1032 1758 -433
2872 -433 -250 823 -1307 -1005 1428 1086 -317 870 455 -2163 -964 1092 458 469 1203 -96 -1297
2889 -1297 -519 -1094 -209 1275 429 -431 399 -776 -2122 -129 1060 -393 475 1239 -1225 -1728 314
2906 314 -175 -1398 963 1390 -1113 -737 -264 -729 -389 978 56 98 -131 -1477 -902 456 -45 -349
2924 -349 1061 180 -1611 -235 210 -1178 107 1809 -253 -1335 751 -307 -1356 634 1179 -242
2940 -242 322 -75 -971 -506 485 -24 638 1122 -384 -735 265 -953 -633 1632 888 -959 440 396
2958 396 -1816 -746 1679 586 -89 1157 114 -1069 -59 517 -113 918 901 -551 -328 -90 -817
2975 -817 815 1407 -144 237 973 -911 -1056 1433 1012 -617 745 991 -1057 -651 527 -234 288
2992 288 1498 571 -649 120 216 -361 374 832 83 395 230 -1091 -29 733 -649 -47 1485 -454
3010 -454 -1605 353 -105 -852 574 1247 -945 -460 370 -660 -777 906 239 -476 237 -837 -787 26
3028 26 -103 -193 966 288 -1145 -409 473 -1001 -219 1611 167 -729 418 -338 -1340 341 207 -537
3046 -537 109 579 -847 -922 41 -99 77 798 -375 -565 610 -438 -729 732 722 -660 -126 437 -1416
3065 -1416 -523 1183 204 -286 883 -258 -1498 179 437 75 795 874 -446 -489 162 -721 111 875
3083 875 86 63 519 -354 -1260 527 647 -115 936 832 -787 -615 978 69 -359 1090 657 -424
3101 -424 376 83 -571 276 639 -358 288 613 -613 -401 946 -110 -112 926 -273 -902 694 275 -771
3120 -771 782 1148 -812 -664 363 -595 -534 1097 456 -61 373 -502 -966 59 383 -417 775 1052
3138 1052 -466 -490 71 -1054 -409 1004 145 -105 454 276 -1403 -83 875 -151 121 488 -714 -590
3156 -590 448 -244 -659 500 64 -620 618 252 -674 174 618 -696 -232 172 -953 -656 1029 197
3174 197 -742 626 -335 -1448 -409 547 -274 134 720 -692 -752 81 -739 -566 914 624 3 161 -622
3193 -622 -966 325 662 -231 259 1317 -171 -631 233 -250 -650 987 701 -387 371 149 -837 46
3211 46 810 -90 -339 554 -143 -167 481 657 -110 648 325 -988 596 737 125 408 747 -158 -391 114
3231 114 -298 39 1498 659 -141 497 409 -1139 -8 591 116 716 896 -426 -582 -135 -526 -400 829
3250 829 727 -142 212 606 -958 -95 699 -604 299 1166 -298 -742 507 230 -1007 390 132 -314
3268 -314 76 265 -489 222 660 -605 -726 -206 -202 -326 577 230 -379 284 -623 -1366 124 516 -160 623
3288 623 909 -640 -1658 -36 -516 -711 610 456 44 505 259 -1351 -647 917 -262 164 376 -58
3306 -58 -436 -325 -560 -667 712 285 -527 75 381 -162 12 147 -632 -691 682 -16 -377 379 300 -165
3326 -165 251 49 -715 -427 786 209 519 1051 -141 -524 150 -390 -677 1204 1183 208 367 -210 -864
3345 -864 -350 615 -90 442 1552 108 -815 -370 -59 -288 538 962 249 362 607 -786 -230 202 -44
3364 -44 26 1244 243 -545 414 375 -559 441 242 -651 387 625 -154 -495 766 59 -925 -429 58
3383 58 174 861 603 -96 226 -44 -1093 -804 207 303 271 986 -558 -995 -18 -372 -708 600 573 -178
3403 -178 173 112 -1405 -852 187 -69 53 926 93 -620 -163 -693 -919 -46 666 174 279 387 -325 -428
3423 -428 527 -709 -1031 548 458 -577 281 730 -692 70 3 -1064 -405 490 450 479 513 -54 -799 -244
3443 -244 -497 -571 786 1346 165 83 5 -1436 -532 668 243 79 1342 477 -468 -329 -606 -366 795
3462 795 890 -315 321 701 -110 -799 5 -201 189 913 226 -499 437 285 -542 25 390 -48 148 556
3482 556 78 -128 617 352 -473 -297 60 -163 751 973 -299 -171 320 -422 -691 -3 -25 626 1341 168
3502 168 -1016 -288 -278 -764 -20 839 360 367 37 -1373 -789 334 165 66 717 615 -284 -96 -262 -1034
3522 -1034 -106 676 -85 4 268 -336 -16 189 -485 -868 -88 67 -383 324 228 -503 48 118 -1038 -641
3542 -641 555 417 -186 506 -124 -723 -274 -454 -811 377 931 186 -137 -95 -815 -890 45 -18 268 1024
3562 1024 573 -294 -399 -693 -658 333 1234 -74 -166 359 -217 -679 -391 -270 222 753 194 -357 -170 539
3582 539 -470 -427 169 -99 168 597 86 -388 798 648 -831 -332 -26 -609 387 963 335 169 660
3601 660 -589 -859 208 -100 520 1381 657 -532 -375 -150 -498 404 705 566 823 689 -497 -1245 -325
3620 -325 5 304 537 602 -186 299 250 -1374 -326 645 441 101 303 -75 -197 228 -212 -315 128 645
3640 645 -294 -266 367 -83 -262 352 -568 -814 -54 160 -114 511 438 -650 -35 -209 -1119 -387 818 621
3660 621 79 -34 -785 -1120 -8 -46 -87 736 817 -423 -521 -644 -784 -135 863 331 80 744 -65 -866 -442
3681 -442 94 -120 563 761 -254 -507 243 -296 -203 -121 -489 -155 370 275 -320 241 458 -447 -247 -179 -633
3702 -633 258 1133 4 -155 486 -165 -787 -269 122 165 1106 537 9 -629 -65 -746 -171 819 923 993
3722 993 826 -193 -1331 -316 187 453 860 760 -39 -10 172 -704 -828 449 321 223 435 -492 -41
3741 -41 145 191 -422 364 889 322 61 316 -436 48 513 81 -384 81 346 254 472 95 -272 -154 54
3762 54 -744 -486 832 706 220 254 -685 -1107 -179 129 -186 686 805 233 -520 -733 -1069 -445 527 409
3782 409 -43 387 327 -696 -516 -593 -535 676 933 -213 -442 41 -53 -260 200 -68 -231 477 -68 -582
3802 -582 168 332 -609 -372 137 -502 -302 944 -74 -124 84 -359 -880 -142 -118 -107 754 1027 -227 -538
3822 -538 -209 -176 -682 235 598 568 1130 -168 -1050 -537 213 -264 561 927 89 -38 143 -766 -1213 407
3842 407 616 268 458 67 -522 107 201 -100 170 575 133 213 -101 -27 -131 359 494 -303 -246 256 109
3863 109 211 534 -145 -215 20 -498 -733 532 719 390 491 -28 -831 -265 135 -312 142 1093 274 -7
3883 -7 -122 -933 -930 641 927 529 659 380 -413 -571 -551 -579 304 1033 267 -305 -263 47 -549 -53 -299 -77
3905 -77 227 727 -504 -355 350 -284 -143 -79 -719 -227 465 -123 -186 475 228 -464 -446 -199 -439 269 1029
3926 1029 478 -523 -62 -639 -663 -13 566 318 715 330 -876 -902 -386 -155 281 609 166 181 156 -885
3946 -885 -1110 -23 487 435 618 400 -537 -212 575 -316 -503 451 61 288 178 -110 -497 89 203 -666
3966 -666 -410 207 -507 414 366 -331 3 328 -88 -368 88 562 663 630 450 -815 -609 392 -479 25
3986 25 1079 1014 200 -192 -736 -675 284 638 46 561 819 25 -442 -583 -829 538 839 511 181 -218
4006 -218 -157 -701 155 114 -182 21 698 -147 -574 212 -34 -243 433 -334 -223 193 348 -298 22 144 -158
4027 -158 -526 -372 -672 39 941 272 -198 -107 -504 -620 -62 288 158 502 476 -467 -562 -631 -442 4 640
4048 640 188 39 148 -343 -859 -327 164 106 673 359 -490 -659 364 -617 -614 67 503 -9 97 -299 -998
4069 -998 7 548 -516 -96 102 -323 163 408 -91 -26 404 -287 -253 135 341 143 722 327 -889 -465
4089 -465 -39 -114 -237 663 533 65 202 -233 -660 141 802 243 292 1024 3 76 -164 -454 95 802 682
4110 682 94 481 115 -292 -38 148 -84 379 470 -44 -512 55 86 30 212 155 -252 445 216 -233 -6
4131 -6 75 92 -129 3 -702 -394 799 348 -326 337 -432 -804 -13 237 -287 406 892 87 -493 -131 -150
4152 -150 -166 591 404 30 -170 -23 -666 -707 -60 70 781 433 -190 -643 -2 -306 -381 21 274 -132 359
4173 359 155 -936 156 195 -137 -485 340 -138 -285 341 213 -222 418 1 -684 -428 100 -53 264 195
4193 195 -95 -518 -146 -248 -233 294 463 174 110 -142 -964 -501 693 222 202 622 68 -402 93 -466 -583
4214 -583 -15 483 380 299 237 -240 -214 143 -110 303 730 434 -50 -240 231 -207 256 391 -321 71 505
4235 505 -299 -590 272 182 -121 89 -219 -331 375 681 90 315 -312 -289 -57 227 -213 -86 785 25 -474
4256 -474 -231 -421 -321 253 594 153 122 -147 -795 -820 73 -276 309 1068 186 -238 -97 -258 -300 27 -23
4277 -23 -21 289 145 -634 -480 438 -81 -308 216 -97 -254 414 -57 -141 -26 275 -453 -383 -167 -99 204 481
4299 481 33 -548 126 -236 -223 -158 126 186 632 -49 -914 -663 97 -64 199 420 263 -65 -415 -521 -386
4320 -386 -193 398 522 -92 -115 -595 -402 -69 -314 204 502 292 54 -8 -228 -367 507 522 -171 -243 421
4341 421 -445 94 100 37 -20 235 1 -700 125 356 158 65 112 -221 155 -49 -194 160 688 421 -15 -16 -325
4364 -325 -440 560 522 283 356 567 -125 -698 -153 116 149 717 417 -375 -226 -86 -234 -279 286 24 337
4385 337 281 -307 -515 10 88 61 353 -42 -370 -138 -24 -556 -144 186 -79 -239 -115 -188 -279 139 346 34
4407 34 -17 223 -241 -59 170 -81 333 358 -182 -698 -485 -265 -235 445 300 -111 -430 -247 -761 -399 504
4428 504 88 13 217 -104 -174 -29 -391 -140 315 350 -169 59 -132 -425 67 386 -197 -125 314 -266 -331 220
4450 220 326 -492 316 208 -570 282 65 -12 -182 192 -162 -371 324 -40 -186 220 444 -54 -374 0
4470 0 -201 3 509 0 349 531 79 15 10 52 -199 310 602 78 280 -40 -550 -94 339 342 409 164 -58
4493 -58 -145 -167 -276 -260 137 5 170 365 699 -228 -59 350 -27 79 245 -56 -153 247 380 -1 -102 327
4515 327 -140 -34 48 38 216 99 -303 -577 -372 -267 -363 227 55 -35 52 -267 -406 -493 175 253 210 312 -131
4538 -131 -298 -214 140 240 208 410 241 -106 -268 -566 -108 284 -271 -286 98 -276 -658 -81 -34 -264 -277 546
4560 546 -446 -435 -24 117 183 441 -233 -525 161 79 -249 146 388 139 63 -270 -216 106 189 31 -20 244
4582 244 69 -189 -64 -356 -310 158 301 -176 -1 259 -587 -201 68 126 70 508 166 -247 -259 -100 -35 245
4604 245 399 43 -65 300 -8 30 165 -2 -319 273 -75 -302 430 350 -120 -72 144 -113 2 243 250 220
4626 220 381 384 -235 -21 -157 -149 156 60 207 157 68 -596 -414 161 489 114 381 58 -18 223 85 -493 -19
4649 -19 133 -78 -47 -14 -279 -232 162 103 -26 388 -190 -301 -144 -136 -385 229 314 -107 -174 -216 12 -532 134
4672 134 69 -88 46 326 -328 -326 161 -70 -99 -192 -109 -393 -51 189 145 60 77 -218 -287 -100 -604 -86 545
4695 545 -96 -11 199 -125 -215 146 -102 13 170 202 -99 -80 41 39 230 286 112 -152 86 126 -274 181 -23
4718 -23 -38 212 -83 -365 116 -52 179 196 229 139 -436 12 40 212 -81 328 -23 -154 -37 15 443 503 -36
4741 -36 184 473 -36 -410 -100 45 -131 573 361 -263 176 133 -242 -32 328 48 -24 -92 48 -147 281
4762 281 22 -36 430 93 -241 -216 119 120 184 444 112 -102 -1 -76 -521 123 204 -45 -39 375 -234 -206 220
4785 220 82 -195 284 -180 -25 238 -35 -564 9 51 -48 -149 89 -140 -118 -95 -226 -454 200 -346 -184
4806 -184 -106 -519 -168 110 369 -272 -392 -81 37 28 216 -138 -263 39 -137 -298 -289 114 -129 -65 53 -62
4828 -62 -113 264 -87 -211 198 52 -343 -303 154 138 114 170 49 -210 240 -136 -366 41 54 -114 351 -2
4850 -2 -45 55 29 -178 -60 378 -165 -132 228 35 -322 491 120 340 135 -132 28 -135 219 299 -72 454
4872 454 295 21 -244 52 -196 50 -100 -4 54 88 -258 -56 129 7 346 266 171 -86 -31 184 -262 86
4894 86 329 -239 30 236 -131 -50 474 -214 -296 80 -188 -23 203 -207 -72 249 -43 -134 6 -41 -119 39
4916 39 14 56 -180 -132 -129 -344 162 -103 122 -90 -25 -247 -304 365 -66 -197 99 -115 -332 48 -264 -361 131
4939 131 -233 -205 64 -122 -254 -18 25 -115 -384 133 -45 63 136 -41 -59 285 116 -109 -242 325 -149
4960 -149 -258 12 111 -153 160 -89 -181 362 80 39 342 250 -441 14 250 4 110 -19 -6 -76 472 -17
4982 -17 -5 614 360 40 315 274 -13 -48 444 1 92 278 -161 21 -31 -31 -76 392 609 49 177 18 40
5005 40 -54 30 139 -129 -42 -46 -294 -29 42 64 293 38 -98 50 121 -164 -47 328 -76 -303 -140 286 -155
5028 -155 86 -77 73 139 99 -73 24 48 -193 -192 117 -279 -57 -406 -199 -289 -186 172 40 -45 53 -92 -207
5051 -207 -58 16 -140 -197 239 -154 -226 89 -220 192 247 -468 -203 184 -21 257 195 -74 -195 -30 205 -228
5073 -228 -9 207 70 82 162 -34 -292 -168 -134 233 368 -13 -259 206 -110 -151 -109 125 -102 179 26 63
5095 63 -423 237 -88 264 101 346 -57 220 -22 144 -217 -124 262 171 155 -311 -170 237 350 44 309
5116 309 -139 63 235 -194 124 39 222 174 -44 145 154 15 183 257 -32 -120 112 -92 128 190 267 137 393
5139 393 178 -78 445 156 284 291 296 -26 17 146 -212 32 -648 66 -235 88 -161 -415 55 52 -181 -42
5161 -42 208 -292 -167 -154 -296 -93 67 75 25 86 -257 -278 -179 -206 -464 6 222 -325 -98 -37 -39 26 -110 -294
5185 -294 -86 -45 25 29 -38 390 -8 -311 114 -308 -422 207 -20 -159 42 346 -327 -103 -45 -32 77 -331
5207 -331 -253 -252 175 -209 -112 298 20 -348 17 181 177 53 -6 -29 451 369 272 -92 22 -119 -167 63 212 217
5231 217 91 159 94 269 444 -183 90 265 -118 77 226 48 173 417 112 -152 82 -172 -30 193 543
5252 543 -227 -207 128 231 480 256 324 172 96 -7 -259 -78 108 -206 113 293 -31 -221 5 47 -214
5273 -214 21 270 76 -169 -202 -320 -258 41 -207 -48 265 -164 79 -183 -270 -106 5 -155 -226 -2 189
5294 189 -70 81 22 -233 -74 124 -366 -47 94 51 -118 -38 -180 -348 120 225 -184 -101 264 -179 -14
5315 -14 30 -534 -118 -93 39 44 82 -195 -81 67 238 -6 -60 299 37 -17 -102 198 -152 -26 -43 -42 340 315
5339 315 -21 191 189 -66 -188 264 -86 160 -33 114 -106 -114 406 70 214 439 -253 137 75 -204 -223 199
5361 199 -272 168 344 47 128 412 194 155 186 42 75 107 325 -54 193 132 59 -135 254 102 392 46
5383 46 -36 -267 315 15 -303 -33 574 -123 -52 232 159 129 -44 -218 -129 -188 -121 -220 -269 -108 -81 -234 -21 248
5407 248 -351 162 110 -180 -31 -326 -380 -69 183 -150 -420 42 -218 -109 -43 -421 -170 124 102 -200 -112 274
5429 274 -269 -341 -85 -766 -107 280 169 -295 -4 -97 -280 238 -215 226 69 357 -106 -98 258 174 239 314
5451 314 -105 -284 369 170 -336 -170 284 -239 -166 26 -249 97 118 234 -94 -103 -33 219 148 116 -309 411
5473 411 344 -159 -281 151 414 76 298 192 219 13 -8 -96 104 167 51 259 51 -447 -281 235 98 -201
5495 -201 -313 453 12 269 -280 -300 108 -13 -115 -139 153 15 28 122 41 -77 84 273 -118 244 464 -55
5517 -55 13 269 -105 -288 129 -34 -8 75 35 -441 126 -222 -41 198 145 -122 -337 95 43 54 -77 -310 -187
5540 -187 -317 -541 -266 -204 -205 -96 -191 -7 -284 17 -133 -174 -267 192 -107 150 -168 -223 -228 106 25 -403 -128
5563 -128 -116 52 19 -6 -165 86 135 247 -204 -191 -97 126 37 31 -199 -136 274 111 -502 225 181 57 -77 242
5587 242 140 305 263 -157 -56 416 215 166 262 -375 -130 302 106 -142 137 -55 147 335 -98 -245 -178
5608 -178 608 -107 56 284 116 326 435 -40 -226 113 125 -155 55 393 166 249 -45 -119 -69 417 25
5629 25 248 236 47 203 74 190 -394 97 41 -141 87 183 -286 -74 8 85 -276 19 338 -470 84 41
5651 41 -146 -79 -5 -83 -97 27 -77 33 -358 137 -135 6 51 -408 408 235 -126 -100 8 -139 203 -319
5673 -319 -66 -137 108 53 -374 -251 -172 -89 -65 158 -179 -353 459 29 -438 29 -207 128 182 -72 -289 72
5695 72 91 -154 -144 -242 -85 160 107 103 -254 89 95 31 20 -82 -198 -327 39 -11 -360 404 -174 -62 89 180
5719 180 451 144 76 -47 153 349 -257 -59 438 114 179 304 -146 -124 98 177 -45 -162 292 -68 80
5740 80 107 -167 -218 249 173 123 130 351 -47 173 267 -309 493 577 46 53 80 -352 87 189 193 -12 58 130 -549
5765 -549 -154 319 90 -155 -135 -216 -382 362 43 -179 -350 120 -557 -122 93 -446 14 40 -275 -316 -346 41
5787 41 -165 5 -320 -429 57 251 -177 -287 -192 -22 286 -7 -4 -54 -23 -189 -476 -179 3 -144 109 -297
5809 -297 -356 123 1 -559 -130 174 -26 399 111 -355 -124 -236 -68 -158 247 117 10 230 389 -488 -142
5830 -142 218 -195 -195 118 115 130 185 -198 -340 55 370 0 -88 16 146 166 303 -220 -72 327 351 192 96
5853 96 -192 152 269 258 -317 73 377 87 -287 -130 -112 -102 260 -27 -188 271 301 9 491 286 253 149
5875 149 481 -218 11 501 279 -133 196 179 -87 275 82 -231 -10 328 117 38 -219 136 -135 289 45
5896 45 -529 252 193 -315 -351 -79 -131 144 447 -228 114 230 93 -160 -18 -178 -270 199 187 -711 -264 151
5918 151 -264 -299 -99 -153 -122 146 -239 -469 -25 76 -100 171 -279 -372 298 51 -233 -200 389 -137 -284 -205
5940 -205 45 -24 -32 73 -441 -71 161 -39 -154 134 -39 182 204 -268 -232 116 278 -240 141 -70 -41 162
5962 162 139 -466 234 587 388 -36 31 -225 8 451 374 215 169 386 93 39 -229 258 -87 161 -68 -226
5984 -226 389 206 425 -100 139 -32 -52 343 -289 -110 556 292 54 80 101 -73 -23 137 140 313 95 -113
6006 -113 -58 -3 63 -79 447 133 -97 131 81 -95 110 66 -325 159 179 -186 16 170 -156 -196 -72 -151 -106
6029 -106 -12 -323 -508 17 68 80 -402 176 -16 -354 -222 -280 -120 73 -286 -136 -43 -253 -277 -56 172 -155
6051 -155 47 219 -127 -32 66 159 -348 -38 3 -492 -19 -30 131 -3 -135 -205 -159 20 -203 -164 433 106 -46
6074 -46 -398 -179 -377 304 -42 -177 -37 209 218 -241 76 -254 -11 399 259 -208 -170 -87 -89 74 73 -267 -115
6097 -115 187 219 -411 310 134 24 82 -125 -195 359 76 -253 13 113 -305 -37 -99 63 277 -23 207
6118 207 177 232 29 -55 73 60 -48 590 504 2 -239 -14 51 -152 259 195 52 135 73 -34 -149 501 143
6141 143 207 197 199 27 143 154 -322 39 -107 -353 -18 -379 -231 -261 44 -197 -269 179 64 -370 -143 122
6163 122 -153 279 -107 -261 -151 -13 148 -221 -33 42 -147 -232 -21 -270 -71 103 172 -171 2 -704 -271
6184 -271 26 -283 245 110 3 -242 -31 -158 -198 -82 179 -149 -134 416 -112 -188 107 -79 18 143 19
6205 19 -314 259 523 116 48 -222 -226 333 345 -47 -251 263 371 -151 13 -221 -200 361 348 142 25 174
6227 174 -233 -155 -35 -96 -5 363 -110 -268 205 155 -383 124 -16 -132 191 671 -159 128 82 -8 391 -199
6249 -199 60 8 31 121 -255 275 194 12 -56 -397 -139 -87 344 91 -345 24 199 -136 -43 -55 -55 58 -138
6272 -138 -298 187 39 23 69 38 90 -135 -285 -56 -662 113 124 123 80 -9 -256 -397 189 -93 -12 -66 -149 -93
6296 -93 65 -531 13 -184 458 -52 -29 -123 -167 -199 97 -68 72 50 -189 28 52 -118 214 -28 -89 -184 179
6319 179 333 -473 83 290 67 -99 -35 -214 -244 585 201 10 129 267 26 176 -116 -203 -95 458 33
6340 33 -149 -230 8 66 326 306 -142 198 377 93 -156 -39 -23 -256 -51 210 -69 257 -242 14 357 359
6362 359 316 -42 221 53 16 558 60 -262 72 -263 -73 -3 -114 -122 -43 61 -181 -155 206 349 79 69 -119
6385 -119 -122 273 182 -432 -117 297 -54 234 214 -178 -445 -10 -94 -221 332 103 68 103 -591 -505 191 131 65
6408 65 -296 -188 -112 70 183 -519 -333 309 218 -376 -143 -127 -47 -366 -94 -409 -222 53 -136 -263 59 78
6430 78 -128 -33 -61 -356 -241 -24 -64 -116 30 -47 -297 -385 -144 -384 398 134 105 -105 -124 -121 -126 77 -440 -200
6454 -200 -76 11 -68 39 221 -107 376 290 -451 212 232 -280 64 -34 -241 304 240 169 -162 134 392 -207
6476 -207 356 73 412 328 71 -17 179 352 -296 -74 91 123 -84 268 281 -30 75 477 -372 -148 303
6497 303 30 248 223 71 -285 6 33 -395 123 -50 -31 -315 -127 -259 124 111 -199 -64 335 257 -261 10
6519 10 -134 -213 133 154 -304 252 59 -230 -249 138 -146 -72 167 -210 -196 130 144 -233 245 -448 22 -177
6541 -177 3 45 -10 164 -500 -365 26 -297 -214 63 -70 -241 -185 70 -377 -178 -89 258 -174 302 -106 -388
6563 -388 -141 117 -276 198 -199 -281 145 409 -163 -185 559 -128 168 -101 138 123 -11 320 -304 30 17
6584 17 70 13 -128 -91 -54 191 197 -116 303 -1 136 87 270 141 -43 257 35 245 -200 648 -100 403 402
6607 402 -78 212 235 -212 58 65 76 205 312 -87 -81 173 227 -109 432 477 -492 -28 -37 -46 68 379 -51 -196
6631 -196 154 -78 -112 50 3 -241 -186 68 -290 107 83 -120 -117 -210 -216 76 169 -1 -211 -34 -28 -32 226 -73 -320
6656 -320 13 46 -251 -454 48 28 -134 -240 35 -278 90 159 -21 -52 116 -190 -272 266 -309 -301 -100 -65 -274
6679 -274 93 -68 -181 379 -87 -133 164 62 -80 -444 70 37 -134 455 -203 -63 119 31 -121 342 417
6700 417 -125 164 61 172 -211 638 141 6 102 66 9 255 87 -191 -9 -12 22 -86 113 92 220 258 32
6723 32 -48 93 190 -336 326 -73 -74 279 35 197 500 297 -135 27 426 94 -194 106 -171 66 153 224
6745 224 -218 -148 93 -259 81 397 -153 14 -43 53 -123 71 37 -123 77 237 -229 -65 340 -39 -23 64
6767 64 66 -296 -9 -214 -170 157 270 -82 -123 -335 -278 -25 390 -319 -39 137 -74 -561 53 -211 -359 188
6789 188 17 -485 -158 123 -48 -38 -87 154 -27 44 -167 -189 156 296 -115 -3 17 -360 -320 -122 -73 -287
6811 -287 290 -51 -150 86 122 -266 103 -267 -269 223 -270 -201 -133 312 -107 -40 23 -343 -500 93 272 -266 355
6834 355 414 80 35 319 -164 -60 251 83 -150 132 178 6 365 113 95 -227 349 -209 -134 512 111 -51
6856 -51 235 222 -439 359 398 -292 109 97 -505 -160 519 -145 -206 51 295 -252 35 225 -208 -130 -25 127
6878 127 75 -222 61 -44 141 43 -42 403 359 177 -61 -255 -167 -235 46 46 85 124 -371 -111 -89 181 -402 -27
6902 -27 -55 -306 -142 25 -110 51 107 8 -334 -148 -221 -140 -48 -318 28 7 -176 -231 159 -153 -196 -363 149
6925 149 -331 -77 228 10 -138 27 228 29 136 226 -245 -148 202 -49 -385 350 -18 -214 -90 85 -232
6946 -232 176 159 69 261 -319 49 119 6 212 51 293 -116 -271 -54 51 -4 373 -94 -102 206 288 -199
6968 -199 13 72 -148 104 354 314 -111 301 158 -169 115 -2 71 -49 189 -224 -191 263 -224 -50 105
6989 105 69 -237 160 301 27 87 -145 -319 -223 62 176 81 299 56 -87 -104 14 -323 117 -26 -165 54
7011 54 112 -58 -131 497 3 -150 110 28 -215 146 -231 -75 28 -372 20 -109 305 -267 238 -130 -179 -171
7033 -171 121 -30 -116 4 -177 133 -343 -126 -299 -89 -41 175 -48 -49 72 -357 201 250 -295 167 -95 -50
7055 -50 -364 -253 -182 70 241 -90 -114 -200 -40 -267 113 -62 -341 213 -113 -194 -180 314 -271 99 86 -169
7077 -169 1 555 -58 31 198 109 -179 214 240 -217 -113 357 47 44 264 -61 -154 216 -49 22 60 367 -130
7100 -130 -123 -26 189 -312 28 43 204 77 127 -210 85 121 -58 206 78 151 -246 20 -256 115 224 229 257
7123 257 -78 136 -56 -78 -141 -364 354 98 -222 5 -18 -206 -54 -48 59 -143 -68 61 -395 -248 -291 -148
7145 -148 -120 307 -293 175 195 -58 -153 30 -123 -212 -84 154 -253 -16 27 3 -50 -41 29 -187 -34 -190 -308
7168 -308 -115 -210 -119 131 188 -155 380 339 -36 -151 219 -34 -357 -35 -212 -100 252 325 -345 223 284 -246
7190 -246 -39 -59 64 32 241 15 -193 410 131 172 138 73 -367 156 50 -368 -16 188 362 -126 111 65
7212 65 -75 113 304 -51 239 388 139 -72 361 -163 -375 282 55 -7 34 -66 63 104 161 -182 -53 371
7234 371 -218 202 284 1 -136 578 187 -298 225 -59 47 142 178 -111 51 117 111 -52 390 28 23 -42 49
7257 49 -93 -193 74 -302 152 354 -492 -41 438 34 -298 120 -189 103 -11 -93 -256 -278 103 -212 -100
7278 -100 44 -130 4 242 -30 -197 61 -88 -307 -244 115 -357 151 -12 -456 -208 -141 -120 -159 64 -256
7299 -256 -89 174 20 157 4 -88 -322 174 -5 -236 -454 331 -58 -96 206 -300 -204 -67 266 284 405
7320 405 187 -445 -166 125 -158 157 277 -131 23 146 -130 -46 -183 -156 104 70 228 26 -38 496 85
7341 85 27 431 10 -232 164 -127 155 416 49 -92 217 279 111 49 359 -131 -150 62 125 51 169 287
7363 287 -74 -181 -171 56 -4 234 114 -295 35 17 -2 -283 186 -64 318 -71 -134 -124 27 179 148 110 -61
7386 -61 -149 347 -125 -249 430 14 -57 55 -174 -196 81 137 116 -192 -94 210 100 26 71 -290 56 -111 -567
7409 -567 7 207 -254 9 51 -132 316 144 -159 -126 27 203 -398 -41 17 -341 10 60 -89 -134 273 38
7431 38 282 83 -111 -117 85 -42 -377 357 -28 182 9 -99 7 -130 309 -382 -186 83 164 -36 365
7452 365 -133 1 174 74 -97 -90 298 6 188 238 -349 -138 210 160 66 201 172 83 -130 -69 -22 -47 -26 -85
7476 -85 322 -132 288 -16 156 -107 -173 315 415 -166 25 93 175 -81 232 -244 103 -19 358 -48 -345
7497 -345 78 306 -22 76 -268 234 15 -119 -77 46 197 -82 -89 67 -441 161 166 -296 -111 68 -386 56
7519 56 303 -336 -223 266 277 -560 46 120 -135 286 -95 -114 -95 294 -121 -217 293 -281 -323 81 52 -299 45
7542 45 -76 -452 -67 74 -29 -145 61 -81 100 414 -125 -266 -243 225 10 288 109 -416 68 38 -481
7563 -481 -359 285 -16 -341 167 -97 -339 205 70 -174 -135 -55 -145 57 219 -334 -418 349 -16 64 11 -85
7585 -85 165 103 -27 12 145 148 -110 -13 238 109 61 351 -370 -72 402 327 -124 -51 67 -236 -4 87 -284
7608 -284 -302 435 -278 -48 66 -137 129 347 69 -324 302 258 -197 -71 228 -111 391 258 -22 141 259
7629 259 -128 -60 -344 -2 -273 154 -12 -381 -103 274 195 -237 -96 181 -161 300 -106 -560 -90 137 162
7650 162 56 -78 -99 106 151 -397 10 244 -93 -283 75 242 -191 -100 -167 -234 -26 162 -26 88 -482 106
7672 106 -129 229 -24 -361 -21 -85 10 -84 -31 418 -4 -211 10 -276 -48 88 -124 174 321 25 31 4
7694 4 -129 168 338 231 90 512 193 78 61 -314 -58 546 223 -129 -187 177 44 148 332 39 179
7715 179 84 277 192 -102 -73 328 -63 199 -202 160 200 -211 -24 -87 208 22 267 -33 84 363 207 -17
7737 -17 -78 165 232 566 316 105 -228 153 -6 -310 -383 86 -36 178 -284 -113 102 -14 -162 -320 38
7758 38 -183 157 428 -192 -350 29 -165 -145 -472 -350 28 290 -140 -40 -284 54 126 -125 88 -30 -78
7779 -78 540 -156 -262 -229 112 -30 -88 104 -413 7 261 156 -207 57 1 -226 -33 -19 57 259 -64 -487
7801 -487 -290 158 340 -223 -210 -86 -178 56 -45 -178 0 700 -44 -483 61 -185 60 74 65 290 238 517
7823 517 -170 -209 24 -266 202 26 50 62 414 -18 -206 -112 -118 117 80 35 -318 6 94 -274 19 245 -22
7846 -22 -182 323 104 -146 73 85 -346 115 -169 72 -14 71 -49 -288 491 34 -116 -59 -215 19 467 186
7868 186 -454 17 468 -271 59 49 211 -88 38 26 -290 3 38 53 -20 -77 140 57 106 -249 207 389 28
7891 28 126 -140 -81 10 113 -233 -144 298 295 23 -197 161 -328 -96 198 -270 82 -111 232 -293 -213 48 86
7914 86 424 -172 -350 -354 74 61 -34 123 106 -230 -72 -201 -236 -40 166 99 -156 -168 -58 -174 51 64 -282
7937 -282 363 197 -207 102 -99 66 124 -113 -447 149 227 -17 -105 -303 -15 114 -48 108 -141 389 361
7958 361 -21 95 164 -47 -17 407 -424 40 89 382 -192 -190 -117 6 156 104 193 -191 -37 -109 300 232 80
7981 80 168 105 6 4 -13 258 -214 -196 -117 -228 280 139 -452 -71 21 450 -38 -32 -306 -135 22 286 -220 -391
8005 -391 258 -194 76 -240 -104 -71 -97 -267 52 32 331 -21 243 172 -28 190 8 -359 -294 -82 77 -201
8027 -201 114 -14 -335 -130 -192 -364 154 169 -356 -30 -152 -129 119 444 -140 -191 357 77 -76 34 -98
8048 -98 -74 85 132 -704 11 169 16 161 -49 -61 -179 222 350 -43 -47 14 211 41 -29 305 153 93 -99
8071 -99 -21 237 -90 44 141 -8 -188 215 122 -3 -172 -35 60 76 89 195 43 -31 -104 -426 -227 16 136
8094 136 -22 4 -394 130 232 -261 -76 -50 -30 79 241 61 74 -34 254 -88 -9 270 292 -4 152 263
8116 263 1 276 -213 -520 45 -158 -9 97 128 63 168 179 -76 -74 -61 168 31 -114 -79 57 188 -157
8138 -157 163 -107 173 -321 53 50 -331 -11 51 74 -476 140 -142 -264 203 60 -249 -114 87 -145 27
8159 27 169 -280 -98 -147 -111 -14 149 27 99 179 274 -36 263 -134 -203 -339 309 -95 -143 -89 58 89 144 26
8183 26 71 59 52 -98 -58 -149 9 -37
8191c7
##END NTUPLES=NMR FID
##END=
